No subsystemException IDEA-277575 Multimple java.lang.NoClassDefFoundError: fleet/rpc/client/SocketImplKind exception on WSL tests
Bug IDEA-284364 IllegalStateException: Shouldn't be possible to run a Git command in the safe mode when Share project on Space
Build. Built-in (JPS)Bug IDEA-283502 Getting "Source file already exists error" on trying to incrementally build the project that uses source generation and Eclipse compiler
Bug IDEA-284089 Compiler -> "Build Project Automatically" Never Triggers
Build. GradleBug IDEA-281592 IntelliJ 2021.2.3 freezes on start up
Build. MavenBug IDEA-229600 Maven Reimport does not respect 'Settings for New Projects' in Compiler - Annotation Processors
Bug IDEA-284113 Unable to open Maven project (InvalidPathException: Illegal char <:> at index 8)
Bug IDEA-169048 Maven integration enables Annotation processors
Build. Package SearchBug IDEA-283543 The Dependencies toolwindow sometimes doesn't display any dependencies
Bug IDEA-282875 Undoing upgrade dependency operation doesn't re-run inspection
Bug IDEA-283838 Disable computations during headless and unit tests
Bug IDEA-284443 Package Search: add an ability to choose result set size
Bug IDEA-283760 Changing Gradle Configurations in Package Search Configuration throws exception
Code Analysis. InspectionBug IDEA-276197 Can't specify inspection severity for several scopes
Core. IDE SettingsBug IDEA-276949 Proxy authentication does not work after update to IntelliJ IDEA 2021.2.1
Core. InstallationBug IDEA-283631 phpstorm://open fails in 2021.3 RC
Core. LicensingBug IDEA-284532 PHPStorm 2021 failed to start, dropped a "Cannot start" stacktrace
Bug IDEA-282819 Some product EAP links are incorrect
Usability IDEA-281659 Add more detailed message about what is the possible cause of the "Couldnt start {0} EAP due to a login problem. Please contact technical support for assistance" problem
Usability IDEA-283374 When trying to activate Trial without internet connection - no error message will be displayed
Bug IDEA-283469 UI freeze on attempt to delete license with disabled internet access
Core. Plugin ManagementBug IDEA-277884 Plugin detection by class doesn't work with the new plugins model
Bug IDEA-283546 Plugins which store META-INF/plugin.xml directly under the plugin directory cannot be installed
Usability IDEA-283690 Do not suggest to enable the plugin after 'do not suggest this plugin' is invoked for it
Core. Project SettingsBug IDEA-284145 Don't Open in Trust Project dialog shown after IDE upgrade leaves the project in partially-closed state
Bug IDEA-284273 Don't Open in Trust Project Dialogs shown on reopening multiple projects after IDE upgrade breaks IDE
Bug IDEA-280859 trust project dialog: "Don't open" doesn't work for idea started from the command line
Usability IDEA-277454 "Trust and Open Gradle Project" dialog is missing a project name
Bug IDEA-282352 `Don't open` at `Trust and Open Project?` dialog has to be pressed twice if the project is drag-n-dropped to the welcome screen
Core. Quick DocumentationBug IDEA-284186 Documentation popup jumps when invoked in Project View
Bug IDEA-284184 Edit Source (F4) does not work in quick-doc when pressing F4 on keyboard
Performance IDEA-284009 High CPU & GPU utilization with documentation docked and other dock open
Core. Run. ConfigurationsBug IDEA-281386 Can't pass selected system environment variables to WSL in Run configurations
Core. Run. TargetsBug IDEA-282727 DockerCompose target. Focus on the compose container is set only from the second time by debug
Core. SSHBug IDEA-283804 Parse config file checkbox doesn't work for Deployment configurations
EditorBug IDEA-284402 IDE show the quick documentation even not hovering the cursor over that class when enabling the rendered javadoc
Exception IDEA-280637 com.intellij.diagnostic.PluginException: Cannot create class com.intellij.lang.documentation.ide.impl.DocumentationToolWindowManager (classloader=com.intellij.util.lang.PathClassLoader@566776ad) [Plugin: com.intellij]
Bug IDEA-285649 Selection background isn't shown for rendered doc
Editor. FormatterUsability IDEA-281375 Don't run formatter on save on syntactically invalid file
FrameworksException IDEA-284189 Microservices: NCDFE at MicroserviceDebuggerSupportKt.setupEntranceBreakPoint
Bug IDEA-284288 Java smart step into is not working with "Smart Step-Into for Microservice Debugging" plugin
Bug IDEA-273996 JavaScript: endpoints completion doesn't work for `new Request()` in case of concatenated strings
Bug IDEA-284796 Using NavigationGutterIconBuilder.setCellRenderer from pooled thread may lead to a deadlock
Bug IDEA-272457 Express: HTTP Client tab is not available for routes
Bug IDEA-274351 URL completion doesn't work in Angular projects
Frameworks. GrpcBug IDEA-284425 Do not highlight non-json request bodies for grpc requests in http-client
Exception IDEA-283452 IDEA 3.x HTTP Client - GRPC How to import "google/protobuf/wrappers.proto";
Frameworks. LombokBug IDEA-279075 Lombok and @SuperBuilder failed to generate builder method with latest EAP
Frameworks. MicronautBug IDEA-283893 Micronaut: Controller class is shown as unused in Kotlin
Frameworks. OpenAPI (Swagger)Performance IDEA-284083 Constant freezes while editing JSON
Bug IDEA-285089 OpenAPI/Swagger: Can't change schema with json schema status widget (no list available)
Frameworks. ProtoeditorBug IDEA-285012 Protobuff: In case path to .proto files not specified in Protocol Buffers settings on run grpc request I get com.intellij.grpc.requests.RejectedRPCException: An error occurred during protocol buffers file binary assembly
Task IDEA-284420 Refactor protoeditor built in .proto files
Frameworks. QuarkusBug IDEA-283234 Quarkus: register .qute.yml for Qute (currently only .qute.yaml registered)
Task IDEA-283620 Quarkus in the process of dropping @Deprecated shortId support on code.quarkus.io/api
Bug IDEA-282381 Quarkus: false-positive injection inspection for POJO
Feature IDEA-280072 Quarkus 2.1: support indexed properties assignment
Bug IDEA-274226 Quarkus: support @ReactiveDataSource qualifier
Bug IDEA-272088 Quarkus: @TemplateExtension method is shown as unused
Bug IDEA-282594 Quarkus Config Mapping: do not consider naming strategy while resolving properties with custom name
Feature IDEA-267595 Quarkus: support property references in Scheduled annotation
Task IDEA-279975 Qute: register .qute.json, .qute.yaml extensions
Frameworks. SpringException IDEA-265869 SOE: : isValid leads to endless recursion in class com.intellij.freemarker.psi.files.FtlFileViewProvider: [Language: FTL>, Language: HTML]
Feature IDEA-258159 JPA: Provide code completion for JPA properties in Spring Boot configs
Performance IDEA-283492 Spring plugin decrease performance of highlighting for large files in modules with many dependencies
Feature IDEA-282870 Spring: show gutter icon for @Scheduled tasks
Bug IDEA-280811 SpringInitializr wizard does not apply custom package name from server config
Bug IDEA-282701 Spring: Customize Spring Boot... action disappeared from the facet configuration dialog
Performance IDEA-284038 Slow URL search everywhere in Spring projects
Bug IDEA-282697 Spring Data: custom repository fragment class is shown as unused
GraziePerformance IDEA-283728 Grazie blocks write actions
Usability IDEA-283871 Remove submenu from "Rule settings" intention action
GroovyBug IDEA-272024 Groovy syntax highlighting breaks after restarting IntelliJ
Bug IDEA-283839 IntelliJ IDEA 2021.3 can not parse `record` as a variable name correctly
Bug IDEA-284144 Variables named "record" get highlighted as faulty in Groovy classes, even when using JDK 11
Groovy. GrailsBug IDEA-284133 Grails 3 project cannot be built in 2021.3 was fine in 2021.2
Groovy. InspectionsBug IDEA-283030 Base Properties Not Available from Dependent Project in Nested Classes
Java. Code CompletionUsability IDEA-283424 IDEA insert redundant space after completion of Javadoc tag via space
Java. DebuggerBug IDEA-284003 Evaluate does not work with disabled jb-jdi
Java. InspectionsBug IDEA-283812 Assignment Used as Condition with Element of Array
Bug IDEA-283654 Cannot uncheck "Test" in "Class naming convention" inspection
Java. Profiler. CPUBug IDEA-284682 Profiler Diff on jfr can't compare java 11 and java 17
JavaX. AppServers. JBossBug IDEA-273497 Stopping WildFly Run Configuration results in message "Terminate Batch Job? (Y/N)" and waiting for input
JavaX. CDIBug IDEA-284362 Deadlock in com.intellij.cdi.gutter.CdiInjectionsClassAnnotator
Bug IDEA-271385 CDI: Navigate To Related Symbol drop-down invoked for the injected bean shows the confusing target group name
Bug IDEA-271984 CDI Diagram: incorrect dependencies are shown for the beans of the same base type by different qualifiers
Bug IDEA-280911 CDI. KT. Events: "Navigate to Fire Point " doesn't work
Feature IDEA-280820 CDI. KT. Provide CDI Dependencies Diagram
JavaX. JPABug IDEA-284716 "Generate persistence Mapping" -> "By Database Schema" not working in Intellij Idea
JavaX. Web ServicesBug IDEA-179691 JAX-WS: Generate XML Schema from Java using JAXB action does not work with JDK > 8
Lang. XPath and XSLTBug IDEA-284217 Unable to save changes to the "Run XSLT" dialog
Plugin Development (DevKit)Bug IDEA-283327 DevKit: code insight for com.intellij.advancedSetting EP 'id' attribute
Feature IDEA-284320 DevKit: code insight for com.intellij.advancedSetting EP 'trailingLabelKey' attribute
Tools. DockerBug IDEA-285527 Image push. Registry list by push is empty
Bug IDEA-285039 Docker: exception on connection to JetBrains Space docker registry
Feature IDEA-283085 Docker: use registry HTTP API to check credentials instead of Docker login
Bug IDEA-285219 Docker: Registry configurable: test connection doesn't work
Tools. HTTP ClientBug IDEA-284499 HTTP Client: Do not show file name for run action in context menu
Bug IDEA-284148 HTTP Client: Variables are not substituted in response view
Bug IDEA-283799 HTTPRequest: client.global.set broken inside client.test callback
Exception IDEA-282090 HttpClient: some times get exception failed for REQUEST_TARGET on Tools->HttpClient->Create new request
Usability IDEA-284470 HTTP Client does not print URL parameters in output
Tools. KubernetesBug IDEA-283438 Helm. Add error and update repos state by pressing "Update Repository" gutter in case if the repo is still displayed as added but really it is removed
Tools. TerminalBug IDEA-283193 White text on white background
User InterfaceBug IDEA-283194 Deadlock while debugging
Usability IDEA-257432 Prioritize file path tooltip when editor tab is too narrow
Cosmetics IDEA-271046 Checkbox jumps on hover in the "Rename also" dialog
Bug IDEA-284451 "Evaluation Feedback" popup keeps appearing every 30 sec
Performance IDEA-275391 Modal dialog doesn't appear on copying a large number of files, UI isn't accessible
Bug IDEA-277709 Main menu is slow to build and it can lead to a crash
Bug IDEA-283347 There is a separator under active project tab in non-fullscreen mode
Bug IDEA-271741 Tool window is returned to "Dock Unpinned" mode instead of "Undock"
User Interface. Embedded Browser (JCEF)Bug IDEA-283718 com.intellij.ui.jcef.JCEFHtmlPanel ctor causes disposal error
User Interface. Favorites/BookmarksBug IDEA-283962 Add bookmark using mouse sets bookmark at wrong line
Bug IDEA-284600 Excluded directories are not shown in directories in Bookmarks tool window
Usability IDEA-283956 Next/Previous Bookmark navigation no longer confined to single file
Bug IDEA-281897 Directory and file bookmarks break if the directory or file is deleted and recreated
Bug IDEA-284610 Bookmark is not created with Cmd+Click after restoring default settings
Bug IDEA-283144 Directory content is not shown in Bookmarks list
Bug IDEA-284429 Different sorting for directories in Bookmark tool window comparing to Project View
Bug IDEA-284280 Inconsistent bookmarks behavior on clicks in gutter
Bug IDEA-284688 New bug in 2021.3 / Bookmarks menu / Cant do file diff
Bug IDEA-284400 "Select In" action is not available in Bookmarks tool window
Bug IDEA-283981 Bookmarks context menu is grayed out on folders
User Interface. MenusBug IDEA-282646 There is a Git main menu item instead of VCS if Git repository is not enabled for a project
Bug IDEA-284421 No icons in menu for items with submenu
User Interface. New Project WizardBug IDEA-282672 New project wizard: JavaScript fields remain on Empty project template
User Interface. Recent Files, SwitcherBug IDEA-284736 Can't close open files from Switcher
User Interface. Services ViewBug IDEA-283192 Services view. The item remains for some time in "All Services" by moving into a new tab
User Interface. TabsBug IDEA-283891 Editor tabs aren't highlighted on mouse hover when the focus is in a toolwindow
User Interface. Tool WindowsBug IDEA-278414 A tool in View Mode Window is instantly getting closed
Version ControlTask IDEA-282234 Additional FUS events for Commit dialog interactions
Version Control. GitBug IDEA-283883 Git Log: wrong tab title when filtering log by date
Bug IDEA-282605 Attempt to clone from Git fails from the Welcome Screen or with the untrusted project opened
No subsystemBug WEB-53883 Deno: do not run service for built-in lib.d.ts
Bug WEB-53960 Should not report "Unrecognized attribute or property name" for custom attributes on custom web components
CSSBug WEB-53284 Tailwind 3: Completion for classes doesn't work
Feature WEB-52425 Support v-bind CSS function in Vue Single-File Components.
DebuggerBug WEB-53403 Can't open Debug tool window because of JCEF error
HTMLBug WEB-53690 Typing '</' does not close the currently open HTML tag but instead opens an intelli-sense autocompletion popup with irrelevant choices
Bug WEB-53723 False positive "Empty tag doesn't work in some browsers" for void tags in Angular template
JavaScriptBug WEB-53731 Editing template string causes an exception
JavaScript. FrameworksBug WEB-37574 No completion for CSS properties inside inline style (jsx)
Bug WEB-53447 Angular: False Positive "Wrong attribute value" on all kinds of attributes
Bug WEB-53325 For Vue template file, ant-design component imports are marked unused
Bug WEB-53688 Angular. Event keyup.enter is not emitted
Bug WEB-52809 Vue 3: library (naive-ui) component import is marked unused
Performance WEB-53620 UI frozen on working with Vue components
Bug WEB-53861 Angular animation callbacks not recognized
Bug WEB-53909 Angular support - fxFlex attribute is not recognized
Bug WEB-52125 Multiple imports are marked as unused in <script setup>
Bug WEB-52856 Unable to import VUE component from`@headlessui/vue` package
Feature WEB-47399 Angular: support events from custom EventManagerPlugin
Bug WEB-53635 decodeURIComponent() not resolved in Vue template
Bug WEB-53797 Unresolved type Object in Vue template
JavaScript. RefactoringBug WEB-53808 TypeScript: Inline field refactoring incorrectly handles getters
Bug WEB-50246 TypeScript: Refactor: Inline function breaks code
LintersFeature WEB-53407 Limit the scope of files to be linted with StyleLint 14+
Node.jsBug WEB-53972 Scratch node.js files aren't executed in project working directory anymore
Feature WEB-33571 Add node_modules/.bin folder to PATH in Terminal for current project
Bug WEB-53716 Support Docker Compose Node.js interpreter when project is located under `\\wsl$\<distro>`
Bug WEB-42178 Yarn PnP: Indirect dependencies are not indexed
TypeScriptFeature WEB-53440 deno: show module urls/names instead of cache filenames
Bug WEB-53370 Deno LSP does not work for .tsx files ("Typescript JSX" file type)
Unit TestsBug WEB-53519 Missing highlighting on gutter for covered by Jest/Mocha tests code lines
Code HighlightingBug DBE-14509 Unknown database function ARRAYAGG
Bug DBE-14518 Inspection issue "Unknown Database Function..."
Bug DBE-14528 "ANY" function is not recognized
Bug DBE-14549 Deterministic collation option is not recognized in Postgres dialect
Bug DBE-14517 Not all of Postgres 11 options for CREATE AGGREGATE are recognized
Bug DBE-12112 SQL Parameter hints do not show for functions
ConnectivityBug DBE-14004 [S0001][104455] USE statement is not supported to switch between databases && [S0001][103010] Parse error at line: 1, column: 21: Incorrect syntax near '%'
Data Editor/ViewerFeature DBE-5278 Aggregate functions on result-set
Usability DBE-14545 "0 columns selected" in popup when I delete column in CSV table view
Bug DBE-7770 Incorrect results in DateTime columns when using DataGrip with Clickhouse
Usability DBE-14516 Cell size indicator
Feature DBE-3735 DB // Natural sort of numeric columns (CSV)
Data Import/ExportPerformance DBE-14389 Performance degradation in case of SQLite JSON fields with size ~300 kbytes
Database ExplorerBug DBE-14117 Hierarchy of MongoDB fields is broken
Bug DBE-14771 Data source disappears when DBMS is changed
Database MigrationsBug DBE-14665 Incorrect diff for identity column
IntrospectionPerformance DBE-14531 Stuck introspecting at level 1
Bug DBE-14582 Error when connecting to IBM Db2 z/OS - THE SQL STATEMENT IS NOT SUPPORTED
Bug DBE-14606 DB tool: introspecting MySQL 8.0.15 database fails with "Unknown table 'APPLICABLE_ROLES' in information_schema"
Bug DBE-14553 Error encountered when performing Introspect regular database stuff completely: ORA-00918: column ambiguously defined.
Bug DBE-14639 Exception "Argument for @NotNull parameter 'name'" when introspecting Oracle server objects
Navigation & SearchBug DBE-13089 "Find usages" does not look for usages in routines
Run ConfigurationsFeature DBE-12590 Respect data source color in run configuration UI
Schema DiffBug DBE-14436 No source code for rules