No subsystemBugPY-47247Package's submodules and subpackages are not suggested in completion for not imported qualified names
BugPY-47304pytest.mark disappears from variants of completion for not imported qualified names
App EngineBugPY-46413Invalid default Application ID during GAE project creation
Code InsightFeaturePY-44026Try auto-importing modules when completing module names or the attributes of modules
ExceptionPY-46983s.models.ZipBasedModelProvider - Failed to load model empty_module#python-names:empty_module:1.0.0
UsabilityPY-43889Suggest "main" live template only when typed in the global scope at the beginning of the line
BugPY-46229No completion for "ast" classes
BugPY-47307Don't insert dot "." after completing not imported module name
BugPY-47281Fuzzy completion of not imported qualified names suggests definitions from internal modules (starting from underscore)
BugPY-46056Import completion hint is inconsistent with the actual resolve
BugPY-46054"from ... import ..." suggest irrelevant imports in case of same directory import
BugPY-40339PyCharm doesn't complete paths for os.makedirs()
BugPY-43841Expected type 'function', got '(row: Any) -> str' instead
BugPY-45541Extended completion suggests importing numpy.ndarray as numpy.core._multiarray_umath.ndarray
BugPY-37362Infer types of decorated methods based on the type hints of their decorators
BugPY-27142Infer types of decorated methods based on the types of their decorators
FeaturePY-46668Support matching all parameters with arguments in code completion
BugPY-32404Searching for a python file does not show its extension
BugPY-46381Extended completion and auto-import quick fix suggest variants from third-party package tests and bundled dependencies
BugPY-46422Run icon in Markdown code block
BugPY-29891PyCharm doesn't infer AsyncContextManager types even using type annotations
BugPY-45566Extended completion suggests symbols from python-skeletons, not available in project
UsabilityPY-45459Make f-string like completion available right after "{" on explicit completion invocation
BugPY-45115Standard library import resolves into the same name project module which is not inside the same directory or source/library root
BugPY-44714false positive with TypedDict and None
BugPY-46490No parameters in classmethods for cls when __new__() is defined, but __init__() is not
BugPY-44663"Go to Declaration" on classes with metaclasses and custom parameters for __call__ method [simular to PY-41380 but not the same]
BugPY-45382warning on types.FunctionType, got MethodType instead
ConsoleBugPY-46500Console opens two empty consoles after one was closed.
CoverageBugPY-43500Coverage gutter jumping does not work in 2020.2 EAP
CythonBugPY-43388Support type checker in Cython files
BugPY-46530Type size_t do not match int in Cython code
DebuggerBugPY-24165"attach to local process" has stopped working using Python 3.6 on macOS
BugPY-21538Debugger with "Show command line afterwards" stops somewhere inside libs without showing frame
BugPY-45659Python isolated mode (-I) breaks subprocess debugging
FeaturePY-19764Show shape for tensors and other types with `shape` attribute
BugPY-44730Chinese (Simplified) Language Pack EAP plugin causes Python debugging error
DjangoBugPY-39831Diagrams > Show Diagram > Django Model Dependency Diagram does not show
EditingExceptionPY-46178Auto-conversion to f-string doesn't work in the middle of an URL
BugPY-33035Some modules and functions are not auto-imported on Ctrl+Space+Space in a multi-project setup
BugPY-41312Inconsistent "Move statement" behavior when applied to multiple statements
FeaturePY-40863Add syntax highlighting to double braces in f-strings
BugPY-39406Strings are displayed without prefixes when folding
FormatterFeaturePY-33060Wrapping settings for function call arguments welcome script is created for temporary single-file-projects is opened instead of a given file on macOS from the welcome screen
BugPY-47795Undo causes host to freeze - exception is Shared Indexes
BugPY-391342 Resources in Project structure in PyCharm
BugPY-44605PyCharm creates in every folder to project path on new package creation action
InspectionsFeaturePY-19917Support "type: ignore" comments from PEP 484
BugPY-36062Type checker unable to recognize ModuleType
BugPY-39262False positive "Local variable might be used before assignment" when using assignment expression as part of and expression
BugPY-47359Calling the "hex" method with an argument on a bytearray gives an "unexpected argument" warning
BugPY-46884Syntax inspector cannot regocnize class instances with __call__ function
BugPY-25553Type warnings when object that implements `__index__` is used to index a sequence
BugPY-44957Type checker configured to show warnings, but shows weak warnings in case of generic class
BugPY-45941Wrong return type is reported for itertools.accumulate call
BugPY-45768'Missing Docstring' inspection triggering on type hints
BugPY-42897Parameter 'value' unfilled for signal.Signals
BugPY-42287Inspection "Incorrect call arguments" shown when getting Enum member from value using programmatic access
BugPY-43237Inspection give incorrect warning when using an Enum as a module's member
BugPY-26747Unexpected argument for str.__new__
Interpreters SettingsUsabilityPY-45384Suggest creating WSL-based interpreter after opening a project in \\wsl$
ExceptionPY-45795"Write access is allowed inside write-action only" exception is thrown after loading a project with configured interpreter in IDE with Python plugin
BugPY-44217Virtualenv in project dir is not auto-detected
Jupyter NotebookCosmeticsPY-45758Wording on the 'package isn't installed' bar
PackagingExceptionPY-47789Python Packages: clicking on packages in remote interpreter causes NPE
BugPY-34444IDE fails to show the packages list after proxy configuration: MalformedJsonException
RefactoringBugPY-31369Don't suggest "Add type hints for function .." and replace existing when function already has them
ExceptionPY-46099"Extract Superclass" fails if the method contain a class initialization and its method invocation
BugPY-43823Refactoring: Moving expression with enum to another module wrongly imports __call__ instead of actual enum class
Remote InterpretersFeaturePY-13869Allow X11 forwarding for remote SSH interpreters (including Vagrant)
RestructuredTextBugPY-31110Sphinx: "System Message: ERROR/3"
Scientific ViewBugPY-47710"Open in Editor Tab" in DataView produces exception
Test RunnerBugPY-45405Running test with pytest runner on PyCharm writes error on failed tests twice since 2019
WSLFeaturePY-43023Support projects directly in ``\\wsl$\``
BuildFeatureIDEA-253347Dependency update API for package search
BugIDEA-264085BindException: Cannot assign requested address error When trying to build any project on WSL 1
FeatureIDEA-263998Show warning if gradle script uses gradle-bintray-plugin
Build. Built-in (JPS)FeatureIDEA-253719Annotation Processing gives false compilation error about class that actually exists (was generated); please add option to run APT separately before actual compile
BugIDEA-259119Project cloned from github or created at CLI e.g. micronaut framework does not open
BugIDEA-260359WSL: All files are up-to-date when compiling modified project
Build. GradleBugIDEA-256620Mac OS: Idea doesn't link Gradle/Maven project by project folder
BugIDEA-253967OOM in the IDE can be reported as an OOM in Gradle daemon
BugIDEA-253631Wrong Gradle connection caching for uninstalled Gradle versions
BugIDEA-235964Idea generates deprecated gradle kotlin script
BugIDEA-204526Intellij Gradle importer fail on nested included build
BugIDEA-253826Gradle debugger deadlock if breakpoint hit in doFirst
BugIDEA-255822Gradle reload floating toolbar is displayed when new project is opened
FeatureIDEA-217311Show Gradle build output and results when running Gradle tests
FeatureIDEA-217681Update scope when pasting maven dependency into Gradle
BugIDEA-211296"Show this page" option not working when build/run is delegated to Gradle
BugIDEA-189944"Allow parallel run" option does not work with gradle delegated run configuration
UsabilityIDEA-232888Gradle and other providers should import automatically on project opening, if there is .idea but there is no existing project model
BugIDEA-248431Generated Gradle dependencies should use new configurations
BugIDEA-258095Gradle composite build self-inclusion should not break import
BugIDEA-262879Gradle project sync never completes
BugIDEA-261818Cannot debug code in the gradle custom test sourceset if its name contains hyphens
BugIDEA-264439Gradle project on WSL: error message in the case of using the JDK located on Windows
UsabilityIDEA-260728Gradle init script is not configuration cache compatible
BugIDEA-254884Tests not compatible with gradle configuration cache
BugIDEA-264107Gradle groovy scripts debugging doesn't work for projects on WSL
BugIDEA-264051The specified Gradle installation directory '\\wsl$\Ubuntu-20.04\wsl$\Ubuntu-20.04\wsl$\Ubuntu-20.04\wsl$\Ubuntu-20.04\wsl$\Ubuntu-20.04\wsl$ ...
Build. MavenBugIDEA-259083IntelliJ gets into an endless indexing loop
UsabilityIDEA-244923IntelliJ no longer automatically activates a Maven profile using 'idea.version' system property
BugIDEA-256181Maven: pom.xml file should be saved before performing "Add as Maven project" action
BugIDEA-260324РЎreating a new Maven project: the list of archetypes is not loaded
FeatureIDEA-211863Autofix for "Source option 5 is no longer supported."
BugIDEA-260995Maven: HTTP links are not secure warning in new projects
BugIDEA-261679WSL: Incorrect work with Maven projects that have space characters in their path
BugIDEA-262404Can't import Maven Project in 212.17, Project is untrusted
TaskIDEA-260425Create WSL run configurations for maven projects imported from WSL
BugIDEA-261414Maven distribution installed via package manager does not supported on WSL
UsabilityIDEA-230219Project Name Changes on Module Import
BugIDEA-253535Maven wrapper support: IDEA rewrites URL to maven repo to 'https' regardless of what you have in .mvn/wrapper/
UsabilityIDEA-233077Regression 2019.2->2019.3 import from maven model unable to override user settings and local repository
BugIDEA-259318Endless freeze during importing Maven project
Code Analysis. DependenciesBugIDEA-260616i18n: Dependency Viewer: title of tool window is hardcoded
BugIDEA-261323Add "This Module" scope to Call Hierarchy
Code Analysis. DuplicatesUsabilityIDEA-260645Duplicate finder sometime doesn't show file paths
BugIDEA-219100"Duplicate code fragment" reported for symlinked files
Code Analysis. InspectionBugIDEA-259617Can't export inspection results to HTML
CosmeticsIDEA-259454Add vertical spacing in inspection configuration right panel
BugIDEA-222161Inspection profiles UI problems
BugIDEA-195685Newly created scope doesn't appear right away in 'Scopes Order'
BugIDEA-254506"Reference to non-localized string" false positive for parameter of 'when' statement
UsabilityIDEA-255125Inspect Code on Commit action inspects source files from outside of project source roots
BugIDEA-255980Inspection settings is quite slow to appear
PerformanceIDEA-256481Inspect code spends a long time "scanning scope"
BugIDEA-258992Can't switch to project inspection profile from application inspection profile with the same name
BugIDEA-258991ProfileChangeAdapter.profileActivated() events are never published
CosmeticsIDEA-185794In Inspections dialog, the severity block changes position
FeatureIDEA-31168Specify inspection profile used for code analysis at check-in time
CosmeticsIDEA-259365Make the inspection description text area a description text
CosmeticsIDEA-259713Inspection configuration UI: Remove black border around severity icon
UsabilityIDEA-249566Make it more obvious that inspection options are related to the selected scope
BugIDEA-261916JetBrains analysis annotations do not work on annotation methods
BugIDEA-130333Inspection settings: scopes order is not saved
FeatureIDEA-237242"Unstable API Usage" inspection should work for sources as well as libraries
BugIDEA-260297Unencrypted HTTP usage inspection throws exception on Rust non string literals
TaskIDEA-260048Show Inspections results in Problems tool window
UsabilityIDEA-258873Navigating in inspection results requires to press too many keys
BugIDEA-192702Clicking Edit Settings in Insepction Results does nothing
BugIDEA-262372false warning: Field accessed in both synchronized and unsynchronized contexts - ignore async call CompletableFuture.supplyAsync
BugIDEA-262637Problems tab contains errors when using class java.math.BigDecimal
Code Analysis. Language InjectionBugIDEA-254971Java Parameter Language Injection Settings has bad resize behaviour
BugIDEA-196921Kotlin: Wrong inspection errors at @Query in case of more then 2 string parts
BugIDEA-196924Kotlin: @Query. Adding/removing "newlines" should not lead to language injection disappearing
FeatureIDEA-214466temporal language injection should support multi-line string literals with margins (Scala, Kotlin)
Code Analysis. Structural SearchBugIDEA-254329SSR false match: repeated variables are not matched correctly
TaskIDEA-254848Remove obsolete tooltip option
BugIDEA-254985primitive array not matched with variable template
BugIDEA-256009Filter live indicator is not live enough
BugIDEA-257374Open Replacement dialog automatically when selecting replace pattern from history
BugIDEA-256936Structural search fails to find match because of comment
BugIDEA-257893Incorrect index usage for searching JS
BugIDEA-228320Unsupported replace pattern An expression can not be replaced with a non-expression
BugIDEA-259108Search for simple recursion produces incorrect results
BugIDEA-259106Exception when trying to match recursion
CoreBugIDEA-260330AlreadyDisposedException from Space plugin on dynamic plugin unload
BugIDEA-260524Memory leak: Disposed BreadcrumbsXmlWrapper retained via listener of PostprocessReformattingAspect$LangPomModel
BugIDEA-261020FileInEditorProcessor.showHint leaks PsiFile from unloaded plugin
BugIDEA-260361UAST ClassSetImpl leaks references to JSP plugin classes
BugIDEA-260332Workspace model leaks Kotlin facets on Kotlin plugin unload
BugIDEA-261794Throwing `ControlFlowException` on AWT thread may cause `AWT-EventQueue-0` to die and freezes the IDE's `AWT-EventQueue-1` thread
UsabilityIDEA-229543Command-line launcher should not ask which window it's supposed to open the project in
BugIDEA-258519IDE fails to open a project from the command line if another project is already opened (perhaps Windows-only)
Core. DebuggerBugIDEA-256108Inline watches: Pressing Esc should only undo Set Value interaction and should cancel new Watch addition
UsabilityIDEA-256357Inline watches: when adding inline watch don't switch focus and don't open the Debug tool window if it was closed
BugIDEA-256193Setting inline watch to empty value in Variables/Watches view doesn't remove it from the view
ExceptionIDEA-260261NPE at com.intellij.xdebugger.impl.evaluate.XDebuggerEditorLinePainter.lambda$computeVariablePresentationWithChanges$0
BugIDEA-261198[there is XDebugView in stack trace]"java.lang.Throwable: DataContext shall not be created and queried inside another getData() call" exceptions appear after debugging tests and application
BugIDEA-261405java.lang.Object cannot be cast to class com.intellij.util.keyFMap.KeyFMap when starting scala REPL and debugger cannot be started afterwards
BugIDEA-263014XLightBreakpointPropertiesPanel#myCustomPropertiesPanelWrapper uses wrong layout
BugIDEA-262878Click on toolbar button "Evaluate expression" no longer uses editor selected text
Core. DiagramsExceptionIDEA-255984CCE at com.intellij.util.messages.impl.MessageBusImpl.invokeMethod
PerformanceIDEA-259231UI Freeze when right-clicking on the intellij folder in IDEA
BugIDEA-261035i18n: Diagrams: "New" Menu: "Constructor" is hardcoded
BugIDEA-261015i18n: Preferences/Settings: Tools: Diagrams: hardcode strings
ExceptionIDEA-263489IAE at com.intellij.diagram.presentation.DiagramState.restoreTo
ExceptionIDEA-263255NPE at
ExceptionIDEA-264067NPE at$MyDependencyCollectingVisitor.isCollection
ExceptionIDEA-264064NPE at com.intellij.openapi.graph.impl.view.FastNodeCellRendererPainter.paintNode
BugIDEA-263119JPA: ER Diagram opened not centered
ExceptionIDEA-222077UML diagram: attempt to add note to diagram popup causes IOOBE
ExceptionIDEA-262492CCE at com.intellij.uml.presentation.DiagramPresentationModelImpl.getNodeTooltip
BugIDEA-211984UML Diagrams: any action performed from diagram can't be Undone though Undo is shown enabled with correct last action name
BugIDEA-264029UML diagrams fonts are too big in 2021.1 Beta when comparing with 2020.3.2
ExceptionIDEA-262187Throwable at com.intellij.psi.impl.file.impl.FileManagerImpl.checkHasNoOtherPsi
ExceptionIDEA-263414Throwable at com.intellij.psi.impl.file.impl.FileManagerImpl.checkHasNoOtherPsi
BugIDEA-263868Spring Diagrams: with `Show neighbours of the selected nodes` option the results of selection change is ugly (no layout)
BugIDEA-263877Spring Application Context Dependencies Diagram: on Show Library Models action the layout is not applied
ExceptionIDEA-263561ISE at com.intellij.spring.perspectives.diagrams.SpringDiagramNode.getIdentifyingElement
ExceptionIDEA-263875ICSE at com.intellij.uml.UmlFileEditorImpl.getData
BugIDEA-263112JPA: ER Diagram is not refreshed after adding the attribute
BugIDEA-264679JSF Navigation diagram: no layout on diagram opening
BugIDEA-264684JSF Navigation diagram: on unchecking the ShowSelectedNodesWithDependencies the resulted diagram layout is incorrect
BugIDEA-264695CDI Dependencies diagram action appears outside the Diagrams menu group and causes exception only
BugIDEA-264697CDI Dependencies diagram is always empty
BugIDEA-264693Java Enterprise toolwindow: CDI Dependencies diagram is opened without layout
ExceptionIDEA-264685Throwable: Read access is allowed from event dispatch thread or inside read-action only
UsabilityIDEA-264691Add the ApplyCurrentLayout action to the context menu for the toolbar-less diagrams
BugIDEA-264690Spring Beans toolwindow: the beans graphs appear without layout
BugIDEA-265035UML diagrams: Kotlin: tooltip over package item shows wrong statistics
BugIDEA-265037UML diagrams: Kotlin: constructor is shown for object
Core. File SystemBugIDEA-256146Case-sensitive folders on Windows are not recognised
BugIDEA-258608File become unavailable after rewrite with python
TaskIDEA-259580Delete unused .jar mirroring code
UsabilityIDEA-135546Handle situations when parts of VFS are located on file systems with different case sensitivity
BugIDEA-260872Opening second project from command line does nothing
BugIDEA-252213WSL2: Can't select workspace
Core. IDE SettingsBugIDEA-255673When plugin that registers its own file type is installed, the notification is shown that suggests to revert the association to the incorrect file type
BugIDEA-259129idea.bat cannot set %JDK% from %USER_JDK64_FILE% if %APPDATA% contains spaces.
CosmeticsIDEA-235958Import settings message is too complicated
UsabilityIDEA-253968Import Settings from the backup overwrites the backup
UsabilityIDEA-250146Make ignore.virus.scanning.warn.message possible to revert via UI
CosmeticsIDEA-253866Reword option "Open matching files as text and auto-detect file type by content"
BugIDEA-256106WindowsLookAndFeel is not migrated to IntelliJLaf / JetBrainsLightTheme, defaults to Darcula
FeatureIDEA-245847A way to run an IDE script from command line
CosmeticsIDEA-251453Some description text of Inspections settings has non-consistent padding
BugIDEA-261409Plugins are not shown anymore
BugIDEA-262228Code Style Settings are messed up
CosmeticsIDEA-251455Some inspections' description texts starts with an extra empty line
BugIDEA-261026Nothing here in Preferences | Editor | File and Code Templates
UsabilityIDEA-259872After IDEA update: Propose to use bundled runtime if configured runtime is older
CosmeticsIDEA-227451Settings > Editor > Code Style > Java > Arrangement items disappear or move on mouse hover
BugIDEA-264893[Choose Runtime dialog] there is no ability to add JBR if it isn't located in ~/Library/Java/JetBrainsRuntime/ folder
Core. IDE Settings. SharingBugIDEA-254948JDK classes are not properly resolved after setting up a new SDK
Core. Image ViewerBugIDEA-260894Add Copy action to the BufferedImage display
Core. IndexingBugIDEA-264500VFS cache can't recover automatically after content storage corruption
BugIDEA-254057Exception on exit after plugin unloading
BugIDEA-254028shared-indexes: update plugin description, introduce icon
PerformanceIDEA-257855Excessive memory allocation when the IDE in idle
BugIDEA-258372Save shared index version inside the index directory
BugIDEA-258484shared indexes generator is broken: file based index is not initialized by the time the command "dump-shared-index" is called
BugIDEA-259273Shared index storage should support a large chunk amount
TaskIDEA-257723Integration performance tests with in-memory IDE
TaskIDEA-260427Stale index auto-repair
BugIDEA-258515Request full index rebuild if MapInputException caused by corrupted persistent storage
BugIDEA-257724Indexing diagnostics: collect stats on SnapshotInputMappings
BugIDEA-256129Make possible to discover a plugin which breaks indexing
BugIDEA-261754JSDetectingProjectFileScanner makes the scanning executor starve
BugIDEA-259897shared-indexes: invalidate caches dialog should ask about shared indexes
BugIDEA-263200Shared index trying to attach non-existing chunk
BugIDEA-262428Do not show public CDN URLs
BugIDEA-260379Async file listener should not lose events
BugIDEA-254987shared-indexes: archive-based hashes
BugIDEA-262899Can't find a file using Search Everywhere/Goto File
BugIDEA-265212IntelliJ IDEA 2021.1 beta 4 cannot resolves JDK classes
Core. InstallationTaskIDEA-255426[Apple Silicon] Convert launcher binary to universal format
BugIDEA-260798Wrong vmoptions used after update to CLion 2021.1 EAP
BugIDEA-260882Broken index file in proxy-vole-1.0.5-jb.2.jar
BugIDEA-260909CLion no longer starts after removing left-over files of older installations
UsabilityIDEA-247751Startup script overwtites "UNAME"
BugIDEA-261321Mac Launcher does not request Rosetta 2 to be installed, if run with x86_64-only JBR on Apple Silicon/M1 doesn't allow symlinks
BugIDEA-261720Error updating EAP version
BugIDEA-263043Idea fails to start from path contains spaces on linux
UsabilityIDEA-252209Avoid broken installation on Linux when distributive is unpacked into the same folder
UsabilityIDEA-263364App started from IDEA cannot access Bluetooth on macOS Big Sur
TaskIDEA-257798Bundle Kotlin 1.4.21 with Intellij IDEA 2021.1
UsabilityIDEA-2640602021.1 update journey is broken as it requires multiple "check for updates" to produce a fully working installation
Core. LicensingTaskIDEA-256171Force using EAP license for paid EAP-enabled plugins running in an EAP IDE build
TaskIDEA-263484Docker Desktop causes wrong host name to be sent while obtaining floating license
FeatureIDEA-263678License Panel: hide Evaluate radiobutton for CWM plugin
BugIDEA-265183Broken license dialog UI when user has several licenses
Core. Navigation and SearchFeatureIDEA-256847YAML: highlight both usages of PsiElement and Reference under caret if they have the same TextRange
UsabilityIDEA-252492Do not show Calculator results in Search Everywhere if no operators are used
UsabilityIDEA-256350Search using non english characters stopped working
UsabilityIDEA-248380Find in Path – nothing in the Directory popup menu
BugIDEA-261098Go to usages (CMD+B) not working for variables declared with `var` in Java 11
BugIDEA-261644"Data Flow To Here" yields no results for record constructor parameters
BugIDEA-250259Go To action opens file inside generated sources
Core. Platform APIBugIDEA-252628Make, NamedScopesHolder) non "abstract"
BugIDEA-253543JvmElementActionsFactory#createChangeParametersActions does not expose existing parameter annotations
TaskIDEA-228078Scratch files should have their language file types, not ScratchFileType
FeatureIDEA-207237New API for ConsoleInputFilterProvider
BugIDEA-264897A race condition that leaves daemon hanging
Core. Plugin ManagementBugIDEA-203746New plugin page: depended plugin is not installed after user hit 'Proceed' in depending plugin installation
BugIDEA-254204Plugin is not unloaded after the last project was closed
BugIDEA-257167Cryptic error message on start
BugIDEA-2568802020.3: Enterprise plugin market place drops the port from the plugin download URL
BugIDEA-255055Unable to load/unload plugin when extension point defined in optional config file
BugIDEA-255042Unable to unload plugin that uses module extension if project has no modules
BugIDEA-257854Unclear/incorrect behavior on switching between per-project states
BugIDEA-257851Per-project plugin is not becoming enabled for all projects if action was invoked from another project, but becomes enabled only for the first opened project after IDEA restart
BugIDEA-257906Incorrect wording of "Loaded because enabled for another project" info text
CosmeticsIDEA-257857"Loaded because enabled for another project" doesn't fit plugin info block
BugIDEA-259183JavaFX Runtime for Plugins: An unexpected core classloader: class com.intellij.util.lang.PathClassLoader
BugIDEA-235514Terminal plugin requires restart on disabling
BugIDEA-261981Web Services settings infinite loading
BugIDEA-235321Vagrant plugin can suggest restart on disabling
TaskIDEA-173176Use the latest version of kotlin-runtime library for build process if several plugins depends on different Kotlin versions
BugIDEA-261296Can't install or update any plugin
BugIDEA-253978"File type conflict found" on every IDEA start - 3rd party plugins
Core. ProfilerBugIDEA-253371Profiler error: Not enough memory to load dump
FeatureIDEA-256093Sortable columns in profile results
FeatureIDEA-257544Show cpu load for all processes
BugIDEA-257420[Help | Diagnostic Tools | Profile Indexing] doesn't work (no snapshot is created)
BugIDEA-260576UI does not indicate about reading the dump after profiling session stopped
BugIDEA-257387Run targets profiling
BugIDEA-264587Profiler executors unavailable in run toolbar after list of profiler configurations is changed
Core. Project SettingsExceptionIDEA-257252UnsupportedOperationException at com.intellij.framework.detection.impl.DetectedFrameworksData.updateFrameworksList
BugIDEA-257767Module settings not saved in .idea folder
BugIDEA-257959Project language level covers Java Preview warning dialog
BugIDEA-260248Project Structure dialog: changes in module name aren't applied if module dependencies were changed at the same time
BugIDEA-261800java.lang.RuntimeException: Unable to get registered settings of #VueCodeStyleSettings when trying to open Code Style settings
BugIDEA-261802java.lang.Throwable: Can't find the language with ID Vue when disabling Vue.js plugin
ExceptionIDEA-262073java.lang.RuntimeException: Unable to get registered settings of #VueCodeStyleSettings when enabling Vue.js plugin with opened .vue file
BugIDEA-108806cannot change the manifest file of a jar artifact once it has been specified
UsabilityIDEA-116209Allow to directly specify a jar's META-INF/MANIFEST.MF file
BugIDEA-99596Manifest file located under 'main/java' root in Maven module is shown in artifact editor even if it won't be really copied to artifact
BugIDEA-259705Module can't be deleted
BugIDEA-264113Cannot change library scope second time after clicking "apply" in project structure dialog
BugIDEA-257476Modules get lost on changing the 'store generated files externally' option for multimodule maven project
BugIDEA-260372Maven projects can't be built after disabling the (not used) dependency
BugIDEA-257175IJ resets content root to the incorrect directory
BugIDEA-262946New EAP prints many errors to the log about duplicating LibraryIds
Core. Quick DocumentationFeatureIDEA-258058Support bimodality of the {@return} Standard Doclet tag
CosmeticsIDEA-258219Quick Doc: Typo in the description of JSP contentType
BugIDEA-260323i18n: Documentation: Tool window title is not localized
Core. RefactoringsBugIDEA-258166"Refactor / Rename" on resource file picks wrong file
ExceptionIDEA-121424Throwable at com.intellij.ide.impl.DataManagerImpl$MyDataContext.getData
BugIDEA-235126During dialog-based rename, substituteElementToRename is called twice
Core. Run. ConfigurationsUsabilityIDEA-254515Get rid of unclear "user-local default" option in "Shorten command line" field in JVM-based run configurations
BugIDEA-254720Command line shortening: don't suggest for non-java process
CosmeticsIDEA-257477Fix tooltips in Java and JUnit dialogs
BugIDEA-259247Alt-Enter shows action groups that do nothing
BugIDEA-259116Wrong invocation of Run File action when file starts with #!
BugIDEA-258398@argfile shortening method isn't available in run configuration templates in some projects
BugIDEA-261491RunConfigurationsComboBoxAction.myButton leaks reference to disposed project
BugIDEA-261161Run configurations are not working due to "DataContext shall not be created and queried inside another getData() cal"
CosmeticsIDEA-261879Edit configuration templates - configurations list is collapsed
ExceptionIDEA-262425PluginException: Cyclic service initialization: RunManager
ExceptionIDEA-245958Throwable: Directory index may not be queried for default project
UsabilityIDEA-246087[new run config UI] Improved keyboard navigation to fields
UsabilityIDEA-263886[new run config UI] Change 'modify option' hotkey on macOS to be Option-M
BugIDEA-264202[new run config UI] invoking "command line" fields mnemonics don't move focus during indexing
BugIDEA-264143The root node is configurable in the Run/Debug Configurations dialog
Core. Run. TargetsBugIDEA-260005Hide Run Targets UI from the IDEs with no supported language runtimes
BugIDEA-252404Run Targets: Hide run on list before wizard
BugIDEA-258035Run Targets: After introspection for SSH target, JDK path have extra white space at the end which fails app run
BugIDEA-257693Run Targets: Additional java/maven runtimes from SSH wizard not added to SSH target
TaskIDEA-259479Run Targets: enable run.targets key by default in 2021.1 EAP
UsabilityIDEA-258269Run Targets. Fix layout of the SSH wizard
BugIDEA-252403Run Targets: provide docker image pull completion in run targets configuration
BugIDEA-257453Run Targets: JDK path for SSH target not filled during introspection
BugIDEA-261178Support introspection for WSL run target
BugIDEA-255964"Run on" combobox in run configuration editor should show WSL under "New target"
BugIDEA-261637Run Targets: Can not download single file via SSH
TaskIDEA-262277Remote targets for Go Build: Introspection completed with error. Getting environment failed with exit value 1
TaskIDEA-260008Target tests for WSL
BugIDEA-262162Run Targets: first introspection for WSL target fill JDK path incorrectly
ExceptionIDEA-259929java.nio.file.NoSuchFileException in Docker plugin on pulling the image by creation a run target
BugIDEA-262784Run targets: SSH stops working after installing rsync on Windows
CosmeticsIDEA-258266Run Targets. Cosmetic UI bugs
TaskIDEA-258455Run Targets: download files from target
BugIDEA-261979SSH target startup is very slow because of files syncing
PerformanceIDEA-262457Choose run configuration popup is slow on IntelliJ IDEA project
UsabilityIDEA-262430Run Targets: SSH allow to select the Gradle home using the path chooser
BugIDEA-262289Run Targets: SSH: attempt to run with coverage fails
BugIDEA-262785Run targets: rsync installed via Cygwin exits with code 1
BugIDEA-253377Run Targets: RSync for SSH target not detected in case windows-linux or wsl-linux
BugIDEA-264934Eternal throbber in target creation wizard
BugIDEA-262446Run Targets: SSH: contents of coverageNargs file is not uploaded
UsabilityIDEA-265188Show popup `Please add /Applications/ to Resources -> File Sharing` when GoLand runs from /Applications/ path on macOS
BugIDEA-264928RunTargets. Quarkus. It fails to run on docker target
UsabilityIDEA-253697Run Targets: On create WSL target check if linux distribution actually exist before checking runtime settings
Core. SSHBugIDEA-252300Entered SSH passphrase isn't applied for deployment configuration
BugIDEA-258583Prefer ECDSA/ED25519 host keys when connecting to an SSH server
BugIDEA-255826X11 forwarding doesn't work with VcXsrv (X server) on Windows
BugIDEA-260890"Can't copy sources" -> Connection failed -> Caused by: RemoteCredentials is not set in FileSystemOptions
BugIDEA-259658Move advanced settings from Deployment to Unified SSH
FeatureIDEA-120235Support ForwardAgent option to forward SSH keys
BugIDEA-261740Incorrect ServerAliveInterval=1 and ServerAliveCountMax=0 that disconnects SSH session immediately
Core. Task ManagementExceptionIDEA-260686Cannot edit tasks
UsabilityIDEA-254355Provide an ability to assing shortcuts for "Start Timer" and "Stop Timer" actions
EditorBugIDEA-255156Light Editor doesn't remember changed windows size
BugIDEA-229797Markdown not detected after renaming a scratch file to `.md`
BugIDEA-253077--wait option: terminal waits for whole editor window to be closed when light editor was opened with restored previously opened files
BugIDEA-255295Reader Mode options are not applied for file when switching it to read-only mode
BugIDEA-259724Allow to 'Exclude Recursively' 'External Libraries' when create custom scope
UsabilityIDEA-259829Default width of custom scopes is too narrow
BugIDEA-259828Filter is not applied when scope changed
CosmeticsIDEA-260494Font Settings: add a bottom panel with the help text "Enter any text to preview" to preview
CosmeticsIDEA-260493Add border to separate breadcrumbs and Font Settings
TaskIDEA-260492Font Settings: modify "Typography Settings" to a group that collapsed by default
BugIDEA-262699Wrong variant of Iosevka is used for italics
FeatureIDEA-235188Add ability to reserve separate window for a tab
CosmeticsIDEA-262330Font Settings: adjust top of dialogue box (remove extra margins)
BugIDEA-260496Font Settings: dropdown uses wrong font when Monospaced selected
BugIDEA-259753Unable to open java file in LightEdit mode, UnsupportedOperationException occurs
BugIDEA-258454Reader Mode options are not applied for opened library file until reopening
TaskIDEA-262329Font Settings: improve search within font dropdown
BugIDEA-264440Wrong bold font is used in editor
BugIDEA-242414Inlay code vision hints can't be seen when using 'Hight contrast' theme
Editor. Code CompletionUsabilityIDEA-258892Rename "SmartType completion" to "Type-matching completion"
BugIDEA-260190Lookup popup window is incorrectly sized when there is only one item
Editor. Code Completion. MLBugIDEA-262094Handle ignoring of matching case properly
BugIDEA-261990"Machine Learning Code Completion" plugin visits .class files
BugIDEA-2620905 second freezes in completion in Java Files
Editor. Color SchemesBugIDEA-253840Selected editor colors scheme is not persisted between restarts
Editor. CopyrightBugIDEA-260480i18n: Preferences/Settings: Editor: CopyRight: Formatting: hardcode strings under JSP/JSPX/XML setting pages
Editor. Diff and MergeBugIDEA-255639Compare File with Editor action should be disabled in file context menu when Diff Preview is opened in Editor
BugIDEA-211809Blank diff results loose all user changes
CosmeticsIDEA-240718Caret is placed in the right pane when a blank Diff window is opened
CosmeticsIDEA-255482White line on diff highlighters on 2,25 scaling
UsabilityIDEA-224087Exiting Diff Viewer with a non-file-backed pane looses changes
BugIDEA-256076Extra pixel on editor diff markers
BugIDEA-253069Font ligature settings are being ignored
BugIDEA-258704Clicking on a change marker in left gutter adds a breakpoint if the code block is folded
FeatureIDEA-228934Add option to launch 3-way-diff directly
FeatureIDEA-156485Allow copying a file from another branch in Compare with branch view
BugIDEA-262442Diff detects changes incorrectly when add empty lines
BugIDEA-261968Diff-view in editor: toolbar may remain black when LaF theme is changed
Editor. Editing TextCosmeticsIDEA-203151Remove toolbar in Quick Definition dialog
FeatureIDEA-219868Add "Find in Path" to editor context menu for selected text
BugIDEA-208441"//region" matches a wrong "//endregion" sometimes.
BugIDEA-261199Right click resets selection of multiple lines
FeatureIDEA-119451Extend line selection via keyboard shortcut
UsabilityIDEA-260463EditorTextFieldActionPromoter hides IdeaVim actions
BugIDEA-262434Italic font is broken for Courier in 2021.1 EAP
UsabilityIDEA-92825Allow choosing variations of fonts
UsabilityIDEA-227988Add an option to change tab character rendering
Editor. FormatterBugIDEA-192807Enter calculates wrong indent
BugIDEA-226055"Space before colon in foreach" setting isn't presented in code style preview
BugIDEA-188397Incorrect indent after Enter after curly brace on the same line
CosmeticsIDEA-163806indention in JavaDoc after <br> tag
BugIDEA-239008CodeStyleCachedValueProvider$AsyncComputation leaks reference to PSI File via TransientCodeSettings on plugin unload
BugIDEA-205999"else" and "{}" indentation
BugIDEA-189817Code format breaks long URLs in code comments
BugIDEA-157294Exporting Code Style profile fails when name is not filesystem-friendly (e.g. it contains a slash in *NIX systems)
BugIDEA-254557Need to press code reformat or optimize imports shortcut multiple times to make it work
FeatureIDEA-122600Code Formatting: Allow for always wrap chained builder method calls
Editor. Intention ActionsBugIDEA-236593Docker: java.lang.Throwable: Assertion failed at opening a Dockerfile
BugIDEA-263507Line join silently changes semantics for nested ifs
Editor. TextMate BundlesBugIDEA-258528TextMate plugin pollutes the log with "Failed to parse textmate regex" exceptions
GroovyBugIDEA-251753SuppressWarnings("SpellCheckingInspection") doesn't work for Groovy scripts
BugIDEA-197031Groovy 2.5.x @TupleConstructor produces error at call-site "Cannot apply default constructor for class ..."
FeatureIDEA-257580Error with valid Groovy multi assignment in IDE
FeatureIDEA-144807Add inspection for GStrings that could/should be Strings
BugIDEA-258169Throwable: recursion
Groovy. InspectionsBugIDEA-251327Groovy: calling single-parameter method without arguments yields no warning in IDEA
User InterfaceBugIDEA-255669"Got it" popup changes its position on switching tabs
BugIDEA-255549Empty line at the top of the value popup
TaskIDEA-253581Switch IDE theme directly as entries are selected in the Appearance combo box
TaskIDEA-257575Change color picker move/nudge shortcuts
TaskIDEA-195753Add setting for tree line height
CosmeticsIDEA-211724HTML escape entities appear in the status bar when the tooltip is html-based
UsabilityIDEA-196260"Stretch tool window to *" is disabled via right click/gear icon/find action but not via Window -> Active Tool Window -> Resize
UsabilityIDEA-254272Add tooltips for all tool window buttons
BugIDEA-255675Welcome screen: Changing combobox values on Customize tab switches focus to Projects tab
BugIDEA-257817Issue with highlighting of push combo-button in Push dialog
BugIDEA-255056Unexpected location of "unsplit"
BugIDEA-233135scrolling code tabs with mouse wheel could be much faster
FeatureIDEA-254286Add plugin version for each "Non-Bundled Plugin" to "copy" button on the "About" dialog
TaskIDEA-209631Sort open windows by name in Window menu
BugIDEA-252551Opacity in colorpicker disappeared
UsabilityIDEA-223541Inspection scopes on groups cannot be differentiated in the UI
BugIDEA-251940Some icons became brighter
CosmeticsIDEA-255039Fix icon alignment in the Navbar
UsabilityIDEA-176682Editor tab: `` file label could be optimized
BugIDEA-255350Tab highlighting appears on tab pane when splitting tabs with drag-and-drop
UsabilityIDEA-255394Got it popups from different features overlap
BugIDEA-249645AbstractPopup with AdText: wrong height after pack()
BugIDEA-251630dlopen() failure during buildSearchableOptions
TaskIDEA-219895Implement typography system
UsabilityIDEA-258895Rename "import popup" to "auto-import tooltip"
UsabilityIDEA-251659Clicking Color preview changes CSS color format
CosmeticsIDEA-259206OK-Cancel buttons should be right-aligned in message dialogs on Windows
BugIDEA-259352Cmd+Shift+Up/Down resizes tool window at the bottom instead of moving the line up/down
FeatureIDEA-242086Add actions "close all projects" and "close all but this projects"
UsabilityIDEA-256948Place toolbar on the top of the table
TaskIDEA-190854Replace plus icons with modifiers with one plus icon with dropdown
BugIDEA-260550Shortcuts are misaligned in new popups UI
BugIDEA-260543"Choose run configuration" popup is not opened with shortcut
UsabilityIDEA-227224'Delete line to start' doesn't work in text areas
BugIDEA-259483Pinned preview tab bug
ExceptionIDEA-259970java.lang.Throwable on "Close All Projects" if there are more than two projects opened
BugIDEA-254692Impossible to select menu entries from popup of the hidden toolbar button
BugIDEA-207152"File | New Scratch File" isn't shown in custom "Quick Lists"
BugIDEA-259944New Scratch File does not appear in a Quick List
BugIDEA-257112Settings | Plugins: Can't disable plugin if its dependencies are not loaded
BugIDEA-259863Got it tooltip for Reader Mode does not appear after fresh start
BugIDEA-260260Notification is missing after recording async profiler snapshot
BugIDEA-260344Built-in HTML preview should have white page background by default
BugIDEA-260093Big Sur: Empty bar appears at the bottom after closing the project tab
BugIDEA-261041ToolTipManager leaks references to UI components holding PSI of plugin being unloaded
BugIDEA-257145SVG with embedded base64 PNG is not rendered
BugIDEA-250740LightEdit: no menu on Linux with global menu support
BugIDEA-261133Main menu is not shown on Windows
UsabilityIDEA-260546Pressing Esc in popup submenu should bring focus back to menu
BugIDEA-260688New popups UI: Numbers disappear in menu item when opening submenu
BugIDEA-260545No indents in new popups UI
BugIDEA-261400New popups UI: schemas are switched on hover in DataGrip
BugIDEA-243071SplitButtonAction leaks reference to disposed project
BugIDEA-261454Memory leaks via multiple DragHelper instances stored in IdeKeyboardFocusManager::keyEventDispatchers
BugIDEA-261403Hover selection color in Darcula is incorrect for tables and popups
CosmeticsIDEA-260683New popups UI: Menu item is not highlighted when submenu is opened
UsabilityIDEA-141556Welcome Screen: Recent projects list: search should work within groups
UsabilityIDEA-36854Implement cyclic navigation in trees
BugIDEA-258560Big Sur: Empty bar appears above the navigation bar after closing the project tab
ExceptionIDEA-260862Exception on expanding floating toolbar
BugIDEA-236698List items are not shown on Mac Touch Bar
TaskIDEA-260101Group headers for lists
TaskIDEA-260948Updates settings dialog redesign
BugIDEA-261408Submenu that is shown on the left disappears before the cursor gets there
BugIDEA-261958Fix context hints in Run Options
BugIDEA-262148UI inspector shortcut triggers Alt+Click action on the inspected component
CosmeticsIDEA-262729cosmetic file watcher message
UsabilityIDEA-260462Focus is moved to preview tab when opening HTML file in built-in preview
CosmeticsIDEA-262243Mnemonics color in popups is not changed when the row is selected
CosmeticsIDEA-262259Action text is not aligned with mnemonic in popups
TaskIDEA-261797Popups: mnemonics style
BugIDEA-261715Modal progress dialog is hidden on ESC, but Task is not cancelled
BugIDEA-256423Big Sur: Non-native alert for project opening is shown if opening a project while Find in Path is opened
FeatureIDEA-82829Maximize editor window should hide other editor in split view
BugIDEA-224228Refactor dialog appears when trying to open Terminal via Switcher
BugIDEA-87703Recent files doesn't close when floating Navigation bar appears
BugIDEA-263574Choose Boot Runtime: "Failed to set boot JDK runtime" error on attempt to select JDK in Download JDK dialog
UsabilityIDEA-72536Switcher shortcuts changing is confusing
BugIDEA-263626Submenu item not highlighted on mouse over if the submenu is shown LEFT of it's parent menu
BugIDEA-262234Native crash due to uncaught exception NSInvalidArgumentException on several modal dialogs on BigSur
BugIDEA-220248Incorrect UI panels width after reopening DataGrip
BugIDEA-263928Notification balloons do not appear when the corresponding status bar widget isn't displayed
BugIDEA-263915"Quick switch scheme" popup mnemonics display as "..." with larger appearance font sizes
BugIDEA-258490Project from jump list is not opened if another project is already opened
BugIDEA-249791Switcher cannot display all options
BugIDEA-227657"Recent files" popup has UI glitches after removing file
BugIDEA-263961Certain combinations of bookmark icon colors are handled incorrectly
BugIDEA-264220Initial path under \\wsl$\ is not selected in file tree on opening file chooser dialog
BugIDEA-261894Editor tabs for modified files that contain errors have wrong text color
BugIDEA-261723Welcome Screen size grows after each restart so that its frame doesn't fit the display
UsabilityIDEA-264770[Choose Runtime dialog] Minimize button closes the Setting IDE boot runtime pop-up and IDE looks like frozen until downloading will be completed
UsabilityIDEA-187018Make F2 "Go to next highlighted error" work in Recent Files/Recently Edited files popups
BugIDEA-239130The IDE gets stuck after cancelling opening a project
BugIDEA-263404EAP user agreement too small to read
TaskIDEA-252636What's new in Editor
BugIDEA-265418'Subpixel' mode is default for the Editor on macOS
BugIDEA-265019StackOverflowError on action update
BugIDEA-245626NPE: clicking on edit Coverage Color from gutter has no resulting action
UsabilityIDEA-263456Choose boot runtime: Show runtime build number after selecting runtime from disk
User Interface. AccessibilityBugIDEA-254108In the appearance tab, the label is not associated with the "font size:" combobox
BugIDEA-250862On the welcome screen in the customization tab, labels are not associated with combo boxes
BugIDEA-256940The list of file types Associate with Idea does not spoken elements
TaskIDEA-258233Set the project tree view to accessible Name
FeatureIDEA-200170High Contrast Theme should be applied by default on first launch if "High Contrast" mode is applied in Windows
TaskIDEA-261087Make com.intellij.ui.TitledSeparator accessible
BugIDEA-261695Choose Declaration list is no accessible
TaskIDEA-260436Add an UI inspector to display the accessibility hierarchy
BugIDEA-257258camplition popup is not voiced on macOS
BugIDEA-260702Results in Search Everywhere are not read with NVDA version 2020.3
User Interface. Action SystemBugIDEA-259561Ctrl-D shortcut in Editor invokes Diff instead of line duplicating
BugIDEA-238354Touch bar leaks actions on plugin unload
TaskIDEA-263205Action Popups: Disable separate "next step" button
TaskIDEA-261330Action names redefined in IdeUICustomization.projectMessage should be considered in goto action
User Interface. Console ViewBugIDEA-261792Cannot normally input in Run console
User Interface. ControlsTaskIDEA-255170Got It tooltip: do not close on click outside
BugIDEA-260619Empty elements in table after hover
BugIDEA-251059Two-line empty text with a link is cropped
FeatureIDEA-212299Implement Select parent node in UI trees
BugIDEA-261687Arrows separators are shown in Copy Path popup
FeatureIDEA-260013UI for independent submenu in popups
BugIDEA-250004Big Sur: Context menu highlighting breaks if submenu invoked
User Interface. Embedded Browser (JCEF)TaskIDEA-263753provide ability to configure proxy server for jcef
TaskIDEA-261425jcef: add method for setting css background color
BugIDEA-261496Cancelled Navigation in JCEF preview shows error page
BugIDEA-262267Built-in html preview is not rendered from time to time
TaskIDEA-262952allow JBCefBrowser to take focus on show/navigation
BugIDEA-264004JCEF JBCefOsrHandlerBrowser failed to invoke JS when global registry value ide.browser.jcef.jsQueryPoolSize is not set.
User Interface. Find, Replace, UsagesBugIDEA-257087Find Usages context menu item not visible until second right click
UsabilityIDEA-212226Find in Path dialog: option to open results in a separate tab should be keyboard-accessible
BugIDEA-170925Find in Path dialog - default to directory of current file
BugIDEA-244348Find Popup: missing Tooltip for "Show Filter Popup"
BugIDEA-260227Ctrl+Click on an argument in lambda does not show usages.
BugIDEA-170038Find in Path dialog does not close automatically when clicking the code area
BugIDEA-264313Find in Files: dots in empty text
BugIDEA-253378Wrong local usage highlighting in injections
User Interface. FocusBugIDEA-190158Typeahead timeout exception if same shortcut is assigned to multiple actions (Find and Find in Path, or similar case with Goto Class)
BugIDEA-193427Debug Tool window in Unpinned, Undock, Floating, Window modes disappears after clicking "New Watch", "Set Value"
BugIDEA-261798Modal progress dialog doesn't grab focus
BugIDEA-263483focus lost after Reformat code
BugIDEA-249360Project View scroll jumps down to the previously selected file with "Always select opened file" when switching from another app
User Interface. GraphicsUsabilityIDEA-220771The delay when detaching editor tabs is too long
User Interface. Keyboard InputBugIDEA-242263Using hot keys to access "Quick Switch Schemes" Populates a search box with letter 'Q'
BugIDEA-261309Character is typed in the editor when invoking a dialog through shortcut
User Interface. Look and FeelBugIDEA-254098Mac title bar is bright for tool windows opened in float mode (when whole theme is dark)
TaskIDEA-216859Color keys: unregistered root background
BugIDEA-258213Nightly build doesn't show buttons
TaskIDEA-216858Color keys: use color keys for the mouse shortcut area
CosmeticsIDEA-201983High contrast theme: there is no separator on a button with separator
BugIDEA-256913Theme is not changed to light when changing Editor color scheme to classic light and applying bright theme for IDE
User Interface. NavigationFeatureIDEA-253560Cannot navigate from folded reference to property bundle in Kotlin
BugIDEA-193601New SE: No 'Continue search...' link when no results found on applied filter
CosmeticsIDEA-227322When quickfix is found by Find Actions, it contains raw html
BugIDEA-254742Preview tab automatically switching to a real tab
BugIDEA-255955Navigation bar is empty when opening a second project
BugIDEA-207163Recently Edited Files popup doesn't have shortcut for switching between RecentFiles and RecentlyEditedFiles
BugIDEA-216720"Ctrl+E" shortcut is displayed in "Recent Files" popup if it was removed from the keymap
BugIDEA-263874No mnemonics in Switcher opened with one-key shortcut
UsabilityIDEA-263890"Recent Files": unexpected focus, does not only filter on files
BugIDEA-261860Navigation to an open file reopens it in active group
BugIDEA-264409Cannot open a recent file in splitted window
BugIDEA-265505Backspace doesn't update speed search results in recent files
User Interface. PluginsBugIDEA-256506Checkboxes in Plugins don't work
UsabilityIDEA-254729Unify the updates dialog
UsabilityIDEA-254460Default button in the Plugin Updates dialog is weird
BugIDEA-257267Webstorm is suggesting usage of Intelij Idea Ultimate
UsabilityIDEA-259158"Plugin updates installed" notification should not be sticky
BugIDEA-255478Double confirm for IDE restart
User Interface. Project ViewFeatureIDEA-208072"File Nesting" support in "Project Files"
BugIDEA-256683"Enable preview tab" function only works on"Project" view,not working on other views on IDEA 2020.3.
TaskIDEA-209057Changes "for current project" and “for new project” components in Preferences/Settings
FeatureIDEA-248876Show horizontal scrollbar in trees only when visible area contains items wider than viewport
BugIDEA-248797Packages View shows useless empty packages from libraries
BugIDEA-257211Can't navigate to package in external libraries
User Interface. Search EverywhereFeatureIDEA-255672Search Everywhere: file names in results should be the same with editor tab header
FeatureIDEA-255488Search Everywhere: make "Shown Contributors" filter application-wide
TaskIDEA-256217Untidy results in the Search Everywhere calculator
UsabilityIDEA-253918Better rounding of results in Search Everywhere calculations
ExceptionIDEA-259361Search Everywhere: Exception when results contain rendered HTML
BugIDEA-259261Remove suggestion to find in files on Actions and Git tab
BugIDEA-231624Can't find "show code folding outline" option via Find Action
FeatureIDEA-256078Add link to open Find in Path when no results found in SE
BugIDEA-261863"Make File Writable" action cannot be searched by "Writable"
UsabilityIDEA-263459Support screen readers in search dialogs
User Interface. Services ViewBugIDEA-261189Actions are missed for db session node in Services tool window
Version ControlBugIDEA-215959Non-modal commit: the changelist name should be used as default commit message value
BugIDEA-258646Commit action is disabled in the file context menu.
TaskIDEA-259993Hide the selection logic change under registry and disable for now
BugIDEA-252549Double click on change in commit tab no longer shows inline diff window
PerformanceIDEA-259254VCS code look for VirtualFiles for each "Untracked"("Unversioned") file in the repository
BugIDEA-255154Some symbols in author name does not shown
TaskIDEA-244040Add display ID for VCS notifications
BugIDEA-257313Rebase message contains unprintable characters on macOS Big Sur
BugIDEA-256998Throwable at com.intellij.openapi.vcs.ex.ChangelistsLocalLineStatusTracker: Attempt to register duplicate trackers
UsabilityIDEA-254160Refresh icon is not clear enough for Fetch
FeatureIDEA-217323Add Revert current Line action to Alt+Enter
UsabilityIDEA-257543Nothing happens if 'Resolve conflicts' is pressed after all conflicts have been resolved
BugIDEA-203694Grouping changes by Repository shows submodule object change as part of submodule, but it is in the root repo
BugIDEA-209585"Clear initial commit message" setting overwrites fixup message
UsabilityIDEA-259716Use submenu to configure double-click behavior - Diff vs Source
UsabilityIDEA-251017Missing mnemonic for VCS menu
BugIDEA-236524show commit options popup is not honouring the screen top
UsabilityIDEA-216187Non-modal commit: can't keep different comments for changelists
BugIDEA-237387Git Branches popup is displaced
BugIDEA-260241Ctrl + C copies editor line instead of previous changed chunk content
BugIDEA-237029Selecting text shortcut conflicts with toolwindow resize in Commit toolwindow
BugIDEA-250477Option to view All changed files disapearing randomly
BugIDEA-261046Correctly dispose `ConfigurableUi` from `BaseCommitMessageInspection#createOptionsConfigurable` if it implements `Disposable`
BugIDEA-262921New "Pull Requests UI" is not good / Return to the old "Create Pull Request" dialog
Version Control. GitUsabilityIDEA-250748Git Merge dialog: The text in branch combobox isn't pre-selected after first git merge action invocation
UsabilityIDEA-259241Jump to Source is missing in file context menu when staging area is enabled
BugIDEA-256674Git Staging Area: gutter markers ignore configured border colors
CosmeticsIDEA-255833Branches in Git Log: Add tooltip for branches setting icon
CosmeticsIDEA-254366Rename the 'Rebase my GitHub fork' action to 'Sync Fork'
BugIDEA-251850Choose upstream branch fails if some of repositories are in Detached Head
BugIDEA-226786Synchronous execution on EDT from GitApplyChangesProcess$ResolveLinkListener.hyperlinkUpdate
BugIDEA-257593A file called .git is detected as git root.
CosmeticsIDEA-259428"Failed to stage files" balloon incorrectly appears on staging file from ignored directory
UsabilityIDEA-108310Git: provide icon for 'Fetch' command in VCS/Git menu
FeatureIDEA-255250Git Rebase Dialog: save HEAD~n references
UsabilityIDEA-255504Git Rebase dialog: Hash from upstream field does not copied to new base field on adding --onto option
ExceptionIDEA-260333Exception on project opening after switching from non-modal to stage mode while project was closed
UsabilityIDEA-143244Propose commit message on cherry-picking even if "clear commit message" is enabled
BugIDEA-246614Modification lines are not highlighted in gutter after dynamic plugin unloading
UsabilityIDEA-260806Git Rebase dialog shows the "Select a new base" error on opening
BugIDEA-251945Can't resolve merge conflicts
ExceptionIDEA-261251Exception on diff preview opening after dynamic plugin unloading
BugIDEA-261593Cherry-pick with dialog could miss some changes
UsabilityIDEA-257569Cannot find Resolve conflicts... in the new Git menu
BugIDEA-261638Access from EDT is not allowed in GitVFSListener
BugIDEA-261550choose upstream path - Git Root cut - path partial visible
UsabilityIDEA-262282Staging operations should not be in the document undo stack.
Support RequestIDEA-254998Failed to start Git process: Unknown WSL distribution (Pengwin - Wlinux)
ExceptionIDEA-262818Exception every time then git panel is open
BugIDEA-263695Can't commit staged changes on the first Commit toolwindow opening
BugIDEA-262223Git Commit Template: respect relative paths
BugIDEA-262301Git Staging Area: don't group by repository changes in a single-root project
BugIDEA-262518Cherry-pick with conflict works incorrectly when conflicted file is open in the editor
FeatureIDEA-256885Git Stage: Support committing different git roots separately
BugIDEA-264428Git: pressing OK in "Define Remote" dialog does nothing
BugIDEA-248343Git Remote add unable to cancel.
UsabilityIDEA-262307Git Staging Area: allow commit without checking the checkbox when changes from the only one repo are staged
BugIDEA-254571"Create Git repository" action fails when the project is in WSL
UsabilityIDEA-260641Rename Revert to Rollback in Git Stage
BugIDEA-258247Git Staging Area: commit message doesn't save in "Commit Message History" after commit
Version Control. GitHubCosmeticsIDEA-252595Inconsistent PR number formatting
BugIDEA-255058GitHub Pull Requests: Empty editor is opened on moving pull request tab to new window
BugIDEA-244211GitHub PRs: Comment markdown - multiple newlines are not rendered correctly
BugIDEA-256782GitHub Pull Requests: the images in PR timeline doesn't load
BugIDEA-259886GitHub Enterprise: unable to load and add pull request multi-line comments
FeatureIDEA-233916Support adding comments to Multi-Line on pull request
UsabilityIDEA-233137GitHub Pull Requests: add tooltip to add comment
UsabilityIDEA-263182GitHub Pull Requests: add shortcut to Create Pull Request
BugIDEA-262621GitHub Pull Requests: Cannot display item - Icon cannot be found in 'GithubIcons.Branch', class='org.jetbrains.plugins.github.GithubIcons' for events with branch icon in timeline
UsabilityIDEA-262857GitHub Pull Requests: no way to switch between Title and Description inputs from keyboard
UsabilityIDEA-262835GitHub Pull Requests: no focused item on "New Pull Request" tab opening
ExceptionIDEA-262607GitHub Pull Requests: exception on successful PR creating after failed PR creation
BugIDEA-263227GitHub Pull Requests: wrong branch is preselected in head branch on PR creation if branch checkout was performed while Pull Requests tool window was opened
UsabilityIDEA-262615GitHub Pull Requests: sort alphabetically head branch list on PR creation
UsabilityIDEA-262613GitHub Pull Requests: preselect head repo improvements on PR creation in project with multiple remotes
BugIDEA-262590GitHub Pull Requests: commits with PR links are displayed incorrectly
BugIDEA-259888GitHub Pull Requests: Empty content of Pull Requests toolwindow when account token is invalid
BugIDEA-259924GitHub Pull Requests: Deleted remote remains open
FeatureIDEA-142717GitHub pull request template
FeatureIDEA-263015Ability to start PR creation without opening the toolwindow first
FeatureIDEA-263016Allow filtering branches when selecting one to create a PR
PerformanceIDEA-263978IntelliJ consumes 100% of one core while being idle
BugIDEA-263925GitHub Enterprise: can't view pull requests
CosmeticsIDEA-264070GitHub Pull Requests: add project name on New Pull Request tab
BugIDEA-263510GitHub Pull Requests: wrong line separators error on editing PR description
BugIDEA-264219Github Pull Requests: file tree on Commits pane gets stuck in loading state on new pr creation
UsabilityIDEA-263396GitHub Pull Requests: New Pull Request tab isn't focused when call Create Pull Request action without opening Pull Requests toolwindow
BugIDEA-263686Pull Requests: changing metadata from no assignees to 1 moves the entire right block to the left
CosmeticsIDEA-264072GitHub Pull Requests: rename "Create Pull Request" action and button tooltip to "Create Pull Request..."
BugIDEA-200596Git: automatically update Log after pull request creating
FeatureIDEA-146659Option to assign pull request when creating it
FeatureIDEA-226822Ability to create draft pull request
FeatureIDEA-242197Pull Requests pane should have a New button to open Create Pull Request dialogue
BugIDEA-261955GitHub pull request base branch is not the same as the branch used when branching out from selected
UsabilityIDEA-135412the Create Pull Request UI should have a history of commit messages like the commit UI; ideally letting you see the recent commit messages
Version Control. Local HistoryBugIDEA-235371When selecting 'Get' on VCS history extra space being added at the top of the file.
ExceptionIDEA-248074LocalHistoryLog - Assertion failed: not balanced 'begin/end-change set' calls
Version Control. LogBugIDEA-261290Navigation to a rebased commit from "Go To Hash/Branch/Tag" shows incorrect error message
BugIDEA-257628Typo in git "committed date" when committer and author differ
Version Control. PerforceBugIDEA-251857"time lapse view" does not work in Perforce 2020.2
BugIDEA-231976Perforce plugin should not try to delete "Default changelist"
Version Control. SubversionBugIDEA-257274i18n: VCS: Subversion: hardcode strings in SVN window
BugIDEA-257549Subversion fails on Build for AppleSilicon ARM (aarch64) due to missing native sqlite lib
No subsystemTaskDBE-12439Create icons for sortHistory and filterHistory
BugDBE-12806Jump to source not working correctly after updates
FeatureDBE-12022Set the default dialect after connecting to the data source
Code CompletionBugDBE-12780No completion for system procedures if they are unquaified
ExceptionDBE-12561Throwable at com.intellij.sql.psi.impl.SqlImplUtil.quoteIdentifier
BugDBE-11977Code completion for collection names containing dots
Code FormatterExceptionDBE-12213Egypt style pre-set doesn't work
BugDBE-12212Formatter breaks empty parentheses in Egypt style
BugDBE-12214Postgres: sometimes formatter fails to format function with arguments in Egypt style
FeatureDBE-11983OUTPUT clause formatting control
BugDBE-11953Unexpected line break after keyword 'member'
BugDBE-11975Formatting of records inside Oracle packages is not implemented
Code GenerationBugDBE-12892BigQuery: can't drop materialized view via UI
BugDBE-12759unable to get the comment information for the database view field. It's OK in version 2019.3.5.
BugDBE-5615Bug when set an existing column as auto increment primary key
BugDBE-12303Invalid sql script in modify object for Oracle materialized view
BugDBE-9945WITH block for GreenPlum DDL
Code HighlightingBugDBE-12775Outdated MariaDB dialect
BugDBE-12693Exasol QUALIFY clause
BugDBE-12517False-positive "Unreachable code", PL/SQL
BugDBE-12556'RESTART' is not recognized in PostgreSQL
BugDBE-12833Exasol: support FORCE/KERBEROS PRINCIPAL keywords for user creation
BugDBE-2489For SQL Server syntax, should recognise 'well-known' stored procedure names
FeatureDBE-12470Support MariaDB Compound Statements outside of Stored Programs
BugDBE-12528TODO comments ignored in procedure bodies for PostgreSQL
BugDBE-12500Can't use type cast inside "PARTITION OF" clause
BugDBE-12492Ambiguous column name isn't reported in qualified with CTE name
BugDBE-12371MariaDB SQL dialect: Incorrect handling of 'FOR SHARE' and 'RETURNING'
BugDBE-12499Can't pass multiple values in the ROWS FROM clause
BugDBE-12493Incorrect syntax with min_active_rowversion
BugDBE-12553Analytic functions are marked as error for H2
FeatureDBE-12473Better highlighting in Run Configurations
BugDBE-12227Specify Null Bheaviour in Window Function
BugDBE-12289Multiple PL/SQL Declarations in WITH clause
FeatureDBE-12302Support ClickHouse REMOVE DEFAULT clause
BugDBE-12285ILIKE ANY is not recognized
BugDBE-12180Unknown function STRTOK()
BugDBE-12191Invalid syntax check for the BigQuery dialect: valid `date_part` being highlighted as invalid
BugDBE-10078The legacy Transact SQL syntax for index hints like 'from ABC (index = XYZ)' is valid in MSSQL but throws syntax error in Datagrip editor
BugDBE-10730Setting statistics with multiple arguments displays syntax error
BugDBE-10422MSSQL set syntax
BugDBE-8907Combined usage of CTE and XMLNAMESPACES
BugDBE-9090ms sql server dialect errors and missing syntax
FeatureDBE-11699Extend selection
BugDBE-7432Incorrect syntax error on bulk insert in SQL Server
FeatureDBE-8603Inspection: Deprecated type
BugDBE-8887Incorrect inline hint
BugDBE-11811BOOLOR_AGG function in Snowflake SQL not recognized
BugDBE-12058Support create user from external provider syntax
BugDBE-11937Exasol: Support elseif - then syntax in function
BugDBE-6511Cannot add SUBPARTITION after PARTITION definition when Oracle dialect is used
BugDBE-12016Incorrect marking of an error in `where` clause with JSONb value
BugDBE-11928ROW_NUMBER is highlighted improperly in SQLite
BugDBE-5387SQL Server Geometry and Geography types not recognized
BugDBE-11778Support for remote(), remoteSecure(), cluster(), clusterAllReplicas() table functions as ClickHouse dialect
BugDBE-10439ClickHouse: unknown database function
BugDBE-11833[BigQuery] Support for `UNION ALL` with subqueries enclosed in parentheses
BugDBE-11829Empty string rises an error in query
ConnectivityBugDBE-12522Incorrect icons for basic support drivers
UsabilityDBE-12813Pressing the "Plus" button in the Data Sources and Drivers does nothing
BugDBE-12520Extend Provided Driver for Oracle to support Autonomous DB
BugDBE-12559Database plugin doesn't handle MySQL expired passwords
BugDBE-12365Connecting to Snowflake not working on Apple M1 silicon device
FeatureDBE-12164Support Azure AD Multi-Factor interactive Authentication (Universal with MFA)
FeatureDBE-12505Advise tnsnames records when adding a new Oracle connection with connection type TNS
FeatureDBE-10828Do not include password to data source name for "Data sources from URL" action
PerformanceDBE-12398Test Connection allocates memory but never frees it, when encountering UnknownHostException
UsabilityDBE-11884Make data source URL field expandable
BugDBE-12078Redshift AWS Profile auth is not working with jdbc driver 1.2.50
Data Editor/ViewerFeatureDBE-1764Need a way to view formatted content of xml field/variable
BugDBE-12817MongoDB: cannot convert one numeric type to other numeric type
BugDBE-12594Formatted mode for XML removes all spaces
BugDBE-12940"Toggle Soft-Wrap" button in Value Editor gone if select another cell
PerformanceDBE-11578Smaller page size limit for MongoDB
FeatureDBE-9375Edit values in MongoDB table
FeatureDBE-12714Add titled separators to context menu of column header
BugDBE-12818MongoDB: maximize doesn't show string values in a column that is detected as numeric
BugDBE-12830Grid quick-doc is broken. getDataContext is invoked on non-EDT
FeatureDBE-6704Loading Datagrip tables with descending order as default
BugDBE-11097Presto - table data view does not work
BugDBE-12410Unable to access referenced data
BugDBE-12575Filtering (and foreign Key referencing) does not work on binary columns
UsabilityDBE-11751Boolean values are difficult to distinguish. Bring the checkboxes back
BugDBE-6401H2: Cannot add/edit enum columns
UsabilityDBE-11933DataGrip is copying truncated data to clipboard without warning
FeatureDBE-12306The option to ‘auto-transpose’ when the result set is only a single record
UsabilityDBE-2955Table editor sorting: make possible to disable additive sorting by default
UsabilityDBE-10271Disable "commit" and "submit" in data grid right click menu if changes are made outside selected cells
FeatureDBE-12137Make field auto-completion available during data loading in data view filter
Data Import/ExportPerformanceDBE-11892CSV Upload extremely slow
BugDBE-12536Exasol csv upload extremly slow
BugDBE-12683Conversion failed timestamp -> smalldatetime when coping tables
FeatureDBE-10465First row is header in the context menu
FeatureDBE-11815ability to add the SQL query code when uploading data to Excel (append query text to exported data)
Database ExplorerFeatureDBE-12685'got it' tooltip about '0 of 23' control when first creating the data source.
BugDBE-12283'Show Generated Objects' setting does not always filter objects
BugDBE-12219The order of the objects in '+' button is annoying: creating data source pattern is broken
Database MigrationsBugDBE-12873BigQuery: Invalid default data type `int` for new table creation
BugDBE-12445SQL Generator produces DEFAULTS in grants for routines for PostgreSQL
BugDBE-12730Comment on routine not supported
BugDBE-12678Missing mandatory keywords when saving stored procedure
BugDBE-12589Unable to open "events" and view error when errors occur
BugDBE-8721`Create New Table` generates SQL that is not accepted by MySQL when {Auto inc, Unique} are set
BugDBE-12422Renaming MySQL JSON column with default value
FeatureDBE-12357Additional option 'purge' in drop confirmation dialog for Oracle
BugDBE-12148Table creator stops showing column being edited after error.
CosmeticsDBE-12167The popups 'New -> User/Schema/Table/etc.' provide examples and do not select them
Full-Text SearchBugDBE-12967"Full Text Search" for SQLite should use LIKE to search within LONGVARCHAR fields
GeneralBugDBE-12629Context templates for select N rows in Oracle generates invalid query
CosmeticsDBE-12628Incorrect size of resolution scope tree selection
FeatureDBE-7003Custom Password Provider Plugin
BugDBE-12533Unable to save some settings
BugDBE-11539MySQL Driver download failed on MacOS 10.15
BugDBE-12220Color Settings in Database view not working
UsabilityDBE-12098Folder icon doesn't lead to sqlite db file location
UsabilityDBE-3893Allow JSON1 extension in SQLite
FeatureDBE-10347Attach folder via drag-n-drop
IntrospectionFeatureDBE-12487Why is DataGrip refresh schemas so slow? (any version)
BugDBE-12298Cannot display DDL for mysql 8 view
BugDBE-12786Introspection fails with numeric overflow
BugDBE-4797Intospection interupted if one of DB is offline
FeatureDBE-6811Show offline databases
FeatureDBE-10584Table structure in database window does not show partition information for MariaDB/MySQL
FeatureDBE-8295Generating DDL for MariaDB: include table partition information
TaskDBE-12513Error while introspecting H2 database: Syntax Error
BugDBE-12264Code: 417, e.displayText() = DB::Exception: Expected ANY or ALL in JOIN section, because setting (join_default_strictness) is empty, e.what() = DB::Exception
BugDBE-12367Athena introspection does not work after latest update
BugDBE-12176Greenplum - when performing introspect database to rebuild index, An ERROR generated and it stops reindexing
BugDBE-12247Incorrect grants in Postgres
BugDBE-12032PG/GP Sources introspection inefficient due to forgoten join
BugDBE-11870Problem refreshing DB connection on old SQL server databases
Navigation & SearchBugDBE-12609Broken behavior for going to object declaration
UsabilityDBE-10349Make navigation clear again
PL & DDL EditorBugDBE-12829Generate DDL (SQL Scripts) doesn't handle default values properly if they're functions
Query ConsoleBugDBE-8092Database Console Editor Tab Filename Includes Path
BugDBE-12118error with select into local variable after latest update DB-203.5981.102
UsabilityDBE-12190Remove 'run 'console.sql'' item from the context menu of the editor in console
BugDBE-11734Do not highlight MongoDB and GraalJS built-in functions as unresolved
UsabilityDBE-11731Query execution for unsupported DBMS
BugDBE-7612Split statements for execution using separator
BugDBE-11564JS arrow functions are not parsed in MongoDB consoles
SQL GeneralBugDBE-10132IDE does not execute a PIVOT query
UsabilityDBE-3840SQL: Sybase: support system stored procedures
BugDBE-7361MSSQL: Incorrect read/write access for OUTPUT INTO table in "Find"
BugDBE-6504Incorrect quick fix "Quote identifier" for GOTO statement
SQL ResolveBugDBE-12779Go to declaration doesn't work with system procedures
BugDBE-8860False error in CTE with order by and union [Sql Server]
BugDBE-6525UPDATE STATISTICS does not resolve indexes as valid statistics name
BugDBE-6524Column name in unique constraint not resolved if no comma between column definition and constraint
BugDBE-6526Column name not resolved in FOR UPDATE OF clause of DECLARE CURSOR
BugDBE-5051Postgres: function's OUT parameter is unresolved
BugDBE-11832Fix resolve of Couchbase LET clause
Schema DiffBugDBE-12384Problem with some schema comparisons
BugDBE-12351'Set Do nothing' option does not affect on result migration script
Tools IntegrationBugDBE-12634"Restore with mysql" fails with added parameter (max_allowed_packet)
No subsystemCosmeticsWEB-48323'npx: the --ignore-existing argument has been removed' while creation new project (Node 15.2.0, npm 7.0.8)
UsabilityWEB-48298New projects creation doesn't proceed without confirmation in terminal (Node 15.2.0, npm 7.0.8)
BugWEB-48308core-modules is empty when enabling coding assistance for Node.js with node 15.2.0
BugWEB-48462Exiting Reader Mode crashes WebStorm when analyzing large d.ts file
BugWEB-48777JavaScript "forof" template: unstable order of elements in completion / suggestion
TaskWEB-49047Updated the Getting Started link under the Learn WebStorm tab
BugWEB-48429IncorrectOperationException when creating a project via Yeoman – project can't be created
PerformanceWEB-44334Minute-long freeze when starting to type inside large mixed php file
BugWEB-49227at-rule properties are not correctly resolved to MDN
BugWEB-48697TSLint: new version of the ts service plugin requires explicit execution rights
ExceptionWEB-49200Selecting an option in completion in React causes an exception in HTTP Client plugin
ExceptionWEB-49409InvocationTargetException when running Jest configuration with Coverage
BugWEB-48604Surround with tag not working inside parentheses
TaskWEB-47518Hide Node.js field from tool integration configuration pages
FeatureWEB-48771Ship MDN documentation with IDE
FeatureWEB-40293Add Quick documentation for SVG elements
FeatureWEB-49702Provide docs for CSSImportRule
BugWEB-49620Provide docs for JavaScript global objects
BugWEB-49530Quick documentation for pseudo CSS classes is not available in html files
BugWEB-49598('string = is not valid Windows path') when debug Node.js app via interpreter from container
BugWEB-49900MDN docs are not available for constructor calls
BugWEB-48451Vuex symbol resolution not working with namespaced modules
BugWEB-49225Quick documentation for some deprecated HTML tags should show warning and tag description
PerformanceWEB-48488Webstorm hangs with resolving reference
FeatureWEB-10499Embedded Browser
PerformanceWEB-48133Freeze after sync with file system on WSL (PhoneGap, Jade plugins)
CosmeticsWEB-48885Help popup references WebStorm instead of PyCharm
Build toolsBugWEB-48485Endless analyzing of code
BugWEB-48547Unable to resolve Webpack aliases in WebStorm 2020.3 w/ Vue or Nuxt CLI
CSSBugWEB-45868Parsing error when using DOM element selectors CSS injection if CSS dialect is set to 'PostCSS'
BugWEB-48329Wrong formatting inside styled-component
BugWEB-48533Tailwind plugin: Preview of 'white' shows wrong color
BugWEB-48257Tailwind autocomplete doesn't work in JS string templates
ExceptionWEB-48770Stub type mismatch: PsiElement(CSS_PSEUDO_CLASS)!=PsiElement(CSS_PSEUDO_ELEMENT) in #Language: CSS
FeatureWEB-48226Tailwind CSS support doesn't work in Yarn PnP projects
BugWEB-48210Valid value 'break-spaces' of CSS property 'white-space' is highlighted as error.
BugWEB-48695Don't report "Redundant measure unit" error for css-grid "fr"
BugWEB-48207CSS parsing error when using negative function arguments in min()/max() functions
BugWEB-49011TailwindCSS completion/css-preview on hover doesn't work when using breakpoint prefixes with utilities
ExceptionWEB-49193ClassCastException: GruntfileManager cannot be cast to GruntfileManager
BugWEB-40212The CSS env function is flagged as unknown
BugWEB-49410Don't show docs for HTML tag when caret is on CSS class selector
BugWEB-48473TailwindCSS plugin doesn't work if "tailwincss" package version is "npm:@tailwindcss/postcss7-compat@^2.0.1" and 'npm' is used as package manager
FeatureWEB-8295Show selector specificity for CSS code
BugWEB-49387Show values for CSS properties in the quick documentation popup
BugWEB-35215CSS modules, SCSS/Less: support selectors created using &_suffix
BugWEB-48428Tailwind CSS support does not work in WSL2
CoffeeScriptBugWEB-38553CoffeeScript: JSX: simultaneous editing is not working for React.Fragment shorthand
DartBugWEB-43142Contents of typed_data does not show up in the debugger
BugWEB-48717No option to create a new Dart project in IntelliJ IDEA Community Edition (Dart plugin enabled)
BugWEB-48497"Reformat code before commit" option sometimes doesn't work in Dart/Flutter projects.
UsabilityWEB-48264'Dart Command Line App' and 'Dart Test' run configurations should start Observatory only when debugging
FeatureWEB-25687Add 'VM Options' field to the Dart Test run configuration editor.
TaskWEB-49464Support new Dart syntax: Generalized Type Aliases
BugWEB-50043Dart file move: relative imports become absolute. (Windows only)
DebuggerBugWEB-48558Don't suggest to Open in Browser Vue and other template files on built-in web server
BugWEB-48816Chrome custom user data gets cleared on IDE restart
BugWEB-48918Mocha: Debugger doesn't stop on breakpoints when use WSL interpreter
BugWEB-46662Multiprocess nodejs debugger not working with wsl2 node interpreter
BugWEB-46619WSL debugging is not working while using npm run configuration
BugWEB-49996Throwable + IllegalArgumentException + can't press anything in IDE after Force step into
UsabilityWEB-49896Rename 'Console' for Node.js
BugWEB-50050BlockingOperationException when debug electron app via npm script
File WatchersBugWEB-49445"$/FilePathRelativeToProjectRoot$" is not treated as a file specific macro
HTMLBugWEB-41768Multicursor Emmet unstable behavior
BugWEB-47551Multicursor Emmet creates broken code
BugWEB-46838Wrong tag autocomplete with several cursors
BugWEB-47806Incorrect paired tag editing
BugWEB-42725Problem with html tag autocomplete, changes the wrong tag
BugWEB-28886Unclosed p tag wreaks havoc
BugWEB-48715Quick doc using MDN documentation is broken
BugWEB-48185wrong autocomplete for react fragment shorthand syntax close tag in jsx
BugWEB-36210Allow ARIA accessibility attributes in SVG elements
BugWEB-49001Support data-* attribute in SVG 2.0 files
BugWEB-49690No documentation for 'onclick' attribute in button tag
BugWEB-49051Adding a new JSX tag causes simultaneous editing of non-related closing tag
BugWEB-49654`type` attribute on HTML 'script'/'style' is marked deprecated, but its not
BugWEB-49386Show supported browser versions for HTML tags in the quick documentation popup
BugWEB-49285"loading" attribute of "<img>" tag is reported as not allowed
JSONFeatureWEB-31888Add support for JSON Lines file format (.jsonl filename extension)
BugWEB-49403Empty .jsonl files show error
FeatureWEB-26450Add JSONPath evaluator to JSON editor windows
JavaScriptBugWEB-48567/** should expand into the doc comment in empty file
BugWEB-48901JSDoc: return type not correctly inferred from @return when assigning imported function
BugWEB-48989JSRegExpModifierProvider treats 'm' as Pattern.DOTALL instead of Pattern.MULTILINE
BugWEB-49003Deadlock in JSResolvedTypeIdCache
ExceptionWEB-49154PsiInvalidElementAccessException: Element: class com.intellij.lang.javascript.psi.impl.JSReferenceExpressionImpl because: containing file is null
BugWEB-46879Code completetion doesn't work on destructuring exports with renaming
BugWEB-48574function name() template doesn't work in some cases
BugWEB-47260Snake Case filename convention doesn't work for Typescript
BugWEB-48603"Insert pair quote" option stops working in `.jsx` after adding any js pattern to "React JSX" file type
BugWEB-47276Some object variables displays as unresolved from another class in node.js
BugWEB-48008Requiring a module breaks class member intellisense
BugWEB-48245JSDoc: infer method parameter types from the jsdoc interface definition
BugWEB-48425Preceding exclamation mark in a comment in Array disables RegExp literal recognition (Javascript)
BugWEB-47428Code Inspection "Comparison of expressions having incompatible types" does not recognise optional types
BugWEB-47118False positive: onclick unresolved variable
UsabilityWEB-48501Invoke completion suggestions for strings only after typing 4+ symbols
FeatureWEB-38709Automatically add file extensions in imports in files with .mjs extension
BugWEB-48368"Opening file" status does not disappear in Flow toolwindow
BugWEB-48551Autocomplete suggestions for properties of an object returned by Object.freeze no longer works in Vue SFC files
BugWEB-46991Invalid "unresolved variable" warning in JSDoc inside a destructuring object assignment
BugWEB-47419False "JSDoc comment matches function signature" violation for destructuring parameters if there is a rest parameter with name matching object name
TaskWEB-47437Support move members refactoring should respect index.js files for folders
FeatureWEB-48448Add more meaningful information to breadcrumb
BugWEB-48976Comma expression without parentheses inside a string interpolation expression marked as a syntax error
BugWEB-48719Having a colon in JSX results in a syntax error
BugWEB-42605JSX fragment closing tag with a space breaks syntax highlighting
BugWEB-48348JSDoc: РЎtrl+click on parameter description shows usages
BugWEB-48400Base-class method is not known by intellisense when class is in separate file
TaskWEB-49030Support this annotations in functions
BugWEB-49037RejectedExecutionException when comment a piece of code
BugWEB-49082Add support for type parameters in anonymous class expressions
BugWEB-49081Support declare on class fields
BugWEB-48318Wrong code references for static methods in JavaScript
BugWEB-47179Subclass of type is not recognised
BugWEB-43860"Element not exported" shown for class field declared in constructor
TaskWEB-48969Add help tooltip for "Unambigous imports on the fly" option
PerformanceWEB-48019Completion in JavaScript has become slower
BugWEB-47223Inject CSS in Element.closest
BugWEB-14586No means to override Type Library Inspection error.
BugWEB-48945Invalid suggestion list for plain text string
BugWEB-47305Typo in word: false positive
BugWEB-48803Import suggest does not work for "render" react-dom method
BugWEB-49250False positive invalid code with property computed with combination of "in" and ternary operators
TaskWEB-49259Show suggestions from string literals only on Ctrl-Space
BugWEB-49290JavaScript private class members # syntax: member name starting with "include" reported as error
BugWEB-49224No completion for exported modules within destructured require()
BugWEB-49149In JSX files a syntax error is still reported after correction
BugWEB-49249javascript statement parsing error in Ultimate 2020.3
FeatureWEB-11205Move statement up/down and comments
FeatureWEB-29361Better color scheme highlighting for javascript jsdoc comment block
PerformanceWEB-48983Webstorm 2020.3.x MacOS slow and high CPU compared to 2020.2
BugWEB-48606Incorrect type definition in 2020.3
BugWEB-40528Incorrect JS autocompletion
BugWEB-49429Cannot fetch external documentation error in JavaScript doc popup for standard methods
FeatureWEB-48502Allow disabling completion suggestions for strings
BugWEB-49307Opening project in new version of IDE changes settings of JavaScriptSettings component in .idea/misc.xml
BugWEB-49506Unwanted character escaping in `Template literals`
TaskWEB-48616Smart suggestion variable and function names based on file name
BugWEB-49424Documentation invoked from JSDoc tag can't render definition part properly
BugWEB-49462Type of async function called with `await` is not evaluated correctly
BugWEB-49156Incorrect syntax error "yield is not allowed as identifier in strict mode" in a generator function
BugWEB-49699Type is not correctly inferred when iterating over a collection typed with JSDoc using "for .. of" loop
BugWEB-49717False-positive no overlap for destructured props
BugWEB-35948module.exports not recognized
BugWEB-49850'rulezzz' in suggested completion names
PerformanceWEB-49859High CPU usage on file change
BugWEB-49764No suggestion to auto-import commonJS module if the module is required in other files
PerformanceWEB-49073High CPU usage
BugWEB-49905Incorrect refactoring rename property (js + jsdoc + ts)
BugWEB-49499Highlight correct argument in parameter info when using spread in function calls
UsabilityWEB-48904Request a way to include dynamic references when refactoring names
BugWEB-49727Auto SQL code inject doesn't work with variable in JavaScript string template
BugWEB-49869Highlighting issue in JSDoc @see tag
BugWEB-42617Not recognizing TypeScript generics in JavaScript
BugWEB-47219module.exports = class Foo doesn't work like module.exports = Foo;
BugWEB-49034Broken formatting in TSX with HTML "Enforce single quote" + removing trailing commas
BugWEB-50035Runaway indexing yet again
CosmeticsWEB-49078'Expand optional chaining and nullish coalescing to explicit checks': update intention's example
BugWEB-40048Quick documentation on leads to 404
BugWEB-33199'querySelector()' documentation is not available
JavaScript. FormatterBugWEB-48237Enter and backspace handling in the beginning of the injection
BugWEB-47523AlignOnColon formatting: inconsistent behavior
BugWEB-50053Spaces not removed after parameter property modifiers
JavaScript. FrameworksBugWEB-49135Incorrect import suggestions for React methods
BugWEB-49064Using getter in React defaultProps breaks JSX syntax
BugWEB-46889"Go to Declaration" not working for Vue methods (within script block)
BugWEB-48465Language injection not working in <i18n> vue single component file
BugWEB-39057PyCharm, new React project wizard: missing option 'Create TypeScript project'
BugWEB-29018vue files with jade/pug as lang - comments not working!
BugWEB-48461Auto-import for vue component not working with Vue.extend
BugWEB-47948HTML in PHP files is indented according to Vue indentation settings
BugWEB-48478Vuex: regression in support for namespaced store modules with Nuxt
FeatureWEB-31721Vue: support Vue.extend() construction
BugWEB-48837Nuxt: Issue auto-importing components from paths ending with '/'
FeatureWEB-46418Nuxt.js: support component auto-import with @nuxt/components
BugWEB-33866Vue.js: correctly handle lazy loaded Components
BugWEB-41733Angular: "Missing associated label" when using attribute binding for 'aria-label'
BugWEB-33969Angular: "Form input without an associated label or title attribute " warning in case of property binding
FeatureWEB-41922Don't report 'missing associated label' warning when using <input> in Bootstrap <b-form-group> with label
BugWEB-36025Wrong ID tag recognition ('missing associated label' warning) if it is set as vue prop
FeatureWEB-44150Vue: support type inference for component props within template
PerformanceWEB-47150Performance issues with `styled-system` and TypeScript
BugWEB-49137Quick fix 'Add import statement' doesn't work for 'React'
FeatureWEB-43318No code completion in dynamically evaluated classname attribute value
BugWEB-49229MDN documentation for tags in TSX is broken
BugWEB-48038No autocompletion for makeStyles/createStyles
BugWEB-48778Auto-import doesn't work for components with doc comments
BugWEB-49656'React' is duplicated in completion
BugWEB-31701Vue.js: `ref` attribute is not correctly handled
BugWEB-47477cmd-click on a $refs in vue script should go to the ref in the template instead of where $refs is defined in the vue code
BugWEB-48980Unrecognized regular (not binded) "key" attribute in Vue templates
BugWEB-47054Vue: Support properties from super class of a decorated component
FeatureWEB-43480Quick documentation for Angular components
BugWEB-47706No props completion for function component with propTypes
BugWEB-49657incorrect import suggestions in react+js for React.createElement()
PerformanceWEB-49122Avoid accessing index if it's not built
FeatureWEB-34380Vue.js: support recognition of CSS classes inside literals in :class bindings
PerformanceWEB-49596Every press on the mouse right button cause a freezes for a few seconds (approximately: 5s) and is annoying
BugWEB-49838Infinite indexing with Vue plugin (EAP 2021.1)
BugWEB-49311Vue 3 + Vuex 4 - Mutations, actions & getters: wrongly marked as unused
FeatureWEB-49157Provide support for Vuex 4 store
BugWEB-49901Actions inside vuex 4 modules have no indication of being in use.
BugWEB-49920Wrong props types validation in Vue 3
FeatureWEB-32178CSS modules in Vue <style> tags are not supported
FeatureWEB-43748input missing associated label error when using @angular/material
PerformanceWEB-49959Freezes on vuex completion
BugWEB-48085Code completion and auto-import don't work for Chakra-UI components
PerformanceWEB-47515Slow syntax/error higlighting
JavaScript. InspectionsFeatureWEB-49032Don't report "unused property toString" when the property is implicitly used in template literal
BugWEB-48310Add "use strict" pragma quick fix breaks code
BugWEB-47292Inspection 'Mismatched query and update of collection' isn't shown for array
BugWEB-18700JSDon @callback tag description isn't displayed in documentation modal window
FeatureWEB-10308Ability to suppress inspection for file
BugWEB-46924JS: outer captured variable assigned in a closure is marked unused
BugWEB-43129Type Mismatch warning when setting current value of a useRef() to a custom type
TaskWEB-49631Remove 'Using function arguments object outside function' inspection
FeatureWEB-48305JavaScript: Add an inspection to check usages of void function
BugWEB-49796"Void function return value used" inspection shouldn't work on IIFE
BugWEB-49443Can be simplified to [...] for (JSDoc + TypeScript)
UsabilityWEB-46611Add example to Unfiltered loop inspection description
JavaScript. RefactoringBugWEB-47263Extract Method > "Selected fragment has multiple exit points"
BugWEB-48437Extract method adds redundant parameter
BugWEB-45292Can‘t Refactor in TypeScript File
BugWEB-50091Do not change const to let when applying the 'Replace for...of' intention
BugWEB-47108Quick-fix 'Create field' creates field outside the function's scope
LintersBugWEB-48468ESLint eslint-plugin-vue 'vue/comment-directive' — error in the end of public/index.html just after vue-cli installation
ExceptionWEB-49295JSLinterGuesser.guessLinters: throws Slow operations are prohibited in the EDT
BugWEB-49013Prettier doesn't work on save or reformat if trailing space is accidentally added to glob pattern
ExceptionWEB-49593'Access is allowed from event dispatch thread with IW lock only.' when open a project
FeatureWEB-47511Lint Javascript in Laravel Blade files with ESLint
FeatureWEB-49181Support ESLint in MDX files
FeatureWEB-47837ESLint support for CoffeeScript files
BugWEB-47908TypeScript files are not linted when `@babel/eslint-parser` parser is specified in the config
FeatureWEB-33429Stylelint: provide a way to specify config file location
FeatureWEB-25069Stylelint: implement auto fixes
BugWEB-49512EslintConfigWrapper.RULES leaks references to extensions from unloaded plugins
Live EditBugWEB-48560Live editing external CSS doesn't always work
Node.jsFeatureWEB-48961Support Yarn PnP with ES modules (.pnp.cjs)
BugWEB-48086Package express successfully upgraded but the version remains unchanged
UsabilityWEB-48610Webpack error output not clickable for many types of apps (Vue.js app, Typescript, webpack, etc.)
FeatureWEB-38060ESLint report file paths are not clickable
BugWEB-47427performance - indexing hard links - used by pnpm & @microsoft/rush monorepos
BugWEB-49297docker-desktop is available in the 'WSL | Linux distribution' list
BugWEB-42169Vue: Support Yarn 2 in PnP mode
SASSBugWEB-48499"There is no module with the namespace" error when using "<namespace>." syntax to access variables/functions if @use declaration is preceded with variable declaration
BugWEB-14547SASS. "Expand shorthand css property" removes variable.
TypeScriptBugWEB-50001Package Type Inference Broken with Yarn 2
TaskWEB-48434Update bundled TypeScript to 4.1
BugWEB-48407Node-style module resolution shouldn't be applied for vue in *.ts
BugWEB-48579Template type is not believed to be assignable to constraint type in template literal type
BugWEB-48675TS 4.1 template string literal type isn't being fully computed for switch statements ("Possibly infinite type substitution" error)
BugWEB-48741"a module cannot have multiple default exports" with overloaded default function
BugWEB-47869Error on generic async methods called get
BugWEB-48627"Mismatched query and update of collection" warning should not be shown for unused variables
BugWEB-48950"Ambient declaration should have no body" false positive when function declaration followed by block statement
BugWEB-48903Update bundled schema for tsconfig.json
PerformanceWEB-43639Resolution of augmentations may be slow
BugWEB-49621Typescript unsuccessful auto-completion for known type. Syntax highlighting gets stuck.
BugWEB-43140export const [ destructured_1, desctructured_2 ] = my_array not being indexed in *.ts files
BugWEB-49802Provide docs for standard JavaScript interfaces in TS
PerformanceWEB-48997CPU Spike, while editing mocha *.ts/*.js files
BugWEB-47178Row & Col component cannot be prompted when using antd v ^4.5.4
TaskWEB-49833Update bundled TypeScript to 4.2
BugWEB-46680Union literal completion broken for type created from typeof when using type only import
FeatureWEB-49094TypeScript 4.2: abstract Construct Signatures
BugWEB-49826false 'missing required attribute' error for styled components
BugWEB-48295Changes made to imported JSON not immediately recognized by Typescript language service
BugWEB-49779wrong colour for inferred generics
BugWEB-49888Go to defintion and find usages not works with ts imports started with slash
FeatureWEB-44914Move refactoring on TS class or interface: default to file with same name
PerformanceWEB-49847Sluggish typing during autocomplete of big firebase angular material projects
BugWEB-50019Syntax error using `import type thing = require('things')`
BugWEB-49595No import suggestions for variables that are assigned values vie destructuring
BugWEB-49327Webstorm auto import does not work properly with inherited aliases
Unit TestsFeatureWEB-48850Detect mocha config file automatically
BugWEB-39983Cucumber.js 5: step definitions can't be matched when using custom parameter types
BugWEB-48312Can't run Karma with Coverage in @angular/cli@next project
BugWEB-42164Test assertion diffs are not shown when using jest-circus runner instead of jest-jasmine2
BugWEB-48463Cucumber 7.0.0: can't find cucumber package to set up run configuration
FeatureWEB-13230Can't set environment variables for Cucumber.js tests
BugWEB-42292Cucumber.js: support for versions 6.0.0+
BugWEB-49314Cannot debug karma v6 test code (error in karma-intellij-debug.js)
BugWEB-48673Jest: save Coverage report according options in jest.config.js when call 'Run with Coverage'
BugWEB-48569Error debugging Mocha tests run with Vue CLI due to "Unknown argument: jobs"
BugWEB-49052Running All Tests in Jest doesn't show the error message when there is a failed test.
BugWEB-49452Failed Jest test never completes when running with `--watch`
FeatureWEB-46202Jest "update failed snapshot"/"go to snapshot" not available for `toThrowErrorMatchingSnapshot`
BugWEB-49873'Cannot read coverageDirectory option' when re-run Jest tests
BugWEB-32836Coverage reporter is asking for `` file if `coverage` is absent in karma.conf.js reporters
BugWEB-49309Cucumber.js plugin breaks when feature file uses Example/Rule syntax
BugWEB-49534Cucumber.js: run configuration for scenario outline
Plugin: Deployment _ FTP..UsabilityWI-55338"Sync with" menu item missing when default server is selected if Web server URL is empty