No subsystemFeatureRUBY-23557Change profiler frames colors
FeatureRUBY-8877Iterator Methods - Automatically complete {}.
BugRUBY-23695Make Chef plugin automatic deployable
BugRUBY-21929Improve default gems handling
BugRUBY-23491Fix RubyGemExecutionContext as a holder in CV closure
TaskRUBY-21189Rewrite `RubyPsiUtilBase#getElementText`
Code InsightFeatureRUBY-23401Factory Bot - support paramdefs for defining associations inside factories
FeatureRUBY-23400Factory Bot - support inheritance by nesting
FeatureRUBY-23232Factory Bot - add parameter suggestions when creating factories
FeatureRUBY-23233Factory Bot - add types when using factory creation methods
FeatureRUBY-23379FactoryBot - provide partial definition line markers for factories
FeatureRUBY-16165caller hierarchy (tree) for methods
FeatureRUBY-23306Factory Bot - support factory aliases
FeatureRUBY-23235Factory Bot - ensure find usages works for factories, sequences and traits
FeatureRUBY-22947String Constant Inference + Dynamic Method Inference
FeatureRUBY-22276YARD comments for instance variables
FeatureRUBY-23228Factory Bot - support jumping from a factory usage to it's definition
FeatureRUBY-23229Factory Bot - reuse code and add support for Factory Girl
FeatureRUBY-22876Nil analysis doesn't process ternary operator
BugRUBY-23472Find usages for global variable miss assignments
BugRUBY-23564There is no validation for string when create methods from string contstants
BugRUBY-23545Wrong inferred return type of empty-body method
BugRUBY-23279Exception raised on type inference of not completed ternary expression
BugRUBY-23254Allow multiple YARD directives to be declared in a row via comments
BugRUBY-22297Unused variable inspection. False Positive. Declaration before Retry
BugRUBY-23248RDoc Lexer has O(N^2) complexity which suddenly leads to RubyMine freezes
BugRUBY-23436Factory Bot - getByFirstRArgument in partial declaration line markers is broken for aliases
BugRUBY-23295In case of many assignments variables are not connected by single expression
BugRUBY-23449Factory Bot - don't suggest "self" in param defs for parent factory suggestion
BugRUBY-23740Fix with_options block parameter type
BugRUBY-23533Show Choose Declaration Dialog for fields and attribute accessors
BugRUBY-23565Typing separator in array of strings may cause exception
BugRUBY-23515Factory Bot - recognise methods in spec files
BugRUBY-23451Factory Bot - in related symbols, we should show the original factory name not the aliases
BugRUBY-22286No type inference for if statements
BugRUBY-23448Factory Bot - don't show a warning on factory name as "unresolvable" if we have a class/parent/implicit parent specified
BugRUBY-21142Usages Read/Write access does not work for fields
BugRUBY-23683No dynamic method resolve for symbols with expression substitution
BugRUBY-23460Factory Bot - include type information in paramdef completion popup
BugRUBY-17790Type is not inferred for instance variables with attr_readers
BugRUBY-23530Call hierarchy in ruby injections in erb doesn't show titles of callers
BugRUBY-23274RUBY: I18nKeyNamesValidator is too restrictive for YAML keys
PerformanceRUBY-23246Indexing time is increased
UsabilityRUBY-23457Factory Bot - tidy up find usages classifications based on where they are used
TaskRUBY-22972Rewrite ControlFlow in order to have some invariants
TaskRUBY-23518Factory Bot - check correct behaviour of nested factories with class/parent options
TaskRUBY-23519Factory Bot - check expected behaviour when sequences/traits are defined with the same name
ExceptionRUBY-23546Find usages of factories/traits/sequences throws exception
CucumberBugRUBY-23202Find usages doesn't work from step definitions
DebuggerFeatureRUBY-21038Allow to use pre-load server while debugging tests
CosmeticsRUBY-23635Empty line is added before code after patching Spring config
DockerBugRUBY-23582Docker exec mode on Windows doesn't work
EditingFeatureRUBY-20704Make continuous auto indent with hashtag on comment blocks configurable in the Settings
FeatureRUBY-23030Provide "File" as an option in new "Ruby Class"
FeatureRUBY-16190Show method in isolation (focus mode)
BugRUBY-23042Replace Test-Spec template with a Minitest template
BugRUBY-23203Move Caret to Matching Brace doesn't work for do/end blocks
IDEFeatureRUBY-23435Factory Bot - add icons to completion and other locations
FeatureRUBY-23468Refactor This... -> Create method should infer arguments
FeatureRUBY-13000Add model factory to related files
BugRUBY-23478Unable to run bundle install when user shell is set to fish
BugRUBY-23369ChefDK isn't saved in the list of SDKs
BugRUBY-23391Cannot run bundler actions with Ruby 2.6.0 on Windows
BugRUBY-23674FactoryBot - add gutter icons to settings
UsabilityRUBY-23450Update Rails "Related to Symbols" dialog
UsabilityRUBY-23445Rails 6.0 is provided in the list for Ruby older than 2.5 in Create New Project dialog
InspectionsBugRUBY-23225No assert that value is not nil after it was colon dereferenced
BugRUBY-23270Unused local variable false positive. Redo statement in For statement
BugRUBY-23244Nil dereference after nil colon method
BugRUBY-23331Remove unnecessary return statement leads to unnecessary local variable
BugRUBY-23479Block variable is not registered as used if referenced only in symbol construction
MarkdownBugRUBY-19897Duplicated JavaFX markdown preview panels
BugRUBY-22869Markdown formatting options shows as undefined in Undo
BugRUBY-21555Markdown preview - Custom CSS is not applied
ParsingBugRUBY-22406Incorrect parsing of if modifier
ProfilerFeatureRUBY-10368Rbspy Profiler Support
FeatureRUBY-23662Import profiler data
BugRUBY-23656Profiler tab notifications displayed when run or debug
BugRUBY-23828Path to rbspy is not detected on Windows automatically in the Settings
BugRUBY-23824Paths in process names are not soft shorted
BugRUBY-23680Ruby Profiler doesn't start on Windows
BugRUBY-23697Profiler doesn't run with tests
BugRUBY-23827Profiler custom settings are not saved after restart IDE
BugRUBY-23668Profiler cannot be stop from Performance Profiler tab
BugRUBY-23779Escape angle brackets in profiler's flamegraph frame hover
BugRUBY-23651Profiler cannot be run without sudo on macOS
UsabilityRUBY-23660Ellipsis makes it difficult to analyse the results in Flame graph
UsabilityRUBY-23833'Attach profiler to process' action is available when no Profiler run configuration is specified
UsabilityRUBY-23825No data is available to generate report is shown on Windows
CosmeticsRUBY-23654Tooltip on the profiler icon shows underscore in the name as doubled
RHTMLBugRUBY-23187Reformatting adds an extra space before %> bracket in case there's a comment
BugRUBY-21386Smart remove of paired quotes
RailsFeatureRUBY-21264Exclude webpack output directories from indexing when using webpacker gem
FeatureRUBY-5014Factory_Girl gem code insight support
BugRUBY-22726Rename rails association from Structure view doesn't provide class name
BugRUBY-21443Ability to create views for Rails API projects
BugRUBY-23044Add support for query field methods for all fields in Rails models, not just boolean fields
BugRUBY-23474Cannot add new locale with translation in Create Property dialog
TaskRUBY-22785Investigate possible speedups in rails tests by skipping tests with mismatched rails versions
Rails. Code InsightFeatureRUBY-22333I18n add support for default option
FeatureRUBY-23148Polymorphic associations - resolve source parameter
FeatureRUBY-23143Polymorphic associations support for source_type param
FeatureRUBY-23231Factory Bot - add support for Rails-specific attributes & associations
BugRUBY-23146Polymorphic associations - use source_type to filter resolves if present
BugRUBY-16945go to declaration for (render 'partial.js') can't resolve "_partial.js.erb" in app/views/application
BugRUBY-23050Support table_name_prefix in parent modules
BugRUBY-23463Fields 'title' and 'name' from factories are resolved into Capybara code
BugRUBY-23554Completion contains running items
BugRUBY-23144Polymorphic associations - don't offer class names in `through` argument
BugRUBY-22190Allow _url and _path autocomplete inside of controllers and in Rails API projects
BugRUBY-23046Offer model fields when performing text based resolution
BugRUBY-23145Polymorphic associations - resolve as: arguments to associations
Rails. DiagramsBugRUBY-18898Controller fields displayed twice in the Ruby class diagram
Rails. ParamdefsBugRUBY-22967Update Bundler paramdef provider to include x64_mingw as a platform
Rails. Project ViewFeatureRUBY-23067Rails Project View - create a "concepts" top level folder
BugRUBY-23034Rails Project View - create a "jobs" top level folder
BugRUBY-23036Rails Project View - include "app/lib" in the Lib top-level folder
RefactoringsBugRUBY-23285Refactor / Inline doesn't recognize usages in blocks
BugRUBY-23110Extract field: strange name suggestions
Remote InterpretersBugRUBY-23574No gems are shown and cannot install bundler for WLinux Ruby SDK
BugRUBY-23605WSL sdk gems from Ubuntu 1804 are not visible in RM
BugRUBY-23338Adding remote sdk dialog is looped
Ruby Version ManagersFeatureRUBY-19217Recognising alternative Ruby implementation called TruffleRuby
BugRUBY-23456Error searching for RVM, despite RVM not being installed.
BugRUBY-23166RM thinks gems in rbenv gemset aren't available even though they're in selected gemset
BugRUBY-23584RM is non-responsive after rename .ruby-gemset or .rbenv-gemset file
BugRUBY-23936Deadlock in getRvmHome in 2019.1 RC1
ExceptionRUBY-23444Error getting RbConfig exception and crashes on the start
ExceptionRUBY-23586Rbenv may refresh things synchronously
RubyGemsFeatureRUBY-21455Gems under local development don't appear in the "External Libraries"
FeatureRUBY-16865bundler config for gemfile is not respected
BugRUBY-18065Deadlock on startup
TestsFeatureRUBY-15635Support for RSpec dynamic 'have_' matchers
BugRUBY-22425Lines size limit cause false positive tests run
CosmeticsRUBY-15628RSpec test template uses deprecated code
YAMLBugRUBY-23671<< is not valid property key for Merge Key
BugRUBY-23497Should handle empty values in json-schema-based YAML validation
BugRUBY-23470JSON Schemas: Validates to more than one variant
BugRUBY-23469YAML plugin should show error when 'number type' is used in an array of 'string type'. JSON editor does not have this issue.
BugRUBY-23616YAML plugin: missing ‘suggestions’ . JSON editor does not have this issue.
BugRUBY-22583Icon for Show aliased sub-trees is not +
BugRUBY-23628YAML schema-based code completion eats colons on tab
BugRUBY-23294YAML: Don't input value to property if it already contains some value
No subsystemFeatureIDEA-138797Prevent double click from maximizing tabs
FeatureIDEA-111333Provide Sublime Text keymap
FeatureIDEA-192898I want to provide searchable options from plugin to allow searching plugin settings in the settings dialogue.
FeatureIDEA-142157"Dump Threads" action in Run panel should open dump view
BugIDEA-201667Soft-Wrap works incorrectly with Inlays
BugIDEA-205817It's possible to open several Recent Locations popups simultaneously
BugIDEA-206149Fix com.intellij.ui.stripe.Updater#findPreviousIndex
BugIDEA-205603Recent Location popup is not redraw after resize
BugIDEA-205847Comments from coffescript files shown as text in snippets
BugIDEA-149084Spring Boot: completion in .yml files: incorrect results on inserting property if one with same prefix exists
BugIDEA-2061325 modules of the IntelliJ Community are missing in the master branch source tree
BugIDEA-206726Test icon doesn't appear after test completion
BugIDEA-202994DiffUserDataKeys.GO_TO_SOURCE_DISABLE property is ignored in OpenInEditorAction
BugIDEA-203310Memory leak detected VirtualFilePointerManagerImpl, ConsoleViewImpl
BugIDEA-200366No way to configure Run Configuration Templates for a new projects in non-IDEA IDEs
BugIDEA-207318mac.touchbar exception in 2019.1 EAP
BugIDEA-73793PyCharm will freeze when opening certain files and switching to another app
BugIDEA-202296EditorConfig-related actions in the status bar: on the first attempt only one action is shown
BugIDEA-205818Switching between Look and feel spoils Recent locations popup
BugIDEA-125327"Surround with try/catch" code generation seems to not respect final modifier settings
BugIDEA-204173"Settings | Scopes" - "Expand" action doesn't work for ill-formatted strings
BugIDEA-185161ShelveChangesManager must be PersistentStateComponent
BugIDEA-208060Deadlock on Rider startup
BugIDEA-207848IDE crashes on startup
BugIDEA-199415UIDefaults completion inside IntelliJ theme files
BugIDEA-205663Recent Locations is not available in Find Action
BugIDEA-204674The logs' arhive file name is too generic
BugIDEA-203356Junit tests should not be marked as ignored when assertion in @AfterClass fails
BugIDEA-145069EditorConfig plugin doesn't handle indent_size option correctly
BugIDEA-202134Wrong location of a magnifier icon in Light theme on Mac
BugIDEA-201376IntelliJ IDEA 2018.2.4: Mocha 5.2.0 with Node 10.12.0 does not work, only output when trying to run test: Test Framework quit unexpectedly
BugIDEA-168781Mnemonics for run actions is broken in case of '_' and '&' in configuration name
BugIDEA-204455Breadcrumbs: breadcrumbs still shown after turning them off
BugIDEA-206008Test with Coverage doesn't report number of passed tests in tooltip
BugIDEA-205658Empty lines at the end of file are shown as empty snippet
BugIDEA-204044move clashes with resize in custom decorated mode
BugIDEA-207782Memory leak in gradle import process
BugIDEA-201820UI concurrent creation
BugIDEA-206487Error:java: java.lang.IllegalArgumentException: Not supported: org.jetbrains.jps.javac.InputFileObject[...]
BugIDEA-205350Fold region at beginning of file causes issues
BugIDEA-203108fix for RUBY-19897 fails with JFX10
BugIDEA-208045Exception from `RootModelImpl` on (Cargo) project update.
BugIDEA-205756contract can be simplified
BugIDEA-204163Don't suggest `P` and `B` live templates in all Kotlin contexts
BugIDEA-201003Huge freeze while "navigate to test data"
BugIDEA-204946File templates: File Template Variables aren't parsed in includes
BugIDEA-204505Plugin Settings: Custom plugin icons are not scaled on HiDPI Linux
BugIDEA-201532The BlockInlay loses the background of the editor's selection
BugIDEA-206403unused declaration inspection: constructor used in code outside analysis scope should be marked as used
BugIDEA-205654Extra lines in recent location snippet
BugIDEA-203161SOE at ThreeComponentsSplitter.visibleDividersCount() on attempt to open Run tool window in certain Gradle-based projects
BugIDEA-206285Suggestions bubble can make it impossible to mouse click at the beginning of line
BugIDEA-205610Already disposed exception if close project with opened Recent location popup
BugIDEA-202381Missed splitter in navigation bar
PerformanceIDEA-200469Should we really convert code style settings into XML just for damage checking?
UsabilityIDEA-201429Remove .editorconfig from the list of file templates
UsabilityIDEA-206611Editor | General | SoftWraps| Soft-wrap file types: it is unclear how to specify types there
UsabilityIDEA-205681Recent location list size should be configurable in Settings
UsabilityIDEA-205605Long code samples shows scroll bars
UsabilityIDEA-205653There is no ability to clear Recent Location history from popup
UsabilityIDEA-155709IDE Fatal Errors dialog could show the installed plugin version when blames a plugin
UsabilityIDEA-204836Nested class/method navigation breadcrumb trail off by one
UsabilityIDEA-161842Key Mapping: Ctrl-Y not assigned to "Redo" is problematic
UsabilityIDEA-202024Rename "View / Expression Type" to "View / Type"
UsabilityIDEA-78518Method Inheritance Hierarchy should allow to narrow by search scope
UsabilityIDEA-201792Ability to edit Run Configuration Templates when a project is opened
UsabilityIDEA-204836Nested class/method navigation breadcrumb trail off by one
CosmeticsIDEA-205841Right border is not redraw if resize Recent location popup
CosmeticsIDEA-168874New 'Find in Path' dialog hard to read
CosmeticsIDEA-204514Some spaces between file names in logs would be really nice
CosmeticsIDEA-201465Improve display for long string in Ctrl+hover tooltips
CosmeticsIDEA-203127Rename "Settings Summary" to "Collect Troubleshooting Information"
CosmeticsIDEA-187402When compressing CPU profile, progress bar in status line says "compressing memory snapshot"
CosmeticsIDEA-201114Plugins: do not show "Show All" link if all plugins in the group are already shown
TaskIDEA-205758Hide 'Show parameter name hints on completion' in Code Completion settings
TaskIDEA-205600[Bundled JRE 11] Get rid of MimetypesFileTypeMap usage because it is moved to private package since JDK 11
TaskIDEA-207393Update bundled trove library to prevent unnecessary rehashing
TaskIDEA-205647Shortcut for Recent location
TaskIDEA-203680Invalidate external projects imported data on 'Invalidate Caches' action
TaskIDEA-202382Update spy-js icons
ExceptionIDEA-205608Editor is already disposed exception if navigate on recent location sample with quick search result
ExceptionIDEA-206776in Linux on project closing Throwable occurs at com.intellij.openapi.wm.impl.GlobalMenuLinux.access$800
ExceptionIDEA-202313Exception appears on Compress Logs and Show in Explorer menu item
ExceptionIDEA-196008Throwable at com.intellij.openapi.roots.impl.libraries.LibraryImpl.<init>
ExceptionIDEA-199921com.intellij.util.Alarm - Assertion failed: Already disposed
ExceptionIDEA-202454PluginManager - mixer IllegalArgumentException: mixer[0..1] is 2.0
ExceptionIDEA-206482RuntimeException: java.lang.reflect.InvocationTargetException
ExceptionIDEA-207299com.intellij.openapi.extensions.impl.PicoPluginExtensionInitializationException (ShowDiagramBase)
Android.DesignerFeatureIDEA-204927Please add a way to determine when the user has resized the components in a ThreeComponentsSplitter
AntBugIDEA-202538Starting already built project takes a lot of time
Code Analysis. DependenciesBugIDEA-203484Empty node is shown instead of JDK name in 'Analyze Dependencies' results
BugIDEA-203520"Analyze This Dependency" action doesn't process usages of classes from other modules and libraries exported by the dependency
Code Analysis. DuplicatesFeatureIDEA-181304Highlight duplicated branches in 'switch-case' statement
BugIDEA-206673Inspection `Duplicated code fragment` does not analyze content folders.
CosmeticsIDEA-207219Change "Hide duplicates fix" for "Duplicated code fragment" inspection
Code Analysis. InspectionFeatureIDEA-33733"Field can be local" quickfix should not create redundant variable
BugIDEA-181614Inspection profile changes every time project is opened
BugIDEA-202177Error during injected code cleanup
BugIDEA-208033Go to next highlighted error is broken
BugIDEA-205936Inspections View: Group by Module doesn't work for groovy files
BugIDEA-200142Deadlock in Inspection tree view
BugIDEA-204111Run inspection by name produces empty view
BugIDEA-203922Ctrl+Alt+Up in inspection results moves to the next result, rather than previous
BugIDEA-183685Incorrect parameter type - ParamConverterProvider
BugIDEA-204414Exporting inspections results as HTML doesn't produce output
BugIDEA-207410Can't choose Constant conditions and exceptions in settings
BugIDEA-201595All problems in file disappear from "Inspection Results" after applying a single fix
BugIDEA-203538Cannot export results of single inspection run to XML
BugIDEA-201236Import of inspection results could not parse method name when it has parameter type
BugIDEA-206216Fix all for warning in the top level file doesn't work when caret is located inside injection
BugIDEA-86833web.xml inspection for assignable to javax.servlet.Servlet is wrong
PerformanceIDEA-204287LocalInspectionTool.isValidID should precompile regular expression
PerformanceIDEA-207013Uast: Evaluator hangs uninterruptible analysing some loops
UsabilityIDEA-204733Troubles massively apply fix to all found warnings
UsabilityIDEA-201800Progress Bar Doesn't Move in Batch Suppress For Statement
UsabilityIDEA-204371Remember "Group by severity" setting in inspection results
TaskIDEA-77381NonSerializableFieldInSerializableClass should check whether all possible values of final field are serializable
ExceptionIDEA-203498com.intellij.analysis.AnalysisScope$2.visitFileEx(AnalysisScope.java:248): Read access is allowed from event dispatch thread or inside read-action only
ExceptionIDEA-206047Invalid cached value assertion during offline inspections
Code CoverageFeatureIDEA-196509Not possible to remove custom coverage suite from suite selection dialog
BugIDEA-200258Coverage tool window: Autoscroll from Source does not work on 1st test execution
BugIDEA-161415Cannot "show tests covering line" if test class name contains _ or $
BugIDEA-206286Run/Debug configuration - JUnit - Code coverage - when include a class for exclusion and save the item is added to include dialog box
BugIDEA-90722File name too long IOException on CodeCoverage *.tr file
CosmeticsIDEA-200520What is the meaning of a checkbox with "include/exclude" title?
Code Formatting and Code StyleFeatureIDEA-149529Code Style settings export options
BugIDEA-189934Replace lambda with method references messes up indentation
BugIDEA-203464There is not same code style in 2018.2 and 2018.3 which I have the same codestyle.xml
BugIDEA-200800Configure indents action from the status bar should open JS code style for JS/JSX files
BugIDEA-203775NPE on opening unified diff view when Upsource Integration plugin is enabled
BugIDEA-204458Java Formatter : close-brace in enum does not create new line
BugIDEA-206778Export codestyle settings to JSON: export fails when non-default values are provided for java | wrapping and braces | braces placement options
BugIDEA-206769Export codestyles settings to JSON: space_within_* attributes of java settings are not exported
Code NavigationFeatureIDEA-205404When navigating from Java stacktrace try to find the relevant position within line
BugIDEA-205772Javadoc: multi-resolve method references without signature to all overloads
BugIDEA-164838Open three new same windows when do "Open In New Editor Window"
BugIDEA-202922Navigate | File results are not sorted by proximity
BugIDEA-178367Weird 'choose implementation' popup
BugIDEA-207132Recent locations popup shows 1 less snippets as in settings
UsabilityIDEA-194817Show enum constant usages on mouse middle-click
CosmeticsIDEA-207272Recent locations: icon is not shown for decompiled classes
Code. GenerateBugIDEA-203737Introduced method has wrong context
BugIDEA-200281Generete "Delegate Methods..." action doesn't respect already implemented method
BugIDEA-201670Generating setter for final field
BugIDEA-202062Code generation for equals will reference built-in java classes directly regardless of whether identically named user-defined classes are already in scope
ColdFusionBugIDEA-205139CFML: Improper closing tag auto completion with <cfset> and <cfif>
BugIDEA-206225CFML: investigate duplicate conditions in CfmlQuoteHandler
BugIDEA-205092CFML: Inspection Error When Writing SQL Variables with Pound Signs
BugIDEA-205201ColdFusion: conflict in order of closing tags by type handler HTML with CFML
Cucumber JVMFeatureIDEA-201317Update Cucumber Formatter Plugin to Support ConcurrentEvents in Cucumber 4.x
BugIDEA-189140Syntax highlighting of step variables in Cucumber features does not work together with doc string
BugIDEA-205969Broken Layout in Dialog "Create new step definition file" on UHD 4k screen
BugIDEA-142408Show difference link is not always shown
BugIDEA-205590Executing Cucumber step for which WebElement in POP hasn't been found results in doubling step listing in "Run:" window
BugIDEA-171313Cucumber: Regex not abiding by anchors ^ or $
BugIDEA-205598191 IDEA could not find Cucumber step definitions
BugIDEA-142407Generating Cucumber step definiton using JVM Cucumber plugin does not properly escape parentheses in generated regex
BugIDEA-171766Cucumber-java plugin does not support java8 step definitions with dynamic regexp
BugIDEA-203555Cucumber sentences does not evaluate {n} regular expressions
PerformanceIDEA-187983Long code analysis - Cucumber with java8
UsabilityIDEA-206258Cucumber Autocomplete doesn't give me the ability to autocomplete capture groups that use the or operator
TaskIDEA-202545Java8 step definition in languages other than English
DebuggerFeatureIDEA-189549Better display for Maps in debugger
FeatureIDEA-202293Support synchronized statement in evaluator
FeatureIDEA-202292Support asserts in evaluator
FeatureIDEA-202146Support switch statement in evaluate code block
FeatureIDEA-201942Do not use compiling evaluator for method references
FeatureIDEA-186962Allow user defined Async annotations
FeatureIDEA-173619Debug mode / Mouse gesture "Run to mouse pointer"
FeatureIDEA-124595Feature to "Step Out" of the current block when debugging
BugIDEA-206755Hovering over line numbers in editor during debug make lines highlighted as if they're active in debugger
BugIDEA-202459Unable to evaluate virtual method ref
BugIDEA-208136Can't run Tomcat run configuration in 2019.1 EAP (build 5849.21): Could not find agent library ... Can't load AMD 64-bit .dll on a IA 32-bit platform
BugIDEA-207569Can't use Debug: Error occurred during initialization of VM
BugIDEA-203322"Hold alt and click to evaluate expression not working" (this is a tip of the day)
BugIDEA-203825Deadlock in debugger
BugIDEA-203014Target Jdk version does not match message
BugIDEA-200161Exception related to debugger agent on plugin project startup
BugIDEA-202129.attach_pid files in the working dir
BugIDEA-208000"Target JRE version does not match project JDK version" message is shown for the same JDK/JRE = 1.8.0_121
BugIDEA-195531Debug tool window causes segmentation fault in the JVM
BugIDEA-199602Stepping into String constructor with debugger makes a string that is shown as empty in variables view
BugIDEA-205230"View as" popup item is inactive on the first click but becomes active on the next clicks
BugIDEA-205407Parameter is not resolved in breakpoint condition after adding @NotNull to parameter
BugIDEA-204691Unable to cast primitive value to Object
BugIDEA-203275Cast in evaluator does not fail when is should
BugIDEA-204693Argument boxing does not happen if type is not available
PerformanceIDEA-204448Debug startup slowly with `debugger-agent.jar`
UsabilityIDEA-204807"Add to Watches" action shouldn't create duplicates
UsabilityIDEA-205987Preselect main thread on pause
UsabilityIDEA-172140Suspend only current thread during evaluation of breakpoint's condition
UsabilityIDEA-205901Debugger: Clicking into empty area below stack frames makes IntelliJ navigate to bottom-most item
UsabilityIDEA-200972View Breakpoints: Show breakpoint icons in the tree view to distinguish between suspend options
UsabilityIDEA-200637Debugger pop-ups trigger OutOfMemoryError
UsabilityIDEA-207231Don't change sort order when selecting a different goroutine in debugger
CosmeticsIDEA-202684Map Entry's value displayed not good
Debugger. Memory ViewBugIDEA-208333Memory Agent causes strange exceptions in program when running in debug mode
Debugger. StreamsBugIDEA-199022Stream Trace cannot access private class or method
DecompilerFeatureIDEA-174243Decompiler Switch-Enum Sugaring Doesn't Support Obfuscated Code
BugIDEA-204272Decompiler loses generic info on varargs params
BugIDEA-197665Decompiler decompiles references to static fields inside class inforrectly
BugIDEA-204310Decompiler adds redundant imports for lambdas
BugIDEA-204223Decompiler doesn't add mandatory narrowing cast on integer type
BugIDEA-208443Java decompiler not correctly decompiling string concatenation with recent Java
Diff_MergeFeatureIDEA-48213Compare two files action does not allow to select which file will be left and which one will be right (swap diff)
FeatureIDEA-197789Allow adding file contents to the Blank DIff Window
FeatureIDEA-1997503-way merge should have a Rollback action in the changes stripe menu
FeatureIDEA-77478Diff: Add by-char comparison mode that will compare individual chars
BugIDEA-203659Shift+Tab in Diff editor changes line indentation style
BugIDEA-111268Tab width not respected when viewing code changes inline
UsabilityIDEA-207839Accept left/right shortcuts are reversed
CosmeticsIDEA-206495Partial commits: Excess "Uncheck all" checkbox on Diff dialog
ExceptionIDEA-207311Error: can't show diff on EAP
DockerFeatureIDEA-172715Docker: Provide possibility to debug code within a docker container
BugIDEA-208100Docker. java.lang.AssertionError: Without manager but not disposed: Log at deleting container with the opened Log
BugIDEA-208312Error in typehint in cap_add block in docker-compose
BugIDEA-202973Docker: RunConfiguration: "..." instead of the error about the wrong path to the Dockerfile
PerformanceIDEA-208129DockerDebug. Docker works slow after many "docker debug" runnings
DroolsPerformanceIDEA-203046Intellij lags when editing drl (Drools rules) files.
Editor. Code CompletionFeatureIDEA-203280Groovy Script for PHP Storm Live Templates give suggested box?
BugIDEA-208424Word completion doesn't work in language-specific elements in small IDEs
BugIDEA-148060Completion doesn't work after switching window
BugIDEA-207334Edit Postfix template dialog: custom template box is missing
BugIDEA-204126[Live templates] autocompletion is not shown for some live templates (e.g. sout, psvm)
BugIDEA-205485Goto Declaration doesn't work in completion autopopup with automatic quick doc popup
BugIDEA-199925Dash breaks autocompletion for live template name
Editor. Color SchemesTaskIDEA-206064Display a warning of Rider color schemes incompatibility instead of failing, fall back to some other color scheme
Editor. Editing TextFeatureIDEA-204140Should be able to unwrap rule based switch expression
FeatureIDEA-205621Switch statement unwrapper
FeatureIDEA-144788Code folding - Class description doxygen/javadoc comments: leave first line visible
FeatureIDEA-168176Move Caret Backward/Forward a Paragraph With Selection
FeatureIDEA-204702Support after-line-end inlays in editor
FeatureIDEA-106702Folding comments block
FeatureIDEA-36496Move statement up/down handles catch blocks improperly
BugIDEA-201750Move Up/Down and Scroll works wrong with a cloned caret
BugIDEA-199639While typing TODO comment with Korean text, color scheme to the last letter is disappeared
BugIDEA-205774Moving Up/Down doesn't work properly for Enum constants in case of missing ';'
BugIDEA-199621Text selection doesn't work after triple-click
BugIDEA-201210Expanding selection within method's generic type parameter expands to beginning of file
BugIDEA-204769Editor: selecting "Copy" action from menu copies whole line instead
BugIDEA-201725Rich text copy / paste on high DPI screens should scale down fonts
BugIDEA-203902Text drag'n'drop in editor is not canceled by Esc key
BugIDEA-205365Git diff view in commit dialog does not allow copying text to clipboard (CTRL+C) if this shortcut is assigned to "Copy as Plain Text" action.
BugIDEA-201882Scrolling position jumps on completion
BugIDEA-197843'Move Statement Up/Down' for switch-case-blocks does only detect the statement when the caret is exactly on the statement
BugIDEA-205776Moving Up/Down dowsn't work for Enum constant with body
BugIDEA-202245Editor ignores EditorMouseEvent consuming
BugIDEA-205130Parameters info shows the actual proper method signature as disabled
BugIDEA-205622Scope popup closes diff fragment popup
BugIDEA-199790FileEditorManagerImpl does not properly handle opening TextEditor instances created by custom FileEditorProvider
BugIDEA-205635Moving up/down enum entry declaration with empty line after declaration produces red code
BugIDEA-136779In editor, alt+drag should clear the old caret.
BugIDEA-205802Repaint issues for soft-wrap marks in a diff pane
BugIDEA-192879"Move statement" skips position outside code block in Java
BugIDEA-204703Text selection significantly slows down when cursor is outside the text editor
BugIDEA-103199Undo: UTF problem
BugIDEA-202915Highlighting of deleted ranges in diff window is blinking sometimes
BugIDEA-195293Strange behavior when join lines with "builder.append('...')"
BugIDEA-205336after new file is added, "last edit location" doesn't work
BugIDEA-175878Multicursor first cursor incorrect indent on tab press in injected fragment
BugIDEA-207951Ide freeze on showing parameter info
BugIDEA-204898Exception in buildFoldRegions can block loading of editor
BugIDEA-208537folding toggles are not shown for added fold regions
BugIDEA-205739Editor: Action is applied for the wrong line if invoked from menu
BugIDEA-201502Weird soft wraps behavior when working with XML content
BugIDEA-203201Cursor jumps back and sometimes random extra spaces are inserted
BugIDEA-203335Parameter info appears when not required
PerformanceIDEA-199690Terrible performance with multiple cursors in insert with multiple values
PerformanceIDEA-206039IntelliJ froze for 148 seconds after tabbing alt-tabbing away and back to IntelliJ with large buffer.txt file
UsabilityIDEA-89608Should be able to set editor view options like soft wraps for certain file types
UsabilityIDEA-203855Cloned carets visually off
UsabilityIDEA-204308Multiline TODO popup interferes with editing the TODO.
UsabilityIDEA-199375Parameter info (Ctrl+P) does not recognize array parameter as a vararg
UsabilityIDEA-199843Ctrl hovering over keyword should not show quick doc popup
UsabilityIDEA-200276Multiline TODO: line comment <-> block comment conversion breaks multiline comments
UsabilityIDEA-200275Multiline TODO: support line Split in block comments
UsabilityIDEA-200630too eager commenting out
UsabilityIDEA-198213Double clicking on the { or } (curly brace) should select class body
UsabilityIDEA-185682Parameter info hides the code being editing at the top of a file
CosmeticsIDEA-200296confusing gutter folding hints for "closure" folding
TaskIDEA-205639Gutter current line number highlighting doesn't respect conversion function
Editor. Error HighlightingBugIDEA-202625IDEA doesn't see library after it is copied into 'lib' folder
BugIDEA-155186Daemon status icon (aka eye aka TrafficLightRenderer) isn't always repainted
BugIDEA-204791Duplicate highlights in maven
PerformanceIDEA-20704523 lines with open dots cause of hang of IDEA
Editor. Intention ActionsBugIDEA-200761Settings: Intentions: "Before/After" sections for intention actions are empty
External ToolsCosmeticsIDEA-184889External Tool named with an underscore does not display properly from project context menu
File SystemFeatureIDEA-198080fsnotifier fails to start from Flatpak image
BugIDEA-188926`VirtualFileManager.refreshWithoutFileWatcher` can take an extremely long time on a Windows FileSystem with a large number of mapped network drives
PerformanceIDEA-202236UI freeze on VFS operations (I/O in PersistentFS.processEvents)
ExceptionIDEA-207039Import Database Schema + H2 datasource: select or unselect table or column may invoke exception InvalidPathException: UNC path is missing sharename
Find, Replace, Find UsagesBugIDEA-203111Undo doesn't work correctly after "replace all"
BugIDEA-168548find usages in file (ctrl-f7) skips some usages
BugIDEA-202717Pinned "Find in Path" window closes on clicking on a result
UsabilityIDEA-202987Ability to customize a shortcut for search history
UsabilityIDEA-76610I want to be able to turn off the "Do you want to find usages of the base method?" question
UsabilityIDEA-170894"Rerun Search" should not open new tab
UsabilityIDEA-108477Preview for in-place regexp replace doesn't preview line breaks
UsabilityIDEA-204169Add "Open results in a new tab" in the Find ToolWindow
ExceptionIDEA-202503Exception occurs on opening file context menu for the first time
GWTBugIDEA-206271GWT Debug broken with latest IDEA version(s)
ExceptionIDEA-208056GWT: invoking New | "GWT UiRenderer and ui.xml File" always produce an exception
HTMLCosmeticsIDEA-201570Questionable folding and preview of "&nbsp;" in HTML (Velocity)
HibernateBugIDEA-185976Hibernate plugin doesn't work with Kotlin "Entities"
IDE ConfigurationFeatureIDEA-107709StringUtils within a File Template
FeatureIDEA-108609Cannot remap cursor keys for navigation outside the editor (popups, etc.)
BugIDEA-201018Unable to submit IDE errors anonymously after enabling 2FA
BugIDEA-207196@NotNull method com/intellij/openapi/projectRoots/impl/JavaSdkImpl.suggestSdkName must not return null
BugIDEA-205643IDE cannot restart after disabling/enabling plugin — hangs indefinitely
BugIDEA-188964Error loading kotlin-language facet
BugIDEA-196437Plugin manager: problem with enabled/disabled plugins blocks any interaction
BugIDEA-206792[jdk11] MaxJavaStackTraceDepth=-1 is outside the allowed range
BugIDEA-179784Idea fails to load a project when running on Java 9
BugIDEA-201898Handle plugin duplications with sync settings
BugIDEA-205967Wrong previous version directory in import setting dialog (2019.1 suggests 2018.1)
UsabilityIDEA-206444"Edit variables" for live template shows empty expression lists for templates with no context
UsabilityIDEA-195932Allow "Check connection" even if no proxy is selected
UsabilityIDEA-206954"Configure soft wraps" action should apply search highlight to the "Soft wraps" group in the editor settings
CosmeticsIDEA-203663Preferences | Editor | General | Gutter Icons: sort plugin groups alphabetically
IndicesPerformanceIDEA-208533OutOfMemory when indexing a 2Gb project, "Out of memory" window stuck forever
PerformanceIDEA-2022212 minute freeze on index query after deleting a large directory
UsabilityIDEA-207075Better diagnosis for FileBasedIndexImpl - scheduleIndexRebuild, reason: File type change
InternalTaskIDEA-206894Extract UrlClassLoader and its dependencies to a separate module
Internal build scriptsBugIDEA-203509Cannot debug tests in nested classes
TaskIDEA-197426pom.xml generated for modules from IntelliJ IDEA project should honor exclusion of transitive dependencies
Configuration ProblemIDEA-199738Upgrade internal Ant to version 1.10.3 or newer (support JUnit5 Jupiter engine)
JSPTaskIDEA-206443Rewrite JSP validation to run inside external build process and download required JARs instead of bundling them
JavaFeatureIDEA-204569Highlight `break` for switch expressions
BugIDEA-201223Type parameter isn't inferred in code completion/parameter popup, but known when Ctrl-hovering
BugIDEA-205583Choose package dialog: a new package specified with several parent packages is shown on the top level and without parent packages
BugIDEA-204005Expected types should be aware of switch expressions
BugIDEA-203841Type hierarchy not complete when using test-jars
BugIDEA-205584Choose package dialog: should not apply changes on closing with Cancel
BugIDEA-204012"Surround with if" action and friends suggests to be applied for switch rule
BugIDEA-205947Join lines works incorrectly if next line string literal is followed by the method call
UsabilityIDEA-208309Add 'main' template as an alias to 'psvm'
ExceptionIDEA-205578IOOBE on editing the JavaDoc
Java. Code FormattingBugIDEA-204482Java Code Formatting of enum uses blank Lines In declarations instead of blank lines before '}'
Java. InspectionsFeatureIDEA-200232Support numeric casts in dataflow
FeatureIDEA-206497Replace with stream: support intermediate map operations in counting loops
FeatureIDEA-203459"'default' not last case in 'switch' statement" inspection needs update for switch expressions
FeatureIDEA-188305Algebraic conversions in conditions DFA
FeatureIDEA-204698Report meaningless operations on empty collections
FeatureIDEA-200859Inspection "Java | Probable bugs | Suspicious 'Collection.toArray()' call" should provide quick-fix
FeatureIDEA-90060Class without logger Inspection enhancements
FeatureIDEA-203316Turn on by default "Number of placeholders does not match number of arguments in logging call"
FeatureIDEA-200820Map.keySet(key).forEach(key -> map.get(key)) can be simplified
FeatureIDEA-203579Update "Unnecessary 'return' statement" for enhanced switch statements
FeatureIDEA-204827When calculating `a - b`, take into account relations between `a` and `b`.
FeatureIDEA-202132Java 12: Switch Expressions: Data flow updates
FeatureIDEA-203449Switch statement without default branch: provide a quick-fix
FeatureIDEA-176351Improve non-null inspection with static flow analysis (isPresent() and similar)
FeatureIDEA-204701Redundant collection operation: suggest emptyIterator()
FeatureIDEA-203985"Fallthrough in 'switch' statement" inspection needs update for switch expressions
FeatureIDEA-96216Missing "Condition always false"
FeatureIDEA-202323Inspection 'Conditional expression with negated condition' should allow != 0
FeatureIDEA-205785Java inspection, which detects unused value of Optional.get() method
FeatureIDEA-202419Missing 'array out of bounds' inspection for multidimensional array
FeatureIDEA-206024Add a quick-fix for "Integer multiplication or shift explicitly cast to long" inspection
FeatureIDEA-203974"Local variable used and declared in different 'switch' branches" inspection needs update for switch expressions
FeatureIDEA-205676Inspection for simplifiable StringBuilder.append(CharSequence, int, int)
FeatureIDEA-205949StringBuilder can be replaced with String inspection should recognize implicit toString() call
FeatureIDEA-205011DFA: limited support for shift-left
FeatureIDEA-203717"Nested 'switch' statement" inspection could use update for new switch
FeatureIDEA-194715Recognize assertTrue(Arrays.equals(a1, a2))
FeatureIDEA-205057DFA: support remainder tracking
FeatureIDEA-206568Shift by inappropriate constant: use dataflow
FeatureIDEA-179180Strike deprecated annotation options
FeatureIDEA-203462Update "Unnecessary 'default' for enum 'switch' statement" inspection for switch expressions
FeatureIDEA-195323Notify if array creation can be replaced with Enum#values()
FeatureIDEA-200908Suspicious 'Collection.toArray()' call: support new Java 11 Collection.toArray(IntFunction)
FeatureIDEA-203878Auto(un)boxing inspection needs update for switch expressions
FeatureIDEA-193906Java intention: Switch - Add default case with IllegalStateException
FeatureIDEA-200879Intermediate Stream::collect could be reported when result of expression is Collection::size
FeatureIDEA-205726DFA: Inline Collection/Map.clear() method
FeatureIDEA-205213Inspect Code, Declaration access can be weaker: have optional "entry points" which should keep visibility as is (as for "Unused Code")
FeatureIDEA-205727DFA: wire Map.keySet/values/entrySet().size() to Map.size()
FeatureIDEA-204787Deprecated usage inspection should (optionally) skip occurrences in documentation.
FeatureIDEA-200365Inspection to collapse simple implementation of Comparator into JDK-provided one
FeatureIDEA-206567Warn about double bitwise complement (~) operation
FeatureIDEA-202753Map.entrySet can be simplified analysis could identify more cases.
FeatureIDEA-204461DFA: Make final getter stable if it gets a final field
FeatureIDEA-206230Pointless bitwise inspection: report `i & ~i` and `i | ~i`
FeatureIDEA-205151Misc improvements for Mismatched array read/write inspection
FeatureIDEA-203387Add limited multiplication support to DFA
FeatureIDEA-204734Track Optional content similarly to boxed numbers
FeatureIDEA-204773Enable non-null parameter inference for non-stable source methods
FeatureIDEA-171758Support Guava collections in 'Suspicious collections method calls'
FeatureIDEA-206224Improve support of bitwise operation in DFA
FeatureIDEA-205560Integer multiplication cast to long: use dataflow to check for overflow possibility
FeatureIDEA-202825Track stream size in stream inliner
FeatureIDEA-203071Switch expressions: provide fix to generate missed branches for enum switches
FeatureIDEA-202623Redundant switch labeled rule block
FeatureIDEA-200455Suggest to replace (a, b) -> a + b lambdas with Integer::sum, Long::sum, Double::sum
FeatureIDEA-160792'Iteration over keySet() may be replaced with entrySet() iteration' should be smarter
FeatureIDEA-192251Infer purity of constructors from sources
FeatureIDEA-203016On nullability violation show which ternary branch is nullable
FeatureIDEA-200056Redundant semicolon: Add an option to ignore trailing semicolons in enums
FeatureIDEA-205846Suggestion to use String.repeat where appropriate when using JDK 11
FeatureIDEA-205555Warn about useless 'if' like "if (x == y) return x; else return y"
FeatureIDEA-205154Cast conflicts with instanceof: take into account assertion methods
BugIDEA-136742unused library inspection: false positive for libraries containing super classes/interfaces.
BugIDEA-205952Invalid Java Refactoring Suggestion - stream-foreach() call throwing exception
BugIDEA-204165[BUG][Inspection][IC-183.4588.61] false report of 'Optional.get()' without 'isPresent()' check
BugIDEA-206640Replace var with explicit type not working with for loop
BugIDEA-203719"Result of object allocation ignored" inspection false positive in new switch
BugIDEA-200832Default constructor, which is marked with @Deprecated via external annotation and absent in source code, is not recognised by inspection
BugIDEA-201335False positive "value of parameter is always..."
BugIDEA-203531Use of obsolete date time API doesn't warn on new expressions
BugIDEA-204431'Unnecessary return statement' false positive in enhanced switch statement
BugIDEA-203697Class.getClass() false-negative on Java 12 switch expression
BugIDEA-172232Field dereference inside try block makes qualifier notnull outside
BugIDEA-208270Action "Replace with old-style switch" is available on empty switch and does nothing
BugIDEA-203510Entry points are not shown in inspection results toolwindow
BugIDEA-202709False negative "Conditional expression with identical branches" inspection on switch expression
BugIDEA-205122Unwrap switch fails with exception
BugIDEA-203454SwitchStatementDensityInspection: update for Java 12
BugIDEA-203692Remove unused variable should be aware of Java 12 switch
BugIDEA-201646Wrong message for inspection
BugIDEA-204867Scope of variable is too broad inspection doesn't keep var keyword.
BugIDEA-205073Remove redundant suppress warning doesn't work for javadoc tags with unrelated descriptions
BugIDEA-204808CloneReturnsClassTypeInspection fails in anonymous class
BugIDEA-200137"Replace with 'try' with resources" produces uncompilable source
BugIDEA-204187Code becomes red after applying conversion to old style switch
BugIDEA-204071Auto-unboxing fix produces red code
BugIDEA-206397Iteration over keySet fix produce wrong code with wildcard ? extends
BugIDEA-204393Cannot unwrap break-with value if the value is a switch expression
BugIDEA-207312Inspection / Java / Declaration redundancy: gets confused by Lombok's @Getter annotation
BugIDEA-204985Auto-replacing deprecated method with a suggested equivalent doesn't check type compatibility and breaks compilation
BugIDEA-207552Wrong inspection "Actual method parameter is the same constant"
BugIDEA-185473false positive "method identical to its super method"
BugIDEA-205090Checking Optionals with Optional#isEmpty() still triggers {'Optional.get()' without 'isPresent()'} hint
BugIDEA-203085Switch expressions: support "Make method call chain to call sequence" intention
BugIDEA-203119Unwrap switch statement: support rule-cases and multiple expression cases
BugIDEA-205309'Replace with findFirst()' produces uncompilable source
BugIDEA-203845com.intellij.util.IncorrectOperationException: Incorrect statement 'else
BugIDEA-203705"Equals called on enum value" doesn't suggest a quick-fix inside switch expression
BugIDEA-203709'equals()' called on BigDecimal false-negative on switch expression
BugIDEA-203698Value of ++ or -- is used: false-negative on switch expression
BugIDEA-200961Simplification of "!list.add(type) is always false" may change code semantic
BugIDEA-203693"Move assignment to field declaration" produces erroneous code when assignment is inside Java 12 switch
BugIDEA-203946Update "Text label in 'switch' statement" inspection for switch expressions
BugIDEA-200488'Java | Class structure | Field can be local' inspection show warning even if annotation added to 'Additional Special Annotations'
BugIDEA-203708"Unnecessary boxing" false-negative with Java 12 switch expressions
BugIDEA-189840False positive: 'Number of placeholders does not match number of arguments in logging call' if error(String, Trowable) is invoked
BugIDEA-204207'Replace with 'old-style' switch statement' removes switch block body, when value break used.
BugIDEA-205851"Compute constant value" suggests to make not equivalent replacement
BugIDEA-200775'Static initializer references subclass' inspection doesn't report anonymous class
BugIDEA-203086Switch expressions: support "Replace conditional with if" intention
BugIDEA-204014"I/O resource opened and not safely closed" should be updated to support switch expressions
BugIDEA-206615Suppression for inspection 'Static field used before initialization' shows as redundant
BugIDEA-205529Conversion from the new to the old 'switch' doesn't split the list of the case constants
BugIDEA-203424@noinspection doesn't work for some inspections
BugIDEA-196997'Number of placeholders ... in logging call' does not support Log4j 2's ParameterizedMessage
BugIDEA-177299Rework of inspection "'default' branch is unnecessary"
BugIDEA-204081`@VisibleForTesting` still treated as `@TestOnly` even if used to relax visibility of production method to call it from tests
BugIDEA-206052Don't report class as unsed when it has a used function because of an annotation
BugIDEA-203625Inspection 'assertEquals() between objects of inconvertible types' doesn't show warning when comparing collection of inconvertable type
BugIDEA-204138Exception in "statement with empty body" inspection with switch expression
BugIDEA-202706InstanceVariableUninitializedUseInspection breaks on switch expression
BugIDEA-205112Declaration access can be weaker false positive with inner class constructor
BugIDEA-204986False Positive: "Class with only private constructor should be declared final" does not detect subclass on same level
BugIDEA-205308'Replace with max()' produces uncompilable source
BugIDEA-203227Switch statement has too many branches: update for Java 12
BugIDEA-200534Remove "Volatile long or double field" inspection
BugIDEA-204013"Redundant local variable" should be switch break-aware
BugIDEA-203979Java | Probable bugs | 'equals()' between objects of inconvertible types false negative with anonymous class
BugIDEA-203069Enum 'switch' statement that misses case should support enhanced switch statements
BugIDEA-204977"Method returns the same value" false-positive for void method with anonymous class inside
BugIDEA-172237SLF4J formatting inspection does not handle escaping backslash
BugIDEA-204804Unused import: don't warn if reference in import itself is unresolved
BugIDEA-203447Switch statement without default branch: support Java 12
BugIDEA-200018"Overly broad 'catch' block" inspection incorrectly highlights Exception/Throwable when "Ignore exceptions which hide others..." is ticked.
BugIDEA-203701Result of assignment is used: false-negative in Java 12
BugIDEA-203984"Remove unreachable branches" quickfix breaks code on switch expression
BugIDEA-202645Good code is yellow: @NonNls-annotated property in annotation triggers the "hard coded string literal" warning if the string literal is concatenated
BugIDEA-206763Iteration over keySet quickfix does not take into consideration that the variable name "entry" is already used by a lambda value
BugIDEA-198040False positive "'equals()' between objects of inconvertible types" for Class types
BugIDEA-207178Incorrect simplification of optional suggested by inspection
BugIDEA-208296Java 12: Replace with old-style switch produces erroneous code for exhaustive enum
BugIDEA-204944"'clone()' defined in non-Cloneable class 'null'" on anonymous class
BugIDEA-202410False positive "Method only calls it super" when using default methods
BugIDEA-204430Red code after conversion to 'enhanced switch statement' when when 'default' has only 'return'
BugIDEA-204584Broken link in Java | Abstraction issues | 'public' method with 'boolean' parameter
BugIDEA-203343Replace with lambda suggestion can produce bad code
BugIDEA-204762"Integer division in floating point context" inspection false negative
BugIDEA-198865Inspection "Parameter '<name>' is not used in either this method or any of its derived methods" not working for methods with public visibility
BugIDEA-204193"'break' statement" inspection should not highlight usage of 'value break'
BugIDEA-203450Ambiguous method call bug
BugIDEA-205482"Use removal by object" fix may change semantics for List<Integer>
BugIDEA-205854"Compute constant value" can be shown and not shown in similar cases
BugIDEA-205525Do not warn "The declared exception X is never thrown" on native methods
BugIDEA-200858No warning for 'Stream.toArray' when types of arguments are mixed
BugIDEA-203798Inspection "Default method not implemented" has too big range when implemented anonymously
BugIDEA-205008"Implicit numeric conversion" inspection doesn't report implicit conversions in compound assignment operators
BugIDEA-206272"Fallthrough in 'switch' statement" false positive
BugIDEA-205376Warning about non-atomic operation on volatile field doesn't work for anonymous instance but works for lambda
BugIDEA-203421"Unused declaration" inspection false positive on fields of inner classes
BugIDEA-200391Quickfix 'Extract side effect' is absent in Editor
BugIDEA-203225Switch statement has too few branches: update for Java 12
BugIDEA-205137`Replace Switch with If` produce exceptions
BugIDEA-203703"Throwable not thrown" false-positive with Java 12 switch
BugIDEA-174522No deannotate intention action for library classes annotated as deprecated via external annotations
BugIDEA-207637"Flip equals" does nothing on unqualified equals
BugIDEA-194091ParameterizedParametersStaticCollection reports valid data methods
BugIDEA-199670Javadoc is inaccessible from here for a reference in the same directory
PerformanceIDEA-203363DuplicateBranchesInSwitchInspection is slow on a file with many switch cases
UsabilityIDEA-202808Method invoked with reflection is marked as unreachable if its caller method is added to custom entry point
UsabilityIDEA-201852If with common parts: suppress in the if-else chain
UsabilityIDEA-205223Iteration over keySet() may be replaced with entrySet(): keep key variable when it's reused
UsabilityIDEA-201258Do not highlight element annotated with ScheduledForRemoval if they declaration reside in the same project
CosmeticsIDEA-206417Typo: Gaurd
CosmeticsIDEA-205019Conversion StringBuilder -> String can be slightly improved
CosmeticsIDEA-199315To reformulate the error about the inability to override the method from java.lang.Object
ExceptionIDEA-200866Structural Search: ConcurrentModificationException during offline inspections
ExceptionIDEA-207640Replace StringBuilder with String throws exception when there are comments inside
ExceptionIDEA-204717Can't convert enhanced 'switch' to 'if' if a branch's body contains an end-of-line comment
ExceptionIDEA-205962AIOOBE in duplicate branches in switch inspection
ExceptionIDEA-204106Auto-unboxing with switch expressions produces exceptions
ExceptionIDEA-206891NPE in data flow inspection
ExceptionIDEA-199489"Simplify" quick fix exception on invalid code
Java. Intention ActionsFeatureIDEA-205362Intention to convert (collection.isEmpty() || collection.size() > 1) to collection.size() != 1
FeatureIDEA-203533Various improvements in "Make call chain into call sequence"
FeatureIDEA-201192Make encapsulate field available on the field declaration as an action
FeatureIDEA-202622Java 12: Switch Expressions: Convert switch labeled rule expression to a block
FeatureIDEA-200412CommentTracker: update API to be able to keep intermediate comments in their place
FeatureIDEA-203895Intention to split switch branch with multiple values into separate branches
FeatureIDEA-200651Analysis for 'switch' statements may determine always truthy conditions on branches in addition to always falsy
FeatureIDEA-190886Create missing 'switch' branches should provide default branch
FeatureIDEA-199264Introduce useful standard interface type for lambda expression
FeatureIDEA-200560Reasonable intention actions are missing for "'catch' or 'finally' missing" error
BugIDEA-203741I cannot prevent IntelliJ from adding annotatations
BugIDEA-206725"Insert default branch" produces uncompilable code
BugIDEA-205607"Replace with old style 'switch' statement" intention produces unreachable code
BugIDEA-201741'Inline method' changes semantics in case of nested if-else
BugIDEA-205835"invert if" inserts zillion of comments
BugIDEA-201457Weird "Cast to Boolean" quickfix
BugIDEA-205710`Change parameter type` / `Create method` quick-fixes malfunction and incorrect handling of the `void` type
BugIDEA-173780Insert declaration should resolve name conflicts
BugIDEA-203897"Import class" popup behaves weirdly in case of package local class
BugIDEA-201206Unwrapping a lambda shows wrong preview
BugIDEA-200209"Replace with findFirst" produces incompilable code
BugIDEA-200216"Extract ++" produces invalid code in for loop update
BugIDEA-201744Quick fix actions don't suggest creating a class if the name starts with lowercase letter
BugIDEA-206882Invert if produces non-equivalent code for nested if statament
BugIDEA-201751Space deleted after comma in type arguments
BugIDEA-173828Convert junit 3 to junit 4 should warn about usages which can't be converted
UsabilityIDEA-202345Weird Tab/Enter behavior in 'replace with x != null' quick fix
UsabilityIDEA-200649Showing 'add missing switch branches' intention for all the nested switches is a bit confusing
CosmeticsIDEA-202990Intellij suggests adding new parameter as '21th' parameter to method
JavaEE. Deployment and RunBugIDEA-203047Rerun for JavaEE server run configuration does not lead to `Update` action
JavaEE.EJB3BugIDEA-151644false error detection on ManagedExecutorService injection
JavaEE.JBossBugIDEA-208360Wildfly 16.0.0.Final Support Missing
BugIDEA-204303Open browser run configuration doesn't launch the browser and causes IntelliJ to constantly poll application (JBoss Server)
JavaEE.JSFBugIDEA-204871JSF not automatically enabled and Cannot Manually add
BugIDEA-124803Code highlighting for ui:repeat varStatus not working. Parameter not recognized.
BugIDEA-188937JSF 2.3 won't load <f:websocket>
UsabilityIDEA-201728Libraries under java enterprise for JSF default to 1.2 when we are at 2.1
JavaEE.StrutsExceptionIDEA-206588Plugin exception [Plugin: StrutsAssistant] at com.intellij.util.ExtensionInstantiator.instantiateWithPicoContainerOnlyIfNeeded
KubernetesFeatureIDEA-194758Helm: Validate requirements.yaml fields
BugIDEA-207953Kubernetes. External resources. CRD. Make it possible to add a schema with "version" key, not only "versions"
BugIDEA-207703java.lang.LinkageError at attempt to load CRD as external spec
BugIDEA-204167Helm. com.intellij.util.IncorrectOperationException at attempt to rename the chart name in a read-only file
BugIDEA-207960Kubernetes: External resources. Multiple CRD schemas in one file: only the first schema is applied
CosmeticsIDEA-205741Kubernetes. Settings. Too big distance between fields.
Language InjectionBugIDEA-201839Injected Brace Matcher Works Pretty Fun
Local HistoryBugIDEA-203490Copy/paste is not working in the left pane of the Local History window
UsabilityIDEA-75181show absolute time in local history
ExceptionIDEA-203259It's possible to call 'Show History for Selection' for project tree items: IllegalArgumentException is thrown
MacrosBugIDEA-204339Some IDEA macro invalid in other IDE's context.
Packaging and InstallationFeatureIDEA-194148Publish 'intellij.platform.testFramework' module as a Maven artifact
BugIDEA-198859Batch Mode for IDE updates: IDEA just restarted without any message when the last patch in chain is wrong
BugIDEA-158855Windows installer starts uninstaller even when clicking back
BugIDEA-204957Projects opened with cli have names ending in ./. opening other projects causes hang and then indexes root file system and or sometimes the parent directory filesystem.
BugIDEA-206868Patch update doesn't work on macOS (2019.1 EAP)
BugIDEA-202232Two versions of commons-codec.jar are included into IntelliJ Platform
BugIDEA-141900Installer: Uninstall old version has weird word wrapping
BugIDEA-203550Windows Installer: 'Uninstall old versions' shows only several installations from only one disk with a weird gap
BugIDEA-206790[jre11.win.zip artifact]: There is 32bit launcher in archive
BugIDEA-208430[jbr 11] Uninstall doesn't work after patching IDEA
UsabilityIDEA-202806There are too few rows in Uninstall Old Versions tab
UsabilityIDEA-197129Kotlin compiler binaries miss executable permissions
UsabilityIDEA-207608[jbr11 windows installers] It is better to remove checkboxes related to win32 system from Setup dialog
CosmeticsIDEA-208125[Setup dialog]: Replace '...install JRE x86...' with '...instal JBR x86...'
CosmeticsIDEA-204535Header text in Rider Installer is heavily misaligned
TaskIDEA-149668Publish javac2 on maven
TaskIDEA-202441Bundle Kotlin 1.3.20 with IntelliJ IDEA
TaskIDEA-192396Publish java-psi and required modules as Maven artifacts
TaskIDEA-206416Bundle Kotlin 1.3.21 with IntelliJ IDEA
TaskIDEA-200437Use correct product code when IDE is started from sources
Platform APIFeatureIDEA-177378make the registry entries extendible by plugins
FeatureIDEA-198928Make UAST provide a priory list of PsiElement types which could be used to get required UElement
FeatureIDEA-200287UCallableReferenceExpression should provide access to referenceNameElement
FeatureIDEA-201009Introduce ApiStatus.AvailableSince annotation
FeatureIDEA-209082Allow IDEs to customize which builds can be used as possible updates
BugIDEA-202707If PersistentStateComponent::loadState failed with exception it won't be called next time
BugIDEA-196796UAST: UMethod should provide access to the return-type reference expression
BugIDEA-205876Completion on a LightClass that is an interface does not include static methods
UsabilityIDEA-207106Log plugin that use registerFileType instead of FileTypeFactory
TaskIDEA-203954Make sure that `PsiReferenceProvider`s add references to elements they were asked about
Plugin DevelopmentFeatureIDEA-206060DevKit: deprecate Project Wizard
FeatureIDEA-194946DevKit: verify plugin provides pluginIcon.svg
FeatureIDEA-201007Devkit: show warning if a plugin code uses API which wasn't available in old versions of the platform
FeatureIDEA-202010Highlight services/components with identical interface and implementation classes as redundant in plugin.xml
BugIDEA-202393Always include ID of a problematic plugin into exception report
BugIDEA-196765Good code red in a module.xml when referring an action defined in the same xml
BugIDEA-208625Devkit: extension point property "className" should have PsiClass code insight
BugIDEA-197440Navigation to testdata hangs uninterruptible
BugIDEA-202417Quick-fix to register PsiReferenceProvider via psi.referenceProvider generates red code
BugIDEA-187409AutoCompletion popup disappears if variant contain dash symbol "-"
BugIDEA-204436Plugin Icon search path is wrong for ZIP plugin distributions
BugIDEA-200152Error launching plugin project with 'local' IDEA SDK
BugIDEA-205189theme.json: no spellchecking for color hex values
BugIDEA-206150Something wrong in ExtensionOrderConverter#isBeforeOrAfterKeyword(java.lang.String, boolean)
BugIDEA-202635Devkit: fix all gutter icon sizes, make configurable
BugIDEA-208354Devkit: subtags of 'intentionAction' tag in plugin.xml are highlighted as errors
BugIDEA-140250Rename class refactoring handles usages in xml incorrectly if inner class is renamed
UsabilityIDEA-204886Navigate to test data action shows multiple blinking modal progresses
UsabilityIDEA-206928plugin.xml: plugin name in Tab title shouldn't only work for plugin projects
TaskIDEA-208472Devkit: allow user to specify modules which are included into single plugin for component registration check
Plugin ManagementFeatureIDEA-206274If there there are two dependencies on the same plugin in plugin.xml and one of them is optional the other is treated as optional as well
FeatureIDEA-201336Drag'n'drop plugin zip file to welcome screen doesn't install it, but instead opens it as a file
BugIDEA-202302Plugins management: confusing reaction in case of required plugin disabling, and the dependent plugin uninstalling
BugIDEA-171225Plugin manager should select ony one (latest compatible) version in custom plugin repository and use it
BugIDEA-202957New Plugins dialog: 503 server error causes two error dialogs - one after settings dialog is closed
BugIDEA-205249Required plugin isn't isn't added when click 'Enable' in 'Preferences | Plugins'
BugIDEA-199129New Plugins panel opens oversized if last opened tab was "Installed"
PerformanceIDEA-205534Typing lags in plugins search UI
UsabilityIDEA-200225When user installs plugin from disk tab should be switched from "Marketplace" to "Installed"
UsabilityIDEA-126874Settings | Plugins have poor keyboard navigation
UsabilityIDEA-200867Show plugin versions in the installed plugins list
ExceptionIDEA-201296Restart from new plugins dialog results in exceptions in console
Project ConfigurationBugIDEA-203651Kotlin MPP (Common and JS) test source roots are not detected as source roots
BugIDEA-208450Memory leak in RootModelImpl.myDisposable
BugIDEA-185499Do not create all facet editors on project settings open
BugIDEA-208237IDEA forgets unloaded modules.
BugIDEA-139332Creating template from project error: Error parsing file template
BugIDEA-206879Scopes: can't exclude folder, only the files inside it
BugIDEA-107676Project Templates: attempt to apply the project template created from one of static web template project fails with velocity exceptions
CosmeticsIDEA-202743Library that contains only a single folder is shown as "libs and one more file" in Project Structure
ExceptionIDEA-202726AccessDeniedException on project name change if .name file is read-only
ExceptionIDEA-205597REWA at com.intellij.openapi.application.impl.ApplicationImpl.assertIsDispatchThread
Quick DocumentationBugIDEA-205190Misplaced Mouse Cursor
BugIDEA-203264Restoring quick doc popup size changes its content
BugIDEA-204179Wrong scrolling position after hyperlink navigation in quick doc popup
BugIDEA-205229QuickDoc popup appears at wrong position when cursor is in "Find" field
BugIDEA-201023QuickDoc popup becomes small after resizing and clicking the link inside the popup
BugIDEA-201393QuickDoc popup hides after selecting "Show Toolbar" option if QucikDoc is shown on mouse move
BugIDEA-201449Documentation tab name is not updated on following links in documentation
BugIDEA-203588JDK11 Javadoc links use wrong anchor format
BugIDEA-203728Quick doc opened for an item from Project View changes position if one clicks on a hyperlink it contains
BugIDEA-202665Quick documentation resolves method to any compatible method
BugIDEA-189815Quick doc popup shown on mouse hover closes when clicking on a reference to a different class inside
BugIDEA-205497QuickDoc popup appears on another monitor if invoked from "Brief Info" popup
BugIDEA-201819QuickDoc popup is shown under the element in Diagram area even if there is not enough space for it
BugIDEA-202789Too many "Element information is not available during index update" notifications
BugIDEA-201280QuickDoc popup appears at the cursor position after closing the documentation tab in Tool Window
UsabilityIDEA-200674Adjust popup size according to the font size
UsabilityIDEA-200124Quick Documentation hides context menu
RefactoringUsabilityIDEA-206481Improve new file "Register New File Type Association"
CosmeticsIDEA-206172Refactor of directory name that begins with a dot to another name that begins with a dot PREVIEW-s a new name with TWO dots.
RegExpFeatureIDEA-202325In RegExp form, check whether the regular expression could match a longer input
UsabilityIDEA-202189Pressing Shift+Tab in the Check RegExp window leaves the window
Run | Debug configurationFeatureIDEA-114577Confirm deletion of run/debug configurations
BugIDEA-96960Run Configurations popup: inconsistent position for run config folders
BugIDEA-157989"Stop" button does not work when the IDE is launched as a background task
BugIDEA-194910Add macro support for VM options field (e.g. expand $ModuleFileDir$ properly)
BugIDEA-195693Context help shows 404 page when invoked for a run configuration which don't have special help page
BugIDEA-206761Run configuration adds one more underscore
BugIDEA-202004Run Configuration. Red class name "Class 'Main' is in the default package"
UsabilityIDEA-204335Need an ability to disable run configuration delete confirmation dialog
UsabilityIDEA-201215JVM launcher cannot process @argfiles produced by IDEA
UsabilityIDEA-206173Environment Variables: can no longer paste from clipboard
UsabilityIDEA-207069Environment Variables "Open Folder"
UsabilityIDEA-206392Do not allow empty parameters in Run configuration > Spring Boot > Application
ExceptionIDEA-205510Throwable at com.intellij.execution.impl.RunManagerImpl.addConfiguration$intellij_platform_lang_impl
Settings RepositoryFeatureIDEA-174290Settings Repository plugin leaks sensitive information in the commit message
BugIDEA-206186When starting up new 2019.1 IDEA it resets settings if JetBrains Account is used.
BugIDEA-182954Font size setting synchronization (via account) fail
BugIDEA-193044Duplicated plugins in Sync Plugin list
BugIDEA-205426Unable to push settings to shared repository - Unknown macro $PROJECT_FILE$ in storage file spec
Structural Search and ReplaceFeatureIDEA-161879CTRL+C on Structural Search > Existing Templates yields SearchConfiguration@2115ed8a
FeatureIDEA-198496Structural search usability: Switch between search and replace modes
BugIDEA-200742Tooltip with "Edit Filters" should be disabled in Existing Templates window
BugIDEA-201528Simple xml query not found because of index access problem
BugIDEA-200892Dialog remembers its size incorrectly
BugIDEA-202914mess after selection
BugIDEA-201300No validation after filter change
BugIDEA-202451SSR: search templates are missing on each project openenig
BugIDEA-206795File type not correctly detected from editor selection
BugIDEA-201833Structural search inspection: added filter is not saved for search template
UsabilityIDEA-203074Cutting and pasting a placeholder in the template editor looses all placeholder filters
UsabilityIDEA-168054Make structural search/replace templates available globally
Task ManagementBugIDEA-205965Pivotal Tracker implementation uses the deprecated and shutdowned API
CosmeticsIDEA-171919Underscore missing in task list drop-down
Template Languages. FreeMarkerBugIDEA-205704Freemarker editor doesn't resolve variables anymore when using <#stop "" /> statement in some cases
ExceptionIDEA-204842nonempty text is not covered by block in #<FreeMarker>
TerminalFeatureIDEA-119667Feature request: shortcut for switching between terminal tabs
BugIDEA-204243In 2018.3 terminal doesn't save commands to the history (zsh).
BugIDEA-201228IllegalStateException when split Terminal tab
BugIDEA-155571terminal history not retained between openings op terminal pane
BugIDEA-205239Cmd+W in a Terminal tab moved to the Editor closes the wrong window
BugIDEA-204725Terminal with bash: 'cat' process ignores SIGPIPE
BugIDEA-165632The terminal is called twice.
UsabilityIDEA-205457Terminal trap DEBUG overrides my trap
UsabilityIDEA-132932Console font change doesn't take effect immediately
UsabilityIDEA-204510too easy to accidentally close terminal window
UsabilityIDEA-206189Fall back shell path for terminal settings
ThymeleafFeatureIDEA-129851Thymeleaf: rename doesn't work for included fragments
BugIDEA-152588Thymeleaf: completion should be available for the included/replaced fragments
BugIDEA-152595Thymeleaf: no navigation/completion/rename is provided for the included/replaces template w/o specified fragments (Complete-template fragments)
BugIDEA-163350Darcula color scheme not looking very nice in Thymleaf templates
BugIDEA-130667Thymeleaf: incorrect completion in th:include attribute value
BugIDEA-145628Thymeleaf: data-th-* syntax should not require xmlns declaration
BugIDEA-129852Thymeleaf: th:include: same-file fragment can be referenced with no keyword specifying
BugIDEA-205379Thymeleaf: navigation to the parametrized fragment doesn't work
BugIDEA-145647Thymeleaf: support navigation to included / replaced fragment
ExceptionIDEA-129849Thymeleaf: exception on attempt to rename the included file
UMLBugIDEA-208229Export diagram to image file: progress cancelling doesn't work
BugIDEA-204874UML diagram: context menu does not work on macOS
BugIDEA-207533Move UML diagram colors to color theme, then use editor color theme
BugIDEA-207912Diagrams background is white on Darcula
Unit Testing. JUnitFeatureIDEA-205843Click to see difference for JUnit doesn't support anonymous FeatureMatchers (too sensitive to whitespace)
FeatureIDEA-201121Ignore @Enabled... conditions when run individual JUnit5 test
FeatureIDEA-2013752018.3 Beta + Rerun Failed Tests does not work with JUnit 5.3.1 Dynamic Test using a testSourceURI
FeatureIDEA-202111JUnit5 suggest, make reference and validate @EnumSource values from enum constants
BugIDEA-206892Incorrect JUnit tree generated for repeated parameterized tests
BugIDEA-204168Test class selection by name is broken
BugIDEA-202869Run Configuration with Test Kind 'TAGS' has unsolvable Error
BugIDEA-199945Idea 2018 and Junit 5 duplicates test executions when running tests from the IDE
BugIDEA-139160Slow response during execution of unit tests when assertion fails with big message
BugIDEA-203414Test configuration with invalid class shows as passing
BugIDEA-198613Test output removed when JUnit test fails
BugIDEA-205512IntelliJ is only running the first package when you select multiple packages to run test
BugIDEA-201118Ignore @DisabledIf condition when run individual JUnit5 test
BugIDEA-123039StackOverflowError when exporting large junit results
BugIDEA-200501JUnit3: "leaf" empty JUnit3 TestSuites are no longer visible
BugIDEA-205937Can't run whole project JUnit tests in Gradle project with multiple modules because of NumberFormatException
BugIDEA-185466Wrong test run configuration can be used when running module tests
BugIDEA-203609IDE won't run JUnit tests classes with same name
BugIDEA-178882Fork doesn't work properly when run tests from package with mix of Junit4 and Junit5 tests
BugIDEA-190838Generated JUnit's setUp() method does not compile
BugIDEA-159414Execute single overridden test method in JUnit test class without explicit @Test
BugIDEA-200313JUnit Jupiter tests ignored when run by pattern and with Vintage tests
BugIDEA-202575JUnit5: FileSource test/container opens file in "bin" folder (if available) on "Jump to Source" or "Show Source"
BugIDEA-202594Counter of total tests shows less then it should when test fails
BugIDEA-202418Confusing output from opentest4j MultipleFailuresError
BugIDEA-195665Not good generate test source
BugIDEA-160306Very long text in test result failures clips the "Click to see difference" link
PerformanceIDEA-203173JUnit 5 Platform Integration calls TestEngine.discover twice
UsabilityIDEA-206042Display name of failed test in JUnit diff window
UsabilityIDEA-205284JUnit5: using @ParameterizedTest and @Test in the same class shows erroneous hint for public access class/methods
UsabilityIDEA-179482Support opentest4j in all tests not just JUnit 5
UsabilityIDEA-195529Test run gutter inconsistency
Unit Testing. TestNGBugIDEA-206449TestNG: test name is not displayed if it is identical to the suite name
User InterfaceBugIDEA-184388Exception on pressing "context menu button" if there is no context menu in the current UI component
BugIDEA-127973Ctrl+Click doesn't work for multiple selection in Changes | Log, File History
BugIDEA-202939Can't exit search from Mac Touch Bar when no Touch Bar menu configurations
BugIDEA-207737support native custom decoration
BugIDEA-198933Problem painting splash screen tail image
BugIDEA-204015IllegalArgumentException because event getcomponent is null (from TrayIcon)
BugIDEA-206484"Switch Boot Runtime" dialog: Some local JDKs are shown as "Undefined[Local]" in drop-down list
BugIDEA-206399Navigation bar missing on opening new project
BugIDEA-207598Show smart step into popup above the line
BugIDEA-201103Linux native menu: some submenu are empty
BugIDEA-203219Touch Bar buttons for "Find/Replace in Path" dialog do not correspond to dialog buttons
BugIDEA-207957IDEA is not switched to full screen on Windows
BugIDEA-204789project frame opens out of screen
BugIDEA-204130Find usages -> Export to Text background does not match font colour
BugIDEA-204534KDE global menu
BugIDEA-206344Recent Locations popup: after exiting presentation mode, popup may keep the enlarged font for snippets
BugIDEA-202305Update JavaScriptDebugger and JavaScriptLanguage icons
BugIDEA-118112Additional keybindings
BugIDEA-166195icons doing the same action: intended?
BugIDEA-186740Scrollbar overlaps piece of text in an overflow hint
BugIDEA-206775Remove Run Anything icon for IntelliJ IDEA
BugIDEA-201104Linux native menu: popups are not closed when native menu is opened
BugIDEA-203502Preview in "Find Usages" toolwindow turns green when disabled
BugIDEA-206700Validation in tables: bugs
BugIDEA-199508New Search Field: replace clean icon with close one
BugIDEA-204678Editor tab is minimized to OS title bar when detaching it with a mouse
BugIDEA-202749Missing mnemonics for labels
BugIDEA-203496java.lang.IllegalStateException: component cannot be null
BugIDEA-204831On IDEA restart 2 projects are opened while when IDEA was closed only one project was opened
BugIDEA-207394Icon animation stops in TestTree for one project if tests were started in parallel in two projects
BugIDEA-186873Unpinned "Find Usages" window became closed when some control in it are pressed
BugIDEA-201284Linux Native Menu Bar: main menu is not available if the detached editor has focus
PerformanceIDEA-205737parameter info tooltip slows down typing in editor
PerformanceIDEA-199938"Compress and Show Logs" works on UI thread
PerformanceIDEA-20434130s hang inside DeferredIconImpl
PerformanceIDEA-199779Make generated icons lazy
UsabilityIDEA-203571Disabled icons on status bar should support LAF changes
UsabilityIDEA-206969Consistent names of actions in View menu
UsabilityIDEA-167451file chooser dialog: can't definitely say which icons are grayed and which are wnot
UsabilityIDEA-202513'Evaluate' window always shows on a fixed size and location.
UsabilityIDEA-203577Update tool window modes menu
UsabilityIDEA-206408"Switch Boot Runtime" dialog takes a long time to show up
UsabilityIDEA-180216Image viewer zooms in wrong direction on scroll wheel
UsabilityIDEA-195255Dialog Non-Project Files Protection: make OK primary button
CosmeticsIDEA-85566Git branches with underscores don't render properly in branch menu
CosmeticsIDEA-199007Incorrect progress dialog border rendering
CosmeticsIDEA-184165Startup splash screen progress bar is not centered
CosmeticsIDEA-203829Analyze actions shows "Include test sources" option even if there are no tests in the project
CosmeticsIDEA-206478Partial commits: 'Uncheck All' checkbox misaligned with dependent checkboxes
CosmeticsIDEA-203937Vertical aligned windows can't be resized entirely anymore
CosmeticsIDEA-205826Annotation name is cropped on hiDPI monitor 175% scale
CosmeticsIDEA-200555Icons in the Apply Patch dialog are not updated
TaskIDEA-205679Rework validation in tables
ExceptionIDEA-205460"Throwable: Project is already disposed" in Structure View on Close project
ExceptionIDEA-203132NullPointerException occurs on entering Presentation mode
ExceptionIDEA-208621Bookmark dialog's move up/down actions do not work (throw exceptions)
User Interface. Action SystemBugIDEA-202541Replacing an action via unregisterAction/registerAction may not update references in action groups
BugIDEA-202598Remove action from all action groups when ActionManager.unregisterAction is called
ExceptionIDEA-203236Throwable occurs when accessing "Run Anything" via shortcut
User Interface. ControlsBugIDEA-204186IDEA lost mnemonic for 'File-eXit'
BugIDEA-204972Cannot assign context-dependent shortcut key if that shortcut is left alone for a different context
BugIDEA-202228NPE at com.intellij.ide.ui.laf.darcula.ui.DarculaProgressBarUI.paintDeterminate
BugIDEA-207083Implement validation of checkboxes
BugIDEA-200457ComponentValidator doesn't work with EditorTextField
BugIDEA-207235On Linux it's impossible to switch tabs in Debug Tool Window (e.g. from Threads to Frames), in Project View if the first line is selected
CosmeticsIDEA-201120Cannot Run Git popup contains Configu link instead of Configure
CosmeticsIDEA-202283Plugins UI: Top border of "Back to Plugins" button is cut
ExceptionIDEA-198778Exception on a click to the hidden toolwindow toolbar item
User Interface. FocusBugIDEA-203154Focus lost when some tab is closed in Version control toolwindow
BugIDEA-187615VCS tool window loses focus when file is selected from History dropdown list
BugIDEA-194482Focus lost from main pane after swithcing tabs with keyboard (Alt+Right)
User Interface. Keyboard InputBugIDEA-203999Double CMD doesn't show tool windows
BugIDEA-206348Can no longer use "AltGr" to invoke Alt-Enter for Intention action under JDK11
UsabilityIDEA-206757[Sublime keymap]: "Ctrl+Shift+Backspace" should be mapped to "delete to line start" action
User Interface. Look and FeelBugIDEA-203934Icons become of a Darcula theme after restarting IDEA with "High Contrast" theme set
BugIDEA-185124Project Structure dialog doesn't change theme properly
BugIDEA-204746No border between 'Shelf' toolwindow content area and toolbar
BugIDEA-201938High Contrast Theme: UML diagram window is still grey for contrast scheme
BugIDEA-159315Black text on dark background in 'Rename File' dialog box. (Dracula theme)
BugIDEA-206617Cannot open Settings when a theme is applied
CosmeticsIDEA-204282Tree in "File and Code Templates" has grey background when "High Contrast" theme is applied
TaskIDEA-203153Support old color key names
User Interface. NavigationFeatureIDEA-115029Feature request: recent files dialog should use up/down/left/right key mappings
BugIDEA-206176Recent locations popup: long string editing leads to location shown as empty
BugIDEA-154117Cannot bind Alt+S to an action
BugIDEA-206340Recent Locations popup: after checkbox is checked by mouse popup loses keyboard focus
BugIDEA-207077Header does not resize on popup resize, title and checkbox may overlap
BugIDEA-207963Can't find some recent files in Search Everywhere top
BugIDEA-208222Search Everywhere: Items duplicated in Files and Symbols sections
BugIDEA-207903Search Everywhere: Selection disappears when "more" item activated
BugIDEA-206205Recent Locations popup: new-created file doesn't appear in popup
PerformanceIDEA-202231Compute breadcrumb information outside of EDT
UsabilityIDEA-207546Goto file: match spaces with file separators
UsabilityIDEA-204149Disable Search Everywhere from automatically inserting last query
UsabilityIDEA-204424Confusing representation of items without a group in go to related symbol popup
TaskIDEA-209217Fixed size RL popup
ExceptionIDEA-206238IAE at com.intellij.util.containers.ContainerUtil.$$$reportNull$$$0
ExceptionIDEA-200357'Quick Documentation' action fails with exception
User Interface. Project ViewFeatureIDEA-123918Allow to use additional keymaps for up/down in project window
FeatureIDEA-200471File nesting not happening when file name is equal to configured file suffix
BugIDEA-176384Scroll from source not working anymore
BugIDEA-204918File nesting doesn't work with .java files
BugIDEA-190056Class members are highlighted as erroneous when they aren't
BugIDEA-203616Update in Resource Bundle makes the file explorer to close the Resource Bundle folder
ExceptionIDEA-204840StringIndexOutOfBoundsException on Enum file opening when "Structure.Show Inherited" enabled
ExceptionIDEA-203552CancellationException at org.jetbrains.concurrency.AsyncPromise.cancel
Version ControlFeatureIDEA-177606Use more relaxed heuristics to mark cherry-picked commits
FeatureIDEA-167703Shelf deletion should support undo instead of confirmation
FeatureIDEA-202946Show History for selection should work for the caret position
FeatureIDEA-200561VCS Annotations: add mode to show author initials instead of full name
FeatureIDEA-182234VCS code analysis: specify exactly how many files contain problems
FeatureIDEA-203130Allow to apply shelved changes without removing them from shelf by dragging corresponding changelist to 'Local Changes' tab while holding Ctrl
FeatureIDEA-52058Prompt to add files to version control that got copied into a project externally.
BugIDEA-203802Unshelve Silently restores several changelists in one
BugIDEA-148109A file ignored via .gitignore is shown as modified in 'Local Changes'
BugIDEA-202099Shelve tab automatically closed if delete last shelve even if there are items in Recently deleted
BugIDEA-207102Annoying "Shelf" behavior changes
BugIDEA-203012Files which were not added under VCS at once, do not appear at the list of files proposed ti add to VCS on project reload
BugIDEA-179602Workspace should not be restored is a branch is not checked out
BugIDEA-206072IDEA shows half of project with an olive color
BugIDEA-205302'Clean Unshelved Changelist' - Option button has no default option
BugIDEA-204713Deadlock after switching git branches (with kotlin)
BugIDEA-170942Scope background color is not shown for files that do not have VirtualFile
BugIDEA-205331Cancelling pre-commit code analysis leaves all local changes in stash/shelve
BugIDEA-87811No line status markers for files modified without checkout
BugIDEA-201084'Group By' button doesn't work in Apply Patch dialog
PerformanceIDEA-205332Pre-commit code analysis stashes all roots in the multi-repo project
PerformanceIDEA-208067Project leak via EditorImpl -> InlayModelImpl -> AnnotateRevisionAction$MyVcsVirtualFile
PerformanceIDEA-201408ChangesViewManager's tree builds itself in EDT causing performance problems
UsabilityIDEA-93999Don't show modal "add files to VCS" dialog when files being added are project files
UsabilityIDEA-195646'Local Changes' tree shows module names instead of directory names if 'Group by: directory' is selected
UsabilityIDEA-167403Shelf: focus disappears after removing one of the shelved lists
UsabilityIDEA-138130Make 'vcs changed' popup scrollable for much code
UsabilityIDEA-192682Can't drag&drop several files from 'Shelf' tool window to the 'Local Change" tool window
CosmeticsIDEA-203839Change 'Unshelve changes' dialog button rename
TaskIDEA-204766Unbundle TFS plugin
TaskIDEA-204767Unbundle CVS plugin
ExceptionIDEA-201711Throwable at com.intellij.openapi.application.impl.ApplicationImpl.assertReadAccessAllowed
ExceptionIDEA-205978Already disposed on exit from offline inspections
ExceptionIDEA-180971java.lang.RuntimeException: java.lang.Exception: Cannot get ChangeListManager component state
Version Control. GitFeatureIDEA-193870Set GIT_OPTIONAL_LOCKS for IDE operations
FeatureIDEA-116425Ignored files and folders should indicate that they are ignored
FeatureIDEA-139940Force push could be made a bit safer with --force-with-lease option
FeatureIDEA-190870Cherry-pick only some of the files from the selected commit
BugIDEA-200432VCS: deleted previously generated .gitignore file will be recreated anew after opening project again
BugIDEA-200354unwanted .gitignore created
BugIDEA-76760When a file is added to git and immediately deleted, IDEA update fails with no visible reason
BugIDEA-200208Git: the set custom shelf location should be considered on .gitignore generating
BugIDEA-204694IO changes: Outgoing commits are not shown when local and remote branch names do not match
BugIDEA-205297java.lang.NullPointerException at git4idea.checkin.GitCheckinHandlerFactory$MyCheckinHandler.getSelectedRoots(GitCheckinHandlerFactory .java:368)
BugIDEA-200486"This file doesn't belong to the project" warning for .gitignore file in the project
BugIDEA-205777IO Commits: commits status is not saved after refresh time is over
BugIDEA-200433VCS: gitignore not always created after new project creation
BugIDEA-200211Git: if the project files are located not in the project root, but in some subfolder, the .gitignore is generated incorrectly
UsabilityIDEA-187448Partial commit | "Uncheck all" button
UsabilityIDEA-204470'Update checks failed' warning on Branches popup
UsabilityIDEA-201596Don't add unrelated entries to automatically created .gitignore file
UsabilityIDEA-174119Git -> Add option should execute git add for all selected files
UsabilityIDEA-206134Unknown host question is asked N times for a single host
UsabilityIDEA-155587Git action "Checkout with Rebase" has counter-intuitive name
CosmeticsIDEA-203057Unify wordings in 'GitHub Pull Requests'
Version Control. GitHubFeatureIDEA-202764Add Open on GitHub option to annotations in diff dialog of older revisions
BugIDEA-206841GitHub pull requests: reviewers list is not sorted
BugIDEA-201720Multiplr Github accounts: can't clone from the accessible host while another configured one can't be reached
BugIDEA-203744"Checked Out Branch pull/xxx" popup displayed even when no branch is checkout
UsabilityIDEA-200441Git: "Сhoose Github Account " dialog size is not remembered
Version Control. LogBugIDEA-191688Resume indexing operation infinite pop-up dialog
BugIDEA-206766Bug in Log filtering by branch
UsabilityIDEA-202408Strange window flickers on the screen when I navigate through git log (Windows 10)
UsabilityIDEA-160441Better name for Log tabs & tooltips
UsabilityIDEA-130970Git Log: search for filter string both in hashes and in strings
ExceptionIDEA-200875NPE at com.intellij.vcs.log.ui.render.GraphCommitCellRenderer$MyComponent.getFontMetrics
Version Control. MercurialBugIDEA-130035Mercurial - move refactoring bugs
BugIDEA-203079Add project files to Mercurial
TaskIDEA-205988Please get rid of dependency on javax.activation
TaskIDEA-203152Update incoming / outgoingChangesOn icons for HG
Version Control. SubversionBugIDEA-206423Subversion: impossible to merge file conflict using idea
PerformanceIDEA-207024100% CPU usage when working with a changelists of ~100 files
ExceptionIDEA-202460NFE at org.jetbrains.idea.svn.commandLine.CommandUtil.parse
Version Control. TFSBugIDEA-206226Investigate duplicate condition in org.jetbrains.tfsIntegration.tests.ChangeHelper#getModificationChange
BugIDEA-206607TFS: Axis2 configuration error/ClassCastException on workspace creation
BugIDEA-206233TFS checkin not possible "Validation must be performed before checking in"
Web ServicesBugIDEA-176843@OnMessage inspection false positive on String/boolean pair
XMLFeatureIDEA-199839Support deprecation in xsd schemas
BugIDEA-170206'Collapse empty tag' intention breaks code
BugIDEA-199694XML reformatting does not preserve line breaks when the comments are at the end of the file
BugIDEA-194155"Collapse empty tag" quickfix deletes non-empty inner tags in XML file
CosmeticsIDEA-204273Outdated version of the Xerces library in org.jetbrains.intellij.build.CommunityLibraryLicenses
ExceptionIDEA-128571AIOOBE at org.apache.xerces.impl.XMLDocumentFragmentScannerImpl$ElementStack.popElement
i18nBugIDEA-179972Subgroups properties names changes when you select group node
BugIDEA-179376Almost all items from refactoring menu is unavailable for Resource Bundle in Project Tree
BugIDEA-205800Properties keys are not collected into PropertyKeyIndex from Properties language injections
BugIDEA-179977The properties keys names should be in full format in Resource Bundle Editor when "Group by Prefixes" button is not pressed
ExceptionIDEA-180097NPE on deleting Resource Bundle
No subsystemFeatureWEB-37472TypeScript 3.4: support improved type inference for unions/intersections
FeatureWEB-11807Feature: Folder templates for new projects
FeatureWEB-36697Add support for SVG properties to W3C CSS validator
FeatureWEB-34725Angular: provide navigation and content assist for selectors in [ngClass]
FeatureWEB-37151Use proper syntax highlighting for destructured functions
FeatureWEB-29230HSLA (color) support in JS strings
BugWEB-37754Meaningless text in quickdoc for document.createElement() invoked from a TS file
BugWEB-32905Can't analyse webpack.config.js: coding assistance will ignore module resolution rules in this file.
BugWEB-35483Invalid window order for filechooser in window "Run Gulp/Grunt/npm Task"
BugWEB-36877JavaScript projects: IDE frequently freezes when typing in the editor
BugWEB-35729So called "Smart Paste" escapes valid code blocks making them invalid in Javascript.
BugWEB-37006Via quick-fix for failed tests possible to run several identical debug session, put several breakpoints on the same place
BugWEB-37365Autocompletion using Typescript definitions does not work at destructuring.
BugWEB-36034##teamcity log messages when run mocha tests
BugWEB-36639New project template is only visible after the IDE restart
BugWEB-37751Poor documentation formatting for 'ary' function in lodash
BugWEB-36051JSX: no parser recovery on an opening "<"
BugWEB-37226Can't run Vue.js plugin project (outdated config)
BugWEB-37667JSX tag is not closed on typing /
BugWEB-37044Invalid Inspection Warning - JavaScript - Constructor Returns Primitive Value
BugWEB-37062image tag incorrectly marked as deprecated in an SVG context
BugWEB-36306Welcome frame missing Create New Project action link
BugWEB-32850How to apply code style base on Prettier on this project, after saying "no" initially
BugWEB-35513NodeJS: Importing a new project takes hours (when node_modules is already occupied)
BugWEB-36646Please add "parallelize" to the default dictionary
BugWEB-36757Quick Documentation: link to the external doc page is hidden after the click
PerformanceWEB-35491Webstorm process uses up to 500% CPU
UsabilityWEB-36592Quick Documentation tooltip shown on mouse move doesn't include a link to external docs
UsabilityWEB-37387'Ternary to if' and 'Split declaration/initializer' should be available on 'const' and turn them to 'let'
UsabilityWEB-37649Angular: not possible to overtype auto-inserted pair braces in interpolation
UsabilityWEB-36796Save as project template: use notification instead of modal dialog
CosmeticsWEB-37438'Change color' alt+enter menu item is misaligned
Build toolsFeatureWEB-36867Use interactive console for npm scripts run tool window
CSSFeatureWEB-30004Stylelint: allow linting CSS/PostCSS files with custom extensions
FeatureWEB-36035Extract CSS variable refactoring
FeatureWEB-96Allow browser selection for CSS validation
FeatureWEB-21378color preview for css custom properties
FeatureWEB-36260In stylesheet linked to Angular template, provide completion for classes/IDs defined in html
FeatureWEB-37256Instant image preview of encoded SVG data
FeatureWEB-28203CSS Modules: import class with hyphen as camelCase
FeatureWEB-30704@apply is deprecated and only supported by PostCSS, use more lenient parsing
BugWEB-37249CSS inspection for 'appearance' property
BugWEB-37312CSS: 'Browser compatibility (properties)' inspection: "no MDN compatibility data" is shown for the properties with the appropriate data available
BugWEB-35011Sort CSS properties: correctly move the end of line comment together with the property
BugWEB-37014Typo in allowed property values for css overflow property
BugWEB-36942Sort CSS properties (aka Rearrange) in SCSS files doesn't work inside media queries
BugWEB-27632Bad scope for CSS resolution in Angular Templates
BugWEB-37292CSS: Extract variable: do not allow to invoke refactoring over the var() function
BugWEB-37524Hyphen css class renaming doesn't work
BugWEB-37332css attribute place-items has no supported values
TaskWEB-37628Support 'CSS Overscroll Behavior Module' CSS spec
TaskWEB-37622Support "Motion Path Module Level 1" CSS spec
ExceptionWEB-37372Extracting ruleset in JS strings produces the exception
ExceptionWEB-34320Locate duplicates doesn't work for css
DartFeatureWEB-36421Feature: allow to limit the scope of the Dart Analyzer with the current package
FeatureWEB-23646Include non-imported Dart classes in code completion list and auto-insert import
BugWEB-36954Dart plugin incorrectly prevents editing excluded files
BugWEB-17258Dart SDK is not configured after updating Dart
UsabilityWEB-37176when launching a Dart web app, delay launching until wevdev is ready and serving the app
DebuggerFeatureWEB-12349Debugger console: support string substitutions/output styling
FeatureWEB-27977Debugger console: use special colors for `console.info()` and `console.warn()` messages
FeatureWEB-37309Console message filtering
FeatureWEB-35737npm script debugging not supported without $NODE_DEBUG_OPTION argument
BugWEB-36666'Collecting data' for all variables after input in console
BugWEB-36660Debugger: empty library file is opened
BugWEB-37397Syntax error in Debug when try to "evaluate" arrow function expresion
BugWEB-36526When evaluate in console an object with many properties, some of them can't be shown due to a limit
BugWEB-34213javascript debug insists on using Chrome Canary, rather than my release Chrome 68
BugWEB-37354Can't evaluate objects created in console
BugWEB-36462Background is blinking in debugger console
BugWEB-37144Breakpoint already exist error after disabling suspend for existing breakpoint
BugWEB-36953Throwable when rerunning tests
BugWEB-36095WinpException when stop Node.js run/debug configuration on Windows
BugWEB-37352Fonts in js debug console should be the same as in editor
BugWEB-37440Async stacktrace not shown in console
BugWEB-37018ReferenceError when trying to evaluate expression
BugWEB-37070Disabled/muted/removed breakpoints still hit in Webpack applications after recompile
BugWEB-34557Debugging doesn't work for Vue+typescript when using @vue/cli 3.0.0
BugWEB-37444Console input icon doesn't change its size while changing font size
BugWEB-35502Jest: debugger hits the wrong line on debug session restart
UsabilityWEB-36785Show warning when specifying hostname in the "Host" field of "Attach to Node.js/Chrome" remote debug configuration
UsabilityWEB-36448Better presentation for stack trace in debugger console
CosmeticsWEB-37515Icons in console are not aligned
CosmeticsWEB-37357Remove extra line in Filters popup
CosmeticsWEB-37349Move icons on the top line of output
TaskWEB-33598Customize URL for react-native
TaskWEB-37145Debugger console: groups
ExceptionWEB-37538RuntimeExceptionWithAttachments when debug npm script with interactive console
ExceptionWEB-36972Assertion when debugging with temporary breakpoint
ExceptionWEB-37246NoClassDefFoundError when debug via JavaScript run configuration
ExceptionWEB-36460ObjectNotDisposedException when create @angular/cli project
ExceptionWEB-36682UnsupportedOperationException when call 'Pause output'
ExceptionWEB-37223TypeCastException when call console.group()
ExceptionWEB-36540BufferOverflowException when drag console outside IDE
HTMLFeatureWEB-9469Alphabetically sorting of attributes in html and css (inline css)
FeatureWEB-32621Update HTML documentation
FeatureWEB-37374Add "application/ld+json" to `<script type>` completion
FeatureWEB-34660Navigate | Symbol should search for HTML tags by id.
FeatureWEB-2192References guide in html and css
FeatureWEB-36403Show SVG elements only inside svg tag in HTML files
FeatureWEB-27624Code inspection does not scan for deprecated HTML attributes.
FeatureWEB-5087Suggest more relevant tag names and remove delay
FeatureWEB-16881Create inspection to look for deprecated HTML 5 tags and attributes.
BugWEB-36583Tag name editing synchronization lags with some actions
BugWEB-25857<script onerror="..."> highlight error in .html files
BugWEB-36394scoped is marked as deprecated for style tag in vue file
BugWEB-36779HTML Documentation: invalid symbols in the description text
BugWEB-36795HTML docs: doc is not always available in code completion
BugWEB-23008HTML5 documentation: "W3C website" links to old HTML4 specification in HTML5 file
BugWEB-36179HTML code style arrangment with order by name order does not rearrange all elements
BugWEB-32620HTML documentation: remove links to SitePoint
BugWEB-36934React-native tag is incorrectly shown as deprecated
BugWEB-35193HTML5 Outline shows <td> elements
BugWEB-26164onload event on STYLE tag is no longer allowed in v 2017.1
BugWEB-36843HTML Documentation: SVG: empty description with a dot
BugWEB-37518HTML documentation shows existing tag instead of selected variant
BugWEB-36848html 5 boilerplate v7+ falls back to git checkout
BugWEB-36794HTML docs: description for parent docs is shown when doc is invoked in completion
BugWEB-34763MathML tags should not be available in the completion list outside <math> tag
BugWEB-26169style attribute on script correupt
BugWEB-37307"Form input without an associated label" inspection should work when input has a placeholder
UsabilityWEB-6322Suppress code inspection "Form input without an associated label" when input has placeholder
JSONFeatureWEB-31905Semantic highlighting for JSON files
FeatureWEB-36467JSON: show schema conflict notification for widget, get rid of editor notification bar
FeatureWEB-37295Support non-standard deprecation attributes for JSON Schemas
FeatureWEB-36774Add eslintIgnore to package.json schema
FeatureWEB-36487JSON schema in yaml notation
FeatureWEB-34933Suggest schemas from schema catalogue and schema schemas in "$schema" completion
BugWEB-37571json schema oneOf not validating correctly
BugWEB-37261YAML plugin show error: Validates counter ‘if’ branch but no ‘else’ branch is present
BugWEB-37393If-then-else validation issue
BugWEB-36161JSON: Don't input value to property if it already contains some value
BugWEB-31887"Wrap with double quotes" without effect ("JSON standard does not allow such tokens")
BugWEB-36973JSON validation doesn't allow large integer values, although it should
BugWEB-31900JSON: Extend Selection doesn't respect camelHump settings
BugWEB-36429JSON: Don't show object/array default values in completion
JavaScriptFeatureWEB-33449Intention actions and refactoring to replace code by destructuring
FeatureWEB-32703Auto-import with webpack alias: always use the shortest possible path on import
FeatureWEB-32473Intentions to add/remove ES6 exports
FeatureWEB-37007Allow initialising all fields of a class
FeatureWEB-36737ES6: show blacklist settings (Do not import exactly from) in UI
FeatureWEB-36339Intention to convert properties in constructor to class fields
FeatureWEB-30826TS 'Type mismatch' errors should show quickfix to update type when available
FeatureWEB-36957Keyword completion for 'return' should insert whitespace/semicolon when applicable
FeatureWEB-25533No suggestions to autocomplete missing properties in Flow by expected type
FeatureWEB-36316Code completion for 'switch' cases
FeatureWEB-12157Add 'Join subsequent variable declarations' intention
FeatureWEB-35775Support 'globalThis' ESnext proposal
FeatureWEB-36971ES6: add a way to disable autoimports from some modules
FeatureWEB-36338Use file name as a suggested name for class/enum/interface
BugWEB-28792Add Google Closure like destructured parameters of function in JSDoc
BugWEB-36011Flow 'typeof' syntax allows parens, but WebStorm doesn't
BugWEB-37373Add/remove ES6 exports. Wrong context detection for arrow/anonymous function
BugWEB-37355Custom predefined libraries are unavailable in JSP files
BugWEB-36750Color Scheme: Add "Semantic highlighting" option for the JavaScript, TypeScript, and JSON
BugWEB-18054CommonJS: prototype methods of re-exported module should be available in completion
BugWEB-20459CommonJS: properties of function assigned to module.exports not resolved
BugWEB-35454No matching brace/bracket/parenthesis highlighting when ...
BugWEB-25571Unresolved types when destructuring require()
BugWEB-36241'Remove unused local variable' behaves incorrectly with array destructuring
BugWEB-36234Process json file when it's accessed as module.exports property
BugWEB-37550SystemJS autoimports should use path mappings
BugWEB-33767\u not escaped when pasted into js string
BugWEB-37149Destructuring can hide unused variable warnings/errors
BugWEB-37148Semantic highlighting doesn't work for `let` variable assignments inside of separate function scope
BugWEB-37421'Convert ternary to if' breaks variable initialization order
BugWEB-36477Module members are not resolved when using @module + @memberof
BugWEB-36947"Introduce destructuring variables" introduces 'Invalid delete operator target'
BugWEB-34225CommonJS: exported object properties not resolved when assigning `Object.freeze(obj)` to `module.exports`
BugWEB-36012TypeScript/Flow arrow function return type annotation allows parens, but WebStorm doesn't
BugWEB-36854Autocompletion gets confused on properties when there are 2 same-named classes in different modules
BugWEB-18117CommonJS: module property not resolved/completed if module.exports is wrapped in immediately invoked function expression
BugWEB-36872Replace with array destructuring with invalid preceding indexers
BugWEB-37420Invalid Inspection Warnings - Missing semicolon / Selector matches unknown element dummy_selector
BugWEB-36395Completion for React utility types
BugWEB-37413"Can't generate code from Angular Schematics" when using WSL
BugWEB-37416Add/Remove ES6 exports: "Remove export" intention: do not remove the whole code block on the export default
BugWEB-35445Webpack aliases are not resolved if webpack config function is async
BugWEB-34153Broken code after pasting a fragment with escaped symbols
BugWEB-26037Autocompletion gets confused when imported ES6 classes have the same name
BugWEB-30019The IDE can't recognize some mongoose functionality
BugWEB-36193Destructuring is not fully supported in control-flow analysis
BugWEB-35455No intellisense when using spread operator for 'module.export'
BugWEB-36870Replace with destructuring: enable for variables
BugWEB-37112JSDoc return type inference inconsistency between `const` and `let` variables breaks quick documentation and type checking inspections
BugWEB-37264Incorrect "Type void is not assignable to type () => void" warning
BugWEB-36298Semantic highlighting doesn't work for `let` and `const` passed as arguments
BugWEB-36781'Safe delete' is not that safe: should extract side effects
BugWEB-36742Auto completion with named alias is not working correctly
BugWEB-30919Quick Documentation thinks that variable is tag name
BugWEB-33097Call hierarchy action doesn't work for functional expressions
BugWEB-35673Extra item in Structure view if file contains @Component
BugWEB-36879Static member is not accessible for invocation with assignment under arrow function
BugWEB-35742Documentation popup: missing spaces between links to definitions
BugWEB-37211Find usages doesn't work with node.js require()
BugWEB-31053Fields in ES6 class lose their accessor level on re-assignment
BugWEB-36873Introduce new array destructuring doesn't work when invoked inside index
BugWEB-35892Symbols from CommonJS module are not resolved when ternary operator is used for the exported value
BugWEB-32587JSDoc: support typescript "export as namespace" modules
BugWEB-36875Introduce object destructuring doesn't work within template strings
BugWEB-36900'Introduce destructuring variables' wrongly shown
BugWEB-36821CommonJS: exported Promise not recognized
BugWEB-37642Flow integration super slow on flow 0.92.1
BugWEB-37736Flow process is not finished when close IDE
BugWEB-37324Parameter hints popup menu is always invoked for the base language, wrong options page is shown for TypeScript as a result
BugWEB-36902Introduce destructuring variable: doesn't work for static fields
BugWEB-32941Unresolved variable Node
BugWEB-36598Types from 'prop-types' are not resolved
BugWEB-37563Can't type semicolon sign in the color string
BugWEB-37297Syntax error: A term expected
BugWEB-36935Destructuring intentions: Better processing of non-integers (shouldn't be available) and large integers (shouldn't die)
BugWEB-16947CommonJS: prototype methods of exported function not resolved
BugWEB-37258Import is marked as Unused if more than one import path is resolved (incorrectly)
BugWEB-28276Renamed default import causes problems when importing commonjs module
BugWEB-37277No completion provided when using default export in iife format
BugWEB-37516Javascript classes are not identified correctly when declared with unnamed class expression
BugWEB-36041Some refactor actions should not be available for throw expressions
UsabilityWEB-36422Do not show index.d.ts file name for items in completion popup
UsabilityWEB-35652Accelerators in JavaScript run/debug configuration
UsabilityWEB-35838'new Javascript file' attaches .js extension after .mjs
CosmeticsWEB-36414Update icons used in completion for methods that could be overriden
CosmeticsWEB-36186"Must be lvalue" instead of "ReferenceError: invalid assignment left-hand side"
ExceptionWEB-37331Flow: LSP: Server crashing on Windows
ExceptionWEB-37608NoClassDefFoundError: jdk/nashorn/internal/runtime/NumberToString
ExceptionWEB-37026Quick Doc: IllegalArgumentException on invocation documentation with a large image
ExceptionWEB-36918PsiInvalidElementAccessException when call 'Introduce destructuring variables'
JavaScript. FormatterFeatureWEB-7316Feature: Code Style: JS: space before and after unary negate operator
BugWEB-37232Red error highlights in JS code style preview
BugWEB-35831JSX Body tag wrong indentation
JavaScript. FrameworksFeatureWEB-23865Angular2 Class binding [class.special]="isSpecial"
FeatureWEB-37056Angular - context aware code completion for pipes
FeatureWEB-37363Angular: incorrect type of bindings of directives with generics
FeatureWEB-35683Angular: disable Angular language services
FeatureWEB-36071Angular - provide completion for attribute bindings
FeatureWEB-35435Improve handling of Angular entities
FeatureWEB-36150Angular - inspect type of expressions result
FeatureWEB-32278Option to not self-close JSX tags when autocompleting
FeatureWEB-36662Support canonical attribute names completion
FeatureWEB-37243Angular - provide auto-import of NgModules during code completion
FeatureWEB-37063Angular - inspect type in template bindings
FeatureWEB-37057Angular - provide quick fix to auto-import NgModule
FeatureWEB-37284Angular - list module as component's related symbol
FeatureWEB-33517Support React 'defaultProps' + ensure compatibility with TS 3.0 'propTypes'
BugWEB-36790Angular (version 7) intellisense not working with symlinks
BugWEB-37275React + Typescript: broken completion for functional component (React.FunctionComponent)
BugWEB-31288Editor > Code Style > HTML "Add for JSX attributes": None Doesn't Work
BugWEB-37318Angular: syntax issues with xml entity references
BugWEB-36817Completion for 'native' event modifier in Vue.js
BugWEB-36089ng-template is listed twitce in the completion list
BugWEB-32279Support propTypes defined using static getter
BugWEB-34475Angular Dependency and Angular Schematics actions should not be available for scratches and libraries in the project view
BugWEB-31058Incorrect warning: Element XYZ doesn't have required attribute children.
BugWEB-37396Exception when invoking 'Replace with template string' action in the angular template
BugWEB-37791Angular structural directive without argument disables styling
BugWEB-37540Angular: auto close opened curly brackets automatically
BugWEB-37283Angular: false positive 'Type string is not assignable to type String("up")|String("down")' on string expression
BugWEB-37509Emmet expansion in JSX templates generates Quotes for event handlers
BugWEB-37279Declaration is not included in any module inspection doesn't work correct when inpsection the whole project
BugWEB-34133Usages of component prefixed with underscore are not found
BugWEB-36295Angular templates: improve completion suggestions after typing '*'
BugWEB-36856Go to definition for some Ionic components takes you to metadata
BugWEB-37589Some build-in angular modules are marked as not Angular modules
BugWEB-35197Angular: CSS selector marked as unused if it's used in [ngClass]
BugWEB-37588[TypeScript][React] Component requires props from a Component connected to Redux
BugWEB-21457Angular2: path in templateUrl changes to path relative to current file on refactoring
BugWEB-37647"Must be lvalue" in angular template with non-null assertion
BugWEB-37797Angular: incorrect text coloring if char entities are used.
BugWEB-30180New component tag should not always auto complete to self closing for components that require children
BugWEB-36386slot-scope not recognized
BugWEB-35684Angular: ensure Angular support is stub safe
BugWEB-37054Angular - take NgModule structure into account when resolving pipes, directives and components
BugWEB-37798Angular: generic members of parent class not resolved correctly in template
BugWEB-37276False positive ' Expression result type' inspection for trackBy functions
BugWEB-37644Angular expression comments are incorrectly lexed
BugWEB-36652Enable auto imports for JavaScript symbols in .vue files
BugWEB-37737Angular: issues if dot-prefixed templateUrl is relative to base path
BugWEB-22063No completion for props merged with ES6 spread operator
BugWEB-34821No inspection for undefined symbols in pipe expressions.
BugWEB-37348Angular: false positive ambiguous component problem in index.html
BugWEB-37320Angular: binding to an @Input that is a method gives a warning
BugWEB-37132Angular: CSS selectors from component local stylesheets are marked as unused
BugWEB-37520Angular: Wrong case in autocomplete
BugWEB-36002WebStorm doesn't recognize (focusin) or (focusout) event bindings in Angular templates
BugWEB-37693Angular: Inspection "Component or directive matching ... out of the ... scope" broken if importing ModuleAndProviders
BugWEB-36114React components created with ref forwarding are not suggested in completion
BugWEB-37278False positive 'Declaration membership in NgModule' inspection when using spread operator
BugWEB-35820Issue with spellchecking an expression with & and ;
BugWEB-37660JSX: propTypes don't work with spread if they are defined using literal properties
BugWEB-37603Ionic 4 components are reported as undefined tags
BugWEB-37058Angular - support standard attribute to property mappings
BugWEB-37384Angular Material error - "More than one component matched on this element"
BugWEB-37637`Type` is missing in the completion list
BugWEB-37879Angular: $event type is wrong in (ngModelChange)
UsabilityWEB-37414Angular. Template. Autocomple inserts [class.] instead of class attribute
TaskWEB-26592Angular: Improve suppression inside component's templates
ExceptionWEB-36170Exception is thrown when removing reference in angular tempate
JavaScript. InspectionsFeatureWEB-36124Enable and improve JS inspections "Pointless bitwise expression", "Shift operation by inappropriate constant" and "Incompatible bitwise mask operation"
FeatureWEB-36319More inspections related to 'switch' statements
FeatureWEB-36805Inspection and quick fix to move a variable closer to its usage joining with the initializer
FeatureWEB-36229Add Inspection for missing switch statement cases
BugWEB-37025"Condition is always true" inspection for THE standard "is this an object" test
BugWEB-36969Function exit points highlighting: highlight 'yield' in generators, better highlight 'throw' in try-catch
BugWEB-18936ES6/7 class declaration with getter/setter and default value causes "duplicate declaration" highlight.
BugWEB-36236Suppressing several inspections for one line adds comments in several lines
BugWEB-36945Don't highlight unreachable 'switch' labels in case of non-strict literal types
BugWEB-36832Quick fix for 'no default branch in switch statement' is not displayed
BugWEB-36920Unused variables inspection/fix behave incorrectly with destructuring
BugWEB-34810False positive "unused function" with <a href="javascript:functionName()" />
BugWEB-37347False positive "Reports pointless bitwise expressions" inspection
BugWEB-36452"Condition is always true" false positive for result of local arrow function
BugWEB-32220Not relevant quick-fixes for the missing import statement inspection for PropTypes
BugWEB-37097inline suggestion of a const variable -> changes outcome
BugWEB-29577Good code yellow: Local variable is redundant when restoring original value
BugWEB-36979Destructuring intention actions shouldn't be available on type annotations
BugWEB-36970False positive 'Expression type does not have [Symbol.iterator]' for 'any' type
BugWEB-35461Inspections: "Missing required 'alt' attribute" gives false positive in the Vue.js files
BugWEB-34239Not possible to suppress inspection in class decorator
BugWEB-36304False positive: 'arguments' not allowed
CosmeticsWEB-37186'Replace Switch With If' intention has a similar inspection
CosmeticsWEB-36967Typos error in Settings → Editor → Inspections → JavaScript, missed a space in the inspection description
CosmeticsWEB-37011Inspections: JS: clean up descriptions
TaskWEB-35027TypeScript / Javascript nullability: further improvements
JavaScript. RefactoringFeatureWEB-33422Destructuring should be used where possible ('Convert parameters to object')
FeatureWEB-34162Add an intention action to quote/unquote object literal properties
FeatureWEB-36724Add intention to convert between indexed and dotted object notations
FeatureWEB-22569ES6 convert var to let/const inspection/intention: support destructuring operator
FeatureWEB-26313ES6 refactorings: convert promises to async/await
BugWEB-37064Don't show 'Convert parameters to object' for callback function
BugWEB-36898Intention to split variable declaration and initializer incorrectly processes loops
BugWEB-16853Incorrect brace insertion
BugWEB-36912Convert between indexed and dotted object notations: should have better availability
BugWEB-37313'Safe delete' for variables doesn't check for usages anymore
BugWEB-37131Intentions: preserve arguments names with the "Convert to async function" intention
BugWEB-34947"Extract method" refactoring may create method, which doesn't return necessary variables if they are created using object destructuring
BugWEB-37160Intentions: finally statement is lost after the "Convert to async function" intention invocation
BugWEB-35588'Convert to field holding arrow function' removes decorators from class
BugWEB-37228Intentions: "Convert to async function": comments in the code blocks are lost after the conversion
BugWEB-37227Intentions: "Convert to async function": equal constructions are converted differently
BugWEB-37207Convert to hex/decimal/binary/octal is giving wrong results
BugWEB-36088On Refactoring - multiple imports are added
BugWEB-37239Intentions: "Convert to async function": correctly convert the anonymous function into IIFE
BugWEB-36358Split OR'ed if produces corrupt output
BugWEB-37163AssertionError: Could not parse TS type from '*[]' when call 'Change signature'
BugWEB-28356Extract method refactoring is not performed when semicolon is not selected
BugWEB-37081Use 'const' for the introduced destructuring by default
BugWEB-37254Replace with indexer access: introduces red code in case of generics
BugWEB-37328'Convert to async function': properly handle same-call then-catch
BugWEB-37310'Convert parameters to object' shouldn't be available if one of the parameters references 'this'-type
BugWEB-37270Introduce array destructuring: java.lang.RuntimeException: Document is locked by write PSI operations.
BugWEB-37170Remove actions ( 'Introduce local variable' and 'Introduce object destructuring') from embedded expressions
BugWEB-36892'Convert to let/const' breaks code when called in For loop
BugWEB-36725Converting to named function creates unnecessary public modifier
BugWEB-33970False positive 'Cannot extract code with conditional return' in extract method
BugWEB-36891Improve 'Join variable declaration and assignment' for loops
BugWEB-37311'Convert parameters to object and introduce interface' should be available when parameters reference 'this'-type, and should extract generic interface
BugWEB-36136"Extract variable" refactoring may produce incorrect code if spread operator is used
BugWEB-37164'Change signature' is not available inside .vue files when return type is mismatched
BugWEB-36622Wrong default import when using Move refactoring for React components
BugWEB-37205Convert to async function refactoring loses generic parameter
BugWEB-37401'Convert to async function' produces broken code if no semicolons selected in code style settings
BugWEB-35909Inline Function: (Typescript) nested "return" statement of inner anonymous function is lost
BugWEB-37121'Extract type alias' should add an extra type parameter for 'this'
BugWEB-33350Fix focus in 'Change signature' dialog when shown from quick fix
BugWEB-36799'Extract function' should work when selection contains local functions
BugWEB-37280JS 'Extract method' produces extra newlines when selection contains nested function
BugWEB-36633Webstorm goes unresponsive when trying to extract a variable using ` cmd + option + v `
BugWEB-36630Typescript extract parameter in arrow function doesn't affect call site.
BugWEB-36814'Split into declaration and initialization' produces incorrect code
BugWEB-36847Extract method may produce incorrect code when nested function is used in extracted method
BugWEB-37301'Replace with destructuring' intention places variables after the preceding when all the variables are in the same list
UsabilityWEB-37204Simplify parenthesized expressions when doing extract-refactorings
TaskWEB-37188Better UX for 'generate delegating methods' dialog
ExceptionWEB-37158Intentions: java.lang.Exception is thrown for the "Convert to async function" intention
ExceptionWEB-37077Exception on 'introduce object destructuring'
JavaScript. TemplatesFeatureWEB-10883Mustache Plugin: Add Support for Inerhitance
LESSFeatureWEB-31443Support less 3.0 features
BugWEB-34549Less function each
BugWEB-24644less-file report an error on using the literal sign '~'
BugWEB-5649LESS CSS: variables with variable name are not correctly resolved
BugWEB-36397Char is missing when renaming variable variable in less
BugWEB-35947Tilda-escaped import is shown as error in Less
LintersFeatureWEB-36890TSLint: Replace 'Lint JavaScript Files' checkbox with detection based on presence of 'jsRules'
FeatureWEB-35990ESLint: Use the runtime config(cliEngine.getConfigForFile) to detect which file types should be linted
FeatureWEB-36988Support @typescript-eslint for automatically linting .ts files using integrated ESLint
FeatureWEB-30614Stylelint support should allow inspection of JS files
BugWEB-37120TSLint Schema for "whitespace" not up to date
BugWEB-37143Missing support for ESLint globals new syntax
BugWEB-37383Wrong highlighting with typescript-tslint-plugin and whitespace-checking rules in vue
BugWEB-37656eslint.additional.file.extensions registry option should trim space
BugWEB-36889ESLint: doesn't work if there is no dependency to it in package.json and auto-detection of configs is enabled
BugWEB-36806'Detect package and configuration file' in linters doesn't unselect custom config file
BugWEB-37761Unexpected Language service response - eslint with ts files (vue-parser as parser)
BugWEB-37528typescript-tslint-plugin: invoking 'fix all errors' in vue file breaks code
BugWEB-37378typescript-tslint-plugin highlights wrong ranges for semicolons rule
BugWEB-37116ESLint depends on location of first linted file
BugWEB-37178Provide quick fixes when running TSLint with typescript-tslint-plugin
CosmeticsWEB-37027Linters config UI: replace label about automatic configuration with question mark icon with popup
ExceptionWEB-36681NullPointerException when open file in create-react template project
Node.jsFeatureWEB-37534Docker compose: support Debug mode when "JavaScript file" field is empty
FeatureWEB-36167[NodeJS] missing field in packageJsonSchema.json
FeatureWEB-37123Offer the dev an auto-complete list of the environment variables defined in the active project run-time configuration. when process.env is entered in a statement.
FeatureWEB-12988Basic Node JS template
FeatureWEB-22231Feature Request: Semver tooltip hinting
FeatureWEB-35765Navigation and resolve for npm script names
FeatureWEB-35072ESLint on WSL not work when mount point '/mnt/c' is changed to others (e.g. '/c')
BugWEB-36650Go to definition for package name in package.json doesn't open module in project view
BugWEB-37308Navigate and resolve to script files
BugWEB-36987Highlight __filename & __dirname as local
BugWEB-36819Open in browser is suggested for 'url' and 'repository' keys in package.json
BugWEB-36921A window pops up when stopping a run task on windows
BugWEB-36645Use 'bin' property from package.json to run npm/yarn
BugWEB-36753'yarn install' from package.json quickfix / not installed dependencies notification should refresh parent directories
BugWEB-30960Change alignment in 'Package manager' field
UsabilityWEB-36831Do not pre-configure working directory in Node.js run configuration template
UsabilityWEB-35968Settings update npm packages gives no indication of activity
UsabilityWEB-36855NPM Upgrade via IDE allows multiselect but upgrade only updates last selected package
ExceptionWEB-37707package.json: Semver check produces Throwable
Pug (ex-Jade)FeatureWEB-7901JADE: add breadcrumbs bar showcasing the nested elements like HTML & HAML have
FeatureWEB-15349Allow multi-line property lists to be indented
BugWEB-36968Pug: accepting completion for doctype removes a preceding space
BugWEB-32306Arrow functions are not supported in the script tag in Pug
BugWEB-35735Pug: no tags completion in block section
BugWEB-22432Support ES2015 syntax in Jade/Pug unbuffered code
BugWEB-22802Pug: support ES6 template strings
BugWEB-14174Jade: Completion: replace obsolete value '5' with actual 'html'
BugWEB-19541Jade string formatting incorrect if /n is present
BugWEB-19320Highlighting breaks for ES6/2015 tagged strings
SASSFeatureWEB-34910Sort CSS properties (aka Rearrange) in SCSS files
FeatureWEB-6015Add color preview box in the left gutter for variable (containing some color value) reference (as it done at its definition)
BugWEB-36991Sort CSS properties (aka Rearrange) doesn't properly sort nested properties in SCSS
TypeScriptFeatureWEB-37051Support TypeScript 3.4 readonly array/tuple types
FeatureWEB-36292Use capitalised variable name as placeholder for the extracted type or interface name
FeatureWEB-36444Support TypeScript 3.3 merged signatures
FeatureWEB-26429Generate -> Delegate Methods for ES6/TypeScript
FeatureWEB-37445Update bundled TypeScript to 3.3
FeatureWEB-33130Vue.js: use ts service for vue files
FeatureWEB-36375Add new intention to wrap the return type of async method to a global Promise type
FeatureWEB-35004Can 'Compile' action on .ts file trigger compilation on nearest config?
FeatureWEB-35849TypeScript: add explicit action to restart service
FeatureWEB-37122An extra intention action to convert parameters to object + extract interface
FeatureWEB-36981TypeScript: add quick fixes for adding library in tsconfig.json
FeatureWEB-36291Make Extract TypeScript interface available for a variable holding the object
FeatureWEB-37105Support TypeScript 3.4 contextual type inference from generic return types
BugWEB-37507'Redundant local variable' inspection is spurious when the variable assignment is used for type widening.
BugWEB-36334No type keyword completion in extended class generic arguments
BugWEB-36195Incorrect Typescript intention: "make private" on lambda
BugWEB-36317'Specify type explicitly' doesn't work for function/lambda expressions and also doesn't properly derive union return types
BugWEB-36949Expression Result Type inspection - wrong on Component bindings
BugWEB-37125TypeScript: Create Field on enum adds 'public' keyword If 'use public modifier' option is on
BugWEB-36177`constructor` not detected as used when only used with `this`
BugWEB-35862'Extract interface' refactoring should better handle implicitly referenced generics
BugWEB-36731"Introduce destructuring variable" intention. Read/write usages
BugWEB-37602Type guards: cannot resolve narrowed type methods because of invalid type source taken from 'any'
BugWEB-37345Better cycle protection for aliases
BugWEB-33073Go to super class action doesn't work inside objects for implemented properties from the interface
BugWEB-29618Support partial matching of union signatures
BugWEB-36511Variables with construct signatures from libraries not shown in completion after `new` in case of multiple libs with same interface
BugWEB-37552tsserver crashes with assertion on TS side on removing script tag in vue file
BugWEB-37494Circular imports
BugWEB-27886Unused import inspection doesn't work when the path is invalid
BugWEB-36587Cannot parse parenthesized object literal with union type inside function return type annotation
BugWEB-9526Typescript: Extract method should work for selected block inside switch()
BugWEB-37410Type aliases should be in the completion list for implementing
BugWEB-37386Popup menu for parameter hints does nothing in case of TypeScript call signatures
BugWEB-35879idea can't display some func as func color in typescript
BugWEB-36829False positive 'Item is not redundant' when assigning to typed variable before returning
BugWEB-35202TypeScript: No auto-import and completion of exported variables from js files
BugWEB-37663TypeScript: wrap fixes aren't available if ts service is on
BugWEB-36726"Introduce destructuring variable" intention should have better availability
BugWEB-29249TypeScript. Incorrect import after moving files from mapping path
BugWEB-37429Type guard is not evaluated for 'switch (typeof x)'
BugWEB-37028TypeScript: if "lib" array in the tsconfig.json is empty do not duplicate the added library
BugWEB-37154Add 'readonly' in the completion list
BugWEB-30321'instanceof' type guard works incorrectly when provided with 'any' type
BugWEB-36169typescript lost setting after edit field
BugWEB-34392Completion for readonly modifier after other modifiers in constructor
BugWEB-37251TypeScript config: "strict" option includes "strictNullChecks"
BugWEB-37488TypeScript: properly expand mapped type with 'any'
BugWEB-37530Angular: add tsconfig.lib.json to the tsconfigs list
BugWEB-36868Promise.resolve always infers to 'Promise<any>' because of incorrect resolve between library files
BugWEB-37047Marking application assets as Resource Root cause problem with tsconfig lib aliases in Angular NX application
BugWEB-37140IntelliSense does not resolve typescript with typeof import('module').property
BugWEB-36771Incorrect result of type assignability check in TypeScript
BugWEB-37706Incorrect "is null" warning Typescript (closure)
BugWEB-36706Typescript: AutoImport ignoring `paths` field in tsconfig.json
BugWEB-34136Wrong rewriting of import path after moving a dependent file
BugWEB-31139Incorrect inference for Record type in conditional type
BugWEB-36619Typescript class implementing an interface method as a lambda incorrectly reports method as unused/can't find usages
BugWEB-37592Support for typeof import
BugWEB-37273Remove export intention adds public modifier for the variable
BugWEB-37606"Do not show parameter hints for this method" not suggested for functions types
BugWEB-37411Rename-refactoring shouldn't be inplace on this-types and this-expressions
BugWEB-37388False positive in Unsound instanceof type guard check
BugWEB-32596TypeScript overloaded functions resolve to first one that allows the argument, even when more precise alternatives exist
BugWEB-37564TypeScript: type guard doesn't work for re-declarations
BugWEB-36885Type inference fails for Extract<T> type
BugWEB-36412Autocomplete not work with dynamicaly evaluated types
BugWEB-37581False type mismatch errors when returning promise instance
BugWEB-37119this-types should also have this-references
BugWEB-37475Inspection: async function return type should be 'Promise<..>'
BugWEB-37533No expected type for React props in TypeScript files
BugWEB-36464Destructuring intention actions should better handle 'const' variables
BugWEB-37514TypeScript: support keyofStringsOnly compliler option
BugWEB-36439Use our tooltips instead of TS service tooltips on 'this'-expressions
BugWEB-37129typescript/idea auto create method bug
BugWEB-36712No option to disable breadcrumbs in *.tsx files
PerformanceWEB-37049IDEA stop responding (hangs) on Type info (CTRL+SHIFT+P)
UsabilityWEB-30634Extends/implements is not shown in completion for class expressions
UsabilityWEB-36273Don't re-format file on applying "Add <classname> to existing import" Typescript service quickfix
TaskWEB-36160TypeScript: optimize TypeScriptGeneratedFilesStartupActivity#addFileToExclude
TaskWEB-36269TypeScript: overload support for tag functions
TaskWEB-34800Check that new TypeScript 3.1 error UX is compatible with our presentation
Unit TestsFeatureWEB-29620Karma plugin should support CLI args
FeatureWEB-22516Support cucumber step definition in TypeScript way
FeatureWEB-29665Missing navigation support for latest CucumberJs and for TypeScript files
FeatureWEB-36578Show test status in the gutter for both compiled and original file
FeatureWEB-35279Highlight failed line and show error message in the test in the editor
BugWEB-36810Angular workspace: WebStorm is starting Karma tests for Protractor specs
BugWEB-37048WebStorm/IntelliJ considers non Angular project as Angular one while running Jest test
BugWEB-37031Angular with Jest: support running tests for non-default Angular project
BugWEB-31227Mocha: working directory isn't set to sub-folder
BugWEB-36927Jest: no results shown when running multiple tests with Node.js 6.x
BugWEB-36736Add working directory option for Cucumber RC
BugWEB-36845Mocha: afterEach fails but test is reported as a success
BugWEB-21609Cucumber-js: 'Create all steps definition' quickfix creates a single definition
BugWEB-37066##teamcity text in console when debug Jest tests with Node 6
BugWEB-37262Karma Plugin raises deprecation warning when executing tests against Jasmine >= 3.3.0
BugWEB-37492Cucumber.js: Working directory doesn't work for the version 2
BugWEB-37046Support jest todo feature (added in jest 24)
BugWEB-37321Jest runner doesn't execute "setupFilesAfterEnv" correctly with Jest 24
BugWEB-36728Cucumber.js: TypeScript steps: correctly process And and But steps
BugWEB-37680Jest fails with 'Class constructor Spec cannot be invoked without 'new''
BugWEB-36974Improve @angular/cli stack trace parsing (impossible to get some unit test features in @angular/cli project)
UsabilityWEB-36272Add gutter icon for 'jest' in package.json
CosmeticsWEB-37422Cucumber RC. Align the labels to the left
ExceptionWEB-36729Cucumber.js: TypeScript steps: correctly process asterisk step
DB ConnectivityFeatureDBE-1584Database: "Automatically disconnect after XX minutes" Property
FeatureDBE-5890KeepAlive setting in data source properties
FeatureDBE-2606Make it possible to run initialization scripts
BugDBE-7768Database view: password in not saved by database creation
BugDBE-7106Connection error after using mysql-dump on data source with ssh tunnel
UsabilityDBE-7799Data Sources and Drivers dialog: don't ask to download drivers if they were downloaded earlier and they are actual
DB ConsoleBugDBE-7896Datagrip notifications show raw HTML
BugDBE-2114Bug in count over function
DB DiagramBugDBE-6225Foreign keys referencing tables with different casing are not displayed in UML diagram
DB IntrospectionFeatureDBE-3413DB2: support database triggers
BugDBE-7743Database: Error encountered when performing Introspect on a MariaDB schema
IDE GeneralFeatureDBE-5854Console 'Save' is a weak spot in an otherwise brilliant product.
UsabilityDBE-7994"Set UI Theme" has inconsistent screenshots
SQL CompletionBugDBE-7682Incorrect completion for nullable enum types in data editor
SQL Format and StyleFeatureDBE-7806MS SQL: Place each declared variables (inside a stored procedure) onto a new line
FeatureDBE-2913SQL code style "Comma Inside Indent"
BugDBE-4805SQL Reformatting creates error
BugDBE-7801Uncontrollable SQL alignment
BugDBE-7605Postgres: SQL formatter doesn't recognise "into temp table"
BugDBE-7376With clause code style gets broken when inside of a subquery
BugDBE-6937improper formatting of postgresql arrays
BugDBE-7362Sql formatter does not apply to injected language
BugDBE-7890PLPGSQL formatter adds a line break after PERFORM
BugDBE-4641Reformat Code should not quote words like NEW, OLD, and EXCLUDED
PerformanceDBE-7849The function WrapImpl.isChildOf() consumes all CPU and never completes
PerformanceDBE-7823Datagrip infinite "Trigger sources" bug
ImprovementDBE-7881Align assignments in ON CONFLICT (Postgres upsert)
SQL GeneralPerformanceDBE-7930Infinite spin (UI freeze) in com.intellij.sql.inspections.SqlIllegalCursorStateInspection$createAnnotationVisitor$1.visitSqlRouti neDefinition -> FlowUtilKt.computePossibleCursorStates
SQL GenerationBugDBE-7862SqlServer doesn't support column identity alteration
SQL HighlightingFeatureDBE-7854False positive for temporary table column reference in "json_populate_recordset"
FeatureDBE-4546Support SQLCMD Mode (Windows)
FeatureDBE-7648PL/SQL Inspection to Report Use of GOTO statements
BugDBE-7754sql parsing issue with "if exists"
BugDBE-7932Incorrect inspection on UNION usage in DELETE statement
BugDBE-7700Support mysql alter user syntax
BugDBE-7853False positive: "Redundant character escape" for "\_" in Postgres "similar to"
User InterfaceFeatureDBE-6432Possibility to configure icons for custom data sources
FeatureDBE-4074Database keep project datasource visible when scrolled down
BugDBE-7659An item in DB settings list is hidden 1) at first 2) after scrolling