HTTP ClientFeature WI-42693 Add an option to disable logging for a specific request
Bug WI-44195 HTTP Client: Request stays running even after response is received
Bug WI-41923 REST Client: Request body is broken when re-formatting JSON with a comment
Usability WI-43271 Use file templates to create HTTP Request scratch file
Injections in PHPBug WI-32917 Using curly braces in SQL injection breaks completion and highlighting
PHP CompletionFeature WI-44956 Suggest accessible class constants and static methods from other project classes on the second completion
Feature WI-854 Add context-dependent parameter value autocomplete in function/method calls
Feature WI-45351 Complete accessible instance method calls applicable via `expectedReturnValues` in function call arguments
Feature WI-12366 Add prompting for "class use" alias on import
Bug WI-45260 Expected arguments: duplicate completion items for string arguments for ini_* functions
Bug WI-45223 Expected arguments: completion does't honour argument class
Bug WI-44402 Don't suggest classes with private constructors in 'new <caret>'
Bug WI-44611 Completion shouldn't suggest already extended interfaces in interface extends list
Bug WI-45666 expectedArguments is not working for argument after a pipe
Bug WI-45307 Expected arguments completion does't work in case of duplicate definitions
Bug WI-44976 Suggest constants from interfaces on second completion
Bug WI-34826 {@inheritDoc} PHPDoc generation inconsistency
Bug WI-45625 Expected arguments completion: don't suggest class constants with wrong class reference
Bug WI-45225 Expected arguments: completion does't suggest class constants after class qualifier
Bug WI-41027 PHP7 function/method return type completion includes wrong keywords
Bug WI-37152 Completion does not suggest interfaces with the same names, but different FQN's in `implements` which were implemented
Bug WI-44434 new statement doesn't suggest private constructor even in the same class
PHP DebugFeature WI-43707 Indicate variable type on debug
Feature WI-40724 Allow breakpoints on enter and exit an internal PHP function (call breakpoint)
Feature WI-37397 Floats in Variables Debug Tool Window
Feature WI-19499 Twig debug support
Bug WI-4740 Support 'Method Breakpoints'
Bug WI-45383 Twig debug: PhpStorm doesn't let to register a breakpoint in the compiled Twig template
Usability WI-43154 Return Key Differences: PHP Include Path vs Path Mapping
Usability WI-44991 Don't allow to register Twig breakpoints if there is no correct mapping to PHP file line
Exception WI-45199 exception with copy&paste on debug watches window
PHP FormatterFeature WI-32166 Don't wrap inline comments for function-call arguments
Feature WI-45505 Provide predefined Laravel code style
Feature WI-24129 Customize number of spaces in PHPDoc
Feature WI-26079 Rearranger: Sort use statements
Feature WI-14694 allow to define order and blank lines in phpDoc
Feature WI-44747 Set default order for PHPDoc tags
Bug WI-44936 Add a comma after last element in array produces parse error if HEREDOC is the last element and PHP < 7.2
Bug WI-44185 Grouped use statements are being incorrectly sorted when reformat code
Bug WI-45561 Update predefined Laravel code styles to match current laravel formatted code
Usability WI-44946 Order PHPDoc tags: Next tag should be selected after deletion of any tag
Usability WI-41122 PHP Code Style: Line breaks after PHPDoc in function declaration
Usability WI-44206 Import statements are not grouped by type when sort them by length
Cosmetics WI-44744 Redesign Sort PHP Doc block table
PHP InspectionsFeature WI-1925 New inspection: Implement global "dead code" inspection for PHP
Feature WI-44491 Add PHP_CodeSniffer option to specify custom extensions
Feature WI-37294 Convert Simplify FQN intention into inspection/quick fix
Feature WI-44428 Allow to run PHP Code Beautifier and Fixer during code cleanup
Feature WI-7535 Unused local variable: New quick fix: Remove unused access
Feature WI-27095 Duplicate array key provide warning with constants with the same value
Feature WI-44771 Warn if parameters count doesn't match placeholders count in sprintf call: support concatenation
Feature WI-6241 New inspection: method may be 'static'
Feature WI-44175 Allow to choose possible type hints in 'add method' QF
Feature WI-44176 Put all possible types in doc method params type hints in 'add tag method' QF
Feature WI-40739 Avoid reporting unhandled exceptions in a case of constant arguments
Feature WI-44217 Strict type rules violation inspection: Possibility to analyze the files w/o declare(strict_types = 1)
Bug WI-45297 Remove unused variable: remove the whole list assigment
Bug WI-26941 Unused variable is not detected in use for closure
Bug WI-45631 False positive in Unused Declaration inspection for overriding methods
Bug WI-45299 Remove unused variable: remove the whole return statement in case shortcut operator is used
Bug WI-45632 False positive in Unused Declaration inspection for methods called in extended classes
Bug WI-44364 Add method tag won't insert parameter types in case of language level
Bug WI-45002 Introduce parameter: does't differ between function and constant import
Bug WI-19295 Changing severity for the inspection "Undefined variable" has no effect
Bug WI-45676 Unused declaration: False positive for method that is used in phpdoc
Bug WI-44267 "Cleanup code" inserts use statements with conflicts
Bug WI-45036 Can't configure phpcbf on windows
Bug WI-45092 PhpStorm sets name for phpcbf without '.bat' extension when perform composer install on windows
Bug WI-18501 Unused local variable false warning with closure by reference
Bug WI-44159 Duplicate array keys: inspection false positive in case constant values are identical up to 20 characters
Bug WI-45731 Try to always resolve path relative to the project root
Bug WI-45280 Intention Action "PHP CS Fixer: fix the whole file" Offered but does not Apply
Bug WI-5033 PHP: "Add Constant" quick fix does nothing if applied to unresolved interface constant
Bug WI-45442 Remove unnecessary qualifier: quick-fix doesn't respect "Use fully-qualified class names" options
Bug WI-38468 Hints for __invoke stop working with parenthesis
Bug WI-44440 Unnecessary FQN does't remove nested function references
Bug WI-45269 Unused variable: false positive in case iterator is reference
Bug WI-45659 Unused declaration false positive: protected fields in child class are marked as unused
Bug WI-9358 Unused local variable: Unused local variable inspection when passed by reference
Bug WI-44680 "Method may be static" inspection doesn't highlight recursive method calls
Bug WI-38887 Return type mixed with void and if triggers Inconsistent return points inspection
Bug WI-13547 Incorrect inspection: "Expected object[], got Foo[]"
Bug WI-44490 Typing path for quality tool invokes validation on each symbol
Bug WI-45069 Quick-fix for phpcbf does not change file
Usability WI-45289 Fully qualified name usage: ignore global namespace checkbox is enabled by default
Usability WI-45298 Remove unused variable: shows dialog about side-effects for array dereferencing
Usability WI-44346 Fully qualified name usage inspection should ignore partial imports
Usability WI-44406 Add validation for PHP Code Beautifier and Fixer
Usability WI-25815 Allow fixing PHP_CodeSniffer detected errors
Usability WI-44380 "Add @method tag" don't replace specific array type to array
Usability WI-44124 Reduce Code Sniffer & Mess Detector path detection logging noise
Usability WI-45201 Change "Method may be 'static'" inspection severity to "No highlighting, only fix"
Usability WI-45288 Fully qualified name usage: Allow to invoke quick fix when caret is on class name
Usability WI-44408 Label for quick-fix of PHP Code Beautifier and Fixer should mention that quick-fix will be applied for the whole current file
Usability WI-44269 FQN Usage/Unnecessary qualifier inspections: highlight php doc types with WEAK_WARNING
Cosmetics WI-45526 Fully qualified name usage: set text of the quick fix as "Simplify FQN" in case of highlighting on class name
Cosmetics WI-44741 Redesign PHP | Quality tools | PHP Code Sniffer validation options panel
Cosmetics WI-33953 Too many parameters inspection: setting page is center aligned
Cosmetics WI-29773 Grammar error in "Other declaration of class HTTPResponse exist at..." messages
Task WI-44271 Disable "FQN Usage" for global namespaces by default
Exception WI-44334 "FQN Usage" throws exception on self
PHP IntentionsFeature WI-44640 New intention: convert string concatenation into string interpolation and back
Feature WI-44753 New intention: 'implement interface'
Feature WI-44981 Replace with alias: reuse existing alias of class reference in scope if possible
Feature WI-44963 Replace with alias: allow to invoke on fully qualified references
Feature WI-4287 Improve add field/property intention: derive type from context and add appropriate phpdoc
Feature WI-44714 New intention: convert string interpolation into printf and back
Feature WI-44716 New intention: copy string concatenation text to clipboard
Feature WI-33793 New intention: Add existing class field to constructor
Feature WI-44806 Copy string concatenation text to clipboard: substitute constant value
Feature WI-44713 New intention: convert string concatenation into printf and back
Bug WI-45081 Convert string concatenation into string interpolation intention should convert single-quotes to double
Bug WI-44777 Replace concatenation with string interpolation should be hidden for static elements
Bug WI-45129 Not insert variadic type hint by language level
Bug WI-45025 Overrides/implements methods quick fix generates incorrect type hint for variadic parameter
Bug WI-44789 Lost dollar sign when converting interpolation to concatenation using complex syntax + array access
Bug WI-44990 Replace with alias breaks code in case used for trait
Bug WI-44774 Convert string concatenation to scalar value: single quotes shouldn't be changed with double quotes if all string literals are single-quoted
Bug WI-44988 Replace with alias during completion: replace existing import and breaks references
Bug WI-44778 Convert string concatenation to string interpolation incorrectly converts string when there are double quotes inside single quotes
Bug WI-44779 Exception when convert single string interpolation to string concatenation
Bug WI-44992 Replace with alias on FQN doesn't allow to choose an alias name
Usability WI-44807 Convert string interpolation into printf: don't suggest intention in places where expression is not expected (default value, field and constant declarations)
Task WI-44244 Split Import class to "import as alias" intention and "import class" inspection/quick-fix
PHP InterpretersFeature WI-37986 docker-compose should support exec and re-use existing containers
Feature WI-45254 Store Vagrant-based PHP interpreter information using relative paths
Bug WI-45551 Docker Compose for Docker for Windows is broken
Bug WI-43888 Docker for mac volume performance flags are not parsed properly
Bug WI-45722 NPE when starting a script with Docker Compose having 'Connect to existing container' selected
Bug WI-44032 Deployment mappings are applied to files
Bug WI-39386 Can't change type of interpreter: Vagrant to Docker/Docker Compose
Bug WI-42691 Reloading info for a Docker Compose interpreter executable creates redundant containers
Usability WI-39767 PHP Built-in Web Server: substitute project root to Document root
Usability WI-45123 Allow PHP interpreter to be set for docker-compose without a daemon
Cosmetics WI-33748 Empty SFTP server produces "FTP host is not specified"
PHP LangFeature WI-45185 Ability to move multiple functions at once
Feature WI-45001 Import reference on paste: ask to reuse existing alias
Feature WI-22194 Editor. Color&Fonts and Visibility (private, protected, public)
Feature WI-44194 Provide option to search field usages via getters as well
Feature WI-28312 Add styling options for function primitive parameter type
Feature WI-45184 Ability to move multiple file constants at once
Feature WI-45181 Place cursor on class name when opening file if file contains only one class
Feature WI-35532 Be able to expand imported class references to their fully qualified representation when copying to clipboard
Feature WI-45021 Import on paste: import of constants and functions from global namespace should be done based on related settings "Treat symbols from global namespace"
Bug WI-45568 Support completion for constants from interfaces with expectedArguments meta
Bug WI-45175 Import reference on paste: don't insert import if import with same name exists
Bug WI-44599 'Static' modifier should not be allowed for constants
Bug WI-44876 Delete relationship in UML diagram doesn't work
Bug WI-43794 Method not found in case class has multiple equal definitions and method is located inside trait
Bug WI-28835 Highlighting inconsistent for inherited methods with @method
Bug WI-44614 Find usage for __invoke doesn't work in case invokable is parameter
Bug WI-44613 Find usage for __invoke doesn't work in case invokable is field
Bug WI-44995 UML diagrams for extended interfaces doesn't show parents if invoked on interface
Bug WI-20474 Jump to closing tag fails in HTML in PHP
Bug WI-44954 Implement method: parent::__construct is called inside generated constructor stubs
Bug WI-45007 Import on fly: insert import without alias if alias is pasted
Bug WI-44877 Add relationship in UML diagram doesn't update related source code properly
Bug WI-44235 isset with constant as parameter is not marked as error
Bug WI-45545 false|true is not accepted as bool in strict type mode
Bug WI-44781 Remove double message from field's annotator
Bug WI-44616 Find usage for __invoke doesn't work in case invokable class is namespaced
Bug WI-44612 Find usage for __invoke doesn't work in case invokable is returned from function
Bug WI-45565 Missing mixed class constants in expectedArguments completion with same constant names
Bug WI-44620 Variable used as value in yielding key => value expression is marked as unused
Bug WI-45016 Import on paste: doesn't insert import in case original namespace is sub-namespace of target
Bug WI-45017 Import on paste: doesn't insert import for new C in case C has constructor
Bug WI-34223 Find usages doesn't work for __invoke method
Bug WI-45000 Import reference on paste: expand references to FQN's in case of conflict
Bug WI-43520 Missing indentation is not detected for HEREDOC/NOWDOC
Bug WI-36202 Autogenerated Getters first letter not capitalized
Bug WI-44792 "Method not found" when a class_alias has the same name as the original class
Bug WI-45013 Import on paste: doesn't import for elements from global namespace
Bug WI-43519 Mixing tabs and spaces are not allowed for HEREDOC/NOWDOC indentation
Usability WI-38880 Remember Fluent getters and setters checkbox state
Usability WI-44089 Avoid any prompts for "Remove PHP open/close tags while pasting in PHP context" option
Usability WI-28876 Color "from" in "yield from" as a keyword
Usability WI-43952 In case of multiple method declarations the error is always shown on real declaration instead of PHPDoc
PHP Lib StubsFeature WI-45155 As of PHP 7.3, array_push and array_unshift do NOT require a second argument
Feature WI-45203 Update geoip to 1.1.1
Bug WI-45419 PHP stub for stream_isatty() does not have a return type
Bug WI-44624 Function "imagecreatefromwebp" is not recognized as PHP function
Bug WI-44414 RedisCluster::scan stub has wrong method signature
Bug WI-45324 PHP stubs for PDOStatement::execute don't include @throws
Bug WI-44450 Correct types for PHP Stubs
Improvement WI-45684 Stub file for the last pecl_http extension
PHP ParserFeature WI-45261 Parser support for typed properties
Bug WI-26151 Invalid Inspection Warning - Use Curly Braces For Arrays In Strings - Cannot use [] for reading
Bug WI-11651 False positive error when using a string as a class name when accessed via a nested array class property
Bug WI-30239 isset() + constant array generates "Expected: variable" error
Bug WI-21998 "Expression is not assignable: Logical expression" when using static
PHP RefactoringFeature WI-15867 Move to class refactoring for functions
Feature WI-44655 Allow to move constant defined in file to class
Feature WI-44643 Introduce class constant: allow to define constant in another class in single refactoring
Feature WI-44654 Introduce constant in file: allow to define constant in another class in single refactoring
Bug WI-44738 Move constant to class: insert additional conflicting import
Bug WI-44918 Move constant to class doesn't check name conflicts for import of the target class
Bug WI-44711 Moved constant should not have visibility if language level is <7.1
Bug WI-44675 Introduce constant in another class: completion doesn't suggest interfaces as target class
Bug WI-44384 Replace FQN with import doesn't remove FQN if it's used in plain function
Bug WI-44707 Move constant from file to class: It should not be possible to move constant if its value is expression
Bug WI-44691 Introduce constant in other class: IncorrectOperationException: Cannot modify a read-only file when select some core class as target
Bug WI-44724 It should not be possible to move functions to interfaces
Usability WI-44885 'Move to another class' checkbox should be selected by default if dialog was invoked from `introduce constant` with 'Move to another class' checkbox checked
Usability WI-44470 Extract method dialog: provide highlighting in "Signature preview" window
Usability WI-44459 Extract method dialog: provide info about possible duplicates in UI
Usability WI-44458 Extract method dialog: provide some name suggestions for the method
Usability WI-44456 Extract method dialog: highlight invalid parameter names in table
Usability WI-44712 Remove old constant imports after move constant from file to class
Usability WI-44457 Extract method dialog: don't allow to press "refactor" button in case of invalid parameter
Usability WI-44518 Extract method: signature preview doesn't show return type
Usability WI-45226 Move: Provide constant/function name in case it's a single element
Usability WI-44454 Extract method dialog: don't allow to press "refactor" button in case of invalid identifier
Cosmetics WI-39102 Wording in the 'Extract Variable' dialog
Exception WI-44678 Exception is thrown on applying Make static quick fix on anonymous class method
Exception WI-44737 Move constant to class: throws exception if class from stub is selected
PHP TemplatesFeature WI-26476 Enable php debugging in Blade file
Feature WI-6531 Autocomplete for php classes & static methods in smarty, navigate to the declaration, quick documentation and parameter info.
Bug WI-45287 Twig: can be installed only in PhpStorm/IntelliJ (new dependency on PHP)
Bug WI-45624 Blade debug: execution stops in wrong place in case template has comments or extends another template
Bug WI-45459 Blade debug: warn if not-identity line mappings appear in blade/PHP pair
Bug WI-45777 Blade/Twig debug doesn't work on Windows
Bug WI-45504 Blade debug: set server mapping to the root that includes Blade caches
Bug WI-45102 Twig Debug does not work in case cache filename is changing
Bug WI-45759 Twig/Blade debug: path to caches is stored as absolute path in php.xml
Usability WI-44527 Twig debug: set server mapping to the root that includes Twig caches
Usability WI-45458 Blade debug: warn if Laravel version is less than 5.8
Usability WI-45461 Templates debug: generalize debug settings from Twig- to template-related ones
Usability WI-45481 Template debug: expand template settings if they are not empty
Exception WI-45579 Smarty: java.lang.IllegalArgumentException is thrown in case of multiResolve
PHP TestFeature WI-44192 Make PHPUnit composite entries editable
Bug WI-44419 Skipped tests don't work for PHPUnit 4 / 5 being run with a PHP 5.6 remote interpreter
PHP Type InferenceBug WI-37240 Private method marked as unused/not found when used as a parameter to construct a dynamic class in PHP 7.
Bug WI-23386 Multi-level array type is not unwrapped if returned from function and not directly declared
PHPDocFeature WI-19706 Control-Click on @inheritdoc to go to inherited docblock
Bug WI-32894 Quickdoc: {@inheritDoc} does not preserve additional added comments, however {@inheritdoc} does
Bug WI-45552 Go to declaration for @inheritDoc doesn't work for lowercase @inheritdoc
Bug WI-26923 Inlined @see should be resolved to the corresponding element like standalone @see
Bug WI-37030 Inline https @link can't be opened from quick documentation popup
Usability WI-45593 Add scrollbar to PHPDoc code style settings
PS SpecificFeature WI-45587 Add completion for expectedReturnValues inside switch case statement
Feature WI-45131 Provide a way to avoid duplication for expectedArguments
Feature WI-44418 Highlight variables & placeholder in sprintf() doesn't work when string is split (concatenated)
Feature WI-45177 Introduce expectedReturnValues metadata directive to specify possible returning values of function
Feature WI-44161 Add opening PHP tag when creating a PHP scratch file
Feature WI-44055 Remove open/close PHP tags on pasting in PHP context
Feature WI-45583 Add completion for expectedReturnValues in bit-wise checks
Bug WI-44169 Excessive MethodTypesMap computing logging
Bug WI-44444 Quality tools path validation shows false positive error in case of remote interpreter
Bug WI-45180 PHP tags are stripped on paste
Usability WI-44339 File Structure Popup in Wrong Order
Usability WI-44939 "call tree analysis depth" setting is global while it should be per-project
Cosmetics WI-44666 Update default PHP file template
Cosmetics WI-45060 Remove Open Directory action
Exception WI-44230 Exception when add plain function without \ to custom format functions
Plugin: Deployment _ FTP..Bug WI-45342 Passphrase for private key is asked if passphrase is not required
Bug WI-44743 Can't upload to Ipv6 only host
Bug WI-45334 Sftp keyboard-interactive authentication broken
Task WI-45150 Investigate duplicate condition in com.jetbrains.plugins.webDeployment.actions.ToggleRemoteExclusionAction#setSelected
Plugin: Drupal supportFeature WI-28529 Provide predefined Drupal PHPDoc tag order for method/function
Plugin: PhingFeature WI-41335 Auto-detect Phing with composer
Plugin: WordPressCosmetics WI-28766 Spelling in Wordpress plugin notification
SpellcheckerFeature WI-44970 Spellchecker: ignore UUIDs
Cosmetics WI-44927 Add "endian" to spellcheck dictionary
No subsystemFeature IDEA-111333 Provide Sublime Text keymap
Feature IDEA-138797 Prevent double click from maximizing tabs
Feature IDEA-142157 "Dump Threads" action in Run panel should open dump view
Feature IDEA-192898 I want to provide searchable options from plugin to allow searching plugin settings in the settings dialogue.
Bug IDEA-207848 IDE crashes on startup
Bug IDEA-205756 contract can be simplified
Bug IDEA-206008 Test with Coverage doesn't report number of passed tests in tooltip
Bug IDEA-205350 Fold region at beginning of file causes issues
Bug IDEA-205654 Extra lines in recent location snippet
Bug IDEA-204505 Plugin Settings: Custom plugin icons are not scaled on HiDPI Linux
Bug IDEA-204946 File templates: File Template Variables aren't parsed in includes
Bug IDEA-206285 Suggestions bubble can make it impossible to mouse click at the beginning of line
Bug IDEA-199415 UIDefaults completion inside IntelliJ theme files
Bug IDEA-202134 Wrong location of a magnifier icon in Light theme on Mac
Bug IDEA-185161 ShelveChangesManager must be PersistentStateComponent
Bug IDEA-203356 Junit tests should not be marked as ignored when assertion in @AfterClass fails
Bug IDEA-204044 move clashes with resize in custom decorated mode
Bug IDEA-205658 Empty lines at the end of file are shown as empty snippet
Bug IDEA-206726 Test icon doesn't appear after test completion
Bug IDEA-205847 Comments from coffescript files shown as text in snippets
Bug IDEA-201003 Huge freeze while "navigate to test data"
Bug IDEA-208060 Deadlock on Rider startup
Bug IDEA-202296 EditorConfig-related actions in the status bar: on the first attempt only one action is shown
Bug IDEA-205603 Recent Location popup is not redraw after resize
Bug IDEA-205663 Recent Locations is not available in Find Action
Bug IDEA-202994 DiffUserDataKeys.GO_TO_SOURCE_DISABLE property is ignored in OpenInEditorAction
Bug IDEA-204163 Don't suggest `P` and `B` live templates in all Kotlin contexts
Bug IDEA-203108 fix for RUBY-19897 fails with JFX10
Bug IDEA-207782 Memory leak in gradle import process
Bug IDEA-206487 Error:java: java.lang.IllegalArgumentException: Not supported: org.jetbrains.jps.javac.InputFileObject[...]
Bug IDEA-201667 Soft-Wrap works incorrectly with Inlays
Bug IDEA-145069 EditorConfig plugin doesn't handle indent_size option correctly
Bug IDEA-203161 SOE at ThreeComponentsSplitter.visibleDividersCount() on attempt to open Run tool window in certain Gradle-based projects
Bug IDEA-202381 Missed splitter in navigation bar
Bug IDEA-73793 PyCharm will freeze when opening certain files and switching to another app
Bug IDEA-201532 The BlockInlay loses the background of the editor's selection
Bug IDEA-204173 "Settings | Scopes" - "Expand" action doesn't work for ill-formatted strings
Bug IDEA-207318 mac.touchbar exception in 2019.1 EAP
Bug IDEA-206403 unused declaration inspection: constructor used in code outside analysis scope should be marked as used
Bug IDEA-208045 Exception from `RootModelImpl` on (Cargo) project update.
Bug IDEA-201820 UI concurrent creation
Bug IDEA-206132 5 modules of the IntelliJ Community are missing in the master branch source tree
Bug IDEA-204674 The logs' arhive file name is too generic
Bug IDEA-205610 Already disposed exception if close project with opened Recent location popup
Bug IDEA-204455 Breadcrumbs: breadcrumbs still shown after turning them off
Bug IDEA-205817 It's possible to open several Recent Locations popups simultaneously
Bug IDEA-125327 "Surround with try/catch" code generation seems to not respect final modifier settings
Bug IDEA-204844 Integer layered settings are not saved
Bug IDEA-168781 Mnemonics for run actions is broken in case of '_' and '&' in configuration name
Bug IDEA-205818 Switching between Look and feel spoils Recent locations popup
Bug IDEA-200366 No way to configure Run Configuration Templates for a new projects in non-IDEA IDEs
Bug IDEA-149084 Spring Boot: completion in .yml files: incorrect results on inserting property if one with same prefix exists
Bug IDEA-201376 IntelliJ IDEA 2018.2.4: Mocha 5.2.0 with Node 10.12.0 does not work, only output when trying to run test: Test Framework quit unexpectedly
Bug IDEA-203310 Memory leak detected VirtualFilePointerManagerImpl, ConsoleViewImpl
Bug IDEA-206149 Fix com.intellij.ui.stripe.Updater#findPreviousIndex
Performance IDEA-200469 Should we really convert code style settings into XML just for damage checking?
Usability IDEA-204836 Nested class/method navigation breadcrumb trail off by one
Usability IDEA-205605 Long code samples shows scroll bars
Usability IDEA-201429 Remove .editorconfig from the list of file templates
Usability IDEA-201792 Ability to edit Run Configuration Templates when a project is opened
Usability IDEA-206611 Editor | General | SoftWraps| Soft-wrap file types: it is unclear how to specify types there
Usability IDEA-161842 Key Mapping: Ctrl-Y not assigned to "Redo" is problematic
Usability IDEA-155709 IDE Fatal Errors dialog could show the installed plugin version when blames a plugin
Usability IDEA-205681 Recent location list size should be configurable in Settings
Usability IDEA-78518 Method Inheritance Hierarchy should allow to narrow by search scope
Usability IDEA-205653 There is no ability to clear Recent Location history from popup
Usability IDEA-202024 Rename "View / Expression Type" to "View / Type"
Cosmetics IDEA-205841 Right border is not redraw if resize Recent location popup
Cosmetics IDEA-187402 When compressing CPU profile, progress bar in status line says "compressing memory snapshot"
Cosmetics IDEA-201465 Improve display for long string in Ctrl+hover tooltips
Cosmetics IDEA-204514 Some spaces between file names in logs would be really nice
Cosmetics IDEA-168874 New 'Find in Path' dialog hard to read
Cosmetics IDEA-203127 Rename "Settings Summary" to "Collect Troubleshooting Information"
Cosmetics IDEA-201114 Plugins: do not show "Show All" link if all plugins in the group are already shown
Task IDEA-207393 Update bundled trove library to prevent unnecessary rehashing
Task IDEA-202382 Update spy-js icons
Task IDEA-205600 [Bundled JRE 11] Get rid of MimetypesFileTypeMap usage because it is moved to private package since JDK 11
Task IDEA-205758 Hide 'Show parameter name hints on completion' in Code Completion settings
Task IDEA-203680 Invalidate external projects imported data on 'Invalidate Caches' action
Task IDEA-205647 Shortcut for Recent location
Exception IDEA-196008 Throwable at com.intellij.openapi.roots.impl.libraries.LibraryImpl.<init>
Exception IDEA-207299 com.intellij.openapi.extensions.impl.PicoPluginExtensionInitializationException (ShowDiagramBase)
Exception IDEA-202454 PluginManager - mixer IllegalArgumentException: mixer[0..1] is 2.0
Exception IDEA-206776 in Linux on project closing Throwable occurs at com.intellij.openapi.wm.impl.GlobalMenuLinux.access$800
Exception IDEA-206482 RuntimeException: java.lang.reflect.InvocationTargetException
Exception IDEA-205608 Editor is already disposed exception if navigate on recent location sample with quick search result
Exception IDEA-202313 Exception appears on Compress Logs and Show in Explorer menu item
Android.DesignerFeature IDEA-204927 Please add a way to determine when the user has resized the components in a ThreeComponentsSplitter
Code Analysis. DuplicatesFeature IDEA-181304 Highlight duplicated branches in 'switch-case' statement
Bug IDEA-206673 Inspection `Duplicated code fragment` does not analyze content folders.
Cosmetics IDEA-207219 Change "Hide duplicates fix" for "Duplicated code fragment" inspection
Code Analysis. InspectionFeature IDEA-33733 "Field can be local" quickfix should not create redundant variable
Bug IDEA-204111 Run inspection by name produces empty view
Bug IDEA-86833 web.xml inspection for assignable to javax.servlet.Servlet is wrong
Bug IDEA-201236 Import of inspection results could not parse method name when it has parameter type
Bug IDEA-204414 Exporting inspections results as HTML doesn't produce output
Bug IDEA-181614 Inspection profile changes every time project is opened
Bug IDEA-203922 Ctrl+Alt+Up in inspection results moves to the next result, rather than previous
Bug IDEA-207410 Can't choose Constant conditions and exceptions in settings
Bug IDEA-206216 Fix all for warning in the top level file doesn't work when caret is located inside injection
Bug IDEA-205936 Inspections View: Group by Module doesn't work for groovy files
Bug IDEA-201595 All problems in file disappear from "Inspection Results" after applying a single fix
Bug IDEA-202177 Error during injected code cleanup
Bug IDEA-208033 Go to next highlighted error is broken
Bug IDEA-183685 Incorrect parameter type - ParamConverterProvider
Bug IDEA-200142 Deadlock in Inspection tree view
Bug IDEA-203538 Cannot export results of single inspection run to XML
Performance IDEA-204287 LocalInspectionTool.isValidID should precompile regular expression
Performance IDEA-207013 Uast: Evaluator hangs uninterruptible analysing some loops
Usability IDEA-201800 Progress Bar Doesn't Move in Batch Suppress For Statement
Usability IDEA-204371 Remember "Group by severity" setting in inspection results
Usability IDEA-204733 Troubles massively apply fix to all found warnings
Task IDEA-77381 NonSerializableFieldInSerializableClass should check whether all possible values of final field are serializable
Exception IDEA-206047 Invalid cached value assertion during offline inspections
Exception IDEA-203498 com.intellij.analysis.AnalysisScope$2.visitFileEx( Read access is allowed from event dispatch thread or inside read-action only
Code Formatting and Code StyleFeature IDEA-149529 Code Style settings export options
Bug IDEA-189934 Replace lambda with method references messes up indentation
Bug IDEA-203775 NPE on opening unified diff view when Upsource Integration plugin is enabled
Bug IDEA-206778 Export codestyle settings to JSON: export fails when non-default values are provided for java | wrapping and braces | braces placement options
Bug IDEA-206769 Export codestyles settings to JSON: space_within_* attributes of java settings are not exported
Bug IDEA-200800 Configure indents action from the status bar should open JS code style for JS/JSX files
Bug IDEA-203464 There is not same code style in 2018.2 and 2018.3 which I have the same codestyle.xml
Bug IDEA-204458 Java Formatter : close-brace in enum does not create new line
Code NavigationFeature IDEA-205404 When navigating from Java stacktrace try to find the relevant position within line
Bug IDEA-164838 Open three new same windows when do "Open In New Editor Window"
Bug IDEA-205772 Javadoc: multi-resolve method references without signature to all overloads
Bug IDEA-207132 Recent locations popup shows 1 less snippets as in settings
Bug IDEA-178367 Weird 'choose implementation' popup
Bug IDEA-202922 Navigate | File results are not sorted by proximity
Usability IDEA-194817 Show enum constant usages on mouse middle-click
Cosmetics IDEA-207272 Recent locations: icon is not shown for decompiled classes
Code. GenerateBug IDEA-203737 Introduced method has wrong context
Bug IDEA-202062 Code generation for equals will reference built-in java classes directly regardless of whether identically named user-defined classes are already in scope
Bug IDEA-200281 Generete "Delegate Methods..." action doesn't respect already implemented method
Bug IDEA-201670 Generating setter for final field
DebuggerFeature IDEA-201942 Do not use compiling evaluator for method references
Feature IDEA-124595 Feature to "Step Out" of the current block when debugging
Feature IDEA-189549 Better display for Maps in debugger
Feature IDEA-202293 Support synchronized statement in evaluator
Feature IDEA-202146 Support switch statement in evaluate code block
Feature IDEA-202292 Support asserts in evaluator
Feature IDEA-173619 Debug mode / Mouse gesture "Run to mouse pointer"
Feature IDEA-186962 Allow user defined Async annotations
Bug IDEA-208136 Can't run Tomcat run configuration in 2019.1 EAP (build 5849.21): Could not find agent library ... Can't load AMD 64-bit .dll on a IA 32-bit platform
Bug IDEA-207569 Can't use Debug: Error occurred during initialization of VM
Bug IDEA-206755 Hovering over line numbers in editor during debug make lines highlighted as if they're active in debugger
Bug IDEA-203825 Deadlock in debugger
Bug IDEA-208000 "Target JRE version does not match project JDK version" message is shown for the same JDK/JRE = 1.8.0_121
Bug IDEA-195531 Debug tool window causes segmentation fault in the JVM
Bug IDEA-204691 Unable to cast primitive value to Object
Bug IDEA-203275 Cast in evaluator does not fail when is should
Bug IDEA-205230 "View as" popup item is inactive on the first click but becomes active on the next clicks
Bug IDEA-205407 Parameter is not resolved in breakpoint condition after adding @NotNull to parameter
Bug IDEA-202129 .attach_pid files in the working dir
Bug IDEA-203322 "Hold alt and click to evaluate expression not working" (this is a tip of the day)
Bug IDEA-199602 Stepping into String constructor with debugger makes a string that is shown as empty in variables view
Bug IDEA-200161 Exception related to debugger agent on plugin project startup
Bug IDEA-202459 Unable to evaluate virtual method ref
Bug IDEA-203014 Target Jdk version does not match message
Bug IDEA-204693 Argument boxing does not happen if type is not available
Performance IDEA-204448 Debug startup slowly with `debugger-agent.jar`
Usability IDEA-205901 Debugger: Clicking into empty area below stack frames makes IntelliJ navigate to bottom-most item
Usability IDEA-200972 View Breakpoints: Show breakpoint icons in the tree view to distinguish between suspend options
Usability IDEA-172140 Suspend only current thread during evaluation of breakpoint's condition
Usability IDEA-207231 Don't change sort order when selecting a different goroutine in debugger
Usability IDEA-205987 Preselect main thread on pause
Usability IDEA-200637 Debugger pop-ups trigger OutOfMemoryError
Usability IDEA-204807 "Add to Watches" action shouldn't create duplicates
Cosmetics IDEA-202684 Map Entry's value displayed not good
Diff_MergeFeature IDEA-77478 Diff: Add by-char comparison mode that will compare individual chars
Feature IDEA-48213 Compare two files action does not allow to select which file will be left and which one will be right (swap diff)
Feature IDEA-199750 3-way merge should have a Rollback action in the changes stripe menu
Feature IDEA-197789 Allow adding file contents to the Blank DIff Window
Bug IDEA-111268 Tab width not respected when viewing code changes inline
Bug IDEA-203659 Shift+Tab in Diff editor changes line indentation style
Usability IDEA-207839 Accept left/right shortcuts are reversed
Cosmetics IDEA-206495 Partial commits: Excess "Uncheck all" checkbox on Diff dialog
Exception IDEA-207311 Error: can't show diff on EAP
DockerBug IDEA-202973 Docker: RunConfiguration: "..." instead of the error about the wrong path to the Dockerfile
Bug IDEA-208312 Error in typehint in cap_add block in docker-compose
Bug IDEA-208100 Docker. java.lang.AssertionError: Without manager but not disposed: Log at deleting container with the opened Log
Performance IDEA-208129 DockerDebug. Docker works slow after many "docker debug" runnings
DroolsPerformance IDEA-203046 Intellij lags when editing drl (Drools rules) files.
Editor. Code CompletionFeature IDEA-203280 Groovy Script for PHP Storm Live Templates give suggested box?
Bug IDEA-204126 [Live templates] autocompletion is not shown for some live templates (e.g. sout, psvm)
Bug IDEA-205485 Goto Declaration doesn't work in completion autopopup with automatic quick doc popup
Bug IDEA-199925 Dash breaks autocompletion for live template name
Bug IDEA-207334 Edit Postfix template dialog: custom template box is missing
Bug IDEA-208424 Word completion doesn't work in language-specific elements in small IDEs
Bug IDEA-148060 Completion doesn't work after switching window
Editor. Color SchemesTask IDEA-206064 Display a warning of Rider color schemes incompatibility instead of failing, fall back to some other color scheme
Editor. Editing TextFeature IDEA-144788 Code folding - Class description doxygen/javadoc comments: leave first line visible
Feature IDEA-204140 Should be able to unwrap rule based switch expression
Feature IDEA-205621 Switch statement unwrapper
Feature IDEA-168176 Move Caret Backward/Forward a Paragraph With Selection
Feature IDEA-106702 Folding comments block
Feature IDEA-204702 Support after-line-end inlays in editor
Feature IDEA-36496 Move statement up/down handles catch blocks improperly
Bug IDEA-204769 Editor: selecting "Copy" action from menu copies whole line instead
Bug IDEA-202915 Highlighting of deleted ranges in diff window is blinking sometimes
Bug IDEA-205739 Editor: Action is applied for the wrong line if invoked from menu
Bug IDEA-203335 Parameter info appears when not required
Bug IDEA-204703 Text selection significantly slows down when cursor is outside the text editor
Bug IDEA-199639 While typing TODO comment with Korean text, color scheme to the last letter is disappeared
Bug IDEA-203902 Text drag'n'drop in editor is not canceled by Esc key
Bug IDEA-199621 Text selection doesn't work after triple-click
Bug IDEA-205365 Git diff view in commit dialog does not allow copying text to clipboard (CTRL+C) if this shortcut is assigned to "Copy as Plain Text" action.
Bug IDEA-197843 'Move Statement Up/Down' for switch-case-blocks does only detect the statement when the caret is exactly on the statement
Bug IDEA-201502 Weird soft wraps behavior when working with XML content
Bug IDEA-204898 Exception in buildFoldRegions can block loading of editor
Bug IDEA-201210 Expanding selection within method's generic type parameter expands to beginning of file
Bug IDEA-205635 Moving up/down enum entry declaration with empty line after declaration produces red code
Bug IDEA-175878 Multicursor first cursor incorrect indent on tab press in injected fragment
Bug IDEA-195293 Strange behavior when join lines with "builder.append('...')"
Bug IDEA-207951 Ide freeze on showing parameter info
Bug IDEA-201882 Scrolling position jumps on completion
Bug IDEA-201725 Rich text copy / paste on high DPI screens should scale down fonts
Bug IDEA-205336 after new file is added, "last edit location" doesn't work
Bug IDEA-192879 "Move statement" skips position outside code block in Java
Bug IDEA-201750 Move Up/Down and Scroll works wrong with a cloned caret
Bug IDEA-205622 Scope popup closes diff fragment popup
Bug IDEA-136779 In editor, alt+drag should clear the old caret.
Bug IDEA-205130 Parameters info shows the actual proper method signature as disabled
Bug IDEA-199790 FileEditorManagerImpl does not properly handle opening TextEditor instances created by custom FileEditorProvider
Bug IDEA-103199 Undo: UTF problem
Bug IDEA-205776 Moving Up/Down dowsn't work for Enum constant with body
Bug IDEA-208537 folding toggles are not shown for added fold regions
Bug IDEA-202245 Editor ignores EditorMouseEvent consuming
Bug IDEA-203201 Cursor jumps back and sometimes random extra spaces are inserted
Bug IDEA-205774 Moving Up/Down doesn't work properly for Enum constants in case of missing ';'
Bug IDEA-205802 Repaint issues for soft-wrap marks in a diff pane
Performance IDEA-199690 Terrible performance with multiple cursors in insert with multiple values
Performance IDEA-206039 IntelliJ froze for 148 seconds after tabbing alt-tabbing away and back to IntelliJ with large buffer.txt file
Usability IDEA-204308 Multiline TODO popup interferes with editing the TODO.
Usability IDEA-199843 Ctrl hovering over keyword should not show quick doc popup
Usability IDEA-200630 too eager commenting out
Usability IDEA-200275 Multiline TODO: support line Split in block comments
Usability IDEA-203855 Cloned carets visually off
Usability IDEA-200276 Multiline TODO: line comment <-> block comment conversion breaks multiline comments
Usability IDEA-89608 Should be able to set editor view options like soft wraps for certain file types
Usability IDEA-198213 Double clicking on the { or } (curly brace) should select class body
Usability IDEA-185682 Parameter info hides the code being editing at the top of a file
Usability IDEA-199375 Parameter info (Ctrl+P) does not recognize array parameter as a vararg
Cosmetics IDEA-200296 confusing gutter folding hints for "closure" folding
Task IDEA-205639 Gutter current line number highlighting doesn't respect conversion function
Editor. Error HighlightingBug IDEA-204791 Duplicate highlights in maven
Bug IDEA-202625 IDEA doesn't see library after it is copied into 'lib' folder
Bug IDEA-155186 Daemon status icon (aka eye aka TrafficLightRenderer) isn't always repainted
Performance IDEA-207045 23 lines with open dots cause of hang of IDEA
Editor. Intention ActionsBug IDEA-200761 Settings: Intentions: "Before/After" sections for intention actions are empty
External ToolsCosmetics IDEA-184889 External Tool named with an underscore does not display properly from project context menu
File SystemFeature IDEA-198080 fsnotifier fails to start from Flatpak image
Bug IDEA-188926 `VirtualFileManager.refreshWithoutFileWatcher` can take an extremely long time on a Windows FileSystem with a large number of mapped network drives
Performance IDEA-202236 UI freeze on VFS operations (I/O in PersistentFS.processEvents)
Exception IDEA-207039 Import Database Schema + H2 datasource: select or unselect table or column may invoke exception InvalidPathException: UNC path is missing sharename
Find, Replace, Find UsagesBug IDEA-202717 Pinned "Find in Path" window closes on clicking on a result
Bug IDEA-203111 Undo doesn't work correctly after "replace all"
Bug IDEA-168548 find usages in file (ctrl-f7) skips some usages
Usability IDEA-204169 Add "Open results in a new tab" in the Find ToolWindow
Usability IDEA-170894 "Rerun Search" should not open new tab
Usability IDEA-202987 Ability to customize a shortcut for search history
Usability IDEA-108477 Preview for in-place regexp replace doesn't preview line breaks
Usability IDEA-76610 I want to be able to turn off the "Do you want to find usages of the base method?" question
Exception IDEA-202503 Exception occurs on opening file context menu for the first time
HTMLCosmetics IDEA-201570 Questionable folding and preview of "&nbsp;" in HTML (Velocity)
IDE ConfigurationFeature IDEA-107709 StringUtils within a File Template
Feature IDEA-108609 Cannot remap cursor keys for navigation outside the editor (popups, etc.)
Bug IDEA-201018 Unable to submit IDE errors anonymously after enabling 2FA
Bug IDEA-205643 IDE cannot restart after disabling/enabling plugin — hangs indefinitely
Bug IDEA-201898 Handle plugin duplications with sync settings
Bug IDEA-207196 @NotNull method com/intellij/openapi/projectRoots/impl/JavaSdkImpl.suggestSdkName must not return null
Bug IDEA-188964 Error loading kotlin-language facet
Bug IDEA-179784 Idea fails to load a project when running on Java 9
Bug IDEA-205967 Wrong previous version directory in import setting dialog (2019.1 suggests 2018.1)
Bug IDEA-206792 [jdk11] MaxJavaStackTraceDepth=-1 is outside the allowed range
Bug IDEA-196437 Plugin manager: problem with enabled/disabled plugins blocks any interaction
Usability IDEA-206954 "Configure soft wraps" action should apply search highlight to the "Soft wraps" group in the editor settings
Usability IDEA-206444 "Edit variables" for live template shows empty expression lists for templates with no context
Usability IDEA-195932 Allow "Check connection" even if no proxy is selected
Cosmetics IDEA-203663 Preferences | Editor | General | Gutter Icons: sort plugin groups alphabetically
IndicesPerformance IDEA-208533 OutOfMemory when indexing a 2Gb project, "Out of memory" window stuck forever
Performance IDEA-202221 2 minute freeze on index query after deleting a large directory
Usability IDEA-207075 Better diagnosis for FileBasedIndexImpl - scheduleIndexRebuild, reason: File type change
InternalTask IDEA-206894 Extract UrlClassLoader and its dependencies to a separate module
Internal build scriptsBug IDEA-203509 Cannot debug tests in nested classes
Task IDEA-197426 pom.xml generated for modules from IntelliJ IDEA project should honor exclusion of transitive dependencies
Configuration Problem IDEA-199738 Upgrade internal Ant to version 1.10.3 or newer (support JUnit5 Jupiter engine)
Language InjectionBug IDEA-201839 Injected Brace Matcher Works Pretty Fun
Local HistoryBug IDEA-203490 Copy/paste is not working in the left pane of the Local History window
Usability IDEA-75181 show absolute time in local history
Exception IDEA-203259 It's possible to call 'Show History for Selection' for project tree items: IllegalArgumentException is thrown
MacrosBug IDEA-204339 Some IDEA macro invalid in other IDE's context.
Packaging and InstallationFeature IDEA-194148 Publish 'intellij.platform.testFramework' module as a Maven artifact
Bug IDEA-208430 [jbr 11] Uninstall doesn't work after patching IDEA
Bug IDEA-202232 Two versions of commons-codec.jar are included into IntelliJ Platform
Bug IDEA-203550 Windows Installer: 'Uninstall old versions' shows only several installations from only one disk with a weird gap
Bug IDEA-141900 Installer: Uninstall old version has weird word wrapping
Bug IDEA-206868 Patch update doesn't work on macOS (2019.1 EAP)
Bug IDEA-158855 Windows installer starts uninstaller even when clicking back
Bug IDEA-206790 [ artifact]: There is 32bit launcher in archive
Bug IDEA-198859 Batch Mode for IDE updates: IDEA just restarted without any message when the last patch in chain is wrong
Bug IDEA-204957 Projects opened with cli have names ending in ./. opening other projects causes hang and then indexes root file system and or sometimes the parent directory filesystem.
Usability IDEA-197129 Kotlin compiler binaries miss executable permissions
Usability IDEA-202806 There are too few rows in Uninstall Old Versions tab
Usability IDEA-207608 [jbr11 windows installers] It is better to remove checkboxes related to win32 system from Setup dialog
Cosmetics IDEA-208125 [Setup dialog]: Replace '...install JRE x86...' with '...instal JBR x86...'
Cosmetics IDEA-204535 Header text in Rider Installer is heavily misaligned
Task IDEA-149668 Publish javac2 on maven
Task IDEA-202441 Bundle Kotlin 1.3.20 with IntelliJ IDEA
Task IDEA-192396 Publish java-psi and required modules as Maven artifacts
Task IDEA-200437 Use correct product code when IDE is started from sources
Task IDEA-206416 Bundle Kotlin 1.3.21 with IntelliJ IDEA
Platform APIFeature IDEA-201009 Introduce ApiStatus.AvailableSince annotation
Feature IDEA-200287 UCallableReferenceExpression should provide access to referenceNameElement
Feature IDEA-198928 Make UAST provide a priory list of PsiElement types which could be used to get required UElement
Feature IDEA-209082 Allow IDEs to customize which builds can be used as possible updates
Bug IDEA-196796 UAST: UMethod should provide access to the return-type reference expression
Bug IDEA-205876 Completion on a LightClass that is an interface does not include static methods
Bug IDEA-202707 If PersistentStateComponent::loadState failed with exception it won't be called next time
Usability IDEA-207106 Log plugin that use registerFileType instead of FileTypeFactory
Task IDEA-203954 Make sure that `PsiReferenceProvider`s add references to elements they were asked about
Plugin DevelopmentFeature IDEA-202010 Highlight services/components with identical interface and implementation classes as redundant in plugin.xml
Feature IDEA-194946 DevKit: verify plugin provides pluginIcon.svg
Feature IDEA-201007 Devkit: show warning if a plugin code uses API which wasn't available in old versions of the platform
Feature IDEA-206060 DevKit: deprecate Project Wizard
Bug IDEA-204436 Plugin Icon search path is wrong for ZIP plugin distributions
Bug IDEA-202635 Devkit: fix all gutter icon sizes, make configurable
Bug IDEA-202417 Quick-fix to register PsiReferenceProvider via psi.referenceProvider generates red code
Bug IDEA-140250 Rename class refactoring handles usages in xml incorrectly if inner class is renamed
Bug IDEA-196765 Good code red in a module.xml when referring an action defined in the same xml
Bug IDEA-200152 Error launching plugin project with 'local' IDEA SDK
Bug IDEA-208625 Devkit: extension point property "className" should have PsiClass code insight
Bug IDEA-197440 Navigation to testdata hangs uninterruptible
Bug IDEA-187409 AutoCompletion popup disappears if variant contain dash symbol "-"
Bug IDEA-206150 Something wrong in ExtensionOrderConverter#isBeforeOrAfterKeyword(java.lang.String, boolean)
Bug IDEA-202393 Always include ID of a problematic plugin into exception report
Bug IDEA-208354 Devkit: subtags of 'intentionAction' tag in plugin.xml are highlighted as errors
Bug IDEA-205189 theme.json: no spellchecking for color hex values
Usability IDEA-206928 plugin.xml: plugin name in Tab title shouldn't only work for plugin projects
Usability IDEA-204886 Navigate to test data action shows multiple blinking modal progresses
Task IDEA-208472 Devkit: allow user to specify modules which are included into single plugin for component registration check
Plugin ManagementFeature IDEA-206274 If there there are two dependencies on the same plugin in plugin.xml and one of them is optional the other is treated as optional as well
Feature IDEA-201336 Drag'n'drop plugin zip file to welcome screen doesn't install it, but instead opens it as a file
Bug IDEA-199129 New Plugins panel opens oversized if last opened tab was "Installed"
Bug IDEA-202957 New Plugins dialog: 503 server error causes two error dialogs - one after settings dialog is closed
Bug IDEA-202302 Plugins management: confusing reaction in case of required plugin disabling, and the dependent plugin uninstalling
Bug IDEA-171225 Plugin manager should select ony one (latest compatible) version in custom plugin repository and use it
Bug IDEA-205249 Required plugin isn't isn't added when click 'Enable' in 'Preferences | Plugins'
Performance IDEA-205534 Typing lags in plugins search UI
Usability IDEA-200867 Show plugin versions in the installed plugins list
Usability IDEA-126874 Settings | Plugins have poor keyboard navigation
Usability IDEA-200225 When user installs plugin from disk tab should be switched from "Marketplace" to "Installed"
Exception IDEA-201296 Restart from new plugins dialog results in exceptions in console
Project ConfigurationBug IDEA-208450 Memory leak in RootModelImpl.myDisposable
Bug IDEA-203651 Kotlin MPP (Common and JS) test source roots are not detected as source roots
Bug IDEA-208237 IDEA forgets unloaded modules.
Bug IDEA-107676 Project Templates: attempt to apply the project template created from one of static web template project fails with velocity exceptions
Bug IDEA-139332 Creating template from project error: Error parsing file template
Bug IDEA-206879 Scopes: can't exclude folder, only the files inside it
Bug IDEA-185499 Do not create all facet editors on project settings open
Cosmetics IDEA-202743 Library that contains only a single folder is shown as "libs and one more file" in Project Structure
Exception IDEA-205597 REWA at com.intellij.openapi.application.impl.ApplicationImpl.assertIsDispatchThread
Exception IDEA-202726 AccessDeniedException on project name change if .name file is read-only
Quick DocumentationBug IDEA-189815 Quick doc popup shown on mouse hover closes when clicking on a reference to a different class inside
Bug IDEA-201023 QuickDoc popup becomes small after resizing and clicking the link inside the popup
Bug IDEA-205190 Misplaced Mouse Cursor
Bug IDEA-204179 Wrong scrolling position after hyperlink navigation in quick doc popup
Bug IDEA-203588 JDK11 Javadoc links use wrong anchor format
Bug IDEA-201280 QuickDoc popup appears at the cursor position after closing the documentation tab in Tool Window
Bug IDEA-203264 Restoring quick doc popup size changes its content
Bug IDEA-205497 QuickDoc popup appears on another monitor if invoked from "Brief Info" popup
Bug IDEA-201449 Documentation tab name is not updated on following links in documentation
Bug IDEA-202665 Quick documentation resolves method to any compatible method
Bug IDEA-201393 QuickDoc popup hides after selecting "Show Toolbar" option if QucikDoc is shown on mouse move
Bug IDEA-201819 QuickDoc popup is shown under the element in Diagram area even if there is not enough space for it
Bug IDEA-202789 Too many "Element information is not available during index update" notifications
Bug IDEA-205229 QuickDoc popup appears at wrong position when cursor is in "Find" field
Bug IDEA-203728 Quick doc opened for an item from Project View changes position if one clicks on a hyperlink it contains
Usability IDEA-200674 Adjust popup size according to the font size
Usability IDEA-200124 Quick Documentation hides context menu
RefactoringUsability IDEA-206481 Improve new file "Register New File Type Association"
Cosmetics IDEA-206172 Refactor of directory name that begins with a dot to another name that begins with a dot PREVIEW-s a new name with TWO dots.
RegExpFeature IDEA-202325 In RegExp form, check whether the regular expression could match a longer input
Usability IDEA-202189 Pressing Shift+Tab in the Check RegExp window leaves the window
Run | Debug configurationFeature IDEA-114577 Confirm deletion of run/debug configurations
Bug IDEA-202004 Run Configuration. Red class name "Class 'Main' is in the default package"
Bug IDEA-195693 Context help shows 404 page when invoked for a run configuration which don't have special help page
Bug IDEA-206761 Run configuration adds one more underscore
Bug IDEA-194910 Add macro support for VM options field (e.g. expand $ModuleFileDir$ properly)
Bug IDEA-96960 Run Configurations popup: inconsistent position for run config folders
Bug IDEA-157989 "Stop" button does not work when the IDE is launched as a background task
Usability IDEA-204335 Need an ability to disable run configuration delete confirmation dialog
Usability IDEA-206392 Do not allow empty parameters in Run configuration > Spring Boot > Application
Usability IDEA-207069 Environment Variables "Open Folder"
Usability IDEA-201215 JVM launcher cannot process @argfiles produced by IDEA
Usability IDEA-206173 Environment Variables: can no longer paste from clipboard
Exception IDEA-205510 Throwable at com.intellij.execution.impl.RunManagerImpl.addConfiguration$intellij_platform_lang_impl
Settings RepositoryFeature IDEA-174290 Settings Repository plugin leaks sensitive information in the commit message
Bug IDEA-193044 Duplicated plugins in Sync Plugin list
Bug IDEA-206186 When starting up new 2019.1 IDEA it resets settings if JetBrains Account is used.
Bug IDEA-205426 Unable to push settings to shared repository - Unknown macro $PROJECT_FILE$ in storage file spec
Bug IDEA-182954 Font size setting synchronization (via account) fail
Structural Search and ReplaceFeature IDEA-198496 Structural search usability: Switch between search and replace modes
Feature IDEA-161879 CTRL+C on Structural Search > Existing Templates yields SearchConfiguration@2115ed8a
Bug IDEA-201833 Structural search inspection: added filter is not saved for search template
Bug IDEA-200892 Dialog remembers its size incorrectly
Bug IDEA-201300 No validation after filter change
Bug IDEA-202914 mess after selection
Bug IDEA-202451 SSR: search templates are missing on each project openenig
Bug IDEA-201528 Simple xml query not found because of index access problem
Bug IDEA-206795 File type not correctly detected from editor selection
Bug IDEA-200742 Tooltip with "Edit Filters" should be disabled in Existing Templates window
Usability IDEA-168054 Make structural search/replace templates available globally
Usability IDEA-203074 Cutting and pasting a placeholder in the template editor looses all placeholder filters
Task ManagementBug IDEA-205965 Pivotal Tracker implementation uses the deprecated and shutdowned API
Cosmetics IDEA-171919 Underscore missing in task list drop-down
TerminalFeature IDEA-119667 Feature request: shortcut for switching between terminal tabs
Bug IDEA-155571 terminal history not retained between openings op terminal pane
Bug IDEA-165632 The terminal is called twice.
Bug IDEA-204243 In 2018.3 terminal doesn't save commands to the history (zsh).
Bug IDEA-205239 Cmd+W in a Terminal tab moved to the Editor closes the wrong window
Bug IDEA-204725 Terminal with bash: 'cat' process ignores SIGPIPE
Bug IDEA-201228 IllegalStateException when split Terminal tab
Usability IDEA-204510 too easy to accidentally close terminal window
Usability IDEA-132932 Console font change doesn't take effect immediately
Usability IDEA-206189 Fall back shell path for terminal settings
Usability IDEA-205457 Terminal trap DEBUG overrides my trap
UMLBug IDEA-207912 Diagrams background is white on Darcula
Bug IDEA-204874 UML diagram: context menu does not work on macOS
Bug IDEA-208229 Export diagram to image file: progress cancelling doesn't work
Bug IDEA-207533 Move UML diagram colors to color theme, then use editor color theme
User InterfaceBug IDEA-206344 Recent Locations popup: after exiting presentation mode, popup may keep the enlarged font for snippets
Bug IDEA-204130 Find usages -> Export to Text background does not match font colour
Bug IDEA-206700 Validation in tables: bugs
Bug IDEA-204534 KDE global menu
Bug IDEA-203219 Touch Bar buttons for "Find/Replace in Path" dialog do not correspond to dialog buttons
Bug IDEA-198933 Problem painting splash screen tail image
Bug IDEA-201284 Linux Native Menu Bar: main menu is not available if the detached editor has focus
Bug IDEA-204789 project frame opens out of screen
Bug IDEA-206399 Navigation bar missing on opening new project
Bug IDEA-207598 Show smart step into popup above the line
Bug IDEA-206775 Remove Run Anything icon for IntelliJ IDEA
Bug IDEA-207737 support native custom decoration
Bug IDEA-201104 Linux native menu: popups are not closed when native menu is opened
Bug IDEA-206484 "Switch Boot Runtime" dialog: Some local JDKs are shown as "Undefined[Local]" in drop-down list
Bug IDEA-207957 IDEA is not switched to full screen on Windows
Bug IDEA-207394 Icon animation stops in TestTree for one project if tests were started in parallel in two projects
Bug IDEA-202305 Update JavaScriptDebugger and JavaScriptLanguage icons
Bug IDEA-184388 Exception on pressing "context menu button" if there is no context menu in the current UI component
Bug IDEA-199508 New Search Field: replace clean icon with close one
Bug IDEA-204678 Editor tab is minimized to OS title bar when detaching it with a mouse
Bug IDEA-186873 Unpinned "Find Usages" window became closed when some control in it are pressed
Bug IDEA-204015 IllegalArgumentException because event getcomponent is null (from TrayIcon)
Bug IDEA-201103 Linux native menu: some submenu are empty
Bug IDEA-127973 Ctrl+Click doesn't work for multiple selection in Changes | Log, File History
Bug IDEA-118112 Additional keybindings
Bug IDEA-203496 java.lang.IllegalStateException: component cannot be null
Bug IDEA-166195 icons doing the same action: intended?
Bug IDEA-202749 Missing mnemonics for labels
Bug IDEA-186740 Scrollbar overlaps piece of text in an overflow hint
Bug IDEA-204831 On IDEA restart 2 projects are opened while when IDEA was closed only one project was opened
Bug IDEA-203502 Preview in "Find Usages" toolwindow turns green when disabled
Bug IDEA-202939 Can't exit search from Mac Touch Bar when no Touch Bar menu configurations
Performance IDEA-205737 parameter info tooltip slows down typing in editor
Performance IDEA-199938 "Compress and Show Logs" works on UI thread
Performance IDEA-204341 30s hang inside DeferredIconImpl
Performance IDEA-199779 Make generated icons lazy
Usability IDEA-206408 "Switch Boot Runtime" dialog takes a long time to show up
Usability IDEA-195255 Dialog Non-Project Files Protection: make OK primary button
Usability IDEA-167451 file chooser dialog: can't definitely say which icons are grayed and which are wnot
Usability IDEA-180216 Image viewer zooms in wrong direction on scroll wheel
Usability IDEA-202513 'Evaluate' window always shows on a fixed size and location.
Usability IDEA-206969 Consistent names of actions in View menu
Usability IDEA-203577 Update tool window modes menu
Usability IDEA-203571 Disabled icons on status bar should support LAF changes
Cosmetics IDEA-199007 Incorrect progress dialog border rendering
Cosmetics IDEA-203937 Vertical aligned windows can't be resized entirely anymore
Cosmetics IDEA-200555 Icons in the Apply Patch dialog are not updated
Cosmetics IDEA-206478 Partial commits: 'Uncheck All' checkbox misaligned with dependent checkboxes
Cosmetics IDEA-205826 Annotation name is cropped on hiDPI monitor 175% scale
Cosmetics IDEA-184165 Startup splash screen progress bar is not centered
Cosmetics IDEA-203829 Analyze actions shows "Include test sources" option even if there are no tests in the project
Cosmetics IDEA-85566 Git branches with underscores don't render properly in branch menu
Task IDEA-205679 Rework validation in tables
Exception IDEA-203132 NullPointerException occurs on entering Presentation mode
Exception IDEA-205460 "Throwable: Project is already disposed" in Structure View on Close project
Exception IDEA-208621 Bookmark dialog's move up/down actions do not work (throw exceptions)
User Interface. Action SystemBug IDEA-202541 Replacing an action via unregisterAction/registerAction may not update references in action groups
Bug IDEA-202598 Remove action from all action groups when ActionManager.unregisterAction is called
Exception IDEA-203236 Throwable occurs when accessing "Run Anything" via shortcut
User Interface. ControlsBug IDEA-207235 On Linux it's impossible to switch tabs in Debug Tool Window (e.g. from Threads to Frames), in Project View if the first line is selected
Bug IDEA-200457 ComponentValidator doesn't work with EditorTextField
Bug IDEA-204972 Cannot assign context-dependent shortcut key if that shortcut is left alone for a different context
Bug IDEA-207083 Implement validation of checkboxes
Bug IDEA-202228 NPE at com.intellij.ide.ui.laf.darcula.ui.DarculaProgressBarUI.paintDeterminate
Bug IDEA-204186 IDEA lost mnemonic for 'File-eXit'
Cosmetics IDEA-201120 Cannot Run Git popup contains Configu link instead of Configure
Cosmetics IDEA-202283 Plugins UI: Top border of "Back to Plugins" button is cut
Exception IDEA-198778 Exception on a click to the hidden toolwindow toolbar item
User Interface. FocusBug IDEA-187615 VCS tool window loses focus when file is selected from History dropdown list
Bug IDEA-203154 Focus lost when some tab is closed in Version control toolwindow
Bug IDEA-194482 Focus lost from main pane after swithcing tabs with keyboard (Alt+Right)
User Interface. Keyboard InputBug IDEA-203999 Double CMD doesn't show tool windows
Bug IDEA-206348 Can no longer use "AltGr" to invoke Alt-Enter for Intention action under JDK11
Usability IDEA-206757 [Sublime keymap]: "Ctrl+Shift+Backspace" should be mapped to "delete to line start" action
User Interface. Look and FeelBug IDEA-203934 Icons become of a Darcula theme after restarting IDEA with "High Contrast" theme set
Bug IDEA-204746 No border between 'Shelf' toolwindow content area and toolbar
Bug IDEA-206617 Cannot open Settings when a theme is applied
Bug IDEA-201938 High Contrast Theme: UML diagram window is still grey for contrast scheme
Bug IDEA-185124 Project Structure dialog doesn't change theme properly
Bug IDEA-159315 Black text on dark background in 'Rename File' dialog box. (Dracula theme)
Cosmetics IDEA-204282 Tree in "File and Code Templates" has grey background when "High Contrast" theme is applied
Task IDEA-203153 Support old color key names
User Interface. NavigationFeature IDEA-115029 Feature request: recent files dialog should use up/down/left/right key mappings
Bug IDEA-207077 Header does not resize on popup resize, title and checkbox may overlap
Bug IDEA-154117 Cannot bind Alt+S to an action
Bug IDEA-207903 Search Everywhere: Selection disappears when "more" item activated
Bug IDEA-208222 Search Everywhere: Items duplicated in Files and Symbols sections
Bug IDEA-207963 Can't find some recent files in Search Everywhere top
Bug IDEA-206340 Recent Locations popup: after checkbox is checked by mouse popup loses keyboard focus
Bug IDEA-206176 Recent locations popup: long string editing leads to location shown as empty
Bug IDEA-206205 Recent Locations popup: new-created file doesn't appear in popup
Performance IDEA-202231 Compute breadcrumb information outside of EDT
Usability IDEA-204424 Confusing representation of items without a group in go to related symbol popup
Usability IDEA-207546 Goto file: match spaces with file separators
Usability IDEA-204149 Disable Search Everywhere from automatically inserting last query
Task IDEA-209217 Fixed size RL popup
Exception IDEA-200357 'Quick Documentation' action fails with exception
Exception IDEA-206238 IAE at com.intellij.util.containers.ContainerUtil.$$$reportNull$$$0
User Interface. Project ViewFeature IDEA-123918 Allow to use additional keymaps for up/down in project window
Feature IDEA-200471 File nesting not happening when file name is equal to configured file suffix
Bug IDEA-176384 Scroll from source not working anymore
Bug IDEA-190056 Class members are highlighted as erroneous when they aren't
Bug IDEA-203616 Update in Resource Bundle makes the file explorer to close the Resource Bundle folder
Bug IDEA-204918 File nesting doesn't work with .java files
Exception IDEA-203552 CancellationException at org.jetbrains.concurrency.AsyncPromise.cancel
Exception IDEA-204840 StringIndexOutOfBoundsException on Enum file opening when "Structure.Show Inherited" enabled
Version ControlFeature IDEA-167703 Shelf deletion should support undo instead of confirmation
Feature IDEA-203130 Allow to apply shelved changes without removing them from shelf by dragging corresponding changelist to 'Local Changes' tab while holding Ctrl
Feature IDEA-177606 Use more relaxed heuristics to mark cherry-picked commits
Feature IDEA-182234 VCS code analysis: specify exactly how many files contain problems
Feature IDEA-202946 Show History for selection should work for the caret position
Feature IDEA-200561 VCS Annotations: add mode to show author initials instead of full name
Feature IDEA-52058 Prompt to add files to version control that got copied into a project externally.
Bug IDEA-204713 Deadlock after switching git branches (with kotlin)
Bug IDEA-203012 Files which were not added under VCS at once, do not appear at the list of files proposed ti add to VCS on project reload
Bug IDEA-205331 Cancelling pre-commit code analysis leaves all local changes in stash/shelve
Bug IDEA-205302 'Clean Unshelved Changelist' - Option button has no default option
Bug IDEA-170942 Scope background color is not shown for files that do not have VirtualFile
Bug IDEA-207102 Annoying "Shelf" behavior changes
Bug IDEA-203802 Unshelve Silently restores several changelists in one
Bug IDEA-87811 No line status markers for files modified without checkout
Bug IDEA-201084 'Group By' button doesn't work in Apply Patch dialog
Bug IDEA-148109 A file ignored via .gitignore is shown as modified in 'Local Changes'
Bug IDEA-206072 IDEA shows half of project with an olive color
Bug IDEA-179602 Workspace should not be restored is a branch is not checked out
Bug IDEA-202099 Shelve tab automatically closed if delete last shelve even if there are items in Recently deleted
Performance IDEA-208067 Project leak via EditorImpl -> InlayModelImpl -> AnnotateRevisionAction$MyVcsVirtualFile
Performance IDEA-201408 ChangesViewManager's tree builds itself in EDT causing performance problems
Performance IDEA-205332 Pre-commit code analysis stashes all roots in the multi-repo project
Usability IDEA-93999 Don't show modal "add files to VCS" dialog when files being added are project files
Usability IDEA-195646 'Local Changes' tree shows module names instead of directory names if 'Group by: directory' is selected
Usability IDEA-167403 Shelf: focus disappears after removing one of the shelved lists
Usability IDEA-192682 Can't drag&drop several files from 'Shelf' tool window to the 'Local Change" tool window
Usability IDEA-138130 Make 'vcs changed' popup scrollable for much code
Cosmetics IDEA-203839 Change 'Unshelve changes' dialog button rename
Task IDEA-204767 Unbundle CVS plugin
Task IDEA-204766 Unbundle TFS plugin
Exception IDEA-180971 java.lang.RuntimeException: java.lang.Exception: Cannot get ChangeListManager component state
Exception IDEA-205978 Already disposed on exit from offline inspections
Exception IDEA-201711 Throwable at com.intellij.openapi.application.impl.ApplicationImpl.assertReadAccessAllowed
Version Control. GitFeature IDEA-116425 Ignored files and folders should indicate that they are ignored
Feature IDEA-190870 Cherry-pick only some of the files from the selected commit
Feature IDEA-139940 Force push could be made a bit safer with --force-with-lease option
Feature IDEA-193870 Set GIT_OPTIONAL_LOCKS for IDE operations
Bug IDEA-200208 Git: the set custom shelf location should be considered on .gitignore generating
Bug IDEA-200432 VCS: deleted previously generated .gitignore file will be recreated anew after opening project again
Bug IDEA-200354 unwanted .gitignore created
Bug IDEA-205297 java.lang.NullPointerException at git4idea.checkin.GitCheckinHandlerFactory$MyCheckinHandler.getSelectedRoots(GitCheckinHandlerFactory .java:368)
Bug IDEA-76760 When a file is added to git and immediately deleted, IDEA update fails with no visible reason
Bug IDEA-200433 VCS: gitignore not always created after new project creation
Bug IDEA-200211 Git: if the project files are located not in the project root, but in some subfolder, the .gitignore is generated incorrectly
Bug IDEA-204694 IO changes: Outgoing commits are not shown when local and remote branch names do not match
Bug IDEA-200486 "This file doesn't belong to the project" warning for .gitignore file in the project
Bug IDEA-205777 IO Commits: commits status is not saved after refresh time is over
Usability IDEA-204470 'Update checks failed' warning on Branches popup
Usability IDEA-201596 Don't add unrelated entries to automatically created .gitignore file
Usability IDEA-155587 Git action "Checkout with Rebase" has counter-intuitive name
Usability IDEA-206134 Unknown host question is asked N times for a single host
Usability IDEA-174119 Git -> Add option should execute git add for all selected files
Usability IDEA-187448 Partial commit | "Uncheck all" button
Cosmetics IDEA-203057 Unify wordings in 'GitHub Pull Requests'
Version Control. GitHubFeature IDEA-202764 Add Open on GitHub option to annotations in diff dialog of older revisions
Bug IDEA-203744 "Checked Out Branch pull/xxx" popup displayed even when no branch is checkout
Bug IDEA-201720 Multiplr Github accounts: can't clone from the accessible host while another configured one can't be reached
Bug IDEA-206841 GitHub pull requests: reviewers list is not sorted
Usability IDEA-200441 Git: "Сhoose Github Account " dialog size is not remembered
Version Control. LogBug IDEA-191688 Resume indexing operation infinite pop-up dialog
Bug IDEA-206766 Bug in Log filtering by branch
Usability IDEA-202408 Strange window flickers on the screen when I navigate through git log (Windows 10)
Usability IDEA-130970 Git Log: search for filter string both in hashes and in strings
Usability IDEA-160441 Better name for Log tabs & tooltips
Exception IDEA-200875 NPE at com.intellij.vcs.log.ui.render.GraphCommitCellRenderer$MyComponent.getFontMetrics
Version Control. MercurialBug IDEA-203079 Add project files to Mercurial
Bug IDEA-130035 Mercurial - move refactoring bugs
Task IDEA-203152 Update incoming / outgoingChangesOn icons for HG
Task IDEA-205988 Please get rid of dependency on javax.activation
Version Control. SubversionBug IDEA-206423 Subversion: impossible to merge file conflict using idea
Performance IDEA-207024 100% CPU usage when working with a changelists of ~100 files
Exception IDEA-202460 NFE at org.jetbrains.idea.svn.commandLine.CommandUtil.parse
Version Control. TFSBug IDEA-206607 TFS: Axis2 configuration error/ClassCastException on workspace creation
Bug IDEA-206233 TFS checkin not possible "Validation must be performed before checking in"
Bug IDEA-206226 Investigate duplicate condition in org.jetbrains.tfsIntegration.tests.ChangeHelper#getModificationChange
XMLBug IDEA-194155 "Collapse empty tag" quickfix deletes non-empty inner tags in XML file
Bug IDEA-170206 'Collapse empty tag' intention breaks code
Cosmetics IDEA-204273 Outdated version of the Xerces library in
Exception IDEA-128571 AIOOBE at org.apache.xerces.impl.XMLDocumentFragmentScannerImpl$ElementStack.popElement
DB ConnectivityFeature DBE-1584 Database: "Automatically disconnect after XX minutes" Property
Feature DBE-5890 KeepAlive setting in data source properties
Feature DBE-2606 Make it possible to run initialization scripts
Bug DBE-7768 Database view: password in not saved by database creation
Bug DBE-7106 Connection error after using mysql-dump on data source with ssh tunnel
Usability DBE-7799 Data Sources and Drivers dialog: don't ask to download drivers if they were downloaded earlier and they are actual
DB ConsoleBug DBE-7896 Datagrip notifications show raw HTML
Bug DBE-2114 Bug in count over function
DB DiagramBug DBE-6225 Foreign keys referencing tables with different casing are not displayed in UML diagram
DB IntrospectionFeature DBE-3413 DB2: support database triggers
Bug DBE-7743 Database: Error encountered when performing Introspect on a MariaDB schema
IDE GeneralFeature DBE-5854 Console 'Save' is a weak spot in an otherwise brilliant product.
Usability DBE-7994 "Set UI Theme" has inconsistent screenshots
SQL CompletionBug DBE-7682 Incorrect completion for nullable enum types in data editor
SQL Format and StyleFeature DBE-2913 SQL code style "Comma Inside Indent"
Feature DBE-7806 MS SQL: Place each declared variables (inside a stored procedure) onto a new line
Bug DBE-7605 Postgres: SQL formatter doesn't recognise "into temp table"
Bug DBE-7890 PLPGSQL formatter adds a line break after PERFORM
Bug DBE-7362 Sql formatter does not apply to injected language
Bug DBE-4805 SQL Reformatting creates error
Bug DBE-4641 Reformat Code should not quote words like NEW, OLD, and EXCLUDED
Bug DBE-7376 With clause code style gets broken when inside of a subquery
Bug DBE-6937 improper formatting of postgresql arrays
Bug DBE-7801 Uncontrollable SQL alignment
Performance DBE-7849 The function WrapImpl.isChildOf() consumes all CPU and never completes
Performance DBE-7823 Datagrip infinite "Trigger sources" bug
Improvement DBE-7881 Align assignments in ON CONFLICT (Postgres upsert)
SQL GeneralPerformance DBE-7930 Infinite spin (UI freeze) in com.intellij.sql.inspections.SqlIllegalCursorStateInspection$createAnnotationVisitor$1.visitSqlRouti neDefinition -> FlowUtilKt.computePossibleCursorStates
SQL GenerationBug DBE-7862 SqlServer doesn't support column identity alteration
SQL HighlightingFeature DBE-4546 Support SQLCMD Mode (Windows)
Feature DBE-7648 PL/SQL Inspection to Report Use of GOTO statements
Feature DBE-7854 False positive for temporary table column reference in "json_populate_recordset"
Bug DBE-7754 sql parsing issue with "if exists"
Bug DBE-7700 Support mysql alter user syntax
Bug DBE-7932 Incorrect inspection on UNION usage in DELETE statement
Bug DBE-7853 False positive: "Redundant character escape" for "\_" in Postgres "similar to"
User InterfaceFeature DBE-6432 Possibility to configure icons for custom data sources
Feature DBE-4074 Database keep project datasource visible when scrolled down
Bug DBE-7659 An item in DB settings list is hidden 1) at first 2) after scrolling
No subsystemFeature WEB-11807 Feature: Folder templates for new projects
Feature WEB-34725 Angular: provide navigation and content assist for selectors in [ngClass]
Feature WEB-29230 HSLA (color) support in JS strings
Feature WEB-37472 TypeScript 3.4: support improved type inference for unions/intersections
Feature WEB-36697 Add support for SVG properties to W3C CSS validator
Feature WEB-37151 Use proper syntax highlighting for destructured functions
Bug WEB-37044 Invalid Inspection Warning - JavaScript - Constructor Returns Primitive Value
Bug WEB-32850 How to apply code style base on Prettier on this project, after saying "no" initially
Bug WEB-37226 Can't run Vue.js plugin project (outdated config)
Bug WEB-36306 Welcome frame missing Create New Project action link
Bug WEB-36639 New project template is only visible after the IDE restart
Bug WEB-35729 So called "Smart Paste" escapes valid code blocks making them invalid in Javascript.
Bug WEB-36877 JavaScript projects: IDE frequently freezes when typing in the editor
Bug WEB-36051 JSX: no parser recovery on an opening "<"
Bug WEB-32905 Can't analyse webpack.config.js: coding assistance will ignore module resolution rules in this file.
Bug WEB-37365 Autocompletion using Typescript definitions does not work at destructuring.
Bug WEB-37062 image tag incorrectly marked as deprecated in an SVG context
Bug WEB-36757 Quick Documentation: link to the external doc page is hidden after the click
Bug WEB-36646 Please add "parallelize" to the default dictionary
Bug WEB-37754 Meaningless text in quickdoc for document.createElement() invoked from a TS file
Bug WEB-37006 Via quick-fix for failed tests possible to run several identical debug session, put several breakpoints on the same place
Bug WEB-35513 NodeJS: Importing a new project takes hours (when node_modules is already occupied)
Bug WEB-35483 Invalid window order for filechooser in window "Run Gulp/Grunt/npm Task"
Bug WEB-36034 ##teamcity log messages when run mocha tests
Bug WEB-37751 Poor documentation formatting for 'ary' function in lodash
Bug WEB-37667 JSX tag is not closed on typing /
Performance WEB-35491 Webstorm process uses up to 500% CPU
Usability WEB-37387 'Ternary to if' and 'Split declaration/initializer' should be available on 'const' and turn them to 'let'
Usability WEB-37649 Angular: not possible to overtype auto-inserted pair braces in interpolation
Usability WEB-36592 Quick Documentation tooltip shown on mouse move doesn't include a link to external docs
Usability WEB-36796 Save as project template: use notification instead of modal dialog
Cosmetics WEB-37438 'Change color' alt+enter menu item is misaligned
Build toolsFeature WEB-36867 Use interactive console for npm scripts run tool window
CSSFeature WEB-37256 Instant image preview of encoded SVG data
Feature WEB-30704 @apply is deprecated and only supported by PostCSS, use more lenient parsing
Feature WEB-30004 Stylelint: allow linting CSS/PostCSS files with custom extensions
Feature WEB-28203 CSS Modules: import class with hyphen as camelCase
Feature WEB-21378 color preview for css custom properties
Feature WEB-36035 Extract CSS variable refactoring
Feature WEB-96 Allow browser selection for CSS validation
Feature WEB-36260 In stylesheet linked to Angular template, provide completion for classes/IDs defined in html
Bug WEB-27632 Bad scope for CSS resolution in Angular Templates
Bug WEB-35011 Sort CSS properties: correctly move the end of line comment together with the property
Bug WEB-37332 css attribute place-items has no supported values
Bug WEB-37249 CSS inspection for 'appearance' property
Bug WEB-37524 Hyphen css class renaming doesn't work
Bug WEB-37014 Typo in allowed property values for css overflow property
Bug WEB-37312 CSS: 'Browser compatibility (properties)' inspection: "no MDN compatibility data" is shown for the properties with the appropriate data available
Bug WEB-36942 Sort CSS properties (aka Rearrange) in SCSS files doesn't work inside media queries
Bug WEB-37292 CSS: Extract variable: do not allow to invoke refactoring over the var() function
Task WEB-37622 Support "Motion Path Module Level 1" CSS spec
Task WEB-37628 Support 'CSS Overscroll Behavior Module' CSS spec
Exception WEB-37372 Extracting ruleset in JS strings produces the exception
Exception WEB-34320 Locate duplicates doesn't work for css
DartFeature WEB-36421 Feature: allow to limit the scope of the Dart Analyzer with the current package
Feature WEB-23646 Include non-imported Dart classes in code completion list and auto-insert import
Bug WEB-36954 Dart plugin incorrectly prevents editing excluded files
Bug WEB-17258 Dart SDK is not configured after updating Dart
Usability WEB-37176 when launching a Dart web app, delay launching until wevdev is ready and serving the app
DebuggerFeature WEB-27977 Debugger console: use special colors for `` and `console.warn()` messages
Feature WEB-35737 npm script debugging not supported without $NODE_DEBUG_OPTION argument
Feature WEB-12349 Debugger console: support string substitutions/output styling
Feature WEB-37309 Console message filtering
Bug WEB-36462 Background is blinking in debugger console
Bug WEB-37444 Console input icon doesn't change its size while changing font size
Bug WEB-34213 javascript debug insists on using Chrome Canary, rather than my release Chrome 68
Bug WEB-34557 Debugging doesn't work for Vue+typescript when using @vue/cli 3.0.0
Bug WEB-37397 Syntax error in Debug when try to "evaluate" arrow function expresion
Bug WEB-36953 Throwable when rerunning tests
Bug WEB-37070 Disabled/muted/removed breakpoints still hit in Webpack applications after recompile
Bug WEB-36095 WinpException when stop Node.js run/debug configuration on Windows
Bug WEB-37144 Breakpoint already exist error after disabling suspend for existing breakpoint
Bug WEB-35502 Jest: debugger hits the wrong line on debug session restart
Bug WEB-37018 ReferenceError when trying to evaluate expression
Bug WEB-37440 Async stacktrace not shown in console
Bug WEB-36666 'Collecting data' for all variables after input in console
Bug WEB-36526 When evaluate in console an object with many properties, some of them can't be shown due to a limit
Bug WEB-37352 Fonts in js debug console should be the same as in editor
Bug WEB-37354 Can't evaluate objects created in console
Bug WEB-36660 Debugger: empty library file is opened
Usability WEB-36785 Show warning when specifying hostname in the "Host" field of "Attach to Node.js/Chrome" remote debug configuration
Usability WEB-36448 Better presentation for stack trace in debugger console
Cosmetics WEB-37349 Move icons on the top line of output
Cosmetics WEB-37357 Remove extra line in Filters popup
Cosmetics WEB-37515 Icons in console are not aligned
Task WEB-33598 Customize URL for react-native
Task WEB-37145 Debugger console: groups
Exception WEB-36540 BufferOverflowException when drag console outside IDE
Exception WEB-37246 NoClassDefFoundError when debug via JavaScript run configuration
Exception WEB-37223 TypeCastException when call
Exception WEB-36972 Assertion when debugging with temporary breakpoint
Exception WEB-37538 RuntimeExceptionWithAttachments when debug npm script with interactive console
Exception WEB-36682 UnsupportedOperationException when call 'Pause output'
Exception WEB-36460 ObjectNotDisposedException when create @angular/cli project
HTMLFeature WEB-2192 References guide in html and css
Feature WEB-5087 Suggest more relevant tag names and remove delay
Feature WEB-32621 Update HTML documentation
Feature WEB-16881 Create inspection to look for deprecated HTML 5 tags and attributes.
Feature WEB-9469 Alphabetically sorting of attributes in html and css (inline css)
Feature WEB-27624 Code inspection does not scan for deprecated HTML attributes.
Feature WEB-36403 Show SVG elements only inside svg tag in HTML files
Feature WEB-34660 Navigate | Symbol should search for HTML tags by id.
Feature WEB-37374 Add "application/ld+json" to `<script type>` completion
Bug WEB-34763 MathML tags should not be available in the completion list outside <math> tag
Bug WEB-36795 HTML docs: doc is not always available in code completion
Bug WEB-26169 style attribute on script correupt
Bug WEB-36394 scoped is marked as deprecated for style tag in vue file
Bug WEB-36934 React-native tag is incorrectly shown as deprecated
Bug WEB-37518 HTML documentation shows existing tag instead of selected variant
Bug WEB-35193 HTML5 Outline shows <td> elements
Bug WEB-36179 HTML code style arrangment with order by name order does not rearrange all elements
Bug WEB-36779 HTML Documentation: invalid symbols in the description text
Bug WEB-37307 "Form input without an associated label" inspection should work when input has a placeholder
Bug WEB-36794 HTML docs: description for parent docs is shown when doc is invoked in completion
Bug WEB-26164 onload event on STYLE tag is no longer allowed in v 2017.1
Bug WEB-23008 HTML5 documentation: "W3C website" links to old HTML4 specification in HTML5 file
Bug WEB-25857 <script onerror="..."> highlight error in .html files
Bug WEB-36583 Tag name editing synchronization lags with some actions
Bug WEB-32620 HTML documentation: remove links to SitePoint
Bug WEB-36848 html 5 boilerplate v7+ falls back to git checkout
Bug WEB-36843 HTML Documentation: SVG: empty description with a dot
Usability WEB-6322 Suppress code inspection "Form input without an associated label" when input has placeholder
JSONFeature WEB-37295 Support non-standard deprecation attributes for JSON Schemas
Feature WEB-36467 JSON: show schema conflict notification for widget, get rid of editor notification bar
Feature WEB-36774 Add eslintIgnore to package.json schema
Feature WEB-36487 JSON schema in yaml notation
Feature WEB-31905 Semantic highlighting for JSON files
Feature WEB-34933 Suggest schemas from schema catalogue and schema schemas in "$schema" completion
Bug WEB-37393 If-then-else validation issue
Bug WEB-31887 "Wrap with double quotes" without effect ("JSON standard does not allow such tokens")
Bug WEB-36973 JSON validation doesn't allow large integer values, although it should
Bug WEB-37571 json schema oneOf not validating correctly
Bug WEB-36429 JSON: Don't show object/array default values in completion
Bug WEB-31900 JSON: Extend Selection doesn't respect camelHump settings
Bug WEB-37261 YAML plugin show error: Validates counter ‘if’ branch but no ‘else’ branch is present
Bug WEB-36161 JSON: Don't input value to property if it already contains some value
JavaScriptFeature WEB-33449 Intention actions and refactoring to replace code by destructuring
Feature WEB-12157 Add 'Join subsequent variable declarations' intention
Feature WEB-32473 Intentions to add/remove ES6 exports
Feature WEB-30826 TS 'Type mismatch' errors should show quickfix to update type when available
Feature WEB-32703 Auto-import with webpack alias: always use the shortest possible path on import
Feature WEB-36338 Use file name as a suggested name for class/enum/interface
Feature WEB-36971 ES6: add a way to disable autoimports from some modules
Feature WEB-36316 Code completion for 'switch' cases
Feature WEB-36737 ES6: show blacklist settings (Do not import exactly from) in UI
Feature WEB-25533 No suggestions to autocomplete missing properties in Flow by expected type
Feature WEB-37007 Allow initialising all fields of a class
Feature WEB-36339 Intention to convert properties in constructor to class fields
Feature WEB-36957 Keyword completion for 'return' should insert whitespace/semicolon when applicable
Feature WEB-35775 Support 'globalThis' ESnext proposal
Bug WEB-30919 Quick Documentation thinks that variable is tag name
Bug WEB-37355 Custom predefined libraries are unavailable in JSP files
Bug WEB-37736 Flow process is not finished when close IDE
Bug WEB-28792 Add Google Closure like destructured parameters of function in JSDoc
Bug WEB-35454 No matching brace/bracket/parenthesis highlighting when ...
Bug WEB-37642 Flow integration super slow on flow 0.92.1
Bug WEB-37413 "Can't generate code from Angular Schematics" when using WSL
Bug WEB-36395 Completion for React utility types
Bug WEB-26037 Autocompletion gets confused when imported ES6 classes have the same name
Bug WEB-36742 Auto completion with named alias is not working correctly
Bug WEB-36854 Autocompletion gets confused on properties when there are 2 same-named classes in different modules
Bug WEB-18054 CommonJS: prototype methods of re-exported module should be available in completion
Bug WEB-37148 Semantic highlighting doesn't work for `let` variable assignments inside of separate function scope
Bug WEB-33767 \u not escaped when pasted into js string
Bug WEB-36477 Module members are not resolved when using @module + @memberof
Bug WEB-37264 Incorrect "Type void is not assignable to type () => void" warning
Bug WEB-37416 Add/Remove ES6 exports: "Remove export" intention: do not remove the whole code block on the export default
Bug WEB-37297 Syntax error: A term expected
Bug WEB-25571 Unresolved types when destructuring require()
Bug WEB-33097 Call hierarchy action doesn't work for functional expressions
Bug WEB-37373 Add/remove ES6 exports. Wrong context detection for arrow/anonymous function
Bug WEB-37420 Invalid Inspection Warnings - Missing semicolon / Selector matches unknown element dummy_selector
Bug WEB-32587 JSDoc: support typescript "export as namespace" modules
Bug WEB-35892 Symbols from CommonJS module are not resolved when ternary operator is used for the exported value
Bug WEB-37516 Javascript classes are not identified correctly when declared with unnamed class expression
Bug WEB-36598 Types from 'prop-types' are not resolved
Bug WEB-37324 Parameter hints popup menu is always invoked for the base language, wrong options page is shown for TypeScript as a result
Bug WEB-35673 Extra item in Structure view if file contains @Component
Bug WEB-31053 Fields in ES6 class lose their accessor level on re-assignment
Bug WEB-36234 Process json file when it's accessed as module.exports property
Bug WEB-37421 'Convert ternary to if' breaks variable initialization order
Bug WEB-35742 Documentation popup: missing spaces between links to definitions
Bug WEB-34153 Broken code after pasting a fragment with escaped symbols
Bug WEB-20459 CommonJS: properties of function assigned to module.exports not resolved
Bug WEB-32941 Unresolved variable Node
Bug WEB-36872 Replace with array destructuring with invalid preceding indexers
Bug WEB-36012 TypeScript/Flow arrow function return type annotation allows parens, but WebStorm doesn't
Bug WEB-37563 Can't type semicolon sign in the color string
Bug WEB-36193 Destructuring is not fully supported in control-flow analysis
Bug WEB-37149 Destructuring can hide unused variable warnings/errors
Bug WEB-35445 Webpack aliases are not resolved if webpack config function is async
Bug WEB-36935 Destructuring intentions: Better processing of non-integers (shouldn't be available) and large integers (shouldn't die)
Bug WEB-16947 CommonJS: prototype methods of exported function not resolved
Bug WEB-30019 The IDE can't recognize some mongoose functionality
Bug WEB-36902 Introduce destructuring variable: doesn't work for static fields
Bug WEB-36900 'Introduce destructuring variables' wrongly shown
Bug WEB-18117 CommonJS: module property not resolved/completed if module.exports is wrapped in immediately invoked function expression
Bug WEB-36241 'Remove unused local variable' behaves incorrectly with array destructuring
Bug WEB-36870 Replace with destructuring: enable for variables
Bug WEB-36750 Color Scheme: Add "Semantic highlighting" option for the JavaScript, TypeScript, and JSON
Bug WEB-34225 CommonJS: exported object properties not resolved when assigning `Object.freeze(obj)` to `module.exports`
Bug WEB-36041 Some refactor actions should not be available for throw expressions
Bug WEB-37550 SystemJS autoimports should use path mappings
Bug WEB-35455 No intellisense when using spread operator for 'module.export'
Bug WEB-37112 JSDoc return type inference inconsistency between `const` and `let` variables breaks quick documentation and type checking inspections
Bug WEB-36821 CommonJS: exported Promise not recognized
Bug WEB-36875 Introduce object destructuring doesn't work within template strings
Bug WEB-37211 Find usages doesn't work with node.js require()
Bug WEB-28276 Renamed default import causes problems when importing commonjs module
Bug WEB-36879 Static member is not accessible for invocation with assignment under arrow function
Bug WEB-36298 Semantic highlighting doesn't work for `let` and `const` passed as arguments
Bug WEB-37277 No completion provided when using default export in iife format
Bug WEB-36781 'Safe delete' is not that safe: should extract side effects
Bug WEB-36873 Introduce new array destructuring doesn't work when invoked inside index
Bug WEB-36947 "Introduce destructuring variables" introduces 'Invalid delete operator target'
Bug WEB-36011 Flow 'typeof' syntax allows parens, but WebStorm doesn't
Bug WEB-37258 Import is marked as Unused if more than one import path is resolved (incorrectly)
Usability WEB-36422 Do not show index.d.ts file name for items in completion popup
Usability WEB-35838 'new Javascript file' attaches .js extension after .mjs
Usability WEB-35652 Accelerators in JavaScript run/debug configuration
Cosmetics WEB-36186 "Must be lvalue" instead of "ReferenceError: invalid assignment left-hand side"
Cosmetics WEB-36414 Update icons used in completion for methods that could be overriden
Exception WEB-37608 NoClassDefFoundError: jdk/nashorn/internal/runtime/NumberToString
Exception WEB-36918 PsiInvalidElementAccessException when call 'Introduce destructuring variables'
Exception WEB-37026 Quick Doc: IllegalArgumentException on invocation documentation with a large image
JavaScript. FormatterFeature WEB-7316 Feature: Code Style: JS: space before and after unary negate operator
Bug WEB-37232 Red error highlights in JS code style preview
Bug WEB-35831 JSX Body tag wrong indentation
JavaScript. FrameworksFeature WEB-35683 Angular: disable Angular language services
Feature WEB-37057 Angular - provide quick fix to auto-import NgModule
Feature WEB-37284 Angular - list module as component's related symbol
Feature WEB-36662 Support canonical attribute names completion
Feature WEB-35435 Improve handling of Angular entities
Feature WEB-37243 Angular - provide auto-import of NgModules during code completion
Feature WEB-36150 Angular - inspect type of expressions result
Feature WEB-37056 Angular - context aware code completion for pipes
Feature WEB-37063 Angular - inspect type in template bindings
Feature WEB-33517 Support React 'defaultProps' + ensure compatibility with TS 3.0 'propTypes'
Feature WEB-32278 Option to not self-close JSX tags when autocompleting
Feature WEB-37363 Angular: incorrect type of bindings of directives with generics
Feature WEB-23865 Angular2 Class binding [class.special]="isSpecial"
Feature WEB-36071 Angular - provide completion for attribute bindings
Bug WEB-37791 Angular structural directive without argument disables styling
Bug WEB-21457 Angular2: path in templateUrl changes to path relative to current file on refactoring
Bug WEB-36790 Angular (version 7) intellisense not working with symlinks
Bug WEB-30180 New component tag should not always auto complete to self closing for components that require children
Bug WEB-37396 Exception when invoking 'Replace with template string' action in the angular template
Bug WEB-37540 Angular: auto close opened curly brackets automatically
Bug WEB-37879 Angular: $event type is wrong in (ngModelChange)
Bug WEB-37737 Angular: issues if dot-prefixed templateUrl is relative to base path
Bug WEB-36386 slot-scope not recognized
Bug WEB-37647 "Must be lvalue" in angular template with non-null assertion
Bug WEB-37279 Declaration is not included in any module inspection doesn't work correct when inpsection the whole project
Bug WEB-31288 Editor > Code Style > HTML "Add for JSX attributes": None Doesn't Work
Bug WEB-37283 Angular: false positive 'Type string is not assignable to type String("up")|String("down")' on string expression
Bug WEB-37348 Angular: false positive ambiguous component problem in index.html
Bug WEB-37660 JSX: propTypes don't work with spread if they are defined using literal properties
Bug WEB-37589 Some build-in angular modules are marked as not Angular modules
Bug WEB-37054 Angular - take NgModule structure into account when resolving pipes, directives and components
Bug WEB-37798 Angular: generic members of parent class not resolved correctly in template
Bug WEB-37275 React + Typescript: broken completion for functional component (React.FunctionComponent)
Bug WEB-36295 Angular templates: improve completion suggestions after typing '*'
Bug WEB-37276 False positive ' Expression result type' inspection for trackBy functions
Bug WEB-36114 React components created with ref forwarding are not suggested in completion
Bug WEB-34475 Angular Dependency and Angular Schematics actions should not be available for scratches and libraries in the project view
Bug WEB-37588 [TypeScript][React] Component requires props from a Component connected to Redux
Bug WEB-37637 `Type` is missing in the completion list
Bug WEB-36089 ng-template is listed twitce in the completion list
Bug WEB-36652 Enable auto imports for JavaScript symbols in .vue files
Bug WEB-37384 Angular Material error - "More than one component matched on this element"
Bug WEB-34821 No inspection for undefined symbols in pipe expressions.
Bug WEB-37644 Angular expression comments are incorrectly lexed
Bug WEB-37520 Angular: Wrong case in autocomplete
Bug WEB-37132 Angular: CSS selectors from component local stylesheets are marked as unused
Bug WEB-36856 Go to definition for some Ionic components takes you to metadata
Bug WEB-35197 Angular: CSS selector marked as unused if it's used in [ngClass]
Bug WEB-37318 Angular: syntax issues with xml entity references
Bug WEB-37693 Angular: Inspection "Component or directive matching ... out of the ... scope" broken if importing ModuleAndProviders
Bug WEB-35820 Issue with spellchecking an expression with & and ;
Bug WEB-37603 Ionic 4 components are reported as undefined tags
Bug WEB-34133 Usages of component prefixed with underscore are not found
Bug WEB-35684 Angular: ensure Angular support is stub safe
Bug WEB-37509 Emmet expansion in JSX templates generates Quotes for event handlers
Bug WEB-22063 No completion for props merged with ES6 spread operator
Bug WEB-31058 Incorrect warning: Element XYZ doesn't have required attribute children.
Bug WEB-37320 Angular: binding to an @Input that is a method gives a warning
Bug WEB-37797 Angular: incorrect text coloring if char entities are used.
Bug WEB-37278 False positive 'Declaration membership in NgModule' inspection when using spread operator
Bug WEB-36817 Completion for 'native' event modifier in Vue.js
Bug WEB-37058 Angular - support standard attribute to property mappings
Bug WEB-36002 WebStorm doesn't recognize (focusin) or (focusout) event bindings in Angular templates
Bug WEB-32279 Support propTypes defined using static getter
Usability WEB-37414 Angular. Template. Autocomple inserts [class.] instead of class attribute
Task WEB-26592 Angular: Improve suppression inside component's templates
Exception WEB-36170 Exception is thrown when removing reference in angular tempate
JavaScript. InspectionsFeature WEB-36805 Inspection and quick fix to move a variable closer to its usage joining with the initializer
Feature WEB-36229 Add Inspection for missing switch statement cases
Feature WEB-36124 Enable and improve JS inspections "Pointless bitwise expression", "Shift operation by inappropriate constant" and "Incompatible bitwise mask operation"
Feature WEB-36319 More inspections related to 'switch' statements
Bug WEB-36832 Quick fix for 'no default branch in switch statement' is not displayed
Bug WEB-29577 Good code yellow: Local variable is redundant when restoring original value
Bug WEB-36945 Don't highlight unreachable 'switch' labels in case of non-strict literal types
Bug WEB-36979 Destructuring intention actions shouldn't be available on type annotations
Bug WEB-36304 False positive: 'arguments' not allowed
Bug WEB-36452 "Condition is always true" false positive for result of local arrow function
Bug WEB-34239 Not possible to suppress inspection in class decorator
Bug WEB-37347 False positive "Reports pointless bitwise expressions" inspection
Bug WEB-37025 "Condition is always true" inspection for THE standard "is this an object" test
Bug WEB-36969 Function exit points highlighting: highlight 'yield' in generators, better highlight 'throw' in try-catch
Bug WEB-32220 Not relevant quick-fixes for the missing import statement inspection for PropTypes
Bug WEB-36236 Suppressing several inspections for one line adds comments in several lines
Bug WEB-35461 Inspections: "Missing required 'alt' attribute" gives false positive in the Vue.js files
Bug WEB-36920 Unused variables inspection/fix behave incorrectly with destructuring
Bug WEB-37097 inline suggestion of a const variable -> changes outcome
Bug WEB-34810 False positive "unused function" with <a href="javascript:functionName()" />
Bug WEB-18936 ES6/7 class declaration with getter/setter and default value causes "duplicate declaration" highlight.
Bug WEB-36970 False positive 'Expression type does not have [Symbol.iterator]' for 'any' type
Cosmetics WEB-36967 Typos error in Settings → Editor → Inspections → JavaScript, missed a space in the inspection description
Cosmetics WEB-37011 Inspections: JS: clean up descriptions
Cosmetics WEB-37186 'Replace Switch With If' intention has a similar inspection
Task WEB-35027 TypeScript / Javascript nullability: further improvements
JavaScript. RefactoringFeature WEB-26313 ES6 refactorings: convert promises to async/await
Feature WEB-34162 Add an intention action to quote/unquote object literal properties
Feature WEB-22569 ES6 convert var to let/const inspection/intention: support destructuring operator
Feature WEB-36724 Add intention to convert between indexed and dotted object notations
Feature WEB-33422 Destructuring should be used where possible ('Convert parameters to object')
Bug WEB-33350 Fix focus in 'Change signature' dialog when shown from quick fix
Bug WEB-37328 'Convert to async function': properly handle same-call then-catch
Bug WEB-37207 Convert to hex/decimal/binary/octal is giving wrong results
Bug WEB-37311 'Convert parameters to object and introduce interface' should be available when parameters reference 'this'-type, and should extract generic interface
Bug WEB-36088 On Refactoring - multiple imports are added
Bug WEB-37227 Intentions: "Convert to async function": equal constructions are converted differently
Bug WEB-37064 Don't show 'Convert parameters to object' for callback function
Bug WEB-35588 'Convert to field holding arrow function' removes decorators from class
Bug WEB-37170 Remove actions ( 'Introduce local variable' and 'Introduce object destructuring') from embedded expressions
Bug WEB-37131 Intentions: preserve arguments names with the "Convert to async function" intention
Bug WEB-36847 Extract method may produce incorrect code when nested function is used in extracted method
Bug WEB-37205 Convert to async function refactoring loses generic parameter
Bug WEB-36136 "Extract variable" refactoring may produce incorrect code if spread operator is used
Bug WEB-36622 Wrong default import when using Move refactoring for React components
Bug WEB-37310 'Convert parameters to object' shouldn't be available if one of the parameters references 'this'-type
Bug WEB-37164 'Change signature' is not available inside .vue files when return type is mismatched
Bug WEB-33970 False positive 'Cannot extract code with conditional return' in extract method
Bug WEB-37228 Intentions: "Convert to async function": comments in the code blocks are lost after the conversion
Bug WEB-37121 'Extract type alias' should add an extra type parameter for 'this'
Bug WEB-37270 Introduce array destructuring: java.lang.RuntimeException: Document is locked by write PSI operations.
Bug WEB-36892 'Convert to let/const' breaks code when called in For loop
Bug WEB-36630 Typescript extract parameter in arrow function doesn't affect call site.
Bug WEB-37239 Intentions: "Convert to async function": correctly convert the anonymous function into IIFE
Bug WEB-36799 'Extract function' should work when selection contains local functions
Bug WEB-37160 Intentions: finally statement is lost after the "Convert to async function" intention invocation
Bug WEB-36633 Webstorm goes unresponsive when trying to extract a variable using ` cmd + option + v `
Bug WEB-37163 AssertionError: Could not parse TS type from '*[]' when call 'Change signature'
Bug WEB-37081 Use 'const' for the introduced destructuring by default
Bug WEB-36358 Split OR'ed if produces corrupt output
Bug WEB-16853 Incorrect brace insertion
Bug WEB-37301 'Replace with destructuring' intention places variables after the preceding when all the variables are in the same list
Bug WEB-36891 Improve 'Join variable declaration and assignment' for loops
Bug WEB-34947 "Extract method" refactoring may create method, which doesn't return necessary variables if they are created using object destructuring
Bug WEB-37280 JS 'Extract method' produces extra newlines when selection contains nested function
Bug WEB-35909 Inline Function: (Typescript) nested "return" statement of inner anonymous function is lost
Bug WEB-36725 Converting to named function creates unnecessary public modifier
Bug WEB-36898 Intention to split variable declaration and initializer incorrectly processes loops
Bug WEB-28356 Extract method refactoring is not performed when semicolon is not selected
Bug WEB-36912 Convert between indexed and dotted object notations: should have better availability
Bug WEB-36814 'Split into declaration and initialization' produces incorrect code
Bug WEB-37254 Replace with indexer access: introduces red code in case of generics
Bug WEB-37401 'Convert to async function' produces broken code if no semicolons selected in code style settings
Bug WEB-37313 'Safe delete' for variables doesn't check for usages anymore
Usability WEB-37204 Simplify parenthesized expressions when doing extract-refactorings
Task WEB-37188 Better UX for 'generate delegating methods' dialog
Exception WEB-37158 Intentions: java.lang.Exception is thrown for the "Convert to async function" intention
Exception WEB-37077 Exception on 'introduce object destructuring'
JavaScript. TemplatesFeature WEB-10883 Mustache Plugin: Add Support for Inerhitance
LESSFeature WEB-31443 Support less 3.0 features
Bug WEB-36397 Char is missing when renaming variable variable in less
Bug WEB-5649 LESS CSS: variables with variable name are not correctly resolved
Bug WEB-35947 Tilda-escaped import is shown as error in Less
Bug WEB-34549 Less function each
Bug WEB-24644 less-file report an error on using the literal sign '~'
LintersFeature WEB-36890 TSLint: Replace 'Lint JavaScript Files' checkbox with detection based on presence of 'jsRules'
Feature WEB-30614 Stylelint support should allow inspection of JS files
Feature WEB-35990 ESLint: Use the runtime config(cliEngine.getConfigForFile) to detect which file types should be linted
Feature WEB-36988 Support @typescript-eslint for automatically linting .ts files using integrated ESLint
Bug WEB-37656 eslint.additional.file.extensions registry option should trim space
Bug WEB-37116 ESLint depends on location of first linted file
Bug WEB-36806 'Detect package and configuration file' in linters doesn't unselect custom config file
Bug WEB-36889 ESLint: doesn't work if there is no dependency to it in package.json and auto-detection of configs is enabled
Bug WEB-37378 typescript-tslint-plugin highlights wrong ranges for semicolons rule
Bug WEB-37143 Missing support for ESLint globals new syntax
Bug WEB-37528 typescript-tslint-plugin: invoking 'fix all errors' in vue file breaks code
Bug WEB-37178 Provide quick fixes when running TSLint with typescript-tslint-plugin
Bug WEB-37761 Unexpected Language service response - eslint with ts files (vue-parser as parser)
Bug WEB-37120 TSLint Schema for "whitespace" not up to date
Bug WEB-37383 Wrong highlighting with typescript-tslint-plugin and whitespace-checking rules in vue
Cosmetics WEB-37027 Linters config UI: replace label about automatic configuration with question mark icon with popup
Exception WEB-36681 NullPointerException when open file in create-react template project
Node.jsFeature WEB-37123 Offer the dev an auto-complete list of the environment variables defined in the active project run-time configuration. when process.env is entered in a statement.
Feature WEB-36167 [NodeJS] missing field in packageJsonSchema.json
Feature WEB-35765 Navigation and resolve for npm script names
Feature WEB-22231 Feature Request: Semver tooltip hinting
Feature WEB-37534 Docker compose: support Debug mode when "JavaScript file" field is empty
Feature WEB-12988 Basic Node JS template
Feature WEB-35072 ESLint on WSL not work when mount point '/mnt/c' is changed to others (e.g. '/c')
Bug WEB-36819 Open in browser is suggested for 'url' and 'repository' keys in package.json
Bug WEB-36921 A window pops up when stopping a run task on windows
Bug WEB-36650 Go to definition for package name in package.json doesn't open module in project view
Bug WEB-36753 'yarn install' from package.json quickfix / not installed dependencies notification should refresh parent directories
Bug WEB-37308 Navigate and resolve to script files
Bug WEB-36987 Highlight __filename & __dirname as local
Bug WEB-36645 Use 'bin' property from package.json to run npm/yarn
Bug WEB-30960 Change alignment in 'Package manager' field
Usability WEB-36831 Do not pre-configure working directory in Node.js run configuration template
Usability WEB-36855 NPM Upgrade via IDE allows multiselect but upgrade only updates last selected package
Usability WEB-35968 Settings update npm packages gives no indication of activity
Exception WEB-37707 package.json: Semver check produces Throwable
Pug (ex-Jade)Feature WEB-15349 Allow multi-line property lists to be indented
Feature WEB-7901 JADE: add breadcrumbs bar showcasing the nested elements like HTML & HAML have
Bug WEB-14174 Jade: Completion: replace obsolete value '5' with actual 'html'
Bug WEB-22802 Pug: support ES6 template strings
Bug WEB-35735 Pug: no tags completion in block section
Bug WEB-36968 Pug: accepting completion for doctype removes a preceding space
Bug WEB-19320 Highlighting breaks for ES6/2015 tagged strings
Bug WEB-19541 Jade string formatting incorrect if /n is present
Bug WEB-22432 Support ES2015 syntax in Jade/Pug unbuffered code
Bug WEB-32306 Arrow functions are not supported in the script tag in Pug
SASSFeature WEB-34910 Sort CSS properties (aka Rearrange) in SCSS files
Feature WEB-6015 Add color preview box in the left gutter for variable (containing some color value) reference (as it done at its definition)
Bug WEB-36991 Sort CSS properties (aka Rearrange) doesn't properly sort nested properties in SCSS
TypeScriptFeature WEB-36444 Support TypeScript 3.3 merged signatures
Feature WEB-37105 Support TypeScript 3.4 contextual type inference from generic return types
Feature WEB-36375 Add new intention to wrap the return type of async method to a global Promise type
Feature WEB-36292 Use capitalised variable name as placeholder for the extracted type or interface name
Feature WEB-35849 TypeScript: add explicit action to restart service
Feature WEB-37445 Update bundled TypeScript to 3.3
Feature WEB-36981 TypeScript: add quick fixes for adding library in tsconfig.json
Feature WEB-37051 Support TypeScript 3.4 readonly array/tuple types
Feature WEB-37122 An extra intention action to convert parameters to object + extract interface
Feature WEB-33130 Vue.js: use ts service for vue files
Feature WEB-26429 Generate -> Delegate Methods for ES6/TypeScript
Feature WEB-36291 Make Extract TypeScript interface available for a variable holding the object
Feature WEB-35004 Can 'Compile' action on .ts file trigger compilation on nearest config?
Bug WEB-37119 this-types should also have this-references
Bug WEB-36169 typescript lost setting after edit field
Bug WEB-37663 TypeScript: wrap fixes aren't available if ts service is on
Bug WEB-37047 Marking application assets as Resource Root cause problem with tsconfig lib aliases in Angular NX application
Bug WEB-37552 tsserver crashes with assertion on TS side on removing script tag in vue file
Bug WEB-36587 Cannot parse parenthesized object literal with union type inside function return type annotation
Bug WEB-37125 TypeScript: Create Field on enum adds 'public' keyword If 'use public modifier' option is on
Bug WEB-36195 Incorrect Typescript intention: "make private" on lambda
Bug WEB-29249 TypeScript. Incorrect import after moving files from mapping path
Bug WEB-36334 No type keyword completion in extended class generic arguments
Bug WEB-36731 "Introduce destructuring variable" intention. Read/write usages
Bug WEB-37494 Circular imports
Bug WEB-36706 Typescript: AutoImport ignoring `paths` field in tsconfig.json
Bug WEB-36829 False positive 'Item is not redundant' when assigning to typed variable before returning
Bug WEB-37028 TypeScript: if "lib" array in the tsconfig.json is empty do not duplicate the added library
Bug WEB-37533 No expected type for React props in TypeScript files
Bug WEB-36439 Use our tooltips instead of TS service tooltips on 'this'-expressions
Bug WEB-35202 TypeScript: No auto-import and completion of exported variables from js files
Bug WEB-37154 Add 'readonly' in the completion list
Bug WEB-36949 Expression Result Type inspection - wrong on Component bindings
Bug WEB-37507 'Redundant local variable' inspection is spurious when the variable assignment is used for type widening.
Bug WEB-36726 "Introduce destructuring variable" intention should have better availability
Bug WEB-9526 Typescript: Extract method should work for selected block inside switch()
Bug WEB-37411 Rename-refactoring shouldn't be inplace on this-types and this-expressions
Bug WEB-37488 TypeScript: properly expand mapped type with 'any'
Bug WEB-36885 Type inference fails for Extract<T> type
Bug WEB-37273 Remove export intention adds public modifier for the variable
Bug WEB-36712 No option to disable breadcrumbs in *.tsx files
Bug WEB-34136 Wrong rewriting of import path after moving a dependent file
Bug WEB-37530 Angular: add tsconfig.lib.json to the tsconfigs list
Bug WEB-37514 TypeScript: support keyofStringsOnly compliler option
Bug WEB-29618 Support partial matching of union signatures
Bug WEB-36177 `constructor` not detected as used when only used with `this`
Bug WEB-36771 Incorrect result of type assignability check in TypeScript
Bug WEB-37140 IntelliSense does not resolve typescript with typeof import('module').property
Bug WEB-36317 'Specify type explicitly' doesn't work for function/lambda expressions and also doesn't properly derive union return types
Bug WEB-37410 Type aliases should be in the completion list for implementing
Bug WEB-32596 TypeScript overloaded functions resolve to first one that allows the argument, even when more precise alternatives exist
Bug WEB-36464 Destructuring intention actions should better handle 'const' variables
Bug WEB-36868 Promise.resolve always infers to 'Promise<any>' because of incorrect resolve between library files
Bug WEB-37564 TypeScript: type guard doesn't work for re-declarations
Bug WEB-33073 Go to super class action doesn't work inside objects for implemented properties from the interface
Bug WEB-35879 idea can't display some func as func color in typescript
Bug WEB-35862 'Extract interface' refactoring should better handle implicitly referenced generics
Bug WEB-37602 Type guards: cannot resolve narrowed type methods because of invalid type source taken from 'any'
Bug WEB-36511 Variables with construct signatures from libraries not shown in completion after `new` in case of multiple libs with same interface
Bug WEB-37251 TypeScript config: "strict" option includes "strictNullChecks"
Bug WEB-31139 Incorrect inference for Record type in conditional type
Bug WEB-37129 typescript/idea auto create method bug
Bug WEB-37592 Support for typeof import
Bug WEB-37388 False positive in Unsound instanceof type guard check
Bug WEB-37606 "Do not show parameter hints for this method" not suggested for functions types
Bug WEB-27886 Unused import inspection doesn't work when the path is invalid
Bug WEB-30321 'instanceof' type guard works incorrectly when provided with 'any' type
Bug WEB-36412 Autocomplete not work with dynamicaly evaluated types
Bug WEB-37706 Incorrect "is null" warning Typescript (closure)
Bug WEB-36619 Typescript class implementing an interface method as a lambda incorrectly reports method as unused/can't find usages
Bug WEB-37429 Type guard is not evaluated for 'switch (typeof x)'
Bug WEB-37386 Popup menu for parameter hints does nothing in case of TypeScript call signatures
Bug WEB-37581 False type mismatch errors when returning promise instance
Bug WEB-34392 Completion for readonly modifier after other modifiers in constructor
Bug WEB-37475 Inspection: async function return type should be 'Promise<..>'
Bug WEB-37345 Better cycle protection for aliases
Performance WEB-37049 IDEA stop responding (hangs) on Type info (CTRL+SHIFT+P)
Usability WEB-36273 Don't re-format file on applying "Add <classname> to existing import" Typescript service quickfix
Usability WEB-30634 Extends/implements is not shown in completion for class expressions
Task WEB-34800 Check that new TypeScript 3.1 error UX is compatible with our presentation
Task WEB-36160 TypeScript: optimize TypeScriptGeneratedFilesStartupActivity#addFileToExclude
Task WEB-36269 TypeScript: overload support for tag functions
Unit TestsFeature WEB-22516 Support cucumber step definition in TypeScript way
Feature WEB-36578 Show test status in the gutter for both compiled and original file
Feature WEB-29620 Karma plugin should support CLI args
Feature WEB-35279 Highlight failed line and show error message in the test in the editor
Feature WEB-29665 Missing navigation support for latest CucumberJs and for TypeScript files
Bug WEB-37046 Support jest todo feature (added in jest 24)
Bug WEB-37321 Jest runner doesn't execute "setupFilesAfterEnv" correctly with Jest 24
Bug WEB-37680 Jest fails with 'Class constructor Spec cannot be invoked without 'new''
Bug WEB-37066 ##teamcity text in console when debug Jest tests with Node 6
Bug WEB-36728 Cucumber.js: TypeScript steps: correctly process And and But steps
Bug WEB-37492 Cucumber.js: Working directory doesn't work for the version 2
Bug WEB-31227 Mocha: working directory isn't set to sub-folder
Bug WEB-36845 Mocha: afterEach fails but test is reported as a success
Bug WEB-36974 Improve @angular/cli stack trace parsing (impossible to get some unit test features in @angular/cli project)
Bug WEB-36810 Angular workspace: WebStorm is starting Karma tests for Protractor specs
Bug WEB-21609 Cucumber-js: 'Create all steps definition' quickfix creates a single definition
Bug WEB-36736 Add working directory option for Cucumber RC
Bug WEB-36927 Jest: no results shown when running multiple tests with Node.js 6.x
Bug WEB-37048 WebStorm/IntelliJ considers non Angular project as Angular one while running Jest test
Bug WEB-37262 Karma Plugin raises deprecation warning when executing tests against Jasmine >= 3.3.0
Bug WEB-37031 Angular with Jest: support running tests for non-default Angular project
Usability WEB-36272 Add gutter icon for 'jest' in package.json
Cosmetics WEB-37422 Cucumber RC. Align the labels to the left
Exception WEB-36729 Cucumber.js: TypeScript steps: correctly process asterisk step