DocumentationBugWI-40350Language Injection Settings 404 or There is no help
Injections in PHPFeatureWI-39271Provide \%\w as default user parameter applicable to PHP
BugWI-38660SQL Injection: dynamic values are not supported for fields and table names
BugWI-42587Concatenation injections not filtered when injected via PHPDoc
BugWI-42588Concatenation injections not filtered when injected via comment
BugWI-42485Concatenation with PHP_EOL produce syntax error
BugWI-42486Run query in console: doesn't allow to the substitute the values of variables
BugWI-42586Concatenation injections not filtered when injected via "Inject language or reference"
PHP CompletionFeatureWI-27222Postfix completion: add more postfix templates (implement custom templates)
FeatureWI-6000Autocomplete: Suggest fields of class when completing params in __construct()
FeatureWI-24527FQCN autocompletion
FeatureWI-18727Completion: list dynamic methods too (basically all) after :: in second completion invocation (1c-Bitrix style)
BugWI-33132Overridden methods completion: doesn't change self return type
BugWI-42131FQCN autocompletion doesn't work for "throw new"
PHP ComposerFeatureWI-39493Make tool setup easier: CodeSniffer, MessDetector
BugWI-42697Missing extension inspection: Analyze all files except libraries
BugWI-41230Settings Synchronization: Language Level remains blocked after removing the content of composer.json
BugWI-42831Extension is missing in composer.json: don't report extensions enabled by default
BugWI-42303Wrong PHP version if composer.json defines contraints (Logical AND)
BugWI-42352Support composer version "!=" range in minimal language level sync
BugWI-42117Show composer log action stops to work
PHP FormatterFeatureWI-41443Group use: allow to place closing and opening braces on the same line
PHP InspectionsFeatureWI-17482Inspection to validate order of elements in @var/@property
FeatureWI-42471Auto-detect custom ruleset of PHPCS from composer.json and turn the corresponding inspection on
FeatureWI-41510Copy PHPCS/PHPMD local configuration from Default project
FeatureWI-19525Allow to create PHP Code Sniffer/Mess Detector settings on project level
FeatureWI-28043Allow Inspections to Recognize Non-Static Methods Called as Static as Valid
FeatureWI-13197New quickfix: "Add PHPDOC @method annotation" for methods that don't exist.
FeatureWI-37565New inspection: Warn about useless default value in function declaration
FeatureWI-42520Add parameter type hints to the created method while invoking "add method" quickfix
FeatureWI-9399Warn on optional parameter before required/obligatory parameter
BugWI-37926Unused argument in the construct method
BugWI-41392 array_filter to foreach inspection doesn't work when callback function is passed as variable or text
BugWI-42227Parameter type: default value forces the caller to have the same type
BugWI-31329False-positive "Unused private field/constant" for a private method that is used in a trait
BugWI-41384array_map to foreach inspection doesn't work when callback function is passed as variable or text
BugWI-34792Missing yield statement when yield is used in expression context
BugWI-41381for loop to array_fill inspection works only when constants or variables are used as value for array
BugWI-41380array_fill to foreach inspection works only when constants or variables are used as value in method call
BugWI-41501Unused parameter: is not reported in child class constructor if parent class also has contructor
BugWI-41502Unused parameter: shown for magic methods
BugWI-41267Default local Code Sniffer configuration is lost after CS configuration for remote interpreter is created
BugWI-35790Parameter type: anonymous class with __invoke method is not callable
BugWI-41953Flip variable and type quick fix works incorrectly with compound type
BugWI-42147Parameter type: parameter with default value should accept void type
BugWI-27738Improper type checking of type-hinted parameter when default value is set
BugWI-41569array_fill does not work if function call is used as 3rd argument
BugWI-42013PHPMD: UI issues in Inspection settings
BugWI-42014Changing type (application vs project level) of interpreter doesn't change the type of PHPCS/PHPMD
BugWI-41416Disabled extensions stubs doesn't work with class aliases
BugWI-42011Invalid path for auto-detected PHPMD/PHPCS on Windows
BugWI-28758Changing severity for the inspection "Undefined namespace" has no effect
BugWI-41289CodeSniffer/MessDetector settings page UI is broken
BugWI-42119Parameter type checking false positives in the case of variadic arguments
BugWI-34806PHP 7 style class member lambda call ($x->a)(); not marked as syntax error with Language level 5.6
BugWI-42125Parameter type checking FN in the case of variadic args (except first one)
BugWI-38366$this is not accessible in static context inside anonymous functions
UsabilityWI-41133Language Level inspection can override Composer synchronization
UsabilityWI-41954Move Non-canonical order of elements inspection to PHPDoc category
UsabilityWI-42783Save $_SERVER['DOCUMENT_ROOT'] relative to project_root
CosmeticsWI-42317Code sniffer, Mess Detector inspections should be included in some group
PHP ProfilerUsabilityWI-41173Navigation via Quick filter in Execution statistics requires 5 presses of arrow
PHP RefactoringFeatureWI-39374Postfix completions for creating local variable in php
FeatureWI-7523New refactoring: move instance method
FeatureWI-35509Unsupported replacement pattern: partial and expressions patterns are not supported
BugWI-42312False positive 'Method not accessible' when move instance to parent class with protected method
BugWI-29142Allow to rename old style constructor to new style
BugWI-42209Move instance: doesn't handle self/parent references
BugWI-42234Move instance: doesn't replace $this
BugWI-42568False positive 'Method not accessible' when move instance to child class from parent with non public visibility
BugWI-42210Move instance: target visibility is not checked
CosmeticsWI-42219Wrong before preview type for postfix 'throw' action
ExceptionWI-42381Exception when try to move instance method with self from anonymous class
Plugin: Deployment _ FTP..FeatureWI-41900Sync with Deployed: add processed file status (progress bar) while loading
BugWI-801No way to forcefully cancel "remote deployment" when quitting
BugWI-42386Selection of deployment path mappings doesn't ask for password
BugWI-33517SFTP private key passphrase behaves inconsistent for auto-uploading
BugWI-42429Unable to deploy from Mac via SFTP to a IPv6-only host
BugWI-42253Remote Host menu works not as expected
BugWI-41081Right passphrase sticks for sftp server
BugWI-18980Connectionproblems with FTPS. "session reuse required" on vsFTPd/pure-ftd/proftpd
BugWI-30970SFTP: password is not asked after failing with wrong one
BugWI-16820Copying of large file can't be stopped
BugWI-31639PhpStorm freezes on applying settings for invalid server that is being tested
BugWI-42113PhpStorm freezes on test connection to invalid sftp server on Windows
BugWI-42345Ask to reenter invalid password from Remote Host refresh
PerformanceWI-31928Right click on a changelist with 22K files freezes the IDE for half a minute
UsabilityWI-33918Invalid unsaved password is cleared inconsistently
UsabilityWI-10013File deployment: after failed Cancel attempt uploaded file is not shown in Remote Host
UsabilityWI-36742Remote Host - warning dialog to allow canceling of unintended directory or file moves (on the localhost/project side PhpStorm already does this)
UsabilityWI-41694There is no way to provide authentication data on clicking browse button in ''Root path''
CosmeticsWI-42111Remove Path From Excluded has empty icon
Plugin: PhingBugWI-40863Phing: 403 when trying to download latest phar via IDE
SpellcheckerPerformanceWI-39163Speed up spellchecking by hunspell dictionaries
PerformanceWI-36515IDEA 11.1.3 hanging up on text changes
No subsystemUsabilityWI-41749Auto-detect paths to tools when composer install is done
HTTP ClientFeatureWI-40372Add option to decode Unicode entities and character escapes in JSON replies.
FeatureWI-40409Support environment variables in request body
FeatureWI-40450Support formatting for POST request body
BugWI-42269HTTP Client: Allow request body for HEAD requests
BugWI-40373New REST client : HTTP Requests Log file is invalid, file is null
BugWI-40376Editor-based REST Client hangs forever with "Accessing" status
BugWI-40365REST Client: Allow Request Body for DELETE/GET/OPTIONS request
UsabilityWI-40700Deprecate UI based REST Client
PHP DebugBugWI-42279UI freezes when accessing PHP -> debug options
PHP IntentionsUsabilityWI-42617Undefined Method Quick Fix - Add Ability to remove "add @method tag" or change order or options
PHP LangFeatureWI-41978Structural search: support type contraints
FeatureWI-42307SSR: allow to search fields without wrapping class
BugWI-42760Using $this when not in object context
BugWI-42094SSR: Can't find switch statement
BugWI-42274SSR: callable type matches nothing
BugWI-42275SSR: iterable type matches nothing
BugWI-42272SSR: type array matches nothing
BugWI-42047SSR: can't match $a[] expression
BugWI-42034SSR works with if/elseif incorrectly
BugWI-42035SSR: while pattern matches all expressions below
BugWI-42039SSR: import statements can't be found
BugWI-41898Structural Search: can't find "for" loop
BugWI-41897Structural search: can't find shortcut operators
BugWI-41235Browse button for relative paths in PHP Includes opens installation directory
BugWI-41956Quick documentation for @method displays parameter wrong when self is used as parameter
BugWI-42328SSR: can't find 2 assignments when value of second referenced to the first one
BugWI-42126SSR: invalid matching of parenthesized expression
BugWI-42045SSR: type constrains doesn't support namespaced type
UsabilityWI-41896Structural search: doesn't allow to skip code inside statements
UsabilityWI-41817Provide references to parameter types in Quick Documentation
UsabilityWI-41818Provide references to parameter types in Quick Documentation for @method
CosmeticsWI-41815New Quick Doc doesn't show whether function is @internal or @deprecated when there's no description
TaskWI-41939PHP quick fixes produce inconsistent PSI
ExceptionWI-41895Structural search: exception is thrown on attempt to specify Reference target contstraints template
ExceptionWI-42070NPE When invoke SSR (new $aClass$())->$var$();
ExceptionWI-42455SSR: SOE while searching class reference which does't typed var
PHP Lib StubsFeatureWI-35699Warn about extensions used in project but not listed in composer.json
PHP TemplatesTaskWI-42233Blade: support @canany, @elsecanany, @endcanany blade directive
PHP TestFeatureWI-41089PHPUnit: allow to run whole abstract test class
FeatureWI-41219PHPUnit: ability to run several inheritors of abstract test
FeatureWI-41750PHPUnit: allow to run multiple test entries in "test" dashboard
BugWI-41630PHPUnit: 'Generate test method' breaks code when class is placed inside namespace with braces
BugWI-16315Navigate Test: Test class Name is empty for traits and interfaces
BugWI-16274New PHPUnit Test: Class to test shouldn't show test classes during completion
BugWI-41759PHPUnit composite run configuration: alternative patterns base path is enabled after test class renamed
BugWI-42067PHPUnit: multiple dataset triggers run of the whole method
BugWI-42687PHPUnit composite run configuration: Don't add dataset for test method in run command if dataset was empty in run configuration
BugWI-41540Codeception plugin requires "PHP Remote Interpreter" plugin to function and it's not listed as depended
BugWI-41150PhpStorm Codeception support is not compatible with PHP 5.6
BugWI-42236PhpUnit: Dataset indicator is lost in composite run configuration after test method rename
BugWI-41318PHPUnit method and class are not updated on move refactoring
BugWI-41859PHPUnit: there is no way to select library test for Composite configuration
BugWI-40311PHPUnit: it's not possible to select and run 2 tests from "Test" action
BugWI-42611PHPUnit: composite scope does't allow to choose elements via "project" tab
BugWI-42612PHPUnit: allow to choose dataset for elements in composite scope
BugWI-42594Unable To "Rerun Failed Tests" Using PHPUnit
BugWI-27301PHPUnit method and class are not updated on rename refactoring
UsabilityWI-41825PHPUnit: disable "Use alternative patterns base path" by default
UsabilityWI-41281PHPUnit: enable camel-case completion in 'class' field
UsabilityWI-16313Improve sorting in 'navigate to test' list
UsabilityWI-42254@covers autocompletion should not include parenthesis
UsabilityWI-13779PHPUnit: completion suggests method name in its own @depends tag
UsabilityWI-20152Generate unit test method action inserts at incorrect position
UsabilityWI-27049Support @codeCoverageIgnore completion in regular classes
UsabilityWI-41680PHPUnit: Disable ability to create run configuration for anonymous classes
UsabilityWI-41462Full Docker output shown with remote interpreter
UsabilityWI-41645Replace browse button for method fields in Behat/Codeception/PHPSpec config editors with completion
UsabilityWI-38999PHPUnit: use PHPUnit Test Method template while generating method via completion
UsabilityWI-41857PHPUnit: filtering by method name doesn't work
CosmeticsWI-41973PHPUnit show test class icons instead of test files in project view
CosmeticsWI-41758PHPUnit run configuration: Mistake in "Use alternative patterns base path" label
ExceptionWI-41727PHPUnit: NPE after right click on multiple selected folders when PHPUnit run configuration exists
PHP Type InferenceFeatureWI-35064Option to set document_root folder in preferences/directories
BugWI-5467Find usages: Find usages doesn't work on multiresolved references for class members
PHPDocBugWI-41977Regression - "Undefined class object" in method docblock in namespaced class with lang level 7.2
PS SpecificBugWI-42202Jump outside closing bracket/quote: doesn't work for function/method calls if function/method was completed
BugWI-40852Checkout from VCS produces invalid project on first opening
CosmeticsWI-42139Introduce abstract exception icon
Plugin: Joomla!BugWI-42624Variables in injections either empty or repeat the concatenated variable
TaskWI-42402Check SQL injections for Joomla!
No subsystemFeatureIDEA-194897MacBook touch bar: add "Add configuration" button in Run/Debug configuration dialog
FeatureIDEA-188431Better completion variants in Stream::toArray() method
FeatureIDEA-186244Analyse Stack Trace does not understand jstack -F traces
FeatureIDEA-187979 IJ Internal Statistics: FUSUsagesTrigger for application usages collectors
FeatureIDEA-188135Don't report always true asserts: support expression parts; support assertion methods
BugIDEA-193340Batik 1.10 breaks Xerces 2.11.0 dependencies
BugIDEA-193835IDEA starts with error Could not initialize class com.intellij.internal.statistic.eventLog.FeatureUsageLogger
BugIDEA-188452Define context in Live templates. Context can be selected only after second click on it
BugIDEA-194169New SE: Keyboard shortcut settings
BugIDEA-192243Diff Window: Browsing through files by keyboard stopps working when an image cannot be loaded.
BugIDEA-192799Winp exception in the log
BugIDEA-189153Find usages history keeps reference to PSI via computable icon
BugIDEA-188519Actions that do not show popup because of dumb mode fail typeahead
BugIDEA-188895Provide API for custom activity providers
BugIDEA-191258Out of memory on opening/reading SVG file.
BugIDEA-191897Broken SystemInfo.isGNOME on Ubuntu 18.04
BugIDEA-191068After restarted, manually arranged layout jump back to default
BugIDEA-121111Maven and SBT projects are opened as plain directories
BugIDEA-190112Cannot update to new EAP
BugIDEA-187611Support custom icons for NamedScope to use it in the Project toolwindow
BugIDEA-190432NGramEnumeratingService causes Deadlock
BugIDEA-193863exceptions when deleted some .xmls
BugIDEA-187182 Project encoding wrong after first opening of a solution
BugIDEA-177327AltGr special characters don't work under Windows 10, instead hotkeys for Ctrl+Alt are initiated
BugIDEA-172173Completion Stats -> factor with null values are ignored during dump
BugIDEA-186750Indent guides often disappear
BugIDEA-148298File name match regression in version 10
BugIDEA-156074"Cannot redo. Unexpected document state" when undoing then redoing in IntelliJ IDEA 2016.2
BugIDEA-194670Memory leak in DocumentationManager
BugIDEA-194901MacBook touch bar: welcome screen bugs
BugIDEA-192410Find usages doesn't stop searching on tool windows tab closed
BugIDEA-193544100% CPU When Memory View (Debugger tool window) is visible
BugIDEA-189011Go to class popup does not fit the screen
BugIDEA-189873Run Dashboard: Del pressing in the Find box in console deletes the current run configuration
BugIDEA-182889Shortcut conflict: Rerun & Refresh
BugIDEA-189461Stop all StackOverflowError
BugIDEA-191955Focus is lost during typing
BugIDEA-190535Cannot revert trailed space from diff window
BugIDEA-187695Idea logging from the "Periodic tasks thread" leads to a deadlock
BugIDEA-194890MacBook touch bar: More items button does not work in Run/Debug configurations dialog
BugIDEA-192991WS doesn't keep tab positions on newlines in yml files when switching windows
BugIDEA-193180Selecting 'Always show FN-keys at Touch Bar' blows IntelliJ into a billion pieces
BugIDEA-192102Remove close icon from Analyze Stack Trace tab toolbar
BugIDEA-187609NPE in sheets when project does not exist
BugIDEA-191450Idea hangs trying to investigate data flow from a `project` parameter of PsiBuilderImpl
BugIDEA-192359Project Files view in CLion shows two folders as one folder named “A/B” when A doesn't have other content
BugIDEA-190868Go plugin: renaming function does not update function name in project tree
BugIDEA-189737UML diagram titles are broken
PerformanceIDEA-172762ProjectRootManagerComponent$1.fileTypesChanged on AWT causes 30-60s freeze
UsabilityIDEA-186631Confirmation dialog text is trimmed and does not expand when the window is resized
UsabilityIDEA-194132Hide JSON widget for Spring Boot YAML configuration files
UsabilityIDEA-188401Parameters info tooltip disappears on switching method overloads
UsabilityIDEA-84622Default "Open directory/project" path and better navigation
UsabilityIDEA-187112UML diagrams: use editor background color for UML tab background on darcula
UsabilityIDEA-160977Not all similar threads are merged
UsabilityIDEA-191596Only one gutter intention is visible
CosmeticsIDEA-194893MacBook touch bar: improve Configurations popover
CosmeticsIDEA-194905MacBook touch bar: use buttons with labels instead of icons in Diff dialog
CosmeticsIDEA-194902MacBook touch bar: debugger improvments
CosmeticsIDEA-194896MacBook touch bar: use close icon instead of close button
CosmeticsIDEA-188297$FILE$ placeholder is 'unknown' when printing console output
TaskIDEA-189365Get rid of Snappy library
TaskIDEA-185056Remove pin icon from quick navigate tooltip
TaskIDEA-194110Turn on Run Anything action in IDEA
TaskIDEA-187791Make JButtons colorable
ExceptionIDEA-188163BUG | latest EAP Idea ultimate | HttpVirtualFileImpl cannot be cast
ExceptionIDEA-185991Code analysis in "Commit Changes" dialog fails for php formatter
ExceptionIDEA-192088Exception when starting IntelliJ
Code Analysis. InspectionFeatureIDEA-121571Feature request: A Contract Annotation that indicates that a method returns its argument
FeatureIDEA-175780Reactor inspection: unassigned Flux/Mono instance
FeatureIDEA-175784Reactor inspection: do not call blocking operators within a non-blocking scope
FeatureIDEA-49092Inspection profiles: provide possibility to create a scope from inspections dialog
BugIDEA-189769Analyze data flow from here should be available on interface members
BugIDEA-192189"Settings" button disabled in inspections result if focus is in editor
BugIDEA-194855False positive "Blocking operator in non-blocking scope" for a Flux
BugIDEA-187749JSP default package inspection incorrectly displays an error for array types.
BugIDEA-190445Inspection result toolwindow - after excluding some issue cursor disappears
UsabilityIDEA-189380Inspections restore defaults menu option
UsabilityIDEA-192387Not possible to kill inspection quick fix
CosmeticsIDEA-188219"Suppress" button is small
ExceptionIDEA-194975Offline Inspection fails with HeadlessException presumably because EAP version is expired
ExceptionIDEA-188838Keyboard navigation in Inspection Results throws IndexOutOfBoundsException
Code CoverageFeatureIDEA-102075Update code coverage results to include branch coverage column
FeatureIDEA-191726Update JaCoCo to support Java 10
BugIDEA-190928Annotation NotNull changes behaviour of code coverage
BugIDEA-184699Code coverage Report includes excluded packages
BugIDEA-154416Shortcuts for "next uncovered" or "next fully covered" work only once.
BugIDEA-190499Run with Coverage: Error occurred during initialization of VM
BugIDEA-179136Code Coverage: "Edit Coverage Colors" action could expand the tree of colors to the corresponding line coverage color
BugIDEA-191734Generated report doesn't contain branch coverage
UsabilityIDEA-179798Coverage view column size is not helpful and user setting is not remembered
UsabilityIDEA-192287Show full package name at coverage view
ExceptionIDEA-193071Throwable at com.intellij.openapi.application.impl.ApplicationImpl.assertReadAccessAllowed
Code Formatting and Code StyleFeatureIDEA-152088Java Code Style. Add option to not line wrap on import statements
FeatureIDEA-98499Allow staticly imported class members to have a different style than other constants
FeatureIDEA-57898add an option to force a blank line before the end of the class
FeatureIDEA-151870feature request: code style option to put a semicolon on a line after the last comma of an enum
BugIDEA-191843"Adjust code style settings" adds additional chars
BugIDEA-180049New line after javadoc block in enum.
BugIDEA-158493Code formatter adds empty strings when breaking up too long string literal.
BugIDEA-174605Blank Lines for enum doesn't work properly
BugIDEA-115696Incorrect continuation indentation after string concatenation
BugIDEA-153628`Enter` after operator in binary expression should place caret on correctly indented place
BugIDEA-130575Java code style enum wrapping "wrap always" warps also end-of-line comments
BugIDEA-145538Code reformatting forces a space before the colon symbol in a Java foreach statement
BugIDEA-110902File reformatting breaks javadoc @link
BugIDEA-98552for() statement: Place ')' on new line → "incorrect" alignment
BugIDEA-175161Javadoc formatter joins lines incorrectly
BugIDEA-175560Right parenthesis (rparen) on new line is not indented properly
BugIDEA-67968Formatter Ignores Empty Space
Code NavigationFeatureIDEA-189093Implement Go To Declaration and Go To Implementation for Java 10 var
FeatureIDEA-188351Allow to Navigate to a class within a specified package.
FeatureIDEA-44323Go to Symbol could handle the results of "copy reference" (eg: com.apptio.biit.server.GraphicsProxyHttpServlet#doGet)
BugIDEA-194408Exception in 3rd party plugin breaks core functionality
BugIDEA-188178Exception when "//" is typed in the "Navigate to file" popup
BugIDEA-177179Navigate | Class... - navigation by a method reference navigates to the class declaration
BugIDEA-190713Navigate Back action works incorrectly after navigate to class
BugIDEA-193708Navigate from enum constant to enum class if no enum constructor is available
PerformanceIDEA-188959Calculate line marker tooltip in background thread
UsabilityIDEA-188686'File Path' action should work in dumb mode
Code. GenerateBugIDEA-192006Clicking Enter in the "Choose fields to initialize by constructor" dialog was interpreted as OK + new line in the editor
UsabilityIDEA-192185'Insert @Override' by default should be enabled in 'Generate toString()' dialog
ConsoleBugIDEA-130302First line in console is folded when it is too big (and not command line)
BugIDEA-188939Toggling soft wrap in the console folds previously unfolded text
DatabaseExceptionIDEA-194420Throwable at com.intellij.ide.actions.WeighingActionGroup.getAllChildren
ExceptionIDEA-190214Throwable at com.intellij.openapi.application.impl.ApplicationImpl.assertIsDispatchThread
DebuggerFeatureIDEA-191508Breakpoint intentions
FeatureIDEA-181675Cross-project HotSwap
FeatureIDEA-186951Caller method filter
FeatureIDEA-190644Delete breakpoint with a middle mouse button click
BugIDEA-187709Huge number of captureXXXX.props files created under C:\Users\Миша\AppData\Local\Temp.
BugIDEA-189725'Smart step into' doesn't work immediately sometimes
BugIDEA-189894minor problem with horizontal scrollbar when debugging
BugIDEA-192798[Breakpoint intentions] [Stop/don't stop in the class] correct filter was added using intention, but it doesn't filter anything
BugIDEA-192070Deadlock while debugging
BugIDEA-191337Select All from debug tooltip variable select code editor instead of Tooltip variable value
BugIDEA-94049Debugger: Return ability to set field watch point via alt+gutter click
BugIDEA-192430Breakpoint intentions [Stop/don't stop in the class] parent class is displayed instead of caller class
BugIDEA-172425debugger under jdk9 throws NoClassDefFound
BugIDEA-127045Unexpected 'step over' behaviour in debugger
BugIDEA-191140Incorrect variables mapping inside catch block without debug info
BugIDEA-159144Can't set breakpoint in lambda that is a field
BugIDEA-128518Map help buttons of the debugger settings
BugIDEA-193733history-paste doesn't work in debug-watches, even though it's offered
BugIDEA-187338Async stacktraces may not work with several debug sessions
BugIDEA-189504Breakpoints View is bugging in debug view
BugIDEA-193400Duplicated async stacktrace
BugIDEA-192962[Mute breakpoints] option is switched off on the debug session start
BugIDEA-190076Incorrect frame state after thread death
BugIDEA-191114Incorrect variables mapping inside foreach loops without debug info
BugIDEA-189423Unexpected tokens error in multiline condition
UsabilityIDEA-147697Debug : can't set the value of long variable
UsabilityIDEA-130826Prompt user before removing breakpoints with conditions
UsabilityIDEA-194431Async Stracktraces for Platform.runLater
UsabilityIDEA-186171Turn breakpoint condition field background to pink when there is a syntax error
UsabilityIDEA-190833Do not highlight disabled breakpoints
CosmeticsIDEA-192172Text in "Evaluate and log:" field is too small in Presentation mode
CosmeticsIDEA-188878Replace "Stacktraces" with "Stack Traces"
TaskIDEA-122113Get rid of NashornJsBreakpointListener
Diff_MergeFeatureIDEA-182364Add action "Compare something"
BugIDEA-170382Unable to use Idea diff command for directories with special symbols
BugIDEA-189154Partial Commit: "Local Changes" preview does not work if all changes in a file are reverted and applied again
BugIDEA-190698Command line diff : allow diffing single (new) files
BugIDEA-194913Zoom is broken in Diff for images
BugIDEA-188244Invoking JAR Files Diff does not affect productivity guide statistics
BugIDEA-188245Invoking Directory Diff does not affect productivity guide statistics
BugIDEA-193373Diff in Commit Changes: cannot resize TTF preview below some limit
BugIDEA-187715Local history ignore encoding settings and show wrong diff.
UsabilityIDEA-182230VCS "visual merge" window: don't ask "Are you sure" if there was no changes
UsabilityIDEA-90565Diff View:git: do not show LF|CRLF when I have option "automatically convert line separators" on
UsabilityIDEA-191716"Cancel Visual Merge" dialog is shown even with no modifications when pressing Esc
UsabilityIDEA-190466Diff viewer in Local Changes view works incorrect with grouping by repo
DockerFeatureIDEA-175476Add option to wrap words in docker logs
FeatureIDEA-153443Base directory for Docker deployment
FeatureIDEA-186877Docker. Support --runtime command line option
FeatureIDEA-150690Docker - add --rm option
BugIDEA-154034Focus on new tab after exec action
BugIDEA-188923Docker pulling progress dialog has negative value for the download size
BugIDEA-164756Docker log tabs added with each new run
BugIDEA-180157Docker Run configuration : replace JSON file with explicitly listed options in CLI format
BugIDEA-194041Number of Attached Console tabs keeps increasing with every container launch
BugIDEA-194072Dead `--rm` container shown as not removed from the IDE view
BugIDEA-194227Docker: DockerView, Log tab: multiple toolbars at resizing
BugIDEA-187895Docker: Don't add the tabs from the previous run to the new container
BugIDEA-190331DockerCompose. Display volumes on "Volume Bindings" without duplicating if container folder contains "/" at the end
BugIDEA-192393Dockerfile "cannot resolve stage" with valid --from syntax
BugIDEA-187161DockerCompose: Navigation from override files services doesn't work
BugIDEA-194659DockerCompose: impossible to run docker-compose run configuration
BugIDEA-158217Docker: stop and delete old container after redeploy, even if container name is not set
UsabilityIDEA-163754Docker. Container, Exec menu item. Set focus on the command line after Exec-> bash
UsabilityIDEA-194040Typing in Attached Console is very slow
UsabilityIDEA-155340Docker. Add possibility to "inspect" for images.
UsabilityIDEA-155346Docker. Container tabs. The focus is not on the new tab if we perform any command two times.
UsabilityIDEA-155561Docker. Provide possibility to go to the corresponding Dockerfile from Docker view.
UsabilityIDEA-188595Docker-Compose: provide navigation from containers to the services in the corresponding configuration file
TaskIDEA-193122Docker: migrate to docker-java to v3.1.0
TaskIDEA-179297Remove dependency on java-impl from Docker plugin.
ExceptionIDEA-193603Docker: IllegalOptionException at saving run configuration with a folder instead of the Dockerfile
Editor. Code CompletionFeatureIDEA-192382Override unused imports when adding class with same name
FeatureIDEA-76223Showing Both Autocomplete and Javadoc
BugIDEA-193689IDEA logs of EAP version have eaten all free space of a /home - threaddumps
BugIDEA-193509Unintended code completion list pops up when typing non-ASCII strings
UsabilityIDEA-176647Do not show auto-popup with the exact same name when entering text in the middle of a symbol
UsabilityIDEA-144321LookupElementProximityWeigher should work for all lookup items that have PSI
CosmeticsIDEA-187518Support italic in completion lookup element item text
ExceptionIDEA-193362java.lang.IllegalStateException: Not in a typed action at this time
ExceptionIDEA-188584AE at com.intellij.codeInsight.completion.CompletionAssertions.assertHostInfo
Editor. Color SchemesFeatureIDEA-193070"Syntax highlight > Language defaults > Parameter" should have option to inherit from "Identifiers > Default" since it's Identifier
Editor. Editing TextFeatureIDEA-151939In scroll panel highlight lines with breakpoins
FeatureIDEA-130703Join Lines (Ctrl-Shift-J) could join nested if's
FeatureIDEA-123328When positioned on break/continue, highlight for/while/do it breaks out of
FeatureIDEA-172368'Join lines' could handle increment with 0 nicer
BugIDEA-190254Class name is erased after choosing Add Javadoc action and starting to type
BugIDEA-194978Mouse navigation & tooltips handler: take inlay hints into the account
BugIDEA-188682Moving a Statement through comments mixes up the comment lines
BugIDEA-193224Tabbing out of brackets broken when having to import a class.
BugIDEA-192328Entering a newline between a regular multiline comment and doc comment introduces stray asterisk.
BugIDEA-193436editor component draws a typed char in editor component even if a typed handler does nothing and returns STOP
BugIDEA-188770HTML block header sometimes doesn't disappear
BugIDEA-188561Truncated parameter info popup on empty argument list
BugIDEA-194054Gutter icons of the underlying code displayed on folded region quick view
BugIDEA-187666Multi-caret does not move uniformly over >= and <=
BugIDEA-192519yml and other files: Editor does not show unquoted devanAgarI unicode characters.
BugIDEA-189708Wrong position of completion parameter hint popup
BugIDEA-192438Underline is always bold underline
BugIDEA-190905Blacklisted hint can appears sometimes.
BugIDEA-191750Expand selection (ctrl+w) doesn't work correctly for case statements
BugIDEA-192700Left gutter is not resized when breakpoint is removed
BugIDEA-192777Builder methods return hints duplication in the editor.
BugIDEA-164133"Optimize imports" adds import which is immediately marked as "Unused import statement"
BugIDEA-189671Editor loses caret (thus focus) after closing one of the two splits using Close (Ctrl+F4)
BugIDEA-189508Parameter names hinting doesn't work correctly with non-ASCII symbols
BugIDEA-189650IDE closes empty files when restarting
BugIDEA-192288Strange annoying behavior on mouse click in long file in ES6
BugIDEA-186636Keystrokes lost during freezing
BugIDEA-192970 Jump outside closing bracket/quote: doesn't work if if/while/switch statements were completed
BugIDEA-190665Caret is not repainted correctly
BugIDEA-190660ClassCastException after code reformatting using 'Join Lines'
BugIDEA-190298Clipboard content pasted twice when assigning mouse shortcut to `Paste`
BugIDEA-108112Ident after enter in Java binary expressions
BugIDEA-192919Custom file type: incorrect Expand selection if word is between backslashes (tested with in C files)
PerformanceIDEA-189038Slow undo in large file
UsabilityIDEA-126440Collapsed comments preview with timeout or button for preview
UsabilityIDEA-188086Split Editor Tab scrolls back to cursor
UsabilityIDEA-189772Weird presentation of collapsed import block, when something deprecated is inside
UsabilityIDEA-186011Smart Backspace isn't smart enough
UsabilityIDEA-191765soft wrap for active editor switches off
UsabilityIDEA-186311Kubernetes: Json. Display long messages on scroll-bar as short description with "more" link or as text.
UsabilityIDEA-191018Selection under diff popup does not work
UsabilityIDEA-188800PostfixTemplates: no description for the user-defined and edited built-in templates
UsabilityIDEA-126243Reformatting on typing curly brace should be performed in a separate command
CosmeticsIDEA-138747Joining line with EOL comment
TaskIDEA-190840Refactor "Line separator" and "Encoding" status bar widgets to share code
ExceptionIDEA-190959Wrong line separators: '\r' at offset 0
Editor. Error HighlightingTaskIDEA-188957Add possibility to implement DumbAware highlighting passes
Editor. Intention ActionsBugIDEA-191095Raw string literal RegExp should be recongnized
UsabilityIDEA-193480Unable to add annotations to parameters from the gutter icon
File SystemBugIDEA-193418Deadlock on project open
PerformanceIDEA-191007Too large buffer passed to ReadDirectoryChangesW seriously impacts Windows file system performance
UsabilityIDEA-192665Annoying "External file changes sync may be slow" notification
Find, Replace, Find UsagesBugIDEA-191479"Find in Path" partial results can flicker/selection is reset while the search is in progress
BugIDEA-188153Next occurrence doesn't work when focus is in folded code
BugIDEA-193321SearchEverywhere: on scope switching the 'include non-project items' checkbox loses its state
BugIDEA-189385Line with both read and write access to a field is shown with read-access icon in 'Show usages' results
BugIDEA-170585Disable tooltip for regex find
BugIDEA-190721Accessorr search works incorrect when child field hides parent
BugIDEA-188646Livelock in Git commit dialog during code analysis
BugIDEA-186556Find symbol should show [jdk9] module at beginning of the list when exact name entered
BugIDEA-130620Incorrect find usage on fields if exist methods named like a setter and used in inner class
BugIDEA-140859'undo' (ctrl+z) in the 'find' (ctrl+f) box has unexpected behaviour
ExceptionIDEA-193330AIOOBE at com.intellij.ide.actions.searcheverywhere.SearchEverywhereUI$SearchListModel.getContributorForIndex
ExceptionIDEA-189500Search does not work
IDE ConfigurationFeatureIDEA-136387Add a template variable that displays file path from project root.
BugIDEA-186546Copyright plugin can't read copyright profile created in IDEA 2017.3
BugIDEA-192127Launcher Script Should Use Python3 When Available
BugIDEA-187515Parameter hints enable/disable isn't applied when toggled from action popup
BugIDEA-193029Restarting is not supported on GNU/Linux with Python 3 as the only Python interpreter
BugIDEA-170111password storage throws exception if config directory is symlink
BugIDEA-187365Floating license activation over HTTPS on a private network: add 'Test connection' button to Register dialog
BugIDEA-189920Attribute inheritance flag in Editor color scheme is reverted on Apply
BugIDEA-194876When removing "Other" from "B" live template context, it's reset to "None"
BugIDEA-189452IDEA overwrites write-protected files on saving settings (even with "safe write" option turned off)
UsabilityIDEA-189436IDEA fails to launch with JDK 10 set as IDEA_JDK_64.
UsabilityIDEA-193234Sort Live Template Scopes alphabetically
UsabilityIDEA-169751Notification in the IDE about low heap memory which clearly tells user to increase an Xmx and provides a convenient way to do it.
UsabilityIDEA-190017Allow to duplicate postfix templates
ExceptionIDEA-193753MissingResourceException: Can't find resource for bundle java.util.PropertyResourceBundle, key
IndicesBugIDEA-194315Spring Boot: application.yaml file opened in Editor while indexing is not recognized as SpringBoot configuration file
BugIDEA-189189Repeated scanning files for index
PerformanceIDEA-186709freezes on older project open/branch checkout
Internal build scriptsFeatureIDEA-188583Support generation of Maven artifacts for modules of IntelliJ-based IDEs
BugIDEA-189408Incorrect artifactId is generated for module names which include digits
BugIDEA-188812IDEA with Python plugin run configuration is broken
ExceptionIDEA-193553Error while indexing .stylelintrc
JavaFXBugIDEA-187363New FXML File in the Web tool window does nothing
JavaScriptBugIDEA-190598Nashorn JS with Java 9: IDE does not support class declaration
BugIDEA-190826@NotNull method com/intellij/lang/javascript/nashorn/library/NashornJSLibraryProvider$1.compute must not return null
KubernetesBugIDEA-185004Kubernetes: Yml. QuickHelp. It's impossible to restore it as popup from keyboard
ExceptionIDEA-192537java.lang.Throwable: Do not call synchronous refresh under read lock (except from EDT)
Language InjectionBugIDEA-188783Intellij IDEA 2018.1RC#IU-181.4203.519 freezes frequently on start and during project build
BugIDEA-191232Injected language fold regions aren't cleaned up if the injected document becomes invalid
Packaging and InstallationFeatureIDEA-187763Register our IDE for compatible file type on macOS
FeatureIDEA-194011Turn vcs.log.graph module into a healthy maven dependency
FeatureIDEA-187290New balloon notification: IDE update has been applied
BugIDEA-193348The IDE has been updated by Snap shouldn't be shown on macOS
BugIDEA-194822Incorrect sed command in non OS_TYPE Linix libyjpagent check breaks non Linux startup
BugIDEA-190448Missing 'config' dir in Install-Linux-tar.txt instructions
BugIDEA-188130Launcher should be able to recover when config/port contains invalid value
UsabilityIDEA-191432Force "Download and install JRE x86 by JetBrains" and "32-bit launcher" options when installing on 32-bit system
CosmeticsIDEA-191997com.intellij.updater.Runner usage message for Runner install <folder>
CosmeticsIDEA-161414"Profiling agent is not enabled" should not be a WARN log entry and / or chatter to the terminal
CosmeticsIDEA-181200Install-Windows-zip.txt instructions are out of date
TaskIDEA-189413Bundle Kotlin 1.2.50 with IntelliJ IDEA
TaskIDEA-189411Bundle Kotlin 1.2.41 with IntelliJ IDEA
TaskIDEA-166447Provide separate application icon for EAP distributions
TaskIDEA-192733Update bundled JDOM to 2.0
TaskIDEA-192182Extract sources of java annotations to separate GitHub repository
TaskIDEA-195115Bundle Kotlin 1.2.51 with IntelliJ IDEA
TaskIDEA-185083Unblock basic proxy authorization scheme for https protocol
Password SafeBugIDEA-190514"Magic number did not match" exception on opening Deployment Settings
UsabilityIDEA-191264Uncheck remember on push credentials dialog by default
Platform APIFeatureIDEA-169107Create an API to add custom text in place of OuterLanguageElement-s to aid template data language lexer
FeatureIDEA-188386Support debug-level logging in IntelliJ product build scripts
FeatureIDEA-192305EditorTabTitleProvider: pass FileEditor, not just VirtualFile
FeatureIDEA-192059Improve `JavaBuilderUtil.registerFilterToSkipMarkingAffectedFileDirty` for using in other builder categories
FeatureIDEA-184848UAST Pattern: constructor param
FeatureIDEA-192484Allow IntelliJ-based products to define custom icons for EAP builds under Windows and Linux
FeatureIDEA-193136Synchronous notification on file opening
FeatureIDEA-187115JPS: provide API to report exception to IDEA
BugIDEA-188348Change com.intellij.openapi.actionSystem.ex.DefaultCustomComponentAction API
BugIDEA-193989IDE does not start - broken icon loading by relative path and IconPathPatcher in multiple plugins
PerformanceIDEA-189948AST is loaded when computing file icon because of smart pointers
UsabilityIDEA-192560ReplaceConstructorWithFactoryDialog has non public constructor
TaskIDEA-192805Clean up values set by Look-n-Feel
TaskIDEA-193114Make property-based and code insight sanity testing frameworks available outside IntelliJ IDEA repository
Meta IssueIDEA-175637Check in tests that PSI text can be parsed back to a similar PSI structure
Plugin DevelopmentFeatureIDEA-140461DevKit: make TestDataReferenceContributor work for Groovy
BugIDEA-166677XIncludes in plugin descriptions should resolve paths in classpath (or even in entire project's classpath)
BugIDEA-163694Devkit: fix IdeaPlugin DOM
BugIDEA-194424DevKit: fix usage scope for Action/Group
BugIDEA-194306Devkit: fix quick/full doc for extension point w/ "qualifiedName"
BugIDEA-186696TestDataNavigation: don't compound two side editor from files in different directories
BugIDEA-185624False inspection description not found error
BugIDEA-183006Automatically load plugins on which the main plugin optionally depends in tests
BugIDEA-190994Usage of ITNReporter in PlatformExtensions.xml is reported as an error
BugIDEA-191217Devkit: "Element should be registered in ..." false positives
UsabilityIDEA-193156DevKit: keep "plugin.xml" in editor tab title
CosmeticsIDEA-192134Remove 'MaxPermSize' from default VM options when start IDEA plugin run configuration
TaskIDEA-188065Warnings when using httpclient-4.5.2 provided with IntelliJ
Plugin ManagementBugIDEA-191790NoClassDefFoundError in case of disabling Coverage plugin
BugIDEA-193311"Install plugin" button is undistinguished
BugIDEA-182869Plugin update fail if requested with major version IDE patch update
UsabilityIDEA-176508Unable to install plugins when their download URL returns 307 redirect
Project ConfigurationFeatureIDEA-50658Artifact editor: copy artifact action could be provided
FeatureIDEA-193050Add option to specify minimum version of the IDE which is required for a project
FeatureIDEA-193045Repository libraries: add option to exclude only some of transitive dependencies
BugIDEA-192248Default PHP Interpreter settings are reset after PhpStorm restart
BugIDEA-186834Creating a project in the drive root adds the second backslash leading to the wrong project working directory for Run Configurations
BugIDEA-185133Changing version works incorrectly for Maven libraries if MAVEN_REPOSITORY path variable has non-canonical case of letters
BugIDEA-187885Modules may disappear from 'Load/Unload Modules' dialog
BugIDEA-188647Renaming a module breaks stored renaming scheme
BugIDEA-194717Excluded roots are lost after refreshing a repository library
BugIDEA-189444Default run/debug configurations are not saved
BugIDEA-187313New Project Wizard unexpectedly replaces path by '~'
BugIDEA-188581Project Structure: SDK: two JDKs in Add new SDK list
BugIDEA-192913Stop updating misc.xml with test statistics
UsabilityIDEA-192234Quickfixes offer to add annotation and junit jars from IDEA installation directory to project configuration
UsabilityIDEA-190951Reload all repository libraries when list of repositories changes
UsabilityIDEA-189675Remove misleading 'channel' option from 'Required plugin' settings
UsabilityIDEA-189733Properly check version range for bundled plugins in 'Required Plugins'
CosmeticsIDEA-188607Fix warning icon for "Module managed by Gradle" notification
ExceptionIDEA-187726Constant exceptions after opening Idea/ultimate#master with IJ 2017.3.5
ExceptionIDEA-190250Assertion failed: Write access is allowed inside write-action only - at IdeaProjectModelModifier.changeLanguageLevel
ExceptionIDEA-190988Cancelling creation of a library in Project Structure dialog fails with exception
Quick DocumentationBugIDEA-191421{@literal foo} in Javadocs doesn't display correctly in CTRL-Q popup - braces display
BugIDEA-188232Invoking Browse external documentation does not affect productivity guide statistics
CosmeticsIDEA-188396Quick Doc: caret is not hidden when switching from Doc tool window back to Doc pop-up window
RefactoringBugIDEA-187647Rename module does not rename directory
BugIDEA-189391Wrap return value doesn't work with Optional
BugIDEA-185936Rename File action shouldn't be available while indexing is in progress
BugIDEA-191733Copy file dialog: selection with mouse does not select words
UsabilityIDEA-190300Duplicate menu hot keys for Refactor|Make Static and Refactor|Wrap Method return value
RegExpBugIDEA-191355SingleCharAlternationInspection quick fix produces inconsistent PSI
BugIDEA-186023Regexp: "Single character alternation" quickfix yields invalid code
Run | Debug configurationBugIDEA-187390Allow using classpath instead of module path when running applications on JDK9
UsabilityIDEA-181847RunDashboard: auto-scroll to the running item in case of many items in the view
UsabilityIDEA-169476Run configurations are too easily deleted
Settings RepositoryBugIDEA-193023completion.factors.user.xml should not be synchronized by Settings Repository
UsabilityIDEA-149733Settings are not synced when using only read-only sources
Structural Search and ReplaceFeatureIDEA-191915finding switch statements: allow counted branches
BugIDEA-188144 javascript method with optional qualifier pattern returns less results than expected
BugIDEA-189195Not possible to find labeled statements
BugIDEA-187437ActionScript annotation matching incorrectly matches attributes
BugIDEA-176024Adding an annotation with structural replace breaks a nested class reference in annotation parameters
BugIDEA-187792Structural Search Inspection problem: Groovy Script execution error: java.lang.Throwable
BugIDEA-187725Bad Groovy script can cause exception
BugIDEA-191673Find within hierarchy does not handle negation correctly
BugIDEA-190128SSR Structural Replace to achieve Java 7 diamond syntax produces illegal Java
BugIDEA-191669can't find anonymous class within hierarchy
BugIDEA-188376SSR: 1 dimensional array is found when using 2 dimensional array expression syntax
BugIDEA-189344Structural search doesn't match statement variable in lambda
BugIDEA-129336Structural search pattern not found because of comment
BugIDEA-187291Replacing an XML tag set as target does not work correctly
BugIDEA-146380Structural replace fails
BugIDEA-191858Problems with finding try-catch statements
BugIDEA-187436Malformed pattern warning expected on incorrect use of variables
BugIDEA-192548Structural replace replaces arrays with plain values in method signature and class fields
BugIDEA-189852html pattern finds nothing
BugIDEA-190055Can't find XML/HTML tags without a specific attribute value
BugIDEA-189473improve java 9 var matching
BugIDEA-191831Wildcard pattern with a variable finds nothing
BugIDEA-189196Labeled break and continue statements can't be found with a variable
BugIDEA-189220Can't find annotations with counted number of parameters
BugIDEA-187663JavaScript replace replaces only first statement of multiple statement result
BugIDEA-190519replace structurally creates wrong code, when using static import
UsabilityIDEA-187826Find Structurally: remove Unlimited checkbox
UsabilityIDEA-189236Open variable settings directly from search/replacement template in Structural search
UsabilityIDEA-189234Misleading "available variable" if var is optional in structural search groovy code snippets
TaskIDEA-193238File type combo-box for the new design of the Structural Search dialog
ExceptionIDEA-141767NPE at at com.intellij.structuralsearch.plugin.replace.ui.ReplaceUsageViewContext.replaceOne(ReplaceUsageViewC
ExceptionIDEA-191889SSR: java.lang.ClassCastException when open 'Search template' dialog in 'Edit variables'
ExceptionIDEA-193171Existing pattern "all methods of the class (within hierarchy)" fails
Task ManagementBugIDEA-193736Task intgaration with GitLab does not work - 410: Gone error
BugIDEA-190752Adding YouTrack server should configure https URL by default
BugIDEA-187507Cannot save Trello integration settings in 2018.1
BugIDEA-188611[remove context] option not present / not possible while CLion is still indexing
TerminalBugIDEA-118871Integrated terminal doesn't scroll to bottom on "movement-keys"
BugIDEA-184513Terminal prompt displaying incorrectly
BugIDEA-194928Terminal console: a few first long lines are not properly carried over to next line
BugIDEA-173259fish plugin functions do not work on macOS in built-in terminal
BugIDEA-184778Terminal - Console - wrong format - wrap new line after 2017.3.1 update
BugIDEA-191852Show typed user input in terminal console
BugIDEA-185523Fish Terminal displays ⏎ (U+23CE) after every input
UsabilityIDEA-186170Enter key in terminal doesn't scroll down
CosmeticsIDEA-126617Resizing terminal moves caret
ExceptionIDEA-187084StringIndexOutOfBoundsException while executing some action with long output in the Terminal
UMLBugIDEA-187287SVG UML Diagram Export results on zero length file
Unit Testing. TestNGBugIDEA-193024Execution hangs when Testng testsuiterunner throws runtime exception in onStart/onExecutionStart
BugIDEA-193485"Jump to source" action broken for failed tests
User InterfaceFeatureIDEA-163208Add support for MacBook Touch Bar (Magic Toolbar)
FeatureIDEA-189689Move HelpTooltip settings to resources
BugIDEA-183148Cannot export colour scheme as plugin from PhpStorm
BugIDEA-190257Layout changes for no reason when typing in the Description field for a newly created LiveTemplate
BugIDEA-191300Hyperlink stays underlined when mouse leaves its area
BugIDEA-178351"Restore Default Layout" do not work with 2017.2.3 having "Run Dashboard" open
BugIDEA-194795Exception appears when try to open file chooser from Welcome screen
BugIDEA-193536scaling a composite icon modifies the base icons
BugIDEA-190258Context selection popup is unusable in LiveTemplate editor
BugIDEA-188167Remove light line between vertical tool windows
BugIDEA-193028"Refactor this..." is not displayed in Touch Bar
BugIDEA-192318Progress bar in "Getting Started" dialog do not scale correctly in HiDPI
BugIDEA-194131Missing 'Expand All/Collapse All' icons in TODO tool window
BugIDEA-154988No default icon suggested on adding buttons to main toolbar
BugIDEA-192303"Darcula" colors are not replaced with "Light" ones on switching LaF back and forth on Windows
BugIDEA-193875Synchronise '' context menu item
BugIDEA-192055Focus goes nowhere after breakpoint popup
BugIDEA-188740LightweightHint.pack() doesn't have any effect when hint uses AWT tooltip internally
BugIDEA-193493"Tip of the day" pixelated but correct size with 125% DPI scaling
BugIDEA-193316Font setting for IDE appearance is ignored
BugIDEA-116955Text in the "Evaluation Feedback" window is editable
BugIDEA-193867Clicking bottom-most 'more' link in new Search Everywhere popup throws IndexOutOfBoundsException
BugIDEA-194924TouchBar support: touch bar is not appeared after first IDE launch
BugIDEA-97714Add "Associate With File Type" to the editor tab context menu and menu
BugIDEA-192720Selection in Local changes resets when context menu invoked via keyboard
BugIDEA-190948Dropdown button for elements content in Artifacts panel is not very good looking
BugIDEA-151301Navigation over highlighted search matches in "Override/impl method" dialog only works for method names
BugIDEA-193115TouchBar: dropdown values are not selectable
BugIDEA-185834Scope tabs of the Project toolwindow: focus is lost on item deleting
BugIDEA-187834Replace translucent text rendering in tab pane with opaque one using premultiplied alpha and srcOver rules
BugIDEA-188687switch on SVG icons by default
BugIDEA-192157When configuring touch bar, I would like to be able to see changes instantly.
BugIDEA-194712Messages tool window header is missing "Collapse/expand all" icons
BugIDEA-194716Fatal error reporting with optional files not working correctly
BugIDEA-191613Structure tool window steals focus (regression)
BugIDEA-184963"Diff Viewer" switch via popup breaks focus
BugIDEA-194010New SE: some toggles do not change their state while action performed
BugIDEA-182408Provide ability to cache icons in platform-api
BugIDEA-191812Buttons in license agreement popup overlap each other
BugIDEA-191318Icons are not scaled correctly in presentation mode
BugIDEA-189464Poor presentation of incompatible plugins when using the search bar
BugIDEA-193383New SE: please remember last action I typed
BugIDEA-191708VersionControl: visual garbage on the very first opening of VersionControl toolwindow
BugIDEA-191122"Captured Snapshot" notification's "Show in Explorer" link does not work when IDEA is installed on alternate drive letter
BugIDEA-187932Invoking some features does not affect productivity guide statistics
BugIDEA-193398New SE: multi selection is not supported
BugIDEA-192119Some SVG icons are rendered incorrectly in IDE
BugIDEA-192029Touch bar blinks when scrolling the file
BugIDEA-192976MacBook Touch Bar: show debugger actions when run configuration is shown in Run Dashboard
BugIDEA-193169badly rendered SVG icons in Customize dialog
BugIDEA-190646Tool Window tabs revision
BugIDEA-133900Can't type @ in Find/Replace dialog
BugIDEA-186615Tool windows: resizing cursor appears on top of 'Hidden tabs' arrow
BugIDEA-192353Table (list) selected items are shifted to the right
BugIDEA-187873UI glitch in editable combobox with wide popup
PerformanceIDEA-191867Disposed project leaked via Changes View content tab label
PerformanceIDEA-192424Editors are leaked forever after opening, via EditorTabbedContainer.CloseTab shortcut
UsabilityIDEA-190251Unhelpful and misleading wording in update checker under Toolbox
UsabilityIDEA-165231Input fields should be inactive when exception comes from 3rd-party plugin
UsabilityIDEA-192075IDE Fatal Errors dialog - cannot copy/analyze stacktrace
UsabilityIDEA-125158Do not show versions of bundled plugins
UsabilityIDEA-190216Hard to resize quick doc popup
UsabilityIDEA-192180No speed search: Edit Severities
UsabilityIDEA-191361Exception dialog is too tall
UsabilityIDEA-193841New "Search classes" does not show outer class for inner classes
UsabilityIDEA-192403Touchbar support for Select in > Project view
UsabilityIDEA-187091'Mark Directory as | Unmark root' option name is confusing
UsabilityIDEA-186774Change UI texts for Editor Tabs Settings
UsabilityIDEA-190363Improve UI of 'Third Party Software' list
UsabilityIDEA-110169New Action dialog loses all information when there is an error after pressing "OK"
UsabilityIDEA-187133Redesign remote configuration
UsabilityIDEA-185564Match Refactor | Extract | Method ... with "refactor method" in Find action
CosmeticsIDEA-169819"New Window" button in open project dialog has extra space
CosmeticsIDEA-193276Strange gray rectangle instead of disabled value when moving Class
CosmeticsIDEA-190919Increase height for popup headers with buttons
CosmeticsIDEA-191985Speed search is truncated
CosmeticsIDEA-191579table view folded/unfolded toolbar inconsistency
TaskIDEA-190225Replace Run Configuration combobox with button if no configuration created
TaskIDEA-191080Refactor components to clarify insets meaning
TaskIDEA-190218Rename "Default settings" and "Default project structure"
TaskIDEA-189867Switch Search Everywhere toolbar icon to ActionButton
TaskIDEA-192417Provide an API for adding status bar widgets
TaskIDEA-192178Enable IntelliJ laf on Mac
ExceptionIDEA-193393TouchBar: exception is thrown after cancelling Project Structure window
ExceptionIDEA-193575New SE: ClassCastException on selecting filter criteria
ExceptionIDEA-186452StackOverflowError on setting Floating mode for console
User Interface. AccessibilityBugIDEA-193617Accessibility issue with ComboBox and the Win10 LAF
User Interface. ControlsBugIDEA-193777Cannot switch on 'Show function keys on touchbar' feature
User Interface. Look and FeelBugIDEA-191398NullPointerException when switching theme to GTK+
CosmeticsIDEA-186708Standard panel height difference between Darcula and IntelliJ themes causes buttons misalignment in DialogWrapper
CosmeticsIDEA-191671Mac menu icons don't handle Darcula well
User Interface. Project ViewBugIDEA-195578New files do not show on package view
BugIDEA-189742Items in Project View remain highlighted as incorrect after deleting the class with uncompilable code
BugIDEA-191952Scopes view: flatten packages doesn't work
BugIDEA-192028Directories with dots in the name show up incorrectly in Project pane
BugIDEA-192364Problems with opening multiple files when Scoped view is selected
BugIDEA-188727"Select in Project View" should select file in active scope (and not switch to "Project" tab)
UsabilityIDEA-182143Edit Scopes option only appears in Project tool window's menu when a custom scope is selected
UsabilityIDEA-25714Empty folders are invisible in scope tree view
CosmeticsIDEA-168362Inconsistent labels in Project Tree View
Version ControlFeatureIDEA-193537Update "Commit Message History" action UI
FeatureIDEA-66051Local Changes: need a special subtree/group only for unmerged conflicts.
FeatureIDEA-120755Local changelists: apply background scope colors for files as in other views
FeatureIDEA-193058Update commit legend UI
BugIDEA-115100Maven project import sets Subversion VCS for submodules, if there is a folder or file called .svn in parent folders
BugIDEA-191782No tooltip for new button containing "ignore" actions in Changes view
BugIDEA-192793SelectChangesGroupingActionGroup doesn't work via Quick Actions Popup
BugIDEA-148366File history: file history is not shown on two simultaneous requests
BugIDEA-190311Commit directory action is not searchable
BugIDEA-192474Annotate fail in error
BugIDEA-186651Move to another changelist shortcut in Diff moves the entire file
BugIDEA-189350Undo sometimes doesn't work if 'partial Git commits' feature is enabled
BugIDEA-192877Git: CheckOut Tag Or Revision: on the first invocation some tags are not available in completion
BugIDEA-192203keymap "Xcode" not found warnings on startup from Git4Idea & hg4idea
BugIDEA-186758LocalChanges view: when focus in in the Diff Preview, click in the changes tree doesn't change selection
BugIDEA-192400"Move to Another Changelist..." creates new changelist instead of using existing one
BugIDEA-192552CloneDvcsDialog#prependToHistory: Cannot use this method with a non-Mutable data model
BugIDEA-189699Wrong unshelving: XML file is restored to not original state (duplicating lines)
BugIDEA-168338Apply patch choses wrong module for new files if there is similar path in other module
BugIDEA-193195Compare Before with Local should support file move
PerformanceIDEA-174636Unregistered VCS root scanning, which happens in the Settings | Version Control, should be moved out of the EDT
PerformanceIDEA-131357Idea stucks after "accept mine" for 100 files in merge dialog
UsabilityIDEA-192073Missing 'Expand All/Collapse All' icons in VCS Local changes
UsabilityIDEA-193296Assign default shortcut for the "Set Active Changelist" action
UsabilityIDEA-187114Regression: there is no shortcut to group changed files by directory in 'Local Changes' view anymore
UsabilityIDEA-187405Copy to clipboard can copy the currently visible in-place diff instead of the just selected text in editor
UsabilityIDEA-189421Undoing typing sometimes works in two steps if 'partial Git commits' are enabled
TaskIDEA-191693Update patch icon
TaskIDEA-191668Replace "Move to another changelist" icon with combobox in Commit > Diff dialog
Version Control. GitFeatureIDEA-192678Multiple Github accounts: show login dialog if attempt to perform the remote operation fails
FeatureIDEA-75835Init Git projects submodules automatically or by asking user at least?
FeatureIDEA-147018Delete git tag
FeatureIDEA-74492Git: Checkout tag or revision: provide a list of available tags in combobox
FeatureIDEA-192369Allow configuring Local changes toolbar in "Appearance & Behavior | Menus and Toolbars"
BugIDEA-191309Commit failed with error
BugIDEA-192906Git Push with Rebase puts all changes into the Default changelist
BugIDEA-193688Squash message editor starts with an extra line break
BugIDEA-194449New Git root is not detected until restart, if added externally as a submodule or under a new subdirectory
BugIDEA-190132GitCheckinEnvironment#reset needs to split request into multiple commands.
BugIDEA-192800Allow force push is available in Find action but does nothing
BugIDEA-193788Git: Submodules: attempt to merge conflicts fails
BugIDEA-193259Git: Browse Repository At Revision: on new revision tab opening move focus there
BugIDEA-186342Cherry-pick with auto-commit uses full hash in the suffix, while cherry-pick showing the dialog uses short hash
BugIDEA-193260Git: Browse Repository At Revision: JumpToSource action for folders is enabled but doesn't work
BugIDEA-193934Git clone --recurse-submodules checkouts submodules in detached state which breaks Update project
BugIDEA-191992Files Merged with conflicts shows only one branch name
BugIDEA-192531Clone from github: incorrect behavior in case of github accounts configured but w/o saved credentials
BugIDEA-140196Built-in SSH: does not support strong security ciphers - Cannot negotiate, proposals do not match
BugIDEA-195270Missing notification about invalid Git roots
BugIDEA-193134Multiple Github accounts: clone doesn't suggest github repositories if you are not logged in to all accounts
BugIDEA-193141Git: on saving file after Reword Commit performing i often get the File Caches Conflict dialog
BugIDEA-193140Can't undo rewording of a commit made before a merge commit and get an exception
BugIDEA-108316Unregistered Git roots are not auto-detected if they are more than 2 folder levels deep than any project module
BugIDEA-180112IDEA stores passwords in memory even when "Remember" is unchecked
BugIDEA-194991Annotation tooltip is huge and empty
PerformanceIDEA-193442Git Cherry-Pick became slower because of long process of searching for containing branches
UsabilityIDEA-192333Automatically register Git submodules as VCS roots
UsabilityIDEA-56183Optionally Do not show "Push" dialog after pressing "Commit and Push"
UsabilityIDEA-144072Sort order of branch names in git branches drop-down lists is not alpha-numerical (Rebase, Branch Widget etc)
UsabilityIDEA-144948Branch list in Git Rebase dialog should include remote branches
UsabilityIDEA-124453Update Project should not fail completely when some module can't be updated (have no remotes, doesn't have a tracked branch, is in detached state, etc)
UsabilityIDEA-192982Multiple Github Accounts: if default account is selected and you are logged in, use this account for sharing and skip not authenticated ones
UsabilityIDEA-136155Git Resolve conflicts: use more specific text for 'theirs' and 'yours' labels
UsabilityIDEA-153448Shortсut to change action in "Rebasing Commits" window
UsabilityIDEA-180118Interactive Rebase: Clicking Cancel in the dialog to enter a message for Squashed commits should cancel rebase.
UsabilityIDEA-163630"Cherry-picked from" suffix should be optional
CosmeticsIDEA-168642Git remote editor doesn't resize properly
CosmeticsIDEA-192092Rephrase a notification that appears when users switch branches
CosmeticsIDEA-192384History for Selection shouldn't be visible in the context menu of Project Files
ExceptionIDEA-193107IllegalArgumentException trying to open Branches menu in the detached HEAD state
ExceptionIDEA-194024AssertionError at git4idea.rebase.GitRebaseLineListener.onLineAvailable
ExceptionIDEA-192978kotlin.UninitializedPropertyAccessException at org.jetbrains.plugins.github.GithubShareAction$Companion$shareProjectOnGithub$1.onSuccess
Version Control. LogFeatureIDEA-116053Ability to open filtered results in Changes/Log view a new tab
FeatureIDEA-190615Explore the source code based on specific revision
UsabilityIDEA-160834Log: do not display 2 progresses when filtering
TaskIDEA-191611Update toolbar in VCS Log
ExceptionIDEA-191967Throwable at com.intellij.vcs.log.impl.VcsLogTabsWatcher.closeLogTabs
Version Control. PerforceBugIDEA-183743Use file revision encoding when comparing file contents
BugIDEA-193396Perforce: 2 default changelists are displayed by default, and the one not marked as default can't contain any changes
PerformanceIDEA-192097Too many threads spawned by reading Perforce command outputs from refreshing File History
Version Control. SubversionBugIDEA-140811IDE Hangs when importing large maven project.
BugIDEA-191518Subversion "Update Project" dialog - error on selecting revision if url contains special symbols
BugIDEA-191800Urls of switched files are shown encoded in "Local Changes"
BugIDEA-192371NPE on importing project with directory mappings set to "Subversion", but without real svn working copy
BugIDEA-191927"Repository" tab - Aggregating commits from several working copies is slow
XMLBugIDEA-194328Bundled XMLSchema-instance.xsd refers to nill- instead of nil-attribute
PerformanceIDEA-189915Checking DOM applicability loads AST for files under .idea
i18nBugIDEA-189804IDEA hangs after NullPointerException
BugIDEA-190909Autopopup code completion is not working for message bundles
No subsystemBugDBE-6451DataGrip: Execution of SQL command does not ask for colon-parameter values if not whole SQL command is selected
BugDBE-6559New Data Source dialog does not save the status of driver downloads if dialog is closed with Cancel
DB ConnectivityBugDBE-1673Data Sources and Drivers Settings are applied to connection only after reconnect to DB
BugDBE-6435Datasource postgres configuration problem : ClassNotFoundException: org.postgresql.Driver
UsabilityDBE-6321Postgres: if database in connection parameters differs from the database selected in Schemas tab IDE may fail to connect
UsabilityDBE-6655Custom JDBC driver configuration workflow
DB IntrospectionBugDBE-6553NPE when sync DB structure on already droped tables
BugDBE-6362Redshift view with no schema binding - unable to inspect columns
BugDBE-6409MariaDB schema discovery fails with: Unknown column 'purchase_date' in 'field list'
DB RefactoringUsabilityDBE-6235Can't create a table during indexing
Data ViewsFeatureDBE-4100Feature Request: Show column comments in tooltips
FeatureDBE-4150Show # of selected rows in IDE
BugDBE-6292Manual Transaction re-executes command after transaction rollback
BugDBE-5204Database Table DDL does not open in active window group
BugDBE-4868sorting does not work if the filter contains a comment
BugDBE-6436Filter correction does not bring back matching column list
BugDBE-1858Fiter in database table view does not apply to query result after cleared
IDE GeneralFeatureDBE-2614Add support for opening SQLite files from command line
BugDBE-6005Clicking issue does not work in update GUI
BugDBE-5576DataGrip .desktop entry description is not descriptive
BugDBE-6544Fail to generate pojos.groovy on view in database
UsabilityDBE-6405Query plan fails for sub-queries in sqlite
PL & DDL EditingBugDBE-6254Database toolwindow: ModifyTable action should not be available for read-only datasources
SQL Code StyleFeatureDBE-4923First word right-aligned code style
BugDBE-2799SQL formatting: case - when - then else alignment
BugDBE-6681Formatter unwraps MySQL-style line comments
SQL EditingFeatureDBE-2647Custom Parameter %VAR% not working when wrapped in single quotes.
SQL GenerationBugDBE-6473"Request and copy original DDL" action fails
SQL HighlightingFeatureDBE-521Psi aware brace highlighter
BugDBE-5919DataGrip: Color coding when calling a user defined procedure with SQL Server global variables does not work
SQL ResolveBugDBE-6676Quoted Identifiers are case insensitive SQL Server
User InterfaceFeatureDBE-5052In datasources list show only db vendors
UsabilityDBE-6679Provide an easy way to create custom Data Source
UsabilityDBE-6527Cannot create datasource with MSSQL jdbc driver
CosmeticsDBE-1851Clearer connection status indication
No subsystemFeatureWEB-33712ES6: autoimports for ts declarations inside node_modules
FeatureWEB-33641Angular2: allow injecting languages other than CSS in `styles:[]`
FeatureWEB-28371Make links in package.json clickable
FeatureWEB-33236Add ng add integration
BugWEB-32040Missing support for JSON in Prettier
BugWEB-31963Emmet BEM filter doesn't work in JSX
BugWEB-32120Copy and Paste and Syntax Highlight stops working
BugWEB-32053editorconfig plugin is not working properly
BugWEB-16795Git conflicts suggest switching to the JSX Harmony project type
BugWEB-31461prettier: should use builtin config cache
BugWEB-33569Suggest newer version for 'ng-add' dependencies if older one doesn't support 'ng-add'
BugWEB-9333Copyright Formatting Not Working For HTML5 DOCTYPE
BugWEB-33287Nested indices access in JsTestSourcesFilter may cause deadlock
BugWEB-33217DartAnalysisServerService trying to read files on disposed project
BugWEB-33570Do not log issues with bad schematics in New|Angular Schematics... dialog
BugWEB-33007Folder is automatically being excluded, cannot be undone
BugWEB-33002'Change signature to match and update call' removes 'new'
BugWEB-33364Angular template reference wrong typing
BugWEB-32769Webpack config rejects automaticNameDelimiter optimization setting
BugWEB-31307'Reformat with prettier' action is disabled on first opening of project
BugWEB-29946Vue+pug: selector usages in Pug template not found
CosmeticsWEB-32801Webpack option schema has a wrong link in the inspection description
CosmeticsWEB-32211Rename 'twitter bootstrap' project template
TaskWEB-32175JS live template: rename "JavaScript" context to "JavaScript and TypeScript"
CSSFeatureWEB-32228Support of CSS property "font-display"
FeatureWEB-25011Colors and Fonts/CSS should have it's own field for class and attribute identifiers
FeatureWEB-24774Support inline comments in PostCSS
FeatureWEB-32672WebStorm doesn't recognize backdrop-filter
FeatureWEB-7317Provide option to complete styles from all CSS files even if current file has a style tag
FeatureWEB-32000Support repeating-conic-gradient CSS function
BugWEB-20810 Css Custom Properties will be in error if you are in both the transform and calc
BugWEB-31567'<?php' symbols in CSS class completion
BugWEB-22895PostCSS: Colors & Fonts: arithmetic symbols are not colored
BugWEB-22894PostCSS: Colors & Fonts: Tag name is not colored
BugWEB-32646Css: "Insert semicolon" produces incorrect PSI
BugWEB-22893PostCSS: Colors & Fonts: unknown-at-rule cannot be colored
BugWEB-32100CSS autocomplete works unpredictably
BugWEB-28165Wrong CSS syntax check for @apply rule
BugWEB-26368CSS '/deep/' combinator causes 'unexpected token' error if it's the first item in selector list
BugWEB-26828reformating CSS with :host >>> subselect ends up with :host > > > subselect
BugWEB-24619BUG: PostCSS code completion doesn't work right before an &-sign (Ampersand).
BugWEB-24628CSS: string literal with backslash as property value is not parsed correctly
BugWEB-33182Intellij complains about valid css
ExceptionWEB-22810"PSI and index do not match" exception while editing CSS
CoffeeScriptBugWEB-32594Spread Operator in CoffeeScript gives error
BugWEB-32778CoffeeScript "code reformat" change semantics of the string tag
BugWEB-32195CoffeeScript string tag error
BugWEB-31455CoffeeScript the "from" operator is not highlighted in orange
BugWEB-32194CoffeeScript parse error
BugWEB-32793Class as prop value error: unexpected indentation
BugWEB-32452Do not add keywords completion in import statement
BugWEB-33782CoffeeScript: prohibit use of JavaScript Postfix Templates
BugWEB-24288Coffeescript - regex with whitespace considered bad code
DartFeatureWEB-33112Be able to run test of dart 2 code in intellij
FeatureWEB-32254Nest Dart compiled output under *.dart file
FeatureWEB-31130Support Dart Override Completions
FeatureWEB-32909Provide code completion when editing Dart breakpoint condition and in Evaluate Expression dialog
BugWEB-32559Bad Dart formatting (token per line) if syntax error in argument list
BugWEB-32434Dart Analyzer Diagnostics action should be disabled in non-Dart projects
BugWEB-31486Dart code completion list is incorrectly sorted
BugWEB-27128When no selection for Extract Method, IDE sets it to the full line
BugWEB-33051Dart formatter swallows white space on line merge
BugWEB-33011Unfortunate Dart formatting of syntactically valid code
BugWEB-32955Dart tab-autocompletion deletes code
BugWEB-33251Unable to run unit tests from folder with space in path
BugWEB-32974Incorrect 'Pin Tab' icon in Dart 'Get Dependencies' console.
UsabilityWEB-31845the Dart plugin doesn't have content in its changelog
UsabilityWEB-27015need a custom icon for the pub serve tool window icon
TaskWEB-32172In Dart 2 world 'webdev build' should be used instead of 'pub build'
TaskWEB-32296'enable asserts' flag for Dart Command Line App configuration in case of Dart 2
TaskWEB-32571Remove 'Dartium path' field from the Dart Settings page and from the New Dart Project wizard
DebuggerFeatureWEB-14403Drop to frame / Restart frame not available in JavaScript debugger
FeatureWEB-23258Configurable remote mappings for "Attach to Node.js/Chrome" run configuration
FeatureWEB-33127JS Coverage: Show correct coverage for css
FeatureWEB-25793It's not possible to get value of async function in "Evaluate Expression" dialog
FeatureWEB-31991Implement "Run with coverage" for JS Debug configuration
FeatureWEB-15261Unable to put breakpoints inside JavaScript scratch files
FeatureWEB-32096Show coverage on source files when source maps are used
FeatureWEB-25672Allow Node.js/Chromium remote debugger to reconnect automatically
BugWEB-33170Breakpoints not matched properly
BugWEB-32550Wrong line is hit when debugging Jest tests
BugWEB-32389Assertion failed: Debug tool window not initialized yet!
BugWEB-33328Node.js remote debugger ignores breakpoints in .ts file inside Docker container
BugWEB-32841Node.js/Chrome remote: 'Another debugger is attached...' warning is wrongly shown
BugWEB-33151NPE when hovering over field declaration during debug session
BugWEB-32921Turn off breakpoints when run js with coverage
BugWEB-32132Rerun not works with JS coverage.
BugWEB-30501karma debugging: breakpoints not hit when re-running the debugger
BugWEB-33132JS Coverage: create-react-app, App.js is not added in coverage result
BugWEB-33528Out of memory when debugging React Native application
BugWEB-32851Debugging Karma tests with karma-browserify not working sometimes
BugWEB-32714Debugger steps into node_modules even if "Do not step into library scripts" is enabled
BugWEB-32908Can't resolve breakpoints in webpack 3.X project
BugWEB-32155Debug different chromium browsers
BugWEB-33044Debugger stops on muted breakpoints in React native app
BugWEB-33604Infinite 'Loading value' when calculating a variable
BugWEB-33288Incorrect coverage report for @angular/cli 1.7.4
BugWEB-33397No CSS coverage for 'Web Starter Kit' project
BugWEB-33398CSS Coverage is shown for the generated .css, not for the apprepriate .sass file
BugWEB-32636Debugger: the number of properties that can be inspected is limited to ~ 100
BugWEB-33095Breakpoint is not hit in multi-module node projects bundled with webpack
BugWEB-30584Source mapped breakpoints have unexpected behavior in async code
BugWEB-33033IntelliJ 2018.1.3 does not show frames when debugging webpack
BugWEB-33020IndexOutOfBoundsException when stop JS 'Run with coverage'
BugWEB-33119Wrong file path in Console when debugging a Vue app
BugWEB-33128JS Coverage: Rename in Coverage toolwindow
BugWEB-33419Debugger tooltip shows value for the variable one line above
PerformanceWEB-31775Debugger: false stops in same-named files cause delays when debugging
UsabilityWEB-32842Improve notification in case of wrong settings in 'Node.js/Chrome remote' RC
UsabilityWEB-32810Add to watch is not always possible in JavaScript
UsabilityWEB-32843Node.js global.console has duplicate logs in Console tab when Debugger Console tab is hidden, when debugging
CosmeticsWEB-33294Attach to Node.js configuration: add separator
TaskWEB-33027JS Coverage: hide the Debugger and Elements tabs in tool window, add notification
TaskWEB-7998If breakpoints muted, don't stop on debugger keyword
ExceptionWEB-31501[[FunctionLocation]] not found when call 'Jump to source'
ExceptionWEB-33102Exception in IntelliJ IDEA on closing Internet Explorer
File WatchersFeatureWEB-33175Add File Watcher template for Prettier
FeatureWEB-12478Global File Watchers
FeatureWEB-33321Add File Watchers to Settings for Default Project
FeatureWEB-33319Add Insert Macro button for the Program path field in File Watchers
BugWEB-33191File Watcher with custom scope is triggered on all files if this custom scope is deleted
BugWEB-33661Export File Watchers action: preserve Path Variables
CosmeticsWEB-33683File watchers: column title doesn't fit on Linux
HTMLBugWEB-32073Surround with Emmet trims
BugWEB-32388XML/HTML attribute completion items disappear if you press Ctrl+Space once again
BugWEB-31136SVG attributes marked as not allowed in injected HTML fragment
BugWEB-31803Typo in HTML Code Style settings
BugWEB-33582Inspections - Unknown HTML Tag not working
JSONFeatureWEB-32131Support remote JSON schemas and auto-mapping via catalog
FeatureWEB-32433Smarter 'Enter' handling for JSON
FeatureWEB-33426Support path patterns for JSON mappings
FeatureWEB-31909Allow to suppress warning for NaN in json
FeatureWEB-32698JSON Schema selection menu should work for JSON fragment editor
FeatureWEB-32826JSON schema: Provide quick fixes for schema incompatibility errors
FeatureWEB-32238JSON Schema: dropdown to choose JSON schemas
FeatureWEB-31897Make JSON schema compliance inspection configurable
FeatureWEB-32538JSON Schema switcher: show locally stored schemas
FeatureWEB-12776Support the JSON5 file type
FeatureWEB-31882Action to copy JSON editor breadcrumbs as JSONPath / JSON Pointer
FeatureWEB-29953Support JSON schema v6
FeatureWEB-29954Support JSON schema v7
BugWEB-33179Exception while trying to add missing property to JSON file
BugWEB-32556JSON widget: mapping to the built-in schema shown as a schema error
BugWEB-32290JSON Schema autocompletion doesn't work
BugWEB-33099JSON Schema Mappings: conflicting mappings for newly added item
BugWEB-32237Kubernetes: Json. QuickHelp. Display: key name, type, kubernetes version
BugWEB-32852JSON schema switcher: correctly map built-in and local schemas when remote sources are not allowed
BugWEB-32853JSON schema: do not remove manually added schema on schemas reassign
BugWEB-33444JSON Schema mappings are stored with platform-dependent slashes
BugWEB-33845File type detection on EDT via JsonSchemaVfsListener
BugWEB-33494Incorrect handling of allOf+oneOf combination
BugWEB-32038JSON schema for multiple projects
BugWEB-32243JSON schema: JSON pointer refs with array items are ignored
BugWEB-32533JSON Schema switcher doesn't recognize .angular-cli.json
BugWEB-32539JSON Schema dialog: correctly write path to the local file from the dialog and the switcher
BugWEB-33014"File is not a schema" error in json widget when file was manually added with a mapping to schema
BugWEB-33235JSON schema: Don't suggest non-string variants inside string literals
BugWEB-33724Incorrect 'missing property' in case of 'anyOf' with required
BugWEB-31896JSON Schema validation not handling nested "oneOf" properly
BugWEB-31883"Copy Reference" for JSON items does not include arrays indices
BugWEB-31870Provide an option to allow trailing comma in JSON files
BugWEB-31653JSON Schema completion: incorrect handling of a string with only one quote
BugWEB-32514JSON: escape tilde and slash symbols on "Copy JSON Pointer to clipboard" action invocation
BugWEB-32244JSON schema: allOf merge is not recursive
BugWEB-31989Show array index in JSON breadcrumbs
BugWEB-33215JSON Schema Mappings: Empty file pattern and path should match nothing
BugWEB-32504Inspections: remove JSON-related options from the JSON5 inspection
BugWEB-32506JSON5: support negative hexadecimal numbers and character escapes
BugWEB-31196JSON schema: False negative "select file under project root"
BugWEB-32972JSON switcher: schema causes conflict instead of switching for a file in nested folder
BugWEB-20366JSON Schema should not validate itself
BugWEB-32960JSON Schema switcher: applying schema for the file for several times multiplies this file in Schema Mappings
BugWEB-33705Unintended autocomplete list pop-ups when typing B or P inside quotes in JSON strings
BugWEB-33306JSON Schema Mappings: required fields are not suggested inside 'oneOf' definition
PerformanceWEB-33189Add file-based index for "$schema" and "$id"/"id" properties in JSON
UsabilityWEB-33404Add an API to suppress JSON widget for particular files
UsabilityWEB-33178'Missing property' inspection in JSON should provide all missing property names at once
UsabilityWEB-32680JSON Schemas: add "x-intellij-html-description" property into v6 and v7 schema completion
UsabilityWEB-31908Json. Completion. Provide icons depending on key types for the completion list
UsabilityWEB-32878Not clear behavior when trying to use json schema outside of the project
UsabilityWEB-20445JSON Schema: errors from schema in Event log should not be red-colored
UsabilityWEB-33265JSON Schema widget is always visible when index is being updated
UsabilityWEB-20353JSON Schema: provide Edit action for created mapping
UsabilityWEB-33103 JSON Schema Mappings: no validation for empty path to file/pattern
CosmeticsWEB-32555JSON Schema switcher: correctly show "Add/Edit Schema Mapping..." actions depending on the context
CosmeticsWEB-33544Clean up empty items on saving JSON schema mappings
CosmeticsWEB-32404Improve configuration of JSON Schemas
CosmeticsWEB-32407JSON Schema Catalog Settings UI
TaskWEB-33207Limit JSON schema services only to supported files
TaskWEB-32716Add a checkbox to completely disable remote activity for JSON Schemas
ExceptionWEB-32551JSON: "java.lang.Throwable: HTTP response 301" exception while updating schema URL
ExceptionWEB-32532JSON Schema: exception is thrown while typing the value for the "$schema" property
ExceptionWEB-32199Exception in JSON file
JavaScriptFeatureWEB-18381Flow/TSX/React: provide possibility to navigate via namespaced React tags
FeatureWEB-31579Intention action to add/remove numeric separators
FeatureWEB-10122Add SQL auto injection for Javascript
FeatureWEB-32924Better default values for object literals, tuples, arrays and functions
FeatureWEB-30594jsDoc | Add support for optional properties in @typedef with @property
FeatureWEB-18032JSDoc: support name path including "unusual" characters (@event, @fires, @listens, module: etc.)
FeatureWEB-33050Support 'Jump outside closing bracket/quote with Tab' feature for Javascript/Typescript files
FeatureWEB-29350New Quick Fix: Generate 'cases' for enum and unions of literals
FeatureWEB-3564JSDoc: special symbols auto pairing
FeatureWEB-32919Support 'import.meta' metaproperty
FeatureWEB-31502Support for webpack 4 built-in plugin's schemas
FeatureWEB-22487Make ECMAScript 6 default JavaScript version
FeatureWEB-33343Copy path breadcrumbs to clipboard for JS/TS
FeatureWEB-31213Live templates should be language-version-dependent
FeatureWEB-31578'Introduce variable' intention action
FeatureWEB-33195'Iterate' intention action for JS/TS
BugWEB-33574JS: Changing language level doesn't trigger reindexing node modules
BugWEB-32427Renaming function parameter changes usages of same-named variable in inner scope
BugWEB-32421next/prev method ignores es6 object methods when {key: function} is present within a method
BugWEB-24383"Copy reference" from context menu on JS object broken in PhPStorm 2016.3
BugWEB-31938Bad error message for getter/method mismatch in plain JS
BugWEB-32977Undefined property assignment incorrectly triggering
BugWEB-32770Folded regions are unfolded on file reopening
BugWEB-33435Imported class member not resolved when using singleton pattern
BugWEB-24263Scratch files don't support ES6
BugWEB-31571'Implement missing members' should work for object literals with expected types in pure JS
BugWEB-33498Navigate/Declaration works wrong when using computed properties
BugWEB-21478Quick Fix: Implement missing members based on JSDoc interface definition
BugWEB-29083WebStorm can not infer any type in javascript files
BugWEB-32119Proper support for `@instance`
BugWEB-24606Intellisense taking the wrong JS file and not the one imported in require('./...) using NodeJS
BugWEB-32691 'Implement missing members' for object generates redundant comma
BugWEB-33611Javascript. Array type is not properly defined
BugWEB-33290Iterate intention: template should skip the last variable
BugWEB-32706Complete current statement should add semicolon in switch statement after 'default'
BugWEB-32692Exception on opening quick documentation for addEventListener
BugWEB-33280Can't finish template for switch/while by pressing Enter once
BugWEB-22342CommonJS: properties of object instance returned by exported module not resolved
BugWEB-30386TypeScript import added when pasting from clipboard into comment
BugWEB-33077Instance fields have inconsistent styling
BugWEB-33700JavaScript: 'Method expression is not of Function type' after exporting
BugWEB-33061WebStorm doesn't type 'this' properly when used in JSDoc
BugWEB-25333'Replace switch with if' removes block's body
BugWEB-32006assignment to es6 class properties are considered redefinement and marked as unused (possible 2018.1 regression)
BugWEB-32174Quick Documentation overlaps @example formatting
BugWEB-31400Type mismatch errors when mapping `{}` type to object instance
BugWEB-16665Syntax highlighting is wrong when sharing same file between projects with different JavaScript Language versions
BugWEB-32139Invalid 'Returned expression not assignable' when using Object.create
BugWEB-32140Better availability for 'Introduce variable' action
BugWEB-31695'Implement methods' quick fix generates prototype-based members for a class expression
BugWEB-31523Ordered lists <ol> are not supported in JSDoc comments
BugWEB-32971Do not show 'with' keyword on top of completion
BugWEB-32979@memberOf for instance members support only 1 way of declaration of 3
BugWEB-30291Flow Project errors does not show warnings if there are no errors
BugWEB-33591Reduce availability range of some intentions for class members
BugWEB-18469Methods can not be resolved to node_modules
BugWEB-33349Spread expression types in calls are always evaluated as 'any', that is incorrect
BugWEB-32966No completion for `async` keyword after `=` in function expression
BugWEB-26635Regression: Javascript/node references no longer resolved across `require`
BugWEB-32935Install and add to dependencies should respect project package manager
BugWEB-33129Add keyword completion for '' and 'import.meta'
BugWEB-31824Namespaced Classes Constructor Parameter Hinting
BugWEB-26870Complete members of exported class instance
BugWEB-31312Default word in object is bold
BugWEB-32953No support for Node.js Async Hooks module
BugWEB-32208React Stateless Functional Component autocomplete doesn't work with Flow prop types
PerformanceWEB-32469Slow initial indexing and completion in projects with Cypress
UsabilityWEB-33552Autocomplete for properties doesn't show string-named items when typing a capital letter
CosmeticsWEB-33186Wrong before preview for "switch" postfix action
CosmeticsWEB-33635Issues with brace highlighting
CosmeticsWEB-31831Settings: JS/TS: Code generation: align fields on the page
CosmeticsWEB-32663Remove "Implement methods" for objects without contextual type
CosmeticsWEB-31826Method separators aren't shown for arrow functions
TaskWEB-32285JavaScript editable postfix templates
ExceptionWEB-32656IllegalArgumentException when insert text in .js file
ExceptionWEB-32917Mac. exception in JSUnusedGlobalSymbolsInspection
ExceptionWEB-32718StringIndexOutOfBoundsException is thrown on indexing
JavaScript. FormatterFeatureWEB-16696Wrong indent size in multi-line string definition in WebStorm
FeatureWEB-10038Bad JS code format after using completion
BugWEB-31019ES6 Bind operator (::) improperly indents.
BugWEB-30818'Chop down if long' does not work in binary expression in if condition
BugWEB-31928Formatting of "await" in TypeScript broken
BugWEB-12193JSDoc comments with code samples not indented properly
BugWEB-29105JSX in vue uses HTML indentation settings
BugWEB-32659JS formatting: 'Method call arguments -> Align when multiline' does not work if argument is binary expression
BugWEB-31326Code Style: No space at right side of arrow if Arrow function is checked and Function left brace is unchecked
TaskWEB-33431Formatting for conditional types, named and default generics, variadic tuples
JavaScript. FrameworksFeatureWEB-31654Can't autoimport React HOCs
FeatureWEB-30502Add React Live Templates
FeatureWEB-32648Angular6. Add support for angular-cli setting "stylePreprocessorOptions" > "includePaths"
FeatureWEB-20913Intention: Switch between React class and pure function syntax
FeatureWEB-28376Add support for angular-cli setting "stylePreprocessorOptions" > "includePaths"
FeatureWEB-30656HTML tag tree highlighting does not work inside JSX render return statements
FeatureWEB-33381Show type of React props in completion popup
FeatureWEB-33244React: Complex prop-types (oneOf, shape, arrayOfType) should be supported
FeatureWEB-30481Code completion for Vue events and event modifiers
FeatureWEB-29682Angular CLI 1.5 generators don't have command line arguments info
FeatureWEB-33304Remove "introduce local variable" intention for angular methods/data
BugWEB-33573Do not show ng add/install things if @angular/cli is not installed
BugWEB-33575Can't create react-native project
BugWEB-32583Vue project generation fails with @vue/cli 3.0.0-beta.9 and later
BugWEB-32507wrong type mismatch error when using template reference variable for <textarea> (due to uppercase-misspelling)
BugWEB-32949Exception when renaming methods/data in .vue files
BugWEB-29520 Ignore React JS Lifecycle components/properties using ES6 syntax
BugWEB-26939WebStorm doesn't understand bound variables in Angular structural directives
BugWEB-30682Angular. ngIf then/else block shows the error (statement expected)
BugWEB-33526React Class Component template should be 'Component' instead of 'PureComponent'
BugWEB-32323IDE doesn't recognize local variables prior to *ngFor
BugWEB-33599Do not list already installed packages in New|Angular Dependency... dialog
BugWEB-33121Do not suggest running npm install when creating a new Vue project
BugWEB-32268Simultaneous editing of JSX tags is broken on auto-importing component
BugWEB-31439Create a method from angular template with params generates red code
BugWEB-33605Load karma and protractor config paths from angular.json
BugWEB-32642Angular 6. Make output colored again
BugWEB-33114Completion of function inserts parens when completing in JSX with expected function type
BugWEB-33064Regression. imported 3rd party vue components are not resolved (vuetify)
BugWEB-31992auto-imports for scoped packages resolves to wrong file
BugWEB-31322Angular 5 -> Attribute i18n is not allowed here
BugWEB-33722React: add autoimport for Component based on react.d.ts
BugWEB-30850React Native: no completion for native components properties
BugWEB-32986Support pointer events (react 16.4)
BugWEB-32162Copy React import when moving or copying JSX code
BugWEB-33378Angular Schematics dialog: show completion when typing `--`
BugWEB-28018Angular: support navigation/completion for template reference variables in `@ViewChild()` decorator
BugWEB-33451Insufficient new project name validation for latest Angular CLI versions
BugWEB-31557Angular Component host not parsed correctly
JavaScript. InspectionsFeatureWEB-31568"Create derived class / implement interface" intention action
BugWEB-32303Strict mode inspection behavior is not applied in modules and classes
BugWEB-28206Allow to skip files from webpack code analysis
BugWEB-33556Inspections: "Missing require() statement" inspection has no description
BugWEB-33610Wrong "Iterate with for..of" intention inside strings
BugWEB-26902Inspections: "Convert to arrow function": correctly convert function with destructuring parameter
BugWEB-20119TSLint: improve completion for the complex rules
BugWEB-32956False positive for inspection "Primitive type object wrapper used"
BugWEB-24435Pointless boolean expression false positive for double negative
BugWEB-32839Wrong warning var' variables cannot share name with block sc...
BugWEB-33365JSDoc error with default + rest arguments
BugWEB-33588inspection "TypeScript | Unsound 'typeof' type guard check" is not fully correct
CosmeticsWEB-33289Rename Iterate intention
ExceptionWEB-33555Throwable: Tool 'JSUnresolvedFunction' registers INFORMATION level problem in batch mode
JavaScript. RefactoringFeatureWEB-32354JS: Inline refactoring should work across modules
FeatureWEB-13098Replace if/else chain with switch statement when using identity operator
FeatureWEB-23894Refactor: Extract React (JSX) component
FeatureWEB-11191JS: allow to inline function declaration
BugWEB-32651Exception when inlining function call without parenthesis
BugWEB-32849Move module member: dependent member highlighting in dialog has wrong color
BugWEB-31816Rename JS element should validate if member with same name is already present in scope
BugWEB-32403JS: 'inline' refactoring should substitute parameters for function expression assigned to variable
BugWEB-31116Don't suggest converting function expression to arrow function if it uses 'arguments'
BugWEB-6960TypeScript: Refactor/Inline works incorrectly for function that takes a callback as parameter
BugWEB-33091UI issues with the Move Symbol dialog on resize
BugWEB-32829Introduce var: wrong caret position after introduce variable /var postfix template
BugWEB-23504"variable value is changed when accessed from closure" when inlining variable set to this is used in arrow function
BugWEB-33062`Refactor -> Move` is very slow as it checks node_modules too
BugWEB-32838Rename should not change default re-export
BugWEB-33049'Move into matching file' intention should escalate visibility of non-exported items in modules
BugWEB-33417Move ES6 module member: usages of react components should be updated
BugWEB-33107Move module member fails with resolve to implicit overload element
BugWEB-32405Typescript: inline class member should check accessibility
BugWEB-20006Intention replace ternary with if else puts variable declaration in scope
BugWEB-2388'Cannot inline nonlocal variable' for top-level variable in Node module
BugWEB-33309'Move module member' should move assignments to properties
BugWEB-33418Move ES6 module member: update imports to non-js files
BugWEB-32415'Rename with containing file' should work for global entities too
BugWEB-33416Disable Inline refactoring for React functional components
JavaScript. TemplatesBugWEB-18941Handlebars: avoid errors when expression is used as attribute value
LESSFeatureWEB-24450Copyright plugin: support Less, Stylus and PostCSS file types
BugWEB-20921Add support for valid HTML syntax for including LESS/SCSS in <style> tags
BugWEB-33442less file '{' expected with guard clause
LintersFeatureWEB-32441TSLint - Add YAML Support
FeatureWEB-26119Support severity levels in TSLint 5.0
FeatureWEB-30482Apply code style from ESLint JavaScript configs automatically or show notification
BugWEB-29991Options values check for TSLint need update
BugWEB-32110Allow comments in specific JSON configuration files
BugWEB-31341Prettier: hide notification panel in other files immediately when action from it was performed
BugWEB-33055Guessing linters shouldn’t happen while indexing on initial project generation
BugWEB-32328Crash (from idea.log)
BugWEB-28870Support for "extends" in TSLint
BugWEB-32991Code styles from ESLint config inside package.json are not applied
BugWEB-32613JSCS: doubled completion inside the .jscsrc config file
BugWEB-28391TSLint schema: Support 'options' syntax for semicolon rule
BugWEB-33680Throwable: Read access is allowed from event dispatch thread or inside read-action only
BugWEB-27540ESLint: update config schema with overrides
TaskWEB-23376Stylelint: correct schema used for the completion and highlighting
Live EditBugWEB-29792Live Edit: 'restart if hotswap fails' doesn't work with Node.js 8+
BugWEB-33214Support Live Edit without Chrome extension
Node.jsFeatureWEB-26855No Editor > File and Code Templates option for package.json
FeatureWEB-32500Navigate to installed package from corresponding dependency declaration in package.json
FeatureWEB-28587Understand module field in package.json
FeatureWEB-32689Understand esnext field in package.json
FeatureWEB-8794package.json: provide path resolving
FeatureWEB-31796package.json template should start version from `0.0.0` as `npm init` does
BugWEB-24477Unresolved function or method with require() and node-js
BugWEB-33708WSL: webpack config can not be analyzed
BugWEB-33154Support ANSI coloring in log files
BugWEB-32859Incorrect view of ANSI symbols in run tool window when create create-react-app project
BugWEB-32697Node.js: Run console width is limited to 80 symbols
BugWEB-33042Find usages of file doesn't work if it's specified with "main" field in package.json
BugWEB-33263WSL: interpreter from linux is incorrect for some RC
BugWEB-33246WSL: can't configure node coding assistance
BugWEB-33248'WSL Ubuntu is not available' when try to run or debug
BugWEB-33256WSL: can't create project via Ubuntu legacy
BugWEB-33368Incorrect encoding in console.table() output
BugWEB-33707WSL: can't install nyc or istanbull via link from error
BugWEB-33687WSL: flow doesn't start (Throwable: Can't find node interpreter)
BugWEB-33688WSL: covered lines are not marked in the editor
BugWEB-32482Node.js remote interpreter is not added to the list when using Add - Remote
UsabilityWEB-32669Error: startup page is empty -- error displayed on Node.js debug configuration dialog but is not documented anywhere
UsabilityWEB-31707run tab name for npm install dependencies
ExceptionWEB-33725WSL: IllegalStateException when indexing project
ProfilingFeatureWEB-29269Support Node.js heap profiling with Inspector APIs
Pug (ex-Jade)BugWEB-30741PUG - classes are not suggested when using '.class' in pug in Vue files
SASSFeatureWEB-30041Sass imports using path prefixed with Tilde ('~') are not resolved when using Angular CLI
TypeScriptFeatureWEB-32945TS: completion after 'new' should assign higher priority if contextual type is a supertype
FeatureWEB-27095TypeScript: Refactor: Inline Variable should work with type.
FeatureWEB-33546TypeScript service: provide show quick fixes for "suggestion" annotations
FeatureWEB-32501Show computed property names like [a] instead of their actual values in code completion
FeatureWEB-33326Add references to TS 3.0 named generic arguments (so that they can be renamed/navigated)
FeatureWEB-31978Support generics in TypeScript JSX (TypeScript 2.9)
FeatureWEB-31577Intention action to implement interface or abstract class member in derived types
FeatureWEB-31676Semantic support for async generators should be improved
FeatureWEB-33454Support TS 3.0 tuple type inference
FeatureWEB-26909ES6/TypeScript: comments should be moved together with the symbol Move Refactoring
FeatureWEB-33447Replace if with switch intention in should work with enums and constant variables/fields
FeatureWEB-33448Intention actions to convert TypeScript parameter-property to field and back
FeatureWEB-33291Support TS 3.0 tuples in function calls
FeatureWEB-32490Better support for unique symbols and non-string computed-constant properties in code completion
FeatureWEB-31739Support TypeScript 2.9 imported types
FeatureWEB-22273TypeScript 2.0: Allow wildcard ("*") patterns in ambient module declarations
FeatureWEB-33221Support TS 3.0 'unknown' type
FeatureWEB-33430Support TypeScript 3.0 variadic tuple types and tuples with optional items
FeatureWEB-32997Suggest static factory methods based on expected types
FeatureWEB-33222Support TypeScript 3.0 named type arguments
FeatureWEB-31453'Create from usage' should be available on import/export statements
FeatureWEB-32988'Is not accessible' inspection and quickfix "Make constructor public" for private/protected constructors
FeatureWEB-28964Add option to omit JsDoc types for TypeScript code
FeatureWEB-32847TS. Suggest inline implementations for abstract classes in the completion after the "new" keyword
FeatureWEB-31994TypeScript: Make method protected (on call from derived class)
FeatureWEB-31744Context action 'convert type alias to literal const enum'
FeatureWEB-32461TypeScript 2.9: support generics in tagged templates
BugWEB-21141[TypeScript] false error with generic extends non-named types
BugWEB-21143[TypeScript] false error when passing a generic comparator function to Array.sort
BugWEB-31725Code completion and resolve for explicitly specified 'this' is broken (when service is off)
BugWEB-33545Should properly infer tuples from spreads
BugWEB-31742Typescript. Incorrect type inference for array after ternary operator
BugWEB-21614invalid error: rest parameter must be an array type
BugWEB-33701[TypeScript] Wrong "Non-ASCII characters in an identifier" inspection on TypeScript decorator with property access
BugWEB-32113TypeScript typed literals "implemented" and "implementing" gutter icons missing
BugWEB-32688"Generate cases" action generates invalid code if no braces
BugWEB-32593TypeScript: Renaming an interface member doesn't rename usages in curried functions
BugWEB-31743Literal enum values should be target to rename when used via mapped types
BugWEB-31740Enums with literal values are not resolved as valid key sets in mapped types
BugWEB-33467Incorrect type text for tuples with repeating same types
BugWEB-33373TyperScript non-null assertion operator("!") syntax error case
BugWEB-32661Incorrect ASI for TypeScript conditional type
BugWEB-32792Typescript: quick documentation doesn't show properties of type aliases
BugWEB-32943Error about non-implemented members is not shown for unnamed class expressions
BugWEB-33612Incorrect lexing of tuples in TSX tag generic arguments
BugWEB-33293Expected type for tuple element shouldn't include types from other elements
BugWEB-32495Incorrect handling of const-defined properties in this-indexers
BugWEB-33632TypeScript: Types are included in pre-populated JSDoc for properties/vars
BugWEB-33584TypeScript Auto-complete for new Promise is worse now
BugWEB-31606Don't suggest to add getter/setter and to 'make private' on abstract class members
BugWEB-32241Generic TSX component tag without any attributes is parsed incorrectly
BugWEB-33457Spread expressions in arrays are always treated as 'any'
BugWEB-32189Abstract fields should not be in suggestion list to generate getters/setters/constructors
BugWEB-33491Array destructuring should support TS 3.0 variadic tuples
BugWEB-31715Find in path sets the path to a folder in node_modules when searching a package name
BugWEB-31713TypeScript incorrectly infers types of re-exported members from "import * as someName from 'path'"
BugWEB-33716Incorrect rest parameter's type in "parameter info" / "quick doc" for aliases and tuples
BugWEB-33519Remove redundant empty line when replacing if with switch
BugWEB-32582Incorrect parsing of typescript non-null assertion in division operator
BugWEB-33651Typescript. Autocomplete for properties doesn't show string-named items when service is on
BugWEB-32524Traversing base types for non-implemented members doesn't take into account type members from aliases
BugWEB-31110TypeScript: change signature inserts incorrect import
BugWEB-33644Add 'extends' to the suggestion list for conditional types
BugWEB-33647Broken 'Create from usage' and 'Introduce type alias' in TSX tag generics
BugWEB-33001Bad "Must be lvalue" inspections in typescript
BugWEB-32352Generate -> Constructor doesn't properly handle overloads
BugWEB-33225TypeScript: better error messages
BugWEB-33355Generic type arguments in JSX elements should allow whitespaces between tag name and generic list
BugWEB-31076Typescript Complete current statement for interface not adding semicolon
BugWEB-31720Support --noImplicitThis and ThisType semantically
BugWEB-32989Classes with private/protected constructors are suggested after "new" word outside their visibility zone
BugWEB-32148'Create derived type' action should properly handle generic types (e.g., by inserting template sections for generic arguments)
BugWEB-32615Inspector suggests readonly when it can't actually be readonly
BugWEB-32185Enum and type alias have redundant items in "Generate" list
BugWEB-32182Type Inference Broken when using enum instead of string
BugWEB-33036Typescript TSX conditional syntax error
BugWEB-33194TypeScript User Defined Type Guards: Renaming parameter does not rename type gurad definition "x is Y"
BugWEB-33590TypeScript objects with getters/setters fail type validation
BugWEB-32570TypeScript enum value variants: should import enum at target location or don't show if it is impossible to import it there
BugWEB-32965Incorrect unresolved 'super' in case of object literals
BugWEB-33765Completion for generic TSX components doesn't work properly for the first attribute if TS service is enabled
BugWEB-32788TypeScript return value checker erroring when using indexable types
BugWEB-31664Renaming a property and property accessors also renames the setter which is an error
BugWEB-32712Code completion for 'this'-items uses incorrect type when there exists a 'this'-parameter
BugWEB-32952Incorrect errors with class expressions
BugWEB-33230typeof dynamic import error: expression expected
UsabilityWEB-33609Inaccurate typescript autocomplete for text "ret"
TaskWEB-33010TypeScript: remove "rxjs" from default blacklist
TaskWEB-33013TypeScript: enable excluding js sources for node modules packages with typings
ExceptionWEB-32678Exception when replacing switch with if
Unit TestsFeatureWEB-26053Rerun failed Mocha tests
FeatureWEB-31590Debugging Karma tests in Chrome Headless
FeatureWEB-33200Rerun failed Karma tests
FeatureWEB-33164Rerun failed Jest tests
BugWEB-32422mocha --recursive fails to run
BugWEB-9523An issue of running Node.js task & karma server at same time
BugWEB-30368Add JavaScript test files to the predefined test scope
BugWEB-32546ReferenceError: jasmine is not defined when try to run protractor's tests from IDEA
BugWEB-33810'Click to update snapshot' link is missing
BugWEB-33594'Show ignored' option doesn't work for Jest
BugWEB-33622WSL: Jest Coverage tool window not showing any stats
BugWEB-33259 WSL: interpreter from linux is invalid for Karma RC
BugWEB-33631Jest + Vue: coverage marks not shown in gutter of .vue file
BugWEB-33261WSL: interpreter from linux is invalid for jest RC
BugWEB-33076org.jetbrains.concurrency.InternalPromiseUtil$MessageError: No tabs to inspect when debug KarmaHeadless test
BugWEB-33855Jest: custom setupTestFrameworkScriptFile is not executed sometimes
BugWEB-33816Jest: initialization error is shown as passed test
BugWEB-33664Karma: cannot run single jasmine suite or test
BugWEB-33662Improve description for suits with ignored test when 'Hide ignored' is chosen
BugWEB-33260WSL: interpreter from linux is invalid for mocha RC
BugWEB-33353Jest, re-run failed tests: all test files are shown in the result tree
BugWEB-33356Jest: re-run failed tests can be faster
BugWEB-33218ClassCastException when rerun Jest and Mocha test in 'Run with coverage' mode
BugWEB-33216Error when rerun failed Karma test in 'Run with coverage'
BugWEB-33354Jest, re-run failed tests: all same-named tests are run (even not failed)
BugWEB-33682Karma: 'Re-run failed tests' button disappears when debugger starts
UsabilityWEB-30439Jest: show console.log output in test results console when clicking on test