Skip to end of metadata
Go to start of metadata
No subsystemBug CPP-17660 Throwable: Synchronous execution under ReadAction: C:\Users\mari\AppData\Local\Microsoft\WindowsApps\ubuntu1804.exe run pwd
Bug CPP-25419 Do not show send current line to cling in windows other than editor
Task CPP-24631 Bundle CMake 3.20
Performance CPP-23534 "Go to base class" action causes resolve in EDT
Bug CPP-25384 Don't show completion for several functions with the same name
Feature CPP-25256 Use known flags when starting cling
Bug CPP-25068 Debugger: Disasm view steals focus when switching frames using "Next/Prev Frame" shortcuts
Feature CPP-25076 Monitor changes in CMakePresets files
Bug CPP-25710 support nativeToolOptions and cleanFirst for buildPreset
Feature CPP-378 Cling Support
Bug CPP-25143 java.lang.Throwable: Synchronous execution on EDT: C:\Windows\system32\wsl.exe -l -v
Bug CPP-24452 Key Header Search Paths is missing in the map exception in Makefile project
Task CPP-25012 Add new C++ standards to CXX/CUDA_STANDARD chooser of New Project dialog
Performance CPP-25091 the whole editor froze for 97 seconds while I was typing code
Bug CPP-25051 'Run in external console' don't work with WSL anymore
Bug CPP-25135 Add preset selector on import
Bug CPP-25240 Load CMake Presets when project is opened
Bug CPP-24458 Throwable: Synchronous execution on EDT: C:\Windows\system32\wsl.exe --distribution Ubuntu-18.04 --exec /bin/sh -c "readlink -f /usr/bin/gdb"
BuildBug CPP-24642 Stopping build of custom target with external tool sends SIGKILL instead of SIGINT
Bug CPP-25034 Opening CMake project leaves it unusable
Code: ClangdFeature CPP-17363 clang completion: provide completion for UDL
Bug CPP-24391 Syntax highlighting fails after indexing
Code: CompletionFeature CPP-4039 Add postfix completion for C++
Bug CPP-24226 Postfix completion suggests make_shared for member variable
Feature CPP-23937 Add coroutines keywords as postfix completion items
Bug CPP-24046 Postfix completion: Incorrect result of completing std::forward on a constrained type
Bug CPP-24192 Template types and using directive cause auto completion to not work
Bug CPP-24074 Some valid member functions are not show in the first completion attempt
Bug CPP-24072 Postfix completion: Offer switch only for integer or enum variables
Bug CPP-24654 Provide postfix completion for literals
Bug CPP-25209 Unexpected line deletion after usage of multiple cursor and autocomplete
Bug CPP-25355 clangd crash at completion
Feature CPP-24506 Allow to overtype semicolon in snippet completion
Bug CPP-24128 Postfix completion applied to a wrong expression
Bug CPP-18307 clangd completion: Quick Documentation and Quick Definition are not working
Feature CPP-25273 Use clangd completion in all C/C++ code fields
Feature CPP-24397 Add postfix completion for std:: functions from algorithm header
Bug CPP-25607 Weird behavior in Multi-cursor mode
Bug CPP-24961 Share global code completion cache between completion calls
Bug CPP-24221 Boost "true", "false" and "nullptr" completions priority when type matches
Feature CPP-25214 Make check to disable global completion cache
Code: DocumentationBug CPP-25350 java.lang.NullPointerException from Grazie
Bug CPP-24934 CLion doesn't correctly render Doxygen \n
Feature CPP-24851 Enable HTML doc rendering for Doxygen
Code: EditingBug CPP-18010 Editor lost focus when new file is created
Performance CPP-18376 Move lines up/down might lead to freeze
Code: FormattingBug CPP-24164 ObjC language detection in header files with empty or `.h` extension can be exponential long
Bug CPP-25263 Property 'EmptyLineAfterAccessModifier' is not allowed in default (LLVM) clang format scheme
Cosmetics CPP-16520 ClangFormat: Remove Scheme from ClangFormat Scheme name
Performance CPP-25163 clang.format.ClangDaemonFormatProvider.indent may freeze EDT on paste
Performance CPP-17439 Very slow code formatting on paste
Code: GenerationBug CPP-24904 Create New Function Feature error with 2d std::vector
Code: Highlighting and InspectionsUsability CPP-25179 false positive of adding variable type in for-range loop
Bug CPP-25171 Code analysis (Clang-Tidy integration) doesn't work in headers when relative paths are used
Bug CPP-24134 crash in DFA
Bug CPP-24400 Extend escape analysis to handle lifetimes of pointers to variables from nested scopes
Bug CPP-18323 'auto' not allowed in template parameter until C++17 (but using c++20)
Bug CPP-24509 Keyword enum has wrong highlighting
Performance CPP-23083 "Run Test" line markers might be slow and block other line markers
Bug CPP-14111 Inspection Result shows errors which are hidden by clangd
Task CPP-24188 Remove inspections from settings which are not working when clangd is on
Bug CPP-25553 System include paths are not correctly passed to the clangd in remote case
Feature CPP-24581 Suppress warnings in clazy style
Bug CPP-25007 Loop condition is not update inside a loop doesn't detect standard linked list iteration
Bug CPP-24286 Extend escape analysis to handle lifetimes of class-references to class-owners
Code: ParsingBug CPP-25429 Incorrect syntax highlighting when using integer literals with leading zero followed by single quote
Bug CPP-25380 CLion blocks text editing
Code: RefactoringsBug CPP-6660 Renaming function 'void foo(char *args[])' unexpectedly changes param to 'char **args'
Bug CPP-11217 Refactoring method name in CLion causes an incorrect change of parameters
DebuggerFeature CPP-11536 Debugger: Add option to disable using absolute paths for breakpoints
Performance CPP-16329 Clicking on a breakpoint might cause reparse in EDT
Bug CPP-25340 Don't choose Bundled GDB by default for Core Dump Debug configuration on Windows
Bug CPP-25354 Disable Set execution point in breakpoint dialog
Feature CPP-8910 Debugger: Breakpoints in disassembly view
Debugger: GDBFeature CPP-20779 FreeRTOS Thread view
Task CPP-19679 Bundle GDB 9.2
Bug CPP-25669 GDB: Cannot detach or set a breakpoint while program is running
Bug CPP-25054 "GDB ExecutionException: Couldn't send SIGSTOP" with 'Run in external console' on WSL
Debugger: LLDBBug CPP-16750 LLDB for windows: no value formatting for wide/unicode (wchar_t, char16_t, char32_t) strings
Bug CPP-21763 LLDB incorrectly renders tuple collection
Feature CPP-16751 LLDB for windows: support VS format specifiers in natvis
Feature CPP-7048 Remote LLDB debug
Feature CPP-20203 Support "Inheritable" attribute in natvis
Bug CPP-25420 LLDB for Windows: Set Value action is disabled for primitive variables
Bug CPP-20337 Support CustomListItems in natvis
Dynamic Analysis ToolsFeature CPP-14357 Profiler support for remote mode
Feature CPP-14358 Profiler support for WSL
Bug CPP-25241 Can't open profile report
Feature CPP-24067 Attach to Process for perf profiler
Bug CPP-24454 Delete tmp directories on remote machine created during Valgrind/Sanitizers work
Bug CPP-25438 Jump to source in the Profiler tool window doesn't work with default options
Task CPP-24964 Provide dialog and fix to set kernel variables (same to local mode) in remote
EmbeddedBug CPP-25530 Disable RTOS integration for new projects
Bug CPP-25439 Embedded Debugging: Reset Button missing
IDE SettingsUsability CPP-25744 There is no way to insert new line to pre-configuration commands script
Feature CPP-25507 Doc comments foreground color does not work for anything but text
Bug CPP-25748 The result of shell script content being scrolled all the way to the right
Project ModelBug CPP-25339 CLion doesn't recognise Intel's `clang` compiler if `-fsycl` is specified
Bug CPP-25189 Infinite CMake refresh loop with PEGTL project and remote toolchain
Usability CPP-20733 Ability to link Makefile to an existing project if no project model available
Bug CPP-23022 Unable to create Coverage CMake Profile if the same disabled configuration present
Bug CPP-25410 Exception if invalid path is specified in CMake build directory
Feature CPP-25147 CMake Presets: Add ability to select a toolchain for a preset
Bug CPP-25146 CMake Presets: Reload CMake doesn't fetch changes from presets
Bug CPP-25018 Initial CMake Presets support
Bug CPP-25587 CMake Presets: incorrect handling of ${sourceDir} macro in "cacheVariables" targeting WSL
Bug CPP-24676 Makefile Remote toolchain not found after renaming
Bug CPP-25186 'kotlin.NotImplementedError: An operation is not implemented' on Load CMake Presets
Usability CPP-25379 Add easy_find way to Link Makefile project.
Bug CPP-25431 Hide advanced `Use POSIX shell parser on MinGW toolchain` setting on non-Windows
Feature CPP-20997 Detect Kbuild projects and add V=1 to the make command line when analyzing the project
Bug CPP-25552 Adding/removing/editing CMake profiles doesn't reload CMake
Bug CPP-24002 Strange errors when trying to cross compile
Bug CPP-25203 CMake Presets arguments containing space need to be wrapped in quotes
Bug CPP-25321 NPE on loading preset without binary dir
Bug CPP-24339 GCC --include (include header in all files) breaks intellisense
Feature CPP-25581 Support architecture and toolset properties from configure presets
Bug CPP-25232 Move CMake and Makefile registry flags to Advanced settings
Bug CPP-21708 Object (-f) and debugging (-g) format arguments of yasm/nasm invocations are incorrectly treated as input files
Bug CPP-25150 CMake Presets profiles are not persisted
Feature CPP-25371 CMake Presets: Improve error reporting
Bug CPP-25449 Load CMakeLists.txt doesn't load presets
Bug CPP-25663 CMake presets are not loaded on update from VCS
Bug CPP-25459 'Reset Cache and Reload' doesn't load presets
Bug CPP-25205 'JsonSyntaxException: com.google.gson.stream.MalformedJsonException: Unterminated object at line 3 column 4 path' when CMake preset misses a comma
Bug CPP-25187 'Load CMake Presets' should handle identical preset names
Project and File WizardsBug CPP-23908 New Qt UI Class: There is no needed in UpDown control in the dialog
Feature CPP-547 File template for CMakeLists.txt
RunningUsability CPP-25244 Show error message in case of wrong cling executable
Feature CPP-15336 Create before launch task for running CMake targets
Bug CPP-24470 Working directory is not working in Makefile Application run configuration
Bug CPP-24554 Can't run some targets in external console when process elevation enabled
Structure, Hierarchy ViewsBug CPP-25258 struct/class structure view doesn't contain `using type alias`.
ToolchainsBug CPP-22077 When you set the remote host visible only for this project in deployment toolbar, then the cmake will reload failed.
Feature CPP-20936 Remote mode: Provide better diagnostic when "Cannot create directory"
Feature CPP-22975 WSL: get rid of running processes via ssh
Bug CPP-25316 Cannot detect WSL distributions on old Windows 10 version
Feature CPP-16777 Add support for GNU Autotools (Autoconf, Automake) projects
Bug CPP-24931 WSL: run process with root privileges
Bug CPP-25427 New deployment configs are created each time ssh-config is updated
Bug CPP-25025 AssertionError after removing a WSL distribution
Bug CPP-14315 Remote toolchains lose their ssh config on CLion restart if the deployment method is set to "Local or mounted folder".
Unit TestingBug CPP-22189 CTest: llvm-cov export tool failed with error: error: /Applications/CLion 2020.3 EAP.app/Contents/bin/cmake/mac/bin/ctest: Failed to load coverage
Bug CPP-25827 Wrong notification`Warning: No CTest information found. The CTest version in the selected build configuration must be at least 3.14 to debug tests.`
Feature CPP-23057 Boost.Test: Show the test tree before tests execution
Bug CPP-25759 CTest: Modify Run configuration from gutter icon always creates the new one
Unit Testing: CatchBug CPP-25428 Catch2 run test gutter is not changed after running the test case
Bug CPP-25718 Catch2 integration improperly parses backslash characters in Catch's XML output
Unit Testing: DoctestTask CPP-23219 Split Doctest plugin to language dependent and independent parts
Code Analysis. DependenciesBug IDEA-169897 'Analyze Data Flow to Here' shows javadoc instead of enum
Bug IDEA-268859 PWA doesn't properly handle deletion of the folder
Bug IDEA-268417 PWA doens't properly work in power save mode
Bug IDEA-268133 Do not start PWA during editing
Bug IDEA-269770 Throwable: Read access is allowed from inside read-action ... at com.intellij.analysis.pwa.analyser.PwaServiceImpl.
Bug IDEA-265832 com.intellij.testFramework.LightVirtualFile cannot be cast to class com.intellij.openapi.vfs.VirtualFileWithId
Bug IDEA-166964 'Group by nullness' button opens 'grouped by value' tab as well
Bug IDEA-268414 Different number of errors from highlighting and PWA
Bug IDEA-269673 Annotation problems are not detected by PWA
Bug IDEA-268854 Java files in resources are processed by PWA
Bug IDEA-268120 Inconsistent and wrong error from PWA
Feature IDEA-194774 Analyze dataflow: track through Collections.unmodifiableList
Bug IDEA-271194 PWA doesn't work and throws exception on restarting
Bug IDEA-268687 Included sources are not processed by PWA
Bug IDEA-268798 Unknown constructor error reported only once per file
Bug IDEA-154777 'Analyze data flow from here' on parameter from overriding method shows usages of parameter in the base method
Code Analysis. InspectionBug IDEA-230802 Guava Verify.verifyNotNull receives incorrect inferred @Contract annotation
Feature IDEA-207545 Convert `TestFailedLineInspection` to Uast
Feature IDEA-260954 Add option to highlight ambiguous elements in inspection "Java | Visibility | Access of inherited field looks like access of element in surrounding code"
Bug IDEA-217974 Adding/removing files in/out of scope is ignored in Inspection scope settings
Bug IDEA-272286 org.eclipse.jdt.annotation.NonNullByDefault should not add @NonNull to Local variables
Usability IDEA-141260 Analyze Dataflow should have Expand-/Collapse-Buttons
Cosmetics IDEA-267115 Fix "hybrid" lists layout in inspections
Feature IDEA-269819 Inspections table : Add link to create a SSR inspection when empty
Bug IDEA-267847 Scoped inspection configuration is left in inspection profile XML upon scope deletion but not shown in the UI
Bug IDEA-255753 Descriptions are missed for tools warning on attempt to run inspections build in TeamCity
Performance IDEA-270602 Optimize precommit code analysis for property files
Code Analysis. Language InjectionBug IDEA-265653 Ctrl-F1 ('Show error description') doesn't work inside injected fragments
Exception IDEA-272957 Injecting YAML into YAML causes exceptions
Bug IDEA-223039 Throwable when tab in text block injected as a language.
Code Analysis. Structural SearchBug IDEA-264212 Setting a different search target should not require setting count filter
Bug IDEA-263967 Filters shouldn't immediately disappear when they have a default value
Bug IDEA-254332 SSR: Make it possible for custom filters to influence SubstitutionShortInfoHandler
Bug IDEA-266074 Improve switching between search and replace
Bug IDEA-259948 SSR inspection: false positives when the template language is not available
Bug IDEA-269555 Select sensible scope when opening structural search dialog
Feature IDEA-265528 Support searching for java 16 records
Bug IDEA-265535 Support searching for Java 16 pattern matching
Bug IDEA-198425 New SSR: mnemonic for Search target doesn't work
Bug IDEA-270390 Structural Search/Replace: "Match Case" option in UI is imported/exported in XML as "caseInsensitive" (without value negation)
CoreException IDEA-267034 Cannot init component state (componentName=FileTypeManager, componentClass=FileTypeManagerImpl)
Bug IDEA-270202 Background Process Indicator may remain visible after process finishes
Bug IDEA-270326 Stack overflow in BaseComponentAdapter.getImplementationClass when opening 2021.2 EAP
Bug IDEA-269348 ImmediatePainterTest fails
Bug IDEA-263296 Call all not-dumbaware EditorTabColorProvider instances just after indexes are built to update editor tabs background colors
Bug IDEA-268140 IDEA fails to start, stuck at splash screen
Bug IDEA-270818 Can't start RubyMine when Gherkin plugin is disabled: Startup error: java.util.concurrent.CompletionException: java.lang.IllegalStateException: Class loader is not configured
Bug IDEA-262426 com.intellij.serviceContainer.AlreadyDisposedException in EditorGutterComponentImpl
Bug IDEA-268536 Throwable: Attempt to load key 'linux.row.height.disabled' for not yet loaded registry
Bug IDEA-271664 Intellij Idea fails to start with VPN enabled
Performance IDEA-271083 Memory leak in com.intellij.openapi.util.Key.allKeys
Core. DebuggerBug IDEA-266021 Alt+hover blinking on mouse move
Usability IDEA-269151 Debugger: Make toolwindow more keyboard-friendly
Bug IDEA-272734 History navigation is broken in evaluate window
Bug IDEA-260695 Inline values in debugger are shown in comments
Bug IDEA-267725 There's no 'Layout Settings' action on toolbar in debugger TW
Performance IDEA-262527 ValueLookupManager.showHint
Usability IDEA-269145 Debugger: Selection in frames view always rendered as focused
Core. DiagramsException IDEA-271802 IDE hangs on change schema in diagrams
Exception IDEA-271806 AE at com.intellij.openapi.graph.impl.GraphBase.wrap
Task IDEA-265332 UML diagram: missing color parameters for box and edge selection
Bug IDEA-271586 Diagrams: selected node (or no-bends edge) doesn't look selected
Core. File SystemUsability IDEA-225699 IDE attempts to access samba shares without credentials
Exception IDEA-264492 Randomly failing tests due to VFS exceptions
Core. IDE SettingsException IDEA-269559 Advanced settings exception on opening IntelliJ IDEA
Bug IDEA-272996 typo in Advanced settings > Use Windows certificate store option description
Usability IDEA-263845 Notify a user when shell environment loading has failed
Usability IDEA-267336 Registry editing actions: Edit and Revert aren't available while IDE is indexing
Cosmetics IDEA-271651 Actions on Save: Show warning under `Upload to default server` when Deployment sever is not configured
Feature IDEA-228117 Configurable scratch directory
Usability IDEA-189694 OOME dialog usability; memory limits validation
Bug IDEA-191665 Duplicate copyright in META-INF/services files
Bug IDEA-265112 "Override file type" action shows duplicated and irrelevant file types
Task IDEA-216133 Migrate macOS environment reader from Python
Bug IDEA-201853 Can't reload encoding inside jar file when use latest idea, 2018.2
Bug IDEA-256106 WindowsLookAndFeel is not migrated to IntelliJLaf / JetBrainsLightTheme, defaults to Darcula
Bug IDEA-264344 Pressing "Get more keymaps" link inserts search to a wrong textbox
Bug IDEA-230267 File Association not working for some files
Usability IDEA-216847 Add Save option to Low Memory heap configuration dialog
Cosmetics IDEA-271786 Settings | Tools | Actions On Save | Rearrange Code: duplicated 'XML' entry in the 'configure arrangement rules' drop-down
Bug IDEA-269681 UI font changed after update to 2021.2 on Linux
Bug IDEA-204018 Deleted scheme gets restored when a new scheme is created with the same name
Core. IDE Settings. SharingBug IDEA-269456 UnsupportedOperationException when install custom UI theme + theme isn't installed
Bug IDEA-272508 Got all my toolchains removed
Core. IndexingBug IDEA-268788 Indexing pausing might produce deadlock
Cosmetics IDEA-268795 Show local time in indexing diagnostics
Task IDEA-268796 Cleanup indexing diagnostics on cache invalidation
Feature IDEA-269099 Print project ID or name in the logs and diagnostics
Task IDEA-269170 Indexing: add navigation link to project indexing diagnostics from Menu/Tools
Bug IDEA-268926 PhpFieldNamesAssignedByTheConstructorIndex is unstable
Bug IDEA-263726 "SerializerNotFoundException: No serializer is registered for stub ID: 2992" on indexing
Core. InstallationFeature IDEA-165872 Delete old config and system directories after upgrade to a new major version
Task IDEA-270576 Drop x86 support
Usability IDEA-271458 IDE should display notification when there are no leftover directories to cleanup
Bug IDEA-272075 Last Used date shows "51 years" on mac for empty directories
Task IDEA-168113 Include library sources to sources zip artifact
Bug IDEA-271408 2021.2-EAP: phpstorm v219 and intellij-idea-ultimate 301 snap missing 'fsnotifier' bin; reports "External file changes sync may be slow: Native file watcher executable not found"
Task IDEA-266756 Get rid of Log4J usages in updater
Cosmetics IDEA-271094 Broken UI in the Idea installer
Usability IDEA-271457 Behavior of "Delete Leftover IDE Directories" action is dangerously under-documented
Exception IDEA-272114 Unhandled AccessDeniedException if try to clean-up the directory without required permissions
Feature IDEA-261458 Make Windows installer tune the system for screen readers
Core. LicensingBug IDEA-272971 Login Dialog: try to open browser in fallback scenario
Performance IDEA-271827 Login dialog freezing when internet is off
Bug IDEA-271817 Login dialog: Grey frame around dialog content
Bug IDEA-271115 NullPointerException in PluginManagerCore when trying to show license dialog
Bug IDEA-272359 Login Dialog: support fallback scenario
Bug IDEA-273061 Login dialog: Fallback mechanism: an attempt to validate wrong token does not show error messages
Cosmetics IDEA-271732 Login Dialog: UI review
Core. Navigation and SearchBug IDEA-203657 Method name labels in call hierarchy are wrong for nested classes
Bug IDEA-268322 Freeze when Analyze Data Flow from Here
Bug IDEA-250058 Call Hierarchy tab should have a collapse all button
Bug IDEA-203328 "Expand all" on call hierarchy of a recursive method never terminates
Bug IDEA-270674 Hierarchy on Overridden Method shows calls to overriding methods
Core. Platform APITask IDEA-271430 Remove deprecated UAnnotated.annotations
Task IDEA-269551 Replacement for GotoTargetRendererProvider
Bug IDEA-264030 Backgrounding progress dialogs seems to have broken between Android Studio Versions 4.1 and 4.2
Bug IDEA-264418 Inlays don't work well with fractional font width
Bug IDEA-270799 AboutPopupDescriptionProvider information no longer displayed on About screen
Bug IDEA-268191 JBPopupFactory.createConfirmation always runs "No" runnable
Bug IDEA-264792 Broken ToolWindowManagerImpl#unregisterToolWindow(String id)
Core. Plugin ManagementBug IDEA-272801 Plugin recommendations by Maven dependencies are not shown on project opening
Bug IDEA-271398 MissingResourceException after dynamic plugin installation
Bug IDEA-271502 PluginClassloader logs errors which would be ignored otherwise
Exception IDEA-271364 Throwable: jarFiles is not set for PluginDescriptor(name=Spring Integration Patterns)
Bug IDEA-272022 2021.2 EAP doesn't offer a restart after installing language pack plugin
Bug IDEA-215678 "Enable plugins" link in PluginsAdvertiser does not work as intended
Exception IDEA-272436 PluginException: Class com.intellij.spring.boot.cloud.stream.library.SpringCloudStreamLibraryUtil must be not requested from main classloader of com.intellij.spring.boot plugin [Plugin: com.intellij.spring.boot]
Exception IDEA-271370 Throwable: jarFiles is not set for PluginDescriptor(name=Spring Security)
Bug IDEA-268227 Fail to load language plugin
Bug IDEA-272165 `Restart` action in "Plugin list has changed" balloon requires smart mode
Bug IDEA-271835 Class com.intellij.spring.persistence.integration.hibernate.SpringXmlHibernateSessionFactory must be not requested from main classloader of com.intellij.spring plugin
Exception IDEA-273001 PluginException: Class com.intellij.spring.el.SpringBeansAsElVariableUtil must be not requested from main classloader of com.intellij.spring plugin [Plugin: com.intellij.spring]
Bug IDEA-262343 Cannot unload a plugin due to leak: ToolWindowIcon in ActivateToolWindowAction
Bug IDEA-270430 Not Possible to enable bundled plugin: the required implementation-details plugin is disabled
Bug IDEA-272739 Exception in IDEA core at startup
Bug IDEA-269039 Fail to load descriptor from the downloaded plugin archive
Bug IDEA-270855 NPE in Plugin migration downloader
Exception IDEA-271785 Throwable: Class com.intellij.spring.el.SpringELLanguage must be not requested from main classloader of com.intellij.spring plugin
Bug IDEA-271488 PluginException: Cyclic service initialization: interface='com.intellij.openapi.keymap.KeymapManager'
Bug IDEA-272831 On plugins unloading some dependent plugins fail to load without any user-visible hints
Bug IDEA-233743 Restart of IDE is suggested on uninstall/disable of incompatible dynamic plugin
Exception IDEA-271395 Throwable: jarFiles is not set for PluginDescriptor(name=Spring Data)
Exception IDEA-273256 PluginException: Class com.intellij.spring.integration.injection.el.SpringIntegrationELImplicitVariableFactory must be not requested from main classloader of com.intellij.spring.integration plugin [Plugin: com.intellij.spring.boot]
Bug IDEA-264429 IDEA suggests updating an uninstalled plugin
Exception IDEA-271256 Enabling AngularJS plugin causes exceptions
Bug IDEA-270022 java.lang.IllegalArgumentException: com.intellij.openapi.fileTypes.NativeFileType on starting the IDE with 3d party plugins
Exception IDEA-271361 ClassNotFoundException: com.intellij.spring.mvc.jam.SpringRequestBaseUrlElement PluginClassLoader(plugin=PluginDescriptor(name=Spring Boot))
Exception IDEA-271367 ClassNotFoundException: com.intellij.aop.psi.AopPointcutExpressionLanguage PluginClassLoader(plugin=PluginDescriptor(name=Spring)
Bug IDEA-256101 Can't see installed plugin, can't uninstall plugin
Core. Project SettingsPerformance IDEA-265149 Slow synchronization of project model for project with many modules after opening
Bug IDEA-272863 If a module is removed from list of unloaded modules, it may become unloaded again after external changes in project configuration
Bug IDEA-272025 IDEA fails to open project if it has incorrect value of 'type' attribute in 'orderEntry' tag in one of its iml files
Usability IDEA-265303 Using independent numbering per scratch file type was a poor decision
Bug IDEA-262274 Minimize usage of VirtualFilePointerImpl replace to VrtualFileUrlBridge
Bug IDEA-273184 Freshly Created Project in the Drive Root Throws NPEs on Creation and Opening
Exception IDEA-272606 Throwable at com.intellij.packaging.impl.artifacts.workspacemodel.ArtifactManagerBridge.initBridges
Usability IDEA-265597 Unnecessary .idea/libraries-with-intellij-classes.xml is created when I add gradle module to a project
Bug IDEA-269842 Can't delete the manually added facet in the project with ExternalStorageConfigurationManager=true
Bug IDEA-174113 Excluded by pattern files are still compiled
Task IDEA-266774 Provide API for specifying Java language level in workspace model
Bug IDEA-269594 Compare Gradle and Maven projects import at old and new project models
Usability IDEA-269817 Project Structure dialog: on new facet adding via Facets tab re-select some module in the Choose Module dialog
Bug IDEA-271843 Artifacts aren't serialized into cache after importing Maven project from scratch
Bug IDEA-267199 IDEA may automatically unload all modules if some modules were unloaded in the past
Usability IDEA-268573 Shorten default name for libraries downloaded from Maven repositories
Core. Quick DocumentationPerformance IDEA-272548 Heavy UI freezes with quick doc panel and font ligatures enabled
Bug IDEA-265396 Quick Documentation renders only the first one of a repeatable annotation
Core. RefactoringsUsability IDEA-268558 Preview for Move class to other package do not show package name changing
Bug IDEA-266884 Rename refactoring should renames occurrences only inside provided scope
Usability IDEA-186088 Display some "process" when paste/delete a big folder into/from a project
Bug IDEA-264381 IDEA freezes when invoking Surround with Live Template
Core. Run. ConfigurationsUsability IDEA-257348 "command line is too long" error message: hard to understand how to fix, especially with new run configuration UI
Bug IDEA-252159 Run / Debug Configuration $FilePrompt$ as working directory
Bug IDEA-266683 Environment variables in Java Run dialog behavior doesn't conform to the hint provided in configuration window.
Bug IDEA-267309 Fork mode is reset to "method" on reopening of run configuration screen.
Bug IDEA-266139 Kotlin run configuration doesn't support WSL
Performance IDEA-261332 DefaultJavaProgramRunner.doExecute and GenericDebuggerRunner.doExecute
Bug IDEA-255341 [new run config UI] Logs option adding and deleting is not saved
Bug IDEA-261090 [new run config UI] do not show Got It tooltip for classpath in jUnit
Bug IDEA-262227 Move settings that were shown in run configuration dialog with the Templates node selected
Bug IDEA-266062 $FilePrompt$ as working directory in run configurations not working anymore
Usability IDEA-249917 [new run config UI] Highlight error state near the field containing the error
Core. Run. TargetsBug IDEA-268640 IJ cannot complete commands when the terminal is set to zsh and it needs to update
Performance IDEA-264654 Rsync: Upload files in batch sets where possible
Bug IDEA-267619 An exception on Run/Debug is shown to user without means to report it
Bug IDEA-269329 Docker. Run Targets. SpringBoot and Quarkus: runs on docker targets are absent in the Services view
Cosmetics IDEA-260898 Run Targets. SSH wizard small fix
Bug IDEA-270299 Run Targets: RC with run on target excluded from pre-commit run RC list
Bug IDEA-270551 Run Targets: On run Quarkus on docker target get java.lang.NoClassDefFoundError: com/intellij/docker/remote/run/target/configuration/DockerTargetEnvironmentConfiguration
Core. SSHBug IDEA-272423 Broken ProxyJump emulation through ProxyCommand
Bug IDEA-267569 Public keys are asked before the password if auth type is set to password
Bug IDEA-267480 High CPU Usage and Decent amount of exceptions in log when importing new remote makefile project
Bug IDEA-263286 SSH client should not try default keys if any IdentityFile is specified
Core. StatisticsTask IDEA-256920 Track Inspections Widget action
Task IDEA-255671 Add information about array data type to generated scheme
Task IDEA-270682 Add run icon gutter click to gutter.icon.click group
Feature IDEA-271135 Report type of proxy configured in settings
Exception IDEA-268572 ADE at com.intellij.serviceContainer.ComponentManagerImpl.doGetService
Core. Task ManagementBug IDEA-262805 First underscore in context name gone
EditorBug IDEA-272390 VCS name in annotations is longer than the highlighting with JB Mono 14
Cosmetics IDEA-244880 Quick documentation display option: "On hover" vs "on mouse move"
Bug IDEA-268819 Text preview box under "Font" settings changes size when hovering over the "Current editor font" warning
Task IDEA-260495 Font Settings: add sample of bold font to preview
Feature IDEA-271409 Create editor API to provide custom representation for specified blocks of text
Bug IDEA-270542 Renaming inner class does not update part of the editor window
Bug IDEA-262153 IJ requests indexes on caret shape changing
Bug IDEA-271823 NullPointerException occurs when trying to open markdown file again
Bug IDEA-243023 .editorconfig: max_line_length=off disables visual guides
Bug IDEA-269075 Documentation link for an inaccessible symbol doesn't work with rendered documentaion turned off
Task IDEA-268217 Open non-project files in LightEdit mode by default, show a dialog suggesting to switch to project mode
Exception IDEA-265875 java.lang.Throwable: Slow operations are prohibited in the EDT when trying to browse recent projects
Feature IDEA-268343 Add listeners for `Editor.setOneLine`
Bug IDEA-267339 Undo - does not restore selection after using an action via popup or menu, but works properly when using a shortcut
Feature IDEA-267726 Option to disable "advertise actions" on empty editor
Bug IDEA-256658 Editor ignores font settings in 'reader mode'
Editor. Code CompletionFeature IDEA-267743 Color Scheme: separate background option for quick doc and code completion
Bug IDEA-269699 Second completion shows duplicated file entries
Editor. CopyrightFeature IDEA-150579 Add the ability to maintain multiple years in a copyright statement using the Copyright Plugin
Editor. Diff and MergeUsability IDEA-270466 Go To Changed Files button doesn't appear when another changed file occurs in changelist
Usability IDEA-269735 Missing actions "Show Diff in Separate Window" and "Show Diff in Editor Tab" for Image Diff and binary file diff
Bug IDEA-273869 Compare with Local opens diff window instead of Changes between revision and local changes dialog
Usability IDEA-268591 Add an option to switch Diff into a frame to the Editor settigns
Usability IDEA-269638 Confusing behavior with synchronize scroll setting in diff views
Bug IDEA-273361 Diff stops working after back action
Usability IDEA-271662 Too long tab title for compare actions
Cosmetics IDEA-239121 diff viewer artefacts (reggression)
Usability IDEA-271914 Diff in editor overlaps by dialog
Bug IDEA-269981 Shortcuts for Compare Previous/Next File don't work after first invocation
Bug IDEA-268534 A "Diff" dragged into a frame does not remmeber size and position
Usability IDEA-239744 Dangerous behavior with "compare next file" hotkey
Cosmetics IDEA-270307 Diff Unification: unify tooltip for settings gear button
Bug IDEA-270349 Show diff in Separate Window action doesn't work when invoked from Find action
Bug IDEA-273714 Diff in a separate window doesn't get focus on show diff invocation when diff has been already opened
Editor. Editing TextBug IDEA-273143 No selection-related item in "New Scratch File" in Run console
Bug IDEA-273145 "Export to Scratch File" creates files with wrong text
Feature IDEA-169769 Add "Create new scratch file" to Alt+Enter action on selection
Feature IDEA-119435 Keep caret position when commenting code
Feature IDEA-149044 Actions to show popup scratch list and particular scratch
Feature IDEA-194931 Automatically remove empty scratch files
Bug IDEA-271601 Suppress scratch file intention in VCS dialogs
Bug IDEA-262221 Font ligatures do not get enabled in editor but are shown in the preview
Bug IDEA-273731 Strange sorting order in Scratch Files popups
Bug IDEA-264288 Join lines with comment on the second line produces red code
Usability IDEA-138523 Allow new 14.1 AutoWrap Long Lines to be Disabled
Bug IDEA-273729 "New Scratch File" invoked from Find Results creates empty file in some cases
Feature IDEA-136148 Copy from Run Log into Scratch Window
Bug IDEA-138474 Scratches do not support custom file types
Bug IDEA-273127 java.lang.IllegalArgumentException occurs when trying to create scratch file
Feature IDEA-228556 Set field color based on access visibility
Bug IDEA-263980 Unexpected caret movement behavior in text with RtL fragments and a tab char
Usability IDEA-145278 Scratches settings: always create empty scratch file / buffer
Bug IDEA-270291 Blue borders are blinking in TODO
Bug IDEA-166692 Unexpected result when selecting a line and then using shift + down arrow
Feature IDEA-166360 Caret placement after selection
Feature IDEA-273126 Remove opened empty scratch files on closing project
Bug IDEA-273740 Custom file types is ignored when creating scratch
Feature IDEA-80384 Different color and fonts style for public, protected and private methods.
Editor. Error HighlightingUsability IDEA-130373 Highlighting should not be paused during VFS refresh
Bug IDEA-272748 Incorrect displaying settings in Color Scheme → Language defaults
Editor. FormatterBug IDEA-186208 Disabling "Code Style / Java / Chained method calls / Wrap first call" does not glue the method invocation to identifier
Exception IDEA-269375 FormattingModelInconsistencyException at com.intellij.formatting.FormatterImpl.validateModel
Bug IDEA-218936 IDEA: Java code rearrangement may produce illegal forward reference
Bug IDEA-242506 .editorconfig automatic reformat inserts invalid space
Usability IDEA-260940 Can't generate .editorconfig entries after the .editorconfig file has been created
Bug IDEA-170699 Preview for Code Style goes crazy
Bug IDEA-226487 EditorConfig indent settings not applying to SQL file
Editor. Intention ActionsFeature IDEA-263473 'Fix all' action for (at least some) compilation errors
Bug IDEA-264648 Nothing to show pop up is too big
Editor. SpellcheckBug IDEA-272375 False-positive spell correction "Wrong article": "a" vs. "an" in front of "hours"
Editor. TextMate BundlesBug IDEA-263847 Some log files not editable
Lang. JSONBug IDEA-268772 NCDFE: ParseException on Exception on attempt to evaluate JsonPath expression
Bug IDEA-268856 Edit schema mappings shows an extracted version of settings
Feature IDEA-269430 JSONPath: add Evaluate JSONPath action to editor context menu
Feature IDEA-264003 JSONL type for New Scratch
Lang. MarkdownBug IDEA-269403 Markdown: md file toolbar doesn't have the edit buttons
Exception IDEA-270501 CCE at org.intellij.plugins.markdown.editor.lists.MarkdownListEnterHandlerDelegate.postProcessEnter
Usability IDEA-270883 Change "Markdown -> Create Link" shortcut from Cmd+K
Feature IDEA-245576 Convert Markdown to Docx (import/export docx)
Bug IDEA-271134 Disable floating toolbar on pull requests input fields
Feature IDEA-245577 Convert Markdown to Pdf
Bug IDEA-261987 Markdown plugin render blank page
Feature IDEA-261922 'Expand selection' in markdown should stop inside backtick-quoted code
Task IDEA-264671 "export to..." group for markdown with providers for converting to html, docx, and pdf
Feature IDEA-210695 Export markdown to html
Task IDEA-270479 Move Import/Export actions from File to Tools->Markdown Converter sub menu
Lang. Shell ScriptBug IDEA-262819 Syntax Highlighting issue with process substitution and process redirection
Usability IDEA-252906 Support for running scripts without path
Bug IDEA-263122 Wrong detection of the balanced string quotes in the shell script
Bug IDEA-244342 Wrong syntax highlighting in shell script
Lang. YAMLBug IDEA-267035 Syntax language hint no longer works in YAML files.
Bug IDEA-264311 Fragment editor of injection YAML unexpectedly closed after ENTER
Tools. DockerBug IDEA-271210 from services docker-compose down does not include --env-file
Bug IDEA-267093 Dockerfile. Quick help. Correct some descriptions
Feature IDEA-270075 add possibility to disable folding for Docker log console
Bug IDEA-202831 Docker, DockerCompose. Ephemeral ports: Port bindings tab is not updated after the container restart
Feature IDEA-173760 Docker Compose: Allow operations on multiple services/containers (run, stop, etc)
Bug IDEA-271250 Docker: Allow to disable the notification to install/enable the Shell Script plugin
Bug IDEA-267124 Docker-compose. Duration type: wrong inspection errors for 2.5s format
Feature IDEA-270074 ask user before delete orphans services
Bug IDEA-222687 Support docker-compose compatibility option
Bug IDEA-267032 Docker-compose. Add validation for shm_size key values
Feature IDEA-271126 Docker. Log console for every compose service node
Exception IDEA-272043 java.io.IOException: Pipe closed, pipe id: `ComposeExternalRuntime.pipe:writeToT` at a compose app container restart
Bug IDEA-267110 Docker-compose. Ports validation. Add validation errors in case of ports with spaces
Cosmetics IDEA-271972 Docker-compose. Networks: change icons from "container" to the corresponding to volumes/networks
Bug IDEA-272883 Impossible to disable Run Built image option in Docker
Feature IDEA-193298 DockerCompose: provide possibility to navigate from alien nodes to the possible compose files
Bug IDEA-259303 Docker. Settings on the Tools page are wrong red marked
Bug IDEA-267527 Docker. Debug doesn't work: Unrecognized argument: null
Usability IDEA-267225 Docker: Inspect output is barely readable
Bug IDEA-270825 Docker: NullPointerException on connect to node in Services view
Bug IDEA-267013 Docker-compose. Wrong inspection errors for start_period key
Usability IDEA-272439 Docker. Volumes. Smart delete dialog. Provide possibility to expandAll/collapseAll/selectAll/deselectAll buttons, add info about selected sub-nodes
Bug IDEA-267016 Docker-compose. Wrong inspection error for 'user' key
Bug IDEA-271120 Docker-compose. Services view: if all the services are yellow then make the root compose item also yellow
Bug IDEA-271870 Docker. Networks. Remove "Delete" item from the context menu for the default networks
Feature IDEA-265630 [docker-compose editor] add validation for duration type
Bug IDEA-273737 close open project leads to the red Docker Compose service state
Bug IDEA-268618 Docker: [windows] improve error thrown when attempting to connect to Docker when Docker isn't running
Bug IDEA-271868 Docker compose: "Enable synchronization with Services view" doesn't work
Cosmetics IDEA-271836 Docker-compose. The icon of a new compose app looks line it is a simple container
Bug IDEA-272946 Docker over ssh builds docker-compose only locally
Bug IDEA-271920 Docker. Delete a volume: Correct the confirm dialog content
Feature IDEA-159173 Docker integration: ability to restart containers
Bug IDEA-267020 Docker-compose. Inspection error for "subnet" value from spec
Bug IDEA-267017 Docker-compose. Wrong inspection for `cpus` key
Bug IDEA-271873 Docker. Make it not possible to edit the output of the inspect action
Feature IDEA-268333 Dockerfile: add quickfix for not allowed spaces
Usability IDEA-262348 Docker Compose Run Configuration: the focus is not on the chosen option from the Up list
Bug IDEA-272064 Docker. Don't create a new run configuration by re-run with -p option
Bug IDEA-272112 Docker-compose. Impossible to remove project name option
Feature IDEA-255708 Allow language injection info Dockerfile commands
Bug IDEA-273441 attach network to compose service by "com.docker.compose.project" label
Bug IDEA-269753 Docker: Image completion leads to FROM instruction replacement and exception java.util.NoSuchElementException: Array is empty.
Usability IDEA-271130 Docker. Smart delete dialog: add some tips over/near compose items
Feature IDEA-268003 Mark unquoted ports in a docker-compose.yml as a warning
Feature IDEA-171328 Docker - allow for pausing/unpausing containers
Cosmetics IDEA-271720 Docker. Container log tab: Fold log actions layout is inconvenient
Bug IDEA-230542 IDE gives warning for multiple-line "command" service option
Exception IDEA-273372 NPE: DockerRuntimeCache
Bug IDEA-271413 Docker. No list of docker items after connection: Cannot obtain deployments: Illegal char
Bug IDEA-271976 Docker. Networks/Volumes: display "Containers" tab with the related containers
Bug IDEA-267007 Docker-compose. Inspection errors by "list" presentation for `environment` key
Usability IDEA-271112 Docker. Smart delete. Idea is blocked until all is deleted, make the action process in the background.
Bug IDEA-266983 Docker-compose. Inspection errors for device_cgroup_rules values from spec
Usability IDEA-272979 Quick documentation examples in Dockerfiles can be hard to read
Feature IDEA-185923 Docker: provide quick-help for keys in Dockerfiles, docker-compose.yaml files
Bug IDEA-272788 Docker. Networks. "Containers" tab: + button doesn't work
Usability IDEA-262734 Docker-compose run configuration. "With exit code" up option: show the validation error just after this option adding
Bug IDEA-268617 Docker Compose: port indentation is off for code completion
Bug IDEA-266612 java.lang.NullPointerException: Parameter specified as non-null is null at adding build options
Bug IDEA-268997 Docker. Fails to re-run the pointed Dockerfile: the node hangs in the Service view
Usability IDEA-271107 Docker-compose. Add the explaining tooltips about "red/yellow" states of the items in the Services view
Feature IDEA-251843 Docker. Support folding regions for RUN in Dockerfiles
Bug IDEA-273226 Docker Compose: ports outside the 0-65535 interval pass the validation
Bug IDEA-272067 Docker. Don't leave the container in the stopped state after saving changes
Bug IDEA-272228 Docker. No easy possibility to remove volumes without dependencies
Bug IDEA-273371 docker plugin "inspect" vs docker CLI "inspect"
Bug IDEA-273565 Docker via SSH. Inspect on any item leads to java.util.concurrent.CompletionException
Bug IDEA-274078 smart delete work incorrect in some cases
Bug IDEA-272619 Docker. Port bindings are not present on the tab after Save action
Bug IDEA-272035 Docker. Image run configurations: Command Preview is absent
Feature IDEA-227244 Docker: Provide Safe Delete UI for the Delete Image action
Feature IDEA-265631 [docker-compose editor] add validation for ip type
Bug IDEA-270969 Docker Plugin does not work after a restart of CLion EAP 2021.2
Feature IDEA-251420 Docker: Implement start/stop for "alien" compose nodes
Feature IDEA-265632 [docker-compose editor] add validation for ports mapping type
Bug IDEA-271023 Docker. Show image action for a container doesn't work.
Bug IDEA-271143 Docker-compose. Disable or don't show "Delete" action for not existing items
Bug IDEA-273566 Docker. Two equal "Labels" tabs for a volume
Bug IDEA-262553 Docker. Dockerfile/Image run configurations: Command Preview is absent in the new options UI
Bug IDEA-271913 Docker. Rerun via Service view of a Dockerfile/Image doesn't include run config changes
Bug IDEA-271139 Docker-compose. Disable "Down" for the synchronized not-existing compose app
Bug IDEA-271035 Docker. Smart delete. "Delete selected" dialog: correct the behavior of the root item
Bug IDEA-267498 Docker-compose. Wrong inspection error for `cpus` key value
Bug IDEA-273722 all documents should be saved before Docker Compose actions
Tools. HTTP ClientFeature IDEA-271808 HTTP Client: provide Generate HTTP Request intention for implicit web references
Bug IDEA-239324 REST client JSON output limitation / truncated
Bug IDEA-271320 Ctrl+z allows to undo all the text in the Http Client tab
Usability IDEA-265960 "Http is not safe" hint overlaps with underlined references in URL
Usability IDEA-269042 HTTP Client: should not mark regexp for URL as a insecure http link
Feature IDEA-267008 HTTP Usage Inspection: ignore local URL addresses by default and add an option
Bug IDEA-264163 HTTP Client freezes IDE on big response
Bug IDEA-266294 HTTP Client doesn't use credentials specified in Proxy Authentication dialog in case of autodetected proxy
Tools. TerminalFeature IDEA-118845 Allow configurable cursor shape in terminal
Feature IDEA-198475 Powershell as a default shell on Win 10
Feature IDEA-151206 SSH terminal add a new connection
Bug IDEA-260165 Alt + F/B shortcuts do NOT work in Terminal
Bug IDEA-258409 Terminal pane must be opened manually in order for shell configurations to run in 2020.3
Feature IDEA-212446 Make opening external files from the embedded terminal configurable
Bug IDEA-269214 Several keystrokes not recognized by embedded local terminal ( latest debian )
Bug IDEA-265118 Can't open Local Terminal
Feature IDEA-165184 Add "Use Option as Meta key" support to terminal
Bug IDEA-170763 Some special characters cannot be typed in IDE terminal
Feature IDEA-268890 Provide quick way to open WSL in Terminal tool window
Bug IDEA-266310 Typography settings not working in terminal
Bug IDEA-238288 PhpStorm Terminal is not outputting ANSI formatting sequences correctly
Feature IDEA-166948 Presets for different shells
Feature IDEA-268134 Allow to increase/decrease/reset font size in the built-in terminal using keyboard shortcuts
Feature IDEA-142610 Allow to switch between different shells in the terminal plugin
Tools. Test ManagementBug IDEA-272693 PluginException: com.jetbrains.test.ide.actions.OpenDefaultProjectAction: group with id "WelcomeScreen.QuickStart.IDEA" isn't registered
Bug IDEA-270365 "New Test from Test Cases" create file to "/target/generated-sources/annotations" root directory
Bug IDEA-270362 When choose "Test from Test Case" option within TMS selection window test cases has not ids
Bug IDEA-268204 TMS with local markdown files mixes scenarios
User InterfaceFeature IDEA-265000 Navigating from the Editor splits: allow users to choose where to activate the file already opened in another split
Bug IDEA-236120 Transparent title bar is not hidden if a detached tab is opened in full screen mode
Bug IDEA-271330 Settings "Drag-and-drop with Alt pressed only" broken
Task IDEA-272290 Don't show What's new page in the IDE on fresh install
Bug IDEA-267389 Icons appear for popup items without icons
Bug IDEA-267718 [BigSur alerts] Do not support HTML tags in options namees
Cosmetics IDEA-270694 Some components background color looks wrong in macOS Light theme
Usability IDEA-184944 Use words instead of symbols in shortcuts for OSX
Bug IDEA-263607 Inconsistent and annoying presentation of "Copy Path..." menu item
Bug IDEA-263581 Add JDK: "com.intellij.openapi.roots.ui.configuration.SDKListItem$..." action items are displayed on touch bar
Bug IDEA-191366 Text in file inspection header is unreadable due to wrong color
Feature IDEA-237881 Provide a way to group problems by type in Problems View
Bug IDEA-264566 "Updates available" icon disappears after IDEA restart
Bug IDEA-262987 Frame icon is small when in presentation mode
Bug IDEA-189731 Results preview of "analyze dataflow" is "empty" for all but first result inside one node
Feature IDEA-259660 Add a shortcut to allow switching Big Sur tabs
Bug IDEA-271833 Wrong buttons order on touch bar for dialogs
Bug IDEA-269313 Toolbar and navigation bar are hidden under project tabs if projects are opened in full screen
Bug IDEA-268307 Sort tool windows without mnemonics in Recent Files alphabetically
Bug IDEA-268310 File icons are rendered differently for multiple-selection in VCS changes trees
Exception IDEA-269240 'IllegalArgumentException: Can't find advanced setting' when call 'Reset Got it tooltip' action
Feature IDEA-145837 Add left margin regulation for distract free mode
Cosmetics IDEA-270200 Broken selection color in New File dialog
Bug IDEA-268182 Projects are opened as separate windows instead of tabs if transparent title bar is enabled
Bug IDEA-236133 Window does not get to "normalize" state by double-click the transparent title bar
Cosmetics IDEA-267398 "About" dialog is not well-aligned when shown in JetBrains Mono font
Cosmetics IDEA-267732 "Browse icon for selection action (*.png)" doesn't reflect that .svg is also supported
Bug IDEA-268606 Arrow buttons are not displayed in the image diff
Bug IDEA-272337 Reversed arrows in trusted dialog
Bug IDEA-256073 Black frame in selected ComboBox item
Bug IDEA-264380 Exception on startup
Bug IDEA-272081 Items from popups are not shown on touch bar
Bug IDEA-269330 Add notification for IDEs running under Rosetta2 on apple M1 processors
Usability IDEA-270670 Tool window in Float mode is hard to drag
Bug IDEA-270541 Esc doesn't close some dialogs
Bug IDEA-271880 Alerts: remove mnemonics from title and support line breaks in message
Usability IDEA-269111 "Customize menus and toolbars" action shows an extracted version of the settings
Bug IDEA-264013 WebPreview icon isn't shown if all browsers are disabled
Usability IDEA-269106 "Edit scopes" setting opens an extracted part of the settings
Feature IDEA-263488 Add a status bar widget for Power Save mode
Usability IDEA-272108 Splitter sizes are not saved anymore / suitable after new EAP version is released
Bug IDEA-272889 Line numbers are cut in Recent Locations
Bug IDEA-253426 Implement "Show pinned tabs in a separate row" for single row layout
Task IDEA-265429 Set minimal width and height of Welcome Screen
Bug IDEA-267051 Sort icon is missing in table headers
Cosmetics IDEA-263411 Fix System settings layout
Usability IDEA-249597 "Copy" context menu now requires submenu navigation
Bug IDEA-262687 Some mnemonics are not visible in popups
Bug IDEA-270071 Quick Definition popup rendering
Bug IDEA-271735 No plugin counter is visible in High Contrast theme
Bug IDEA-263393 Open In Browser action from the URL context action menu is invoked just on mouse hovering or navigating by arrays through the actions popup if Intentions Preview is enabled
Bug IDEA-271380 Selected item in the completion popup is unreadable with Mac OS Light theme
Bug IDEA-271941 Multi-modules detection needs reopen projects
Usability IDEA-267926 Display project name in 'Open project' confirmation dialog
Bug IDEA-269107 "configure" action for conflicting changelists shows an extracted version of the settings
Cosmetics IDEA-262886 Move the "Open without Importing" button to the center
Bug IDEA-271191 Confirmation dialogs are broken
Task IDEA-270877 Tool windows dnd: add "drag distance" threshold for tool window buttons and headers
Usability IDEA-270122 Only last component of root module group name is shown in Project Structure dialog
Bug IDEA-236115 Mac title bar is empty in full screen mode
Cosmetics IDEA-271858 Detected sdk first element selection looks weird
Usability IDEA-265158 Cannot dnd tab to pin when options 'One row' and 'Show pinned tabs in a separate row' are on
Bug IDEA-261155 Built-in HTML tab is opened as Preview tab if the *.html file is opened as Preview tab
Bug IDEA-267670 Add an option key to call "Maximize Editor" with double-click on editor tab
Usability IDEA-270614 Windows Jump lists items don't have tooltips
Usability IDEA-265384 Make IDE and Project settings widget disablable
Task IDEA-270841 Main menu cleanup (Refactoring, Analyze, Tools, Help)
Bug IDEA-269705 New Project wizard doesn't allow to select project type
Usability IDEA-271622 "Quick definition" popup can't be moved
Cosmetics IDEA-270760 Highlighting area of a dragged tool window takes the whole editor height
Usability IDEA-262095 Pinned tabs in a separate row: don't stretch unpinned tabs
Feature IDEA-269756 Better names for multi-module projects on welcome screen in small IDEs
Bug IDEA-271944 Letter from the last word will be used for abbreviations in icon
Bug IDEA-239838 Duplicated file opened in split mode when we are paused on a breakpoint in debug mode (Tabs are disabled)
Bug IDEA-261853 JBTextField consumes space when invisible
Task IDEA-265276 Improve wording in New Project Settings menu item
Bug IDEA-270699 Toolwindows won't open on mouseclick: TRANSLUCENT translucency is not supported
Bug IDEA-262284 Recent Projects popup doesn't remember it's width
Bug IDEA-271374 Resizing tool windows in "Undock" view mode does not work/work wrong
Task IDEA-234632 Make backgroundable tasks start in background by default
Cosmetics IDEA-236119 Wrong font is used in title bar if transparent title bar is enabled
Bug IDEA-261164 In Mac Messages the warning icon is always displayed as the general IntelliJ icon
Bug IDEA-261052 JDK Update should use the IDE/Plugin updates
Bug IDEA-265122 PHPStorm-EAP 2021.1 throw exception on welcome screen (com.intellij.util.ImageLoader.getResourceData)
Bug IDEA-232632 "Mark modified (*)" works only if "Show file icon" is enabled for Editor tabs.
Task IDEA-268511 ExpandableTextField#setMonospaced(true) should use editor font instead of system one
Bug IDEA-261117 Built-in HTML preview reloads when unreated files are changed
Bug IDEA-270989 New Help menu: Ctrl+C shortcut is not working
Task IDEA-268320 Tab drag out of the editor should open tab in a separate window
Bug IDEA-267047 Frequent crashes at [libnst64.dylib+0x6be2] _setButtonData+0x142 in IDEA Nightly (no reproducer yet)
User Interface. AccessibilityBug IDEA-270858 Items in result list in Search Everywhere are not pronounced by screen reader
Bug IDEA-264923 On MacOS, the name of the IDE error icon is spoken with HTML tags
Bug IDEA-263910 Screen reader pronounces "text/html" for some notifications
User Interface. Action SystemBug IDEA-270131 Context menu is not shown in unfocused Project view
Bug IDEA-269626 "Compact View" button doesn't work
Bug IDEA-267137 Keyboard navigation in popup menu causes duplication in submenu
Bug IDEA-273186 "File" menu sometimes not opening after click
Bug IDEA-263127 Deadlock in ActionUpdater
Feature IDEA-266279 Create dedicated Maximize Editor action
Bug IDEA-264547 Clicking on the "Run Tests" gutter unexpectedly creates a breakpoint
Bug IDEA-263282 Toolbar jumps and popups resize due to that in async update mode
Task IDEA-264768 Right click on a gutter unexpectedly creates a bookmark
Bug IDEA-265677 CloseNotificationAction is not available during indexing
Bug IDEA-264299 Toolbar with browsers is no more visible in html files
Bug IDEA-264398 Empty menu item in Favorites tool window menu
Performance IDEA-264612 0.5 s delay when showing the branch list
Bug IDEA-269110 "Configure inspections" does nothing in 212
User Interface. Console ViewBug IDEA-250608 Output automatically activates soft-wrap when a line is longer than 100000 characters
User Interface. ControlsBug IDEA-267068 Offset clickable area for the Resolve button in the Commit panel
Bug IDEA-267261 "Select File In Project View" in TouchBar toggles project build O_o
Bug IDEA-264027 Branch actions dialog is being closed immediately
Bug IDEA-260511 Combox with JBPopup closes on update
Bug IDEA-271423 'VCS' menu item is renamed to 'Git'
User Interface. Embedded Browser (JCEF)Task IDEA-265333 allow per-browser off-screen rendering mode
Bug IDEA-269711 osr markdown is not painted when switching the view modes
Bug IDEA-244182 JCEF heavyweight popup closes too early or always stays on top [Linux]
Bug IDEA-273898 add registry key to switch Code With Me to OSR mode
Bug IDEA-269568 switch markdown viewer to lightweight OSR mode
Bug IDEA-269332 support JBR-3447 org.cef.browser.CefBrowserOsrWithHandler#createDevToolsBrowser is not implemented
Feature IDEA-265760 implement off-screen jcef render handler
Bug IDEA-260275 Screen sharing in jcef also captures microphone
User Interface. Find, Replace, UsagesBug IDEA-270766 "Usages of ..." tool window notification is not closed after search is completed
Bug IDEA-272398 "Search for base method usages" option is shown for methods without base methods and constructors
Bug IDEA-268087 Fix cosmetics in search field in editor and in popup
Bug IDEA-242476 Filter icon becomes a line of checkboxes when the icon does not fit on the toolbar
Task IDEA-231362 Implement Show Usages popup new design
Task IDEA-231364 Implement Find Usages tool window and dialog design updates
Bug IDEA-268598 "Replace" is not invoked with Cmd+R if focus is in Find field
Bug IDEA-270761 Find in Files defaults to a "Directory" scope after serching in File
Feature IDEA-137166 Export Find Results to new Scratch file
Bug IDEA-272143 "Show usages" popup is not closed with Esc key if Scope combobox is focused
User Interface. FocusBug IDEA-266195 Navigating to Definition not Focusing on Other Screen
Bug IDEA-268607 Some git actions (probably all) don't raise Git tool window focus when the tool window is in window mode
Bug IDEA-250423 Wrong file selected in Project View when clicking it after working in detached Editor
Bug IDEA-264005 Non-modal commit tool window isn't focused sometimes on 'Commit' action (when "Refreshing Local Changes" progress is shown)
Bug IDEA-235818 Cmd+` (Command backtick) switches between windows in different workspaces
Bug IDEA-214538 UI freeze caused by java focus API, Ubuntu 18.04, two monitors
Bug IDEA-271932 Click on gutter does nothing if focus is out of editor
Bug IDEA-265676 Switching to another project using File -> Open Recent does not work if the other project is already opened and its window is minimized
Usability IDEA-194818 Focus in Open Project dialog should be on "New Window"
User Interface. Keyboard InputBug IDEA-198381 Modifiers from macro action invocation shouldn't affect macro execution
User Interface. Look and FeelBug IDEA-256700 Different behaviour of JEditorPane for Darcula and IntelliJ Light themes
Bug IDEA-269582 Broken High contrast theme in 2021.2
User Interface. NavigationUsability IDEA-269923 Navigating Back/Forward should remember if the file was opened in Preview Tab
Usability IDEA-222648 Navigate to test data: Do not show a popup for a single option
Bug IDEA-269744 Duplicates in Search Everywhere
Bug IDEA-272404 Option to open file in an inactive split is not considered when opening a file from Recent files with Tab Placement: None
Feature IDEA-269550 Debugger: Use Preview Tab for files opened for frame navigation and stepping
Bug IDEA-270835 Mnemonics in Switcher window not working with Ctrl+Shift pressed
User Interface. PluginsUsability IDEA-265998 Plugin update: modal error messages appear one on another
Bug IDEA-257729 java.nio.file.InvalidPathException: Illegal char <:> at index 4: file:\C:\Program Files\JetBrains\IntelliJ IDEA 211.3089\lib\icons.jar!\plugins\pluginLogo.svg
User Interface. Project ViewPerformance IDEA-261054 ProjectViewTree.getFileColorFor
Bug IDEA-269161 Broken backward compatibility in PsiDirectoryNode
Bug IDEA-265441 Project tool window "copy path" context menu action copies wrong path (focusing issue)
Feature IDEA-162454 Project View. Count selected items.
Bug IDEA-270746 Remove "Add BOM" option from project tree context menu
User Interface. Search EverywhereBug IDEA-270589 navigate to class: show in find toolwindow opens empty results
Bug IDEA-266701 Search Everywhere: Wrong hint on All tab after switching from Actions tab
Bug IDEA-261426 Empty line in Search Everywhere results when searching for "vcs"
Bug IDEA-271699 Search everywhere: "Quick definition popup" doesn't take current selected item in results list into account
Bug IDEA-273308 Search everywhere: redundant options found for multi-word search sometimes
Bug IDEA-271963 Actions by abbreviations are not shown at the top of results in "Find Action" if ML sorting is enabled
Usability IDEA-265751 "Open recent" name in find dialog could be unintuitive
User Interface. TabsBug IDEA-274043 file opens in new window when using ctrl+alt+left and ctrl+alt+right
Version ControlUsability IDEA-269749 Add "Run Tests" option in Version Control | Commit | Before Commit
Cosmetics IDEA-264640 Branches: Add "Group By" tooltip
Bug IDEA-272191 Double-clicking a file inside "Local Changes" opens strange Diff
Feature IDEA-57574 Ability to enable tests execution in "before commit" actions
Bug IDEA-268108 Balloon notification does not escape html from jest output
Bug IDEA-264651 Branches: "Expand/Collapse All" shortcuts do not work correctly when search filter is filled
Feature IDEA-241921 Branches panel should respect the Path filter
Exception IDEA-266052 Tests before commit: IllegalStateException: Already resumed
Bug IDEA-269829 Commit is done whereas pre-commit test task isn't successful
Bug IDEA-264772 Tests before Commit: cannot run tests in gradle project
Bug IDEA-269314 Shift+Tab navigation is not working in Commit toolwindow
Bug IDEA-269629 Analyze Code before commit: latest added profiles are not shown as selected
Usability IDEA-237547 Ctrl-Tab in preview diff conflicts with tabs switcher
Task IDEA-266238 Add "Fetch" icon to VCS main menu
Bug IDEA-267194 Settings Repository fails at clone due to incorrect upstream branch resolution
Usability IDEA-171261 Cannot delete last changlist
Bug IDEA-270337 Tests before Commit: Selected Tests configuration is not updated in Commit toolwindow if was changed in Settings
Usability IDEA-265077 Pre-commit checks in background: add re-run icon
Usability IDEA-171873 Commit change dialog should show code cleanup profile
Bug IDEA-270294 Error running Tests': Cannot run 'Test' on '<default>' in AppCode
Task IDEA-272199 Add the Show on Double click selector under Gear of GIt toolwindow
Bug IDEA-264996 Tests before Commit: infinite checks spinner if test configuration is not full
Usability IDEA-268812 'Esc' no longer closes the diff window
Bug IDEA-264786 Tests before Commit: first underscore in configuration name turns into mnemonic
Bug IDEA-264758 Tests before Commit: code compilation is not started on tests run before commit
Bug IDEA-265636 Clicking Help button in Remove Remote dialog throws an exception
Usability IDEA-264785 Pre-commit checks in background: hard to distinguish failed checks when many are shown
Bug IDEA-269322 Lost conflicting renamed/modified changes during Update project process
Bug IDEA-264658 Branches: Missing Edit / Remove remote context menu items
Bug IDEA-272134 Regression: Local Changes is missing inline diff in 2021.2 EAP 4
Cosmetics IDEA-269628 Analyze Code before commit: first underscore in profile name turns into mnemonic
Feature IDEA-194094 Add option to disable changelists completely
Version Control. GitBug IDEA-272205 Git GPG Signing: cannot turn off commit signing when no private keys were found
Bug IDEA-271726 VcsException: Cannot run program "gpg": error=2, No such file or directory
Cosmetics IDEA-269554 Show Diff button is always active even though the selection is empty
Bug IDEA-259512 Automatic exclusion of files listed in .gitignore only recognizes files from 1 repository root.
Feature IDEA-259421 Add an action to call Ignored but not excluded check
Task IDEA-269501 Git GPG Signing: provide link to help when gpg-signing fails
Exception IDEA-272443 NPE at git4idea.config.GitExecutableDetector.getBashExecutablePath
Task IDEA-269158 Update Compare actions to show diff in the editor
Feature IDEA-232456 Branches: Allow grouping by repository
Bug IDEA-270207 WSL: IDE incorrectly autodetects git on windows after export/import wsl distro
Bug IDEA-268542 "New branch" doesn't work in branches popup invoked from VCS operations popup
Exception IDEA-267043 Exception and threadDump after merging via Git Merge dialog
Bug IDEA-272962 GPG Key does not display correctly the owner name
Bug IDEA-253401 Git Staging Area: File name completion doesn't work in commit message field when staging is enabled
Feature IDEA-193572 Support git config core.hooksPath
Bug IDEA-262265 Unshelve with drag and drop doesn't work inside commit tab
Bug IDEA-263100 Compare with Branch functionality actually compares with tag if branch and tag have identical names
Version Control. GitHubUsability IDEA-262864 GitHub Sync Fork: sync fork action returns "No suitable GitHub account found" notification instead of "Log In to GitHub" dialog when no github account is configured
Cosmetics IDEA-264969 Create Pull Request: use default font color for the errors, red icon is enough to attract attention
Bug IDEA-264973 Pull Request: Do not suggest to reset filters when the search query is empty
Bug IDEA-265637 GitHub Sync Fork: sync fork doesn't work when upstream configured with ssh or http url
Bug IDEA-264976 Pull requests: reset filter should not set state:open
Bug IDEA-264970 Create Pull Request: do not duplicate error about empty pull request on creation
Bug IDEA-267608 Create PR is just doing a git push without actually creating a PR in PyCharm 2021.1
Bug IDEA-264961 Create Pull Request: remove plus and target icons for New Pull Request View
Bug IDEA-203276 Rebase My GitHub Fork and Create PR offers to select between origin and upstream
Bug IDEA-272485 GitHub PullRequest: remote branch isn't detected on new PR creation
Usability IDEA-264210 GIthub Pull Requests: New Pull Request tab is not focused after login
Cosmetics IDEA-263303 GitHub Pull Requests: beautify API error messages
Bug IDEA-263361 GitHub Pull Requests: push is incorrectly recognized as successful when create PR without access to repo
Bug IDEA-251331 Comments in diffs are not visible when "Hard wrap at" is set to 0
Bug IDEA-270034 GitHub tab is not refreshed after authorization
Bug IDEA-264499 "Create Pull Request" button does not appear until after "Pull Requests" pane has been opened
Bug IDEA-251845 "Malformed URL" error when "Open on GitHub" for files with `[brackets-in-name].js` (common / required Next.js filename pattern)
Cosmetics IDEA-264987 Create Pull Request: new text for "no changes" warning
Bug IDEA-265152 Create pull request: show tooltip with full repo-branch spec on hover
Bug IDEA-260230 Loading Github branch protection rules not consistent
Usability IDEA-263390 GitHub Pull Requests: can't hit pencil button by keyboard
Version Control. Local HistoryCosmetics IDEA-271576 Search in Local History: Changes tree blinks if no results found
Feature IDEA-70015 Search Local History for file content and labels
Bug IDEA-271318 Search in Local History: Do not show diff if no results found
Usability IDEA-271317 Search in Local History: Ctrl+F should set cursor into search field
Usability IDEA-271431 Search in Local History: no keyboard navigation between items
Bug IDEA-269828 Search in Local History Freeze
Version Control. LogException IDEA-269709 Stable 'java.io.IOException: Broken index maps' after reopening some projects in AppCode
Code InsightTask PY-48008 Pattern Matching: Parser, PSI, highlighting
Bug PY-44548 Unresolved reference 'RawArray'
Feature PY-44974 Support PEP 604 -- Allow writing union types as X | Y
Bug PY-42132 Type checker doesn't support Literals in TypeDicts
Bug PY-38065 Support literal tuples types declared with typing.Literal
Bug PY-46355 No completion for xml.dom.minidom
Bug PY-45206 Non-deterministic type inference for recursive instance attributes
Feature PY-46321 Markdown: Add Python REPL (doctest) code fence
Bug PY-48665 Pattern Matching: f-string-like completion should be disabled inside literals used as patterns
Task PY-48760 Pattern Matching: CFG
ConsoleBug PY-30940 "Run with Python console" prevent updating global variables
Bug PY-40000 Debug prompt does not show output when debugging from debugger attached to python console
Cosmetics PY-47974 Single string literal in the Python console is highlighted as a docstring, not as a regular string
Bug PY-48207 Execute In Console executes in the wrong console during debug session
Bug PY-49021 Interrupt doesn't work in Python & Debug Console
Bug PY-43902 TypeError when subclassing object and overwriting __getattribute__
DebuggerUsability PY-48865 Can't attach to a Python process while indexing
Bug PY-42488 Debug console can't handle "sys.stdin"
Bug PY-44778 PyCharm not suspended on break point when Maya as Python interpreter.
EditingBug PY-34151 Keymap - no action "step into my code"
Bug PY-49080 Pattern Matching: Unnecessary backslashes inserted on enter in patterns with brackets
Task PY-48039 Pattern Matching: Keyword completion
Feature PY-48014 Pattern Matching: Complete current statement
FormatterTask PY-48009 Pattern Matching: Formatter
InspectionsBug PY-41268 Broken matching of inferred collection element types with typing.Literal
Bug PY-45438 Support type hinting with callback protocols
Bug PY-41578 Type checker false-positive on dict of literals
Bug PY-48958 sys.orig_argv is unresolved
Bug PY-48948 sys.stdlib_module_names is unresolved
Bug PY-39762 Unexpected arguments on logging.basicConfig
Bug PY-49091 Pattern Matching: update bundled pycodestyle
Bug PY-46755 Duplicate Detection Highlight do not disappear
RefactoringException PY-46099 "Extract Superclass" fails if the method contain a class initialization and its method invocation
Exception PY-47162 IndexNotReadyException after variable name changes during indexing
Bug PY-20675 Problem while renaming element in Inspection Results
Bug PY-47633 Pull Up/Pull Down does not insert necessary imports for complex properties
RunBug PY-36063 Running file in console changes Run/Debug configuration
Test RunnerUsability PY-44421 Switching expected/actual via swapdiff no longer allowed in pytest.ini
Feature PY-48996 Add ability to mark folder as "test root"
Bug PY-49140 Test run configurations are repeated in run configuration template
Usability PY-49070 Auto-detect test runner
Usability PY-48468 Add "--no-header --no-summary -q" flags to the run configuration instead of hardcoding them
Bug PY-30788 (Django) Tests from mixins are run with the wrong module path when using "Rerun Failed Tests"
Bug PY-48747 Error: Provide a qualified name of a function, class or module
Code CompletionBug DBE-2212 IDE suggest columns from pg_catalog instead of columns from selected search path
Usability DBE-10512 Add option to toggle suggestion of all objects from all schemas in completion drop-down
Bug DBE-9025 mssql complete not default schema
Bug DBE-12018 Auto completion in JOIN statement does not qualify objects
Feature DBE-11902 On optimistic left join completion, improve priorization
Feature DBE-10515 Give priority to chosen schema in code completion
Code FormatterFeature DBE-8059 An option to treat the asterisk in the SELECT clause as a regular element
Bug DBE-13485 Datagrip always wraps "Create or Alter Function" statement regardless of Code Style setting
Feature DBE-759 Add options to wrap alter table statement
Feature DBE-12690 Add formatting option for Place ON/USING under JOIN indented
Code GenerationBug DBE-13462 COMMENT and LANGUAGE positioned wrong
Bug DBE-12810 SERAIL field type is incorrectly generated for not default sequence
Code HighlightingBug DBE-13092 CockroachDB SQL dialect doesn't understand partial UNIQUE indexes in CREATE TABLE
Bug DBE-1632 PostgreSQL: Accessing subfields from function returning composite type
Bug DBE-12960 Oracle SQL*Plus dialect does not support "create blockchain table" command in DB 19c (19.10.0) or 21c
Bug DBE-12682 clickhouse dialect don't support EXCEPT and REPLACE in select query
Bug DBE-12059 CREATE\DROP\ALTER INDEX in SQL2016 are not supported
Bug DBE-13084 Add support for [update|drop histogram on] statements for MySQL dialect
Bug DBE-13557 UNMASK not recognized as valid permission (MS SQL Server)
Bug DBE-12548 Some CTEs are not supported in ClickHouse
Bug DBE-11582 select auto_id,`rank` from mm0; rank is parsed as function instead of column
Bug DBE-12992 Fix dictionary and dictionary field references resolving for ClickHouse dialect
Bug DBE-12955 Missing Functions in Snowflake Dialect for Datagrip
Bug DBE-13477 Support Redshift recursive CTE syntax
Bug DBE-13551 Inspector expect NEEST instead of NEST
Bug DBE-13058 BigQuery: support BIGNUMERIC/BIGDECIMAL
Feature DBE-13476 ClickHouse: support EXPLAIN/EXPLAIN PIPELINE statement syntax
Bug DBE-10550 Aliased table names are highlighted as missing or invalid
Bug DBE-13280 Queries with CTE do not work against ClickHouse when sql is multiline or not wrapped in brackets and join syntax highliting
Bug DBE-10782 Wrong coalesce inspection detects in ClickHouse Dialect
Bug DBE-12343 ClickHouse toDecimalN could not take such arguments false positive
Bug DBE-13401 ERROR: syntax error at end of input when running multiline default privileges statement
Bug DBE-12952 GROUP_CONCAT () does not accept LIMIT clause
Bug DBE-12838 The Exasol IGNORE NULLS Option for Analytics Functions is not recognized
Bug DBE-12304 Clickhouse correct SQL query shows an error in editor
Bug DBE-9172 Inline/in-line PL/SQL Functions in SQL queries fail due to syntax-check
Bug DBE-13471 Support Full-Text Search capabilities of MS SQL Server 2016/2017/2019 / Azure SQL Database
Bug DBE-13458 Clickhouse asof and semi join support
Bug DBE-3804 Oracle SQL: Existing synonym marked as unresolvable
Bug DBE-3759 SQL inspection: "column should be in group by clause" inspection doesn't work at PostgreSQL, db2 and Derby
Bug DBE-13364 Not working inspection
Coding AssistanceBug DBE-13493 'Merge INSERT statements' only takes a few of the selected
ConnectivityUsability DBE-13181 Data Sources & Drivers > Advanced: Table not visible on MacOS 11.3
Bug DBE-13468 Athena results in java.lang.NullPointerException
Usability DBE-10327 Database tool window does not appear after creating connection
Data Editor/ViewerBug DBE-13095 [YUGABYTE] [0A000] ERROR: System column with id -1 is not supported yet
Feature DBE-6383 CSV table editor: column names cannot be manipulated
Usability DBE-13055 DataGrip should display the time zone if the data type is one with time zone
Bug DBE-7109 Azure: Incorrect query for Jump to Editor action
Bug DBE-13450 Invalid query to fetch first referenced row(ERROR: operator does not exist: integer = character varying)
Usability DBE-12545 Remember new ORDER BY field location on UI
Feature DBE-12547 Allow to set additive sorting by default (old title: Multiple column sorting no longer works)
Bug DBE-13078 No tooltip when hovering commit/rollback button in Database view
Bug DBE-11744 Insert NULL in column of type enumeration results in error
Bug DBE-13361 Image Preview of Blob only showing text in query results
Bug DBE-12716 Alt+F7 on binary primary key returns empty search result
Bug DBE-11078 No schema name in 'Choose target' popup
Bug DBE-13522 columns header glitch in database tool window
Bug DBE-13236 Data is truncated when pasting on cell(s) in database view
Bug DBE-13130 Keymap conflict in database tool "add Row" <-> "set NULL"
Bug DBE-9814 Oracle DATE type values should not contain time 00:00:00
Usability DBE-12883 Rename 'Related Data' to 'Related Rows' in 'Go To' context menu
Feature DBE-1751 Add an "Open in console" button side by side with the "View Query"
Bug DBE-12679 Filter's inability to format date columns.
Data Import/ExportBug DBE-13328 Too big SQL query causes error when table is exported to Excel
Bug DBE-12683 Conversion failed timestamp -> smalldatetime when coping tables
Bug DBE-13449 Default exported file name doesn't use comment above query
Feature DBE-13448 export table data to the excel would lost precision for bigint field : 导出数据格式为bigint的数据到excel表格,数据精度丢失
Usability DBE-13259 Improve copy numeric data from SQLite due to dynamic types
Feature DBE-10368 Import CSV success message should contain the link to open the new table
Database ExplorerBug DBE-13532 Database view Object filter not working
Usability DBE-13276 No way to create a data source from SQLite file using the context menu
Bug DBE-12745 Broken breadcrumbs
Database MigrationsUsability DBE-12800 Object migration popup default size is weird
Bug DBE-12652 MariaDB: invalid syntax for user creation with TLS Options
Feature DBE-12357 Additional option 'purge' in drop confirmation dialog for Oracle
DiagramsFeature DBE-3541 Table comment in diagrams
Bug DBE-13264 UML Diagram notes are being lost on save
Explain PlanBug DBE-13473 Failed to explain execution plan while using ClickHouse
GeneralFeature DBE-12094 Local history is absent for the source code editors
Usability DBE-13068 Add 'Shorten datasource and object names in tab titles' option to context menu of tab
Feature DBE-13111 Treat DataGrip projects like it's done in all other IDEs.
Bug DBE-13502 Impossible to assign a hotkey for Clone Row
IntrospectionBug DBE-13355 There is no length for varchar index in mysql
Bug DBE-13520 ClickHouse supports ddl comments while DataGrip not.
Performance DBE-13427 Introspection queries needs to be optimized
Bug DBE-4269 Postgres operators: introspect and code-generate the "commutator" clause
Bug DBE-13443 Presto: "primary keys not supported SQLException" after force refresh
Bug DBE-13425 Azure connection loses databases when refreshing a single database
Feature DBE-10580 Introspect Redshift external tables with nested elements
Bug DBE-9386 PG12 generated column DDL not valid
Bug DBE-8546 DataGrip 2019.2. Not Recognize USING keyword in CREATE TABLE syntax (PostgreSQL 12)
Bug DBE-13320 Connection Error: Must declare the scalar variable "@@servername". Catalog view 'fulltext_indexes' is not supported in this version.
Navigation & SearchBug DBE-9259 Can't map keyboard shortcuts to [Full-text Search...]
Feature DBE-13363 CMD + up to explore database schema objects instead of new console opening
Usability DBE-13140 Can't open table data view from Favorites
Bug DBE-13272 Unable to see full name of objects in Favorites despite plenty of room in the Favorites window/panel
Usability DBE-10826 Target data source filter needs to chop long data source names
Query ConsoleCosmetics DBE-12897 Execute routine dialog looks ugly in default settings
Bug DBE-13634 Re-opening MongoDB console triggers NPE in JSItemPresentation.getFileName
RefactoringBug DBE-12711 'Qualify identifier' is missed in ORDER BY
Feature DBE-13365 Intention for adding column to column list or GROUP BY clause
SQL GeneralBug DBE-13479 Oracle Formatter doesn't recognise OCI Unicode String Literal (U'String) syntax
SQL ResolveBug DBE-12619 [SQL Server] Unable to resolve security policy
Feature DBE-12263 Unable to resolve object type 'SimpleAggregateFunction' for Clickhouse DDL
Schema DiffBug DBE-13121 Unify primary key and unique index in diff view
Usability DBE-13277 Create an action point to execute migration script
  • No labels