Child pages
  • IntelliJ IDEA 2021.2 EAP (212.4746.52 build) Release Notes
Skip to end of metadata
Go to start of metadata

You are viewing an old version of this page. View the current version.

Compare with Current View Page History

Version 1 Current »

No subsystemException IDEA-272959 "com.intellij.diagnostic.PluginException: Class com.intellij.spring.boot.run.SpringBootApplicationConfigurationTypeBase must be not requested from main classloader of com.intellij.spring.boot plugin"
Bug IDEA-271853 Actions on save: Don't run dumb aware actions on save in dumb mode
Bug IDEA-272125 macOS: SIGSEGV at [libnst64.dylib] setTouchBar / com.intellij.ui.mac.touchbar.NST.setTouchBar
Bug IDEA-272894 SIGSEGV at [libobjc.A.dylib] objc_msgSend in -[NSTouchBarViewController _updateTree]
Bug IDEA-272131 macOS: SIGILL at [libsystem_kernel] __kill in Should translate autoresizing mask into constraints if _didChangeHostsAutolayoutEngineTo:YES.
Bug IDEA-272172 IdeaVim project is completely broken on 2021.1.2
Usability IDEA-272388 Performance Testing plugin: open support request leads provides non-rider link
Bug IDEA-272992 Class com.intellij.spring.boot.run.lifecycle.SpringBootApplicationLifecycleManager must be not requested from main classloader of com.intellij.spring.boot plugin [Plugin: com.intellij.spring.boot]
Bug IDEA-272993 com.intellij.diagnostic.PluginException: Class com.intellij.spring.boot.run.lifecycle.beans.tab.LiveBeansPanelContent must be not requested from main classloader of com.intellij.spring.boot plugin [Plugin: com.intellij.spring.boot] with 2.4.6 spring boot
Bug IDEA-273291 "ok/cancel" new dialog boxes under windows have default/selected buttons wrong
Exception IDEA-272139 "java.lang.Throwable: Class com.jetbrains.packagesearch.intellij.plugin.maven.MavenProjectModuleType must be not requested from main classloader"
AndroidBug IDEA-273016 Preferences/Settings: Editor: Inspections: Compose preview: titlesof inspection are displayed as keys
Exception IDEA-270482 Could not load wear devices: java.lang.NumberFormatException: For input string: ""
Bug IDEA-258250 Android SDK Manager fails on apple slicon (archer 64)
Build. Built-in (JPS)Bug IDEA-272409 Skipping Scala files without a Scala SDK in module(s) untitled814 when added scala sdk
Build. GradleException IDEA-271340 java.lang.ClassNotFoundException: com.intellij.util.lang.PathClassLoader when running bootRun task
Bug IDEA-200371 IntelliJ Gradle integration selects wrong settings.gradle and build.gradle when having sub projects
Bug IDEA-270755 Gradle Task with 'Allow Parallel Run' option hangs when executed subsequently
Bug IDEA-227167 Gradle composite build does invoke wrong target if includedBuild task is executed in gradle view and fails with exception
Bug IDEA-261872 Cannot launch proper JPS JUnit Run Configuration after previously unsuccessful Run Configuration launch
Bug IDEA-207003 Gradle Composite Build included build has the same root project name as the main build
Build. MavenBug IDEA-267163 Maven importer does not find dependency version declared in parent and reports a validation error
Bug IDEA-268157 Maven bundle dependency no longer resolved after upgrade to 2021.1
Bug IDEA-271495 Suddenly Java version is no longer recognized by the build
Bug IDEA-257309 [Regression] Maven wrapper feature works no longer in IntelliJ Idea 2020.3
Build. Package SearchException IDEA-271528 Exception on inspections pass
Bug IDEA-271229 PackagesTable can create invalid NavigatableArray in getData()
Bug IDEA-272032 [EA-296951] Rerunning code highlight may cause exceptions
Code Analysis. InspectionBug IDEA-255753 Descriptions are missed for tools warning on attempt to run inspections build in TeamCity
Bug IDEA-272286 org.eclipse.jdt.annotation.NonNullByDefault should not add @NonNull to Local variables
Code Analysis. Language InjectionException IDEA-272957 Injecting YAML into YAML causes exceptions
CoreBug IDEA-271664 Intellij Idea fails to start with VPN enabled
Core. DebuggerBug IDEA-272734 History navigation is broken in evaluate window
Core. DiagramsException IDEA-271806 AE at com.intellij.openapi.graph.impl.GraphBase.wrap
Bug IDEA-271586 Diagrams: selected node (or no-bends edge) doesn't look selected
Core. IDE SettingsBug IDEA-272996 typo in Advanced settings > Use Windows certificate store option description
Task IDEA-216133 Migrate macOS environment reader from Python
Cosmetics IDEA-271651 Actions on Save: Show warning under `Upload to default server` when Deployment sever is not configured
Bug IDEA-269681 UI font changed after update to 2021.2 on Linux
Cosmetics IDEA-271786 Settings | Tools | Actions On Save | Rearrange Code: duplicated 'XML' entry in the 'configure arrangement rules' drop-down
Core. IDE Settings. SharingBug IDEA-272508 Got all my toolchains removed
Core. IndexingTask IDEA-268796 Cleanup indexing diagnostics on cache invalidation
Task IDEA-269170 Indexing: add navigation link to project indexing diagnostics from Menu/Tools
Core. InstallationException IDEA-272114 Unhandled AccessDeniedException if try to clean-up the directory without required permissions
Usability IDEA-271458 IDE should display notification when there are no leftover directories to cleanup
Bug IDEA-272075 Last Used date shows "51 years" on mac for empty directories
Core. LicensingBug IDEA-273061 Login dialog: Fallback mechanism: an attempt to validate wrong token does not show error messages
Bug IDEA-272971 Login Dialog: try to open browser in fallback scenario
Bug IDEA-272359 Login Dialog: support fallback scenario
Core. Platform APIBug IDEA-270799 AboutPopupDescriptionProvider information no longer displayed on About screen
Bug IDEA-264792 Broken ToolWindowManagerImpl#unregisterToolWindow(String id)
Core. Plugin ManagementException IDEA-273256 PluginException: Class com.intellij.spring.integration.injection.el.SpringIntegrationELImplicitVariableFactory must be not requested from main classloader of com.intellij.spring.integration plugin [Plugin: com.intellij.spring.boot]
Bug IDEA-271488 PluginException: Cyclic service initialization: interface='com.intellij.openapi.keymap.KeymapManager'
Exception IDEA-271785 Throwable: Class com.intellij.spring.el.SpringELLanguage must be not requested from main classloader of com.intellij.spring plugin
Bug IDEA-272831 On plugins unloading some dependent plugins fail to load without any user-visible hints
Bug IDEA-271502 PluginClassloader logs errors which would be ignored otherwise
Exception IDEA-272436 PluginException: Class com.intellij.spring.boot.cloud.stream.library.SpringCloudStreamLibraryUtil must be not requested from main classloader of com.intellij.spring.boot plugin [Plugin: com.intellij.spring.boot]
Bug IDEA-272022 2021.2 EAP doesn't offer a restart after installing language pack plugin
Bug IDEA-272739 Exception in IDEA core at startup
Bug IDEA-272165 `Restart` action in "Plugin list has changed" balloon requires smart mode
Bug IDEA-271835 Class com.intellij.spring.persistence.integration.hibernate.SpringXmlHibernateSessionFactory must be not requested from main classloader of com.intellij.spring plugin
Exception IDEA-273001 PluginException: Class com.intellij.spring.el.SpringBeansAsElVariableUtil must be not requested from main classloader of com.intellij.spring plugin [Plugin: com.intellij.spring]
Bug IDEA-271398 MissingResourceException after dynamic plugin installation
Bug IDEA-270430 Not Possible to enable bundled plugin: the required implementation-details plugin is disabled
Bug IDEA-272801 Plugin recommendations by Maven dependencies are not shown on project opening
Core. Project SettingsBug IDEA-271843 Artifacts aren't serialized into cache after importing Maven project from scratch
Bug IDEA-272025 IDEA fails to open project if it has incorrect value of 'type' attribute in 'orderEntry' tag in one of its iml files
Bug IDEA-272863 If a module is removed from list of unloaded modules, it may become unloaded again after external changes in project configuration
Bug IDEA-273184 Freshly Created Project in the Drive Root Throws NPEs on Creation and Opening
Exception IDEA-272606 Throwable at com.intellij.packaging.impl.artifacts.workspacemodel.ArtifactManagerBridge.initBridges
Core. Quick DocumentationPerformance IDEA-272548 Heavy UI freezes with quick doc panel and font ligatures enabled
Core. Run. ConfigurationsBug IDEA-266683 Environment variables in Java Run dialog behavior doesn't conform to the hint provided in configuration window.
Core. Run. TargetsCosmetics IDEA-260898 Run Targets. SSH wizard small fix
Core. SSHBug IDEA-272423 Broken ProxyJump emulation through ProxyCommand
Core. StatisticsTask IDEA-270682 Add run icon gutter click to gutter.icon.click group
EditorBug IDEA-271823 NullPointerException occurs when trying to open markdown file again
Cosmetics IDEA-244880 Quick documentation display option: "On hover" vs "on mouse move"
Bug IDEA-272390 VCS name in annotations is longer than the highlighting with JB Mono 14
Editor. Diff and MergeBug IDEA-273714 Diff in a separate window doesn't get focus on show diff invocation when diff has been already opened
Bug IDEA-273869 Compare with Local opens diff window instead of Changes between revision and local changes dialog
Usability IDEA-271662 Too long tab title for compare actions
Usability IDEA-268591 Add an option to switch Diff into a frame to the Editor settigns
Usability IDEA-271914 Diff in editor overlaps by dialog
Bug IDEA-269981 Shortcuts for Compare Previous/Next File don't work after first invocation
Bug IDEA-273361 Diff stops working after back action
Editor. Editing TextBug IDEA-271601 Suppress scratch file intention in VCS dialogs
Feature IDEA-149044 Actions to show popup scratch list and particular scratch
Bug IDEA-273729 "New Scratch File" invoked from Find Results creates empty file in some cases
Bug IDEA-273145 "Export to Scratch File" creates files with wrong text
Bug IDEA-273740 Custom file types is ignored when creating scratch
Feature IDEA-273126 Remove opened empty scratch files on closing project
Bug IDEA-273127 java.lang.IllegalArgumentException occurs when trying to create scratch file
Bug IDEA-273731 Strange sorting order in Scratch Files popups
Bug IDEA-273143 No selection-related item in "New Scratch File" in Run console
Feature IDEA-136148 Copy from Run Log into Scratch Window
Editor. Error HighlightingBug IDEA-272748 Incorrect displaying settings in Color Scheme → Language defaults
Editor. SpellcheckBug IDEA-272375 False-positive spell correction "Wrong article": "a" vs. "an" in front of "hours"
FrameworksCosmetics IDEA-272171 gRPC endpoints provider produces ugly endpoints in compact mode
Frameworks. LombokCosmetics IDEA-269179 Lombok inspections should be nested under the Java branch
Frameworks. MicronautBug IDEA-272608 Run Targets: the remote java is shown in the Application Run Configuration when the remote target is selected, but not in the Micronaut
Bug IDEA-272609 Could not apply run target change for Micronaut run configuration
Bug IDEA-272249 Micronaut: dashes in the groupId of a new project cause errors on attempt to create packages structure
Frameworks. OpenAPI (Swagger)Bug IDEA-273216 i18n:Preference/Settings: Editor: Live Template: hardcode description of OpenAPI
Exception IDEA-272193 Microservices: Slow operations are prohibited on EDT from Endpoints actions update
Frameworks. QuarkusBug IDEA-273452 ConfigYamlAccessor must be not requested from main classloader of com.intellij.microservices.config plugin [Plugin: com.intellij.quarkus]
Bug IDEA-267416 Quarkus: unsatisfied dependency warning is shown when a config class annotated with @ConfigProperties is injected
Bug IDEA-272867 Quarkus: false-positive CDI injection inspection warning for config properties injected into interface
Frameworks. SpringFeature IDEA-267075 Spring: add shared indexes consent option to Spring Initializr wizard
Bug IDEA-269955 Spring Security: role references are not inserted when mvcMatchers() method is used
Bug IDEA-269569 Spring Testing: autowiring error is shown for TestRestTemplate bean in Kotlin
Bug IDEA-264916 Spring Integration: false autowiring error report for the @ServiceActivator-annotated method parameter
Feature IDEA-235953 Support @DynamicPropertySource methods in Spring 5.2.5
Bug IDEA-269890 Group name in Spring Initializr project wizard incorrectly forbids entering dashes
Exception IDEA-271255 Exception "Cannot create class com.intellij.spring.el.parser.SpringELParserDefinition" which prevents proper indexing and analysis of classes
Bug IDEA-254671 Spring MVC Testing: MockMVC urls are not shown in the Endpoints view
GroovyBug IDEA-272024 Groovy syntax highlighting breaks after restarting IntelliJ
JavaBug IDEA-272190 Run configuration doesn't comply with modulepath/classpath distinction
Bug IDEA-273159 Run configuration getting module path wrong with indirect dependencies
Performance IDEA-231798 IntelliJ performance issue while typing (LightJavaModule#claimedModuleName)
Java. Code CoverageBug IDEA-266840 Cancel of prompt about outdated coverage removes all recorded coverage data
Performance IDEA-272132 Filtering default constructor takes a lot of time during coverage report loading.
Bug IDEA-272192 Error running tests with coverage: java.nio.file.FileAlreadyExistsException
Bug IDEA-269908 Detect tests covering line doesn't work with new tracing mode
Java. DebuggerBug IDEA-271799 Unexpected JDWP Error: 41 on StepOver while debugging
Bug IDEA-273116 Possible deadlock in debugger reader thread
Bug IDEA-271607 Empty threads combobox (with read only attach)
Java. Error HighlightingBug IDEA-272717 Good code red: sealed classes in libraries
Usability IDEA-273163 "Enable Project-Wide Analysis" tooltip doesn't make it clear that we only support Java
Java. InspectionsBug IDEA-272374 'New object is compared using ==' shouldn't show warning if object is used in both parts of comparison
Bug IDEA-271523 False positive warning "Casting 's1.toArray()' to 'T[]' will produce 'ClassCastException' for any non-null value"
Bug IDEA-273048 getExpressionNullability with DFA ignores annotations.
Java. Profiler. CPUFeature IDEA-257957 Async-profiler for M1
Java. RefactoringsUsability IDEA-271910 Rename "Generify" action to "Convert Raw Types to Generics"
Java. Tests. JUnitBug IDEA-272928 Test framework quit unexpectedly: Module not found
Bug IDEA-271888 IntelliJ test runner fails to discover Spock tests
Java. Tests. TestNGBug IDEA-271436 IntelliJ hides most of the failures for TestNG SoftAssert
JavaX. CDIBug IDEA-272583 Correctly define the context for CDI dependency diagram invoked via the gutter icon
Usability IDEA-255033 CDI tool window: Select the corresponding element(module) in the opened CDI view by clicking on the gutter
Bug IDEA-273092 CDI: Use the title case for merged gutter popup actions
Usability IDEA-259905 CDI: Merge scope and injection gutter icons on class
JavaX. JPABug IDEA-272468 JPA: insert Entity Graph references to EntityManager.createEntityGraph
JavaX. JavaEEFeature IDEA-260092 Java EE: Provide a global refactoring to migrate to Jakarta
Task IDEA-270723 Java EE: add Hibernate to Jakarta libraries in New Project wizard
LocalizationBug IDEA-272098 Move ChartsGotplBundle.properties to message top level
Task IDEA-272095 Move DockerAgentBundle.properties to messages folder
Bug IDEA-272926 Menus in presentation mode are unusable when Japanese language pack is installed
Localization. ChineseBug IDEA-242311 when this Chinese language pack is installed together with lombok, lombok's onMethod annotation gives an error. Closing the Chinese language pack solves the problem.
Plugin Development (DevKit)Bug IDEA-271845 Devkit: use <dependencies/plugin|module> in calculating dependencies
Bug IDEA-272900 DevKit: check EP "*ClassName" property
Bug IDEA-272164 Unable to run/debug plugin projects
Exception IDEA-271754 "Update IDE from sources" fails with MissingMethodException: eachFileRecurse
Task IDEA-271872 Devkit: support resolving sub-descriptors for <module>
Bug IDEA-271874 Devkit: add main plugin as implicit dependency for module.xml
SpaceUsability IDEA-271971 Space details: cannot hit Accept/Wait for Response buttons and review id link by keyboard
Bug IDEA-270552 Notification about necessity to login to Space does not disappear after logging in
Usability IDEA-270697 Add a login button to space error message in IDE
Cosmetics IDEA-271958 Space review: don't pluralize author and reviewer when there is the only one item
Task IDEA-272142 Space details: add Leave review button
Bug IDEA-272593 Comment field is not focused when opened (e.g. by Reply link)
Exception IDEA-272053 "Throwable: Write-unsafe context!" after logging in to Space
Usability IDEA-269081 Show number of draft comments on Accept Changes/Wait for Response button on review details page
Bug IDEA-272326 Actions in the review details panel are performed by a mouse press on a button.
Bug IDEA-271153 StringIndexOutOfBoundsException on editing comment with mention
Cosmetics IDEA-271839 Space review acceptance status indicator looks blurred
Tools. DockerBug IDEA-273737 close open project leads to the red Docker Compose service state
Exception IDEA-272043 java.io.IOException: Pipe closed, pipe id: `ComposeExternalRuntime.pipe:writeToT` at a compose app container restart
Bug IDEA-273565 Docker via SSH. Inspect on any item leads to java.util.concurrent.CompletionException
Bug IDEA-272946 Docker over ssh builds docker-compose only locally
Cosmetics IDEA-271836 Docker-compose. The icon of a new compose app looks line it is a simple container
Bug IDEA-202831 Docker, DockerCompose. Ephemeral ports: Port bindings tab is not updated after the container restart
Bug IDEA-271913 Docker. Rerun via Service view of a Dockerfile/Image doesn't include run config changes
Bug IDEA-272064 Docker. Don't create a new run configuration by re-run with -p option
Bug IDEA-272067 Docker. Don't leave the container in the stopped state after saving changes
Bug IDEA-271873 Docker. Make it not possible to edit the output of the inspect action
Bug IDEA-271870 Docker. Networks. Remove "Delete" item from the context menu for the default networks
Cosmetics IDEA-271972 Docker-compose. Networks: change icons from "container" to the corresponding to volumes/networks
Exception IDEA-273372 NPE: DockerRuntimeCache
Bug IDEA-273371 docker plugin "inspect" vs docker CLI "inspect"
Bug IDEA-267527 Docker. Debug doesn't work: Unrecognized argument: null
Bug IDEA-272788 Docker. Networks. "Containers" tab: + button doesn't work
Bug IDEA-273441 attach network to compose service by "com.docker.compose.project" label
Bug IDEA-272228 Docker. No easy possibility to remove volumes without dependencies
Bug IDEA-272035 Docker. Image run configurations: Command Preview is absent
Usability IDEA-272979 Quick documentation examples in Dockerfiles can be hard to read
Bug IDEA-273722 all documents should be saved before Docker Compose actions
Cosmetics IDEA-271720 Docker. Container log tab: Fold log actions layout is inconvenient
Bug IDEA-272112 Docker-compose. Impossible to remove project name option
Bug IDEA-272619 Docker. Port bindings are not present on the tab after Save action
Bug IDEA-271920 Docker. Delete a volume: Correct the confirm dialog content
Bug IDEA-271976 Docker. Networks/Volumes: display "Containers" tab with the related containers
Usability IDEA-272439 Docker. Volumes. Smart delete dialog. Provide possibility to expandAll/collapseAll/selectAll/deselectAll buttons, add info about selected sub-nodes
Bug IDEA-272883 Impossible to disable Run Built image option in Docker
Bug IDEA-262553 Docker. Dockerfile/Image run configurations: Command Preview is absent in the new options UI
Bug IDEA-273226 Docker Compose: ports outside the 0-65535 interval pass the validation
Bug IDEA-271868 Docker compose: "Enable synchronization with Services view" doesn't work
Bug IDEA-273566 Docker. Two equal "Labels" tabs for a volume
Tools. HTTP ClientFeature IDEA-271808 HTTP Client: provide Generate HTTP Request intention for implicit web references
Tools. KubernetesBug IDEA-271352 Kubernetes. Custom Namespaces. A new global namespace doesn't appear in all projects at once
Bug IDEA-274020 Kubernetes. Tollbar buttons don't work after adding a custom namespace with global level
Support Request IDEA-272207 Logs downloaded from Kubernetes pods are saved to "roaming" part of IDEA profile
Bug IDEA-271581 Kubernetes. Custom Namespaces: "default" namespace should not jump in/out from the list by by Apply/Refresh configuration
Feature IDEA-265325 Support marking namespaces as favorite
Tools. TerminalFeature IDEA-151206 SSH terminal add a new connection
Bug IDEA-265118 Can't open Local Terminal
Tools. Test ManagementBug IDEA-270365 "New Test from Test Cases" create file to "/target/generated-sources/annotations" root directory
Bug IDEA-272693 PluginException: com.jetbrains.test.ide.actions.OpenDefaultProjectAction: group with id "WelcomeScreen.QuickStart.IDEA" isn't registered
Bug IDEA-270362 When choose "Test from Test Case" option within TMS selection window test cases has not ids
User InterfaceTask IDEA-265429 Set minimal width and height of Welcome Screen
Bug IDEA-271330 Settings "Drag-and-drop with Alt pressed only" broken
Cosmetics IDEA-263411 Fix System settings layout
Usability IDEA-272108 Splitter sizes are not saved anymore / suitable after new EAP version is released
Cosmetics IDEA-271858 Detected sdk first element selection looks weird
Cosmetics IDEA-270694 Some components background color looks wrong in macOS Light theme
Bug IDEA-271880 Alerts: remove mnemonics from title and support line breaks in message
Bug IDEA-272081 Items from popups are not shown on touch bar
Usability IDEA-271622 "Quick definition" popup can't be moved
Bug IDEA-272889 Line numbers are cut in Recent Locations
Bug IDEA-271735 No plugin counter is visible in High Contrast theme
Task IDEA-272290 Don't show What's new page in the IDE on fresh install
Bug IDEA-271380 Selected item in the completion popup is unreadable with Mac OS Light theme
Bug IDEA-271833 Wrong buttons order on touch bar for dialogs
Bug IDEA-261117 Built-in HTML preview reloads when unreated files are changed
Bug IDEA-271374 Resizing tool windows in "Undock" view mode does not work/work wrong
Bug IDEA-271941 Multi-modules detection needs reopen projects
Bug IDEA-264013 WebPreview icon isn't shown if all browsers are disabled
Bug IDEA-271944 Letter from the last word will be used for abbreviations in icon
Bug IDEA-272337 Reversed arrows in trusted dialog
User Interface. AccessibilityBug IDEA-270858 Items in result list in Search Everywhere are not pronounced by screen reader
User Interface. Action SystemBug IDEA-269110 "Configure inspections" does nothing in 212
Bug IDEA-269626 "Compact View" button doesn't work
Bug IDEA-273186 "File" menu sometimes not opening after click
User Interface. ControlsBug IDEA-267261 "Select File In Project View" in TouchBar toggles project build O_o
Bug IDEA-271423 'VCS' menu item is renamed to 'Git'
User Interface. Embedded Browser (JCEF)Bug IDEA-273898 add registry key to switch Code With Me to OSR mode
User Interface. Find, Replace, UsagesBug IDEA-270761 Find in Files defaults to a "Directory" scope after serching in File
Feature IDEA-137166 Export Find Results to new Scratch file
Bug IDEA-270766 "Usages of ..." tool window notification is not closed after search is completed
Bug IDEA-272143 "Show usages" popup is not closed with Esc key if Scope combobox is focused
Bug IDEA-272398 "Search for base method usages" option is shown for methods without base methods and constructors
Bug IDEA-268598 "Replace" is not invoked with Cmd+R if focus is in Find field
User Interface. FocusUsability IDEA-194818 Focus in Open Project dialog should be on "New Window"
Bug IDEA-271932 Click on gutter does nothing if focus is out of editor
User Interface. NavigationBug IDEA-270835 Mnemonics in Switcher window not working with Ctrl+Shift pressed
Bug IDEA-272404 Option to open file in an inactive split is not considered when opening a file from Recent files with Tab Placement: None
User Interface. Search EverywhereBug IDEA-270589 navigate to class: show in find toolwindow opens empty results
Bug IDEA-273308 Search everywhere: redundant options found for multi-word search sometimes
Bug IDEA-271963 Actions by abbreviations are not shown at the top of results in "Find Action" if ML sorting is enabled
Bug IDEA-271699 Search everywhere: "Quick definition popup" doesn't take current selected item in results list into account
Version ControlBug IDEA-272134 Regression: Local Changes is missing inline diff in 2021.2 EAP 4
Task IDEA-272199 Add the Show on Double click selector under Gear of GIt toolwindow
Bug IDEA-272191 Double-clicking a file inside "Local Changes" opens strange Diff
Version Control. GitBug IDEA-253401 Git Staging Area: File name completion doesn't work in commit message field when staging is enabled
Bug IDEA-272962 GPG Key does not display correctly the owner name
Bug IDEA-272205 Git GPG Signing: cannot turn off commit signing when no private keys were found
Bug IDEA-271726 VcsException: Cannot run program "gpg": error=2, No such file or directory
Exception IDEA-272443 NPE at git4idea.config.GitExecutableDetector.getBashExecutablePath
Task IDEA-269501 Git GPG Signing: provide link to help when gpg-signing fails
Version Control. GitHubBug IDEA-267608 Create PR is just doing a git push without actually creating a PR in PyCharm 2021.1
Bug IDEA-251845 "Malformed URL" error when "Open on GitHub" for files with `[brackets-in-name].js` (common / required Next.js filename pattern)
Cosmetics IDEA-264987 Create Pull Request: new text for "no changes" warning
Bug IDEA-251331 Comments in diffs are not visible when "Hard wrap at" is set to 0
Bug IDEA-272485 GitHub PullRequest: remote branch isn't detected on new PR creation
Usability IDEA-264210 GIthub Pull Requests: New Pull Request tab is not focused after login
Bug IDEA-270034 GitHub tab is not refreshed after authorization
Cosmetics IDEA-264969 Create Pull Request: use default font color for the errors, red icon is enough to attract attention
Cosmetics IDEA-263303 GitHub Pull Requests: beautify API error messages
Bug IDEA-264970 Create Pull Request: do not duplicate error about empty pull request on creation
Bug IDEA-264973 Pull Request: Do not suggest to reset filters when the search query is empty
Bug IDEA-264976 Pull requests: reset filter should not set state:open
Version Control. Local HistoryUsability IDEA-271317 Search in Local History: Ctrl+F should set cursor into search field
Cosmetics IDEA-271576 Search in Local History: Changes tree blinks if no results found
Usability IDEA-271431 Search in Local History: no keyboard navigation between items
Bug IDEA-271318 Search in Local History: Do not show diff if no results found
No subsystemFeature WEB-45326 Chromium-based browsers Edge and Opera are assigned to non-Chrome family in "Settings → Tools → Web Browsers" window
Bug WEB-51406 Memory leak editing Vue 2.x Typescript SFC
Feature WEB-51419 Web-types: show icons in documentation
Feature WEB-51613 Show tooltip advertising pressing save to reload built-in HTML preview
Bug WEB-51498 Don't add a path to folder in imports after webpack aliases
Bug WEB-51628 Convert to string template doesn't work in assignment context
Feature WEB-51150 Launching Microsoft Edge
Bug WEB-51616 Prepend relative path prefix to completion items
Feature WEB-51573 Show What's New in WebStorm after update
Bug WEB-50998 "js.namespace.index" seems to produce keys with quotes sometimes
Bug WEB-51576 Run/debug with docker-compose doesn't work with new targets api
Feature WEB-50133 Enable "Copy/Paste with imports" feature for "require"-s
Build toolsBug WEB-50500 Gulp tool window button on sidebar not available after phpStorm restart
Bug WEB-50622 Grunt tool window no longer persists between IntelliJ launches
CSSBug WEB-51099 Support all steps function keywords for "transition-timing-function"
Feature WEB-51071 text-decoration-thickness is marked as Unknown CSS property
Bug WEB-49599 No completion of Tailwind classes if className value is dynamically evaluated
Feature WEB-48767 Support for Tailwind class names completion in styled-components
Bug WEB-50961 Add support for missing generic font families
Bug WEB-50930 Unknown pseudo selector 'file-selector-button'
DebuggerPerformance WEB-50909 Webstorm High Memory Usage Over Time (Suspected Memory Leak)
Usability WEB-50873 Broken default layout of JavaScript debug tool window
Usability WEB-50777 Inline value of an array with an empty string looks unusual in Debugger
Usability WEB-48157 Node.js 15+: Step Into enters "async_hooks" on debugging async/await functions
Bug WEB-51608 Reload Built-in Preview if it's already open
Cosmetics WEB-51183 Incorrect positioning of tabs in Debug tool window
JavaScriptException WEB-51366 Adding require import causes an exception: java.lang.Throwable: Threading assertion. psiFile
Exception WEB-51350 auto-import useState causes exception
Bug WEB-51508 'Redundant await expression' doesn't handle function with non-promise result
Bug WEB-21852 Refactoring (renaming) a JSDoc type name does not rename all occurrences
Bug WEB-51289 Autosave of file every second (on typing) and crashing/freezing because of FLOW.exe
Bug WEB-51311 Ctrl+Click on break inside switch statement jumps to the wrong place
Feature WEB-49120 creating arrow function could be a bit more simplified
Bug WEB-49054 No code completion in dynamic classNames in template strings after interpolation
Bug WEB-49102 PyCharm is not displaying class functions properly
Cosmetics WEB-51320 Update description for the ECMAScript 6 language level
Bug WEB-50996 Copying imports from a type declaration should respect types of import in a file
Bug WEB-49131 No auto-import suggestions provided for lodash
Bug WEB-50897 live templates on keywords completion ignore semicolon termination preferences
Bug WEB-50949 for-await-of doesn't unwrap promise type
Bug WEB-50015 Incorrect javascript import path using aliases when working on WSL2
Feature WEB-51357 Autocomplete/highlighting/navigation broken when importing TypeScript file via a *.js suffix from a JavaScript file
JavaScript. FrameworksFeature WEB-26714 Add support for the classnames library when using React
Bug WEB-51335 Named slots shows 'Unrecognised Slot name'
Bug WEB-50538 Props values completion doesn't work when using component created with forwardRef()
Bug WEB-51329 No documentation & resolve for the 'template' tag in .vue
Bug WEB-51338 Unknown events (@input, @focus)
Bug WEB-51339 Pattern info is shown in the Quick doc popup
JavaScript. InspectionsBug WEB-51403 ES6 Simplification misses possible assignment under very specific conditions within do-while loop
Bug WEB-51312 Add details/examples to "Pointless statement or boolean expression" inspection description
Bug WEB-51274 "Mismatched query and update of collection" inspection not working correctly
Bug WEB-50898 "Method expression is not of Function type" when accessing a prototype method using Symbol
JavaScript. RefactoringBug WEB-51370 Substring isn't removed from a function name when removing a state name
Bug WEB-51401 "Extract method" refactoring fails for switch statement ("multiple exit points" error)
Bug WEB-51511 "Make method static" breaks calls to private methods
LintersFeature WEB-51288 Update bundled JSHint to 2.13
Live EditBug WEB-51423 Live reload stop working (Throwable: Timeout on waiting for client)
Node.jsBug WEB-51783 NPM script run configuration is wrongly marked as invalid if node & npm are taken from WSL2
Bug WEB-51389 Use https to fetch npm package versions
Bug WEB-51514 Can't start TypeScript service with remote node interpreter
Bug WEB-51515 Prettier hangs on the first run when remote node interpreter is configured
Bug WEB-51516 Stylelint doesn't work with remote node interpreter
Bug WEB-51500 NPM install fails with StackOverflowError exception
Bug WEB-47462 WebStorm does not use selected WSL Node for Git operations
Exception WEB-51391 Exception while creating React template project
Performance WEB-51565 Linked packages under @types are indexed always
TypeScriptBug WEB-51392 Update tsconfig.json schema to include ES2021 target.
Feature WEB-51449 Add tsconfig.test.json to the list of associated file names for TypeScript Configuration Files
Bug WEB-50975 Typescript 4.3: Allow override as parameter property
Bug WEB-48764 React + typescript, React class component with generic type raise expected syntax error
Task WEB-51690 Update bundled TypeScript to 4.3
Code CompletionFeature DBE-11902 On optimistic left join completion, improve priorization
Bug DBE-9025 mssql complete not default schema
Code FormatterBug DBE-13485 Datagrip always wraps "Create or Alter Function" statement regardless of Code Style setting
Feature DBE-12690 Add formatting option for Place ON/USING under JOIN indented
Code GenerationBug DBE-13462 COMMENT and LANGUAGE positioned wrong
Code HighlightingBug DBE-13557 UNMASK not recognized as valid permission (MS SQL Server)
Bug DBE-12548 Some CTEs are not supported in ClickHouse
Bug DBE-3804 Oracle SQL: Existing synonym marked as unresolvable
Bug DBE-13551 Inspector expect NEEST instead of NEST
Bug DBE-13458 Clickhouse asof and semi join support
Bug DBE-12682 clickhouse dialect don't support EXCEPT and REPLACE in select query
Bug DBE-10782 Wrong coalesce inspection detects in ClickHouse Dialect
Bug DBE-13280 Queries with CTE do not work against ClickHouse when sql is multiline or not wrapped in brackets and join syntax highliting
Feature DBE-13476 ClickHouse: support EXPLAIN/EXPLAIN PIPELINE statement syntax
Bug DBE-12343 ClickHouse toDecimalN could not take such arguments false positive
Bug DBE-12838 The Exasol IGNORE NULLS Option for Analytics Functions is not recognized
Bug DBE-13471 Support Full-Text Search capabilities of MS SQL Server 2016/2017/2019 / Azure SQL Database
Bug DBE-10550 Aliased table names are highlighted as missing or invalid
Bug DBE-12304 Clickhouse correct SQL query shows an error in editor
Bug DBE-12992 Fix dictionary and dictionary field references resolving for ClickHouse dialect
Bug DBE-13477 Support Redshift recursive CTE syntax
Coding AssistanceBug DBE-13493 'Merge INSERT statements' only takes a few of the selected
ConnectivityBug DBE-13468 Athena results in java.lang.NullPointerException
Data Editor/ViewerBug DBE-13450 Invalid query to fetch first referenced row(ERROR: operator does not exist: integer = character varying)
Bug DBE-11744 Insert NULL in column of type enumeration results in error
Bug DBE-13236 Data is truncated when pasting on cell(s) in database view
Bug DBE-7109 Azure: Incorrect query for Jump to Editor action
Feature DBE-6383 CSV table editor: column names cannot be manipulated
Bug DBE-13522 columns header glitch in database tool window
Bug DBE-13361 Image Preview of Blob only showing text in query results
Data Import/ExportBug DBE-13328 Too big SQL query causes error when table is exported to Excel
Feature DBE-13448 export table data to the excel would lost precision for bigint field : 导出数据格式为bigint的数据到excel表格,数据精度丢失
Bug DBE-13449 Default exported file name doesn't use comment above query
Database ExplorerBug DBE-13532 Database view Object filter not working
Database MigrationsFeature DBE-12357 Additional option 'purge' in drop confirmation dialog for Oracle
Explain PlanBug DBE-13473 Failed to explain execution plan while using ClickHouse
GeneralBug DBE-13502 Impossible to assign a hotkey for Clone Row
IntrospectionBug DBE-13355 There is no length for varchar index in mysql
Bug DBE-13443 Presto: "primary keys not supported SQLException" after force refresh
Performance DBE-13427 Introspection queries needs to be optimized
Bug DBE-13425 Azure connection loses databases when refreshing a single database
Bug DBE-13520 ClickHouse supports ddl comments while DataGrip not.
Navigation & SearchFeature DBE-13363 CMD + up to explore database schema objects instead of new console opening
Query ConsoleBug DBE-13634 Re-opening MongoDB console triggers NPE in JSItemPresentation.getFileName
SQL GeneralBug DBE-13479 Oracle Formatter doesn't recognise OCI Unicode String Literal (U'String) syntax
SQL ResolveFeature DBE-12263 Unable to resolve object type 'SimpleAggregateFunction' for Clickhouse DDL
  • No labels