Skip to end of metadata
Go to start of metadata

You are viewing an old version of this page. View the current version.

Compare with Current View Page History

« Previous Version 18 Next »

RubyMine 2020.3.1 RC (203.6682.122 build) Release Notes

EditorBugRUBY-27545Backspace doesn't work on last line in empty files
Core. InstallationBugIDEA-256573Unsupported Java Version error when idea.jdk file references Java < 11
Core. Project SettingsBugIDEA-257310Changes in *.iml files for projects imported from Maven/Gradle aren't loaded by IDE automatically
Lang. MarkdownBugIDEA-256650UTF-8 characters not rendered properly in Markdown files after update to 2020.3
User Interface. Embedded Browser (JCEF)BugIDEA-258055Empty page and exception when opening "What's new" tab
CSSFeatureWEB-48226Tailwind CSS support doesn't work in Yarn PnP projects

RubyMine 2020.3.1 Preview (203.6682.69 build) Release Notes

Core. ConsolesBugRUBY-27194Rails console parameters from Run Anything aren't passed to rails console
RailsBugRUBY-27145Text field in rails g dialogues became too large
Rails. Code InsightBugRUBY-27229Foreign key not correctly detected in belongs_to when using structure.sql and schemas/table name prefixes
Ruby. ParsingFeatureRUBY-27309Updates to rightward assignment & pattern matching
FeatureRUBY-27312Add support for one-line pattern matching with the "in" keyword for ruby 2.7
BugRUBY-27303RM doesn't highlight incorrect rightward assignment syntax
BugRUBY-27448RubyMine in some cases automatically adds end for endless method definitions
Ruby. Tests. CucumberFeatureRUBY-26444Cucumber: code completion for RSpec assertions
Core. IDE SettingsBugIDEA-252588Cannot export IDE settings (NotDirectoryException: code.style.schemes)
BugIDEA-255461CodeStyle settings jump to last tab when search filter matches entries in last tab
CosmeticsIDEA-244165Preferences: Expand-arrow is hard to notice on blue background
Core. IDE Settings. SharingCosmeticsIDEA-228653Wording: These all Sync Settings
Core. IndexingBugIDEA-255670shared-indexes: public project shared index for IntelliJ Community
UsabilityIDEA-257595Do not show notification about pre-build shared indexes multiple times for the same project
Core. InstallationBugIDEA-256564IntelliJ IDEA Community 2020.3 release has EAP icon on macOS
Core. LicensingBugIDEA-254664License date information off by one day
BugIDEA-257485Add new license should honour previous state
BugIDEA-255967License Collision dialog: change wording
Core. Plugin ManagementBugIDEA-254315Description in File Templates does not work any more
BugIDEA-256922Impossible to enable plugins back after disabling Database Tools and SQL
BugIDEA-254484No opportunity to disable plugin per project via cogwheel menu on the plugin page
Core. Project SettingsBugIDEA-255223"Copy to module libraries..." action throws `IndexOutOfBoundsException` (`OrderEntryUtil#replaceLibraryEntryByAdded`, New project model)
BugIDEA-257310Changes in *.iml files for projects imported from Maven/Gradle aren't loaded by IDE automatically
BugIDEA-257341Changes in facet configuration in iml file aren't loaded by IDE on the fly
BugIDEA-257337Workspace model: issues with NonNegativeIntIntBiMap implementation
BugIDEA-256822IJ creates unwanted folders with gradle project creation
BugIDEA-257335Workspace model: exception when editing non-existing entity
BugIDEA-257235Libraries folder disappear from .idea folder
BugIDEA-257254Facet tag not cleaned up from iml files
BugIDEA-257249Iml files related to the module are not cleaned up
BugIDEA-256482KOTLIN_BUNDLED path variable is sometimes expanded in Kotlin Facet settings in iml file after updating to new build in Toolbox
BugIDEA-256968Incorrect behaviour of workspace model storage
BugIDEA-256411"SDK Default" Default project language level is reset after IDE restart
Core. Run. ConfigurationsBugIDEA-244894[new run config UI] when switching to the new UI - in the Code Coverage section included and excluded classes are hidden
BugIDEA-253468New Run Configuration UI: 'Include dependencies with Provided scope' option is reset
BugIDEA-247789Modify link underline does not disappear
BugIDEA-256532[new run config UI] if delete one of 3 Build Before Launch task - all Build tasks will be deleted after dialog re-opening
BugIDEA-255767Compound Run Configuration .run.xml files are duplicated many times when stored as project file
BugIDEA-257029IntelliJ IDEA 2020.3 GUI: Configuration Window textfield does not scale with font size
BugIDEA-243747[new run config UI] add to Modify menu for Logs and Coverage sections - options to close the appropriate block
BugIDEA-252563"Template. The values saved here..." banner isn't shown for template run configurations using the new UI
BugIDEA-255343[new run config UI] Make Main class background the same as in editable fields
BugIDEA-255843[new run config UI] canceled Before Launch tasks are visible after valid task adding
UsabilityIDEA-256637Edit Configuration dialog in IDEA 2020.3 doesn't have a field to specify the module
UsabilityIDEA-257566[new run config UI] Update default lengths of fields
UsabilityIDEA-256633Option to run application with 'provided' scope dependencies is hard to find
Core. Run. TargetsBugIDEA-257452Run Targets: SSH target introspection in wizard failed for maven RC
BugIDEA-253836Run Targets: (maven configuration) ssh target with RSync option should use the same folder instead if creating new one each time
BugIDEA-253323Run Targets: Docker. Build: image tag is wrong displayed for the created run target with a custom image tag
BugIDEA-254966Run Targets. Docker. Correctly process going to previous steps by creating targets
BugIDEA-256269Run Targets. Docker. Different exceptions/Freeze at re-run an application on docker targets
BugIDEA-252665Run Targets: On run springBoot with docker run target get java.lang.NoSuchFieldException:
BugIDEA-252667Run Targets: Can't debug junit configuration with docker run target
BugIDEA-256343[SSH Target] Support file exclusion for rsync
TaskIDEA-256241Run Targets: make new SSH server configuration global by default
EditorBugIDEA-256084Codeinsight stuck on the screen
BugIDEA-255347IllegalStateException: InSmartMode can't be used in LightEdit mode, check that LightEdit.owns(project)==false before calling
BugIDEA-256943Cannot select text with mouse if the starting point overlaps with current or previous search result highlight
CosmeticsIDEA-252291File Type Associations: tooltip that appears after choosing file types is displayed with extra element
ExceptionIDEA-247391Assertion failed at com.intellij.util.indexing.FileBasedIndexEx.getCurrentDumbModeAccessType(FileBasedIndexEx.java:497)
Editor. Editing TextBugIDEA-255435After drag and drop split, caret is at wrong position
Editor. FormatterBugIDEA-229823EditorConfig doesn't support some settings of YAML Code Style
Lang. RegExpBugIDEA-254217CheckRegex with special symbols
Tools. DockerBugIDEA-254423make docker-machine executable option optional
BugIDEA-171327Docker - log tab not refreshing when container has been restarted
UsabilityIDEA-255274Docker. Container terminal: no info messages for not valid terminal tabs
UsabilityIDEA-255273Docker. Provide an easier way to use the Attached console once more for containers with the previously disconnected console
Tools. HTTP ClientBugIDEA-239355HTTP Client JSON Response parsing fails on display
BugIDEA-255717HttpClient: on attempt to substitute url variable in httpclient tab in endpoints view get java.lang.IllegalArgumentException: Invalid range specified: (-1, -1);
BugIDEA-253281HttpClient: exception on attempt to convert incorrect old rest client xml to new http client format (need to add error message)
BugIDEA-221885Annotation @no-log in text based HTTP client is broken
Tools. TerminalConfiguration ProblemIDEA-256926Terminal: enable "Copy to clipboard on selection" by default on Linux
User InterfaceBugIDEA-254558Missing toolbar buttons "Expand/Collapse All" in the TODO Tool Window
BugIDEA-256164Variables tab in Debugger disappears on drag-and-drop
BugIDEA-255824NPE: null cannot be cast to non-null type javax.swing.DefaultComboBoxModel<com.intellij.openapi.keymap.Keymap!>
BugIDEA-220755"New file" popup is not closed when "Register New File Type Association" dialog appears
BugIDEA-256307Table rows stay not repainted after hover/unhover actions
BugIDEA-163983Unable to evaluate idea if email was added but no checkboxes are checked
BugIDEA-254387Emoji and symbol very broken on Linux
BugIDEA-251129No class opened after new project from template is created
UsabilityIDEA-36854Implement cyclic navigation in trees
UsabilityIDEA-252395Tool windows in "Empty state" are not closed with shortcut
UsabilityIDEA-241397Improve wording for the notification about `idea.config.path` changes
User Interface. Action SystemBugIDEA-255584"Unpin Tab" called with keyboard shortcut closes editor tab
User Interface. Embedded Browser (JCEF)BugIDEA-245304Show Couldn't load page in JCEF for the unresponding URL
User Interface. Find, Replace, UsagesBugIDEA-250949Incorrect insets between icons in find in editor
User Interface. Look and FeelTaskIDEA-251815Theming: add description/since for DefaultTabs.*, EditorTabs.*, Slider.*, TitlePane.*
User Interface. NavigationBugIDEA-256116"Split Pane" button in "Recent Files" window clashes with the scrollbar
User Interface. PluginsBugIDEA-256800IDE shows a warning about third-party plugins when I try to install JetBrains' plugin
User Interface. Project ViewBugIDEA-252177New directories auto-collapse in Project Sidebar
BugIDEA-255867Yaml file icons are shown in Project view instead of GitHub special icons after IDE restart
User Interface. Search EverywhereFeatureIDEA-254874Search Everywhere: switchers for status bar widgets
Version Control. GitBugIDEA-251475Confusing notification from the Unstash dialog
BugIDEA-248795gitignore is not created during project creation in WebStorm
UsabilityIDEA-253889Git Rebase dialog: copy the value from upstream to --onto field when it is added
Version Control. GitHubBugIDEA-253172Github -> Pull requests -> Checkout - selects wrong branch
BugIDEA-244965Pull Requests comments are duplicated in all files
BugIDEA-253894Github PR viewer opens wrong file when file is clicked in "conversations" screen
Version Control. LogBugIDEA-256640Сan't view some of git logs in IDEA on macOS, StringIndexOutOfBoundsException in IDEA log
No subsystemBugWEB-48697TSLint: new version of the ts service plugin requires explicit execution rights
BugWEB-48308core-modules is empty when enabling coding assistance for Node.js with node 15.2.0
BugWEB-48462Exiting Reader Mode crashes WebStorm when analyzing large d.ts file
UsabilityWEB-48298New projects creation doesn't proceed without confirmation in terminal (Node 15.2.0, npm 7.0.8)
CosmeticsWEB-48323'npx: the --ignore-existing argument has been removed' while creation new project (Node 15.2.0, npm 7.0.8)
Build toolsBugWEB-48485Endless analyzing of code
BugWEB-48547Unable to resolve Webpack aliases in WebStorm 2020.3 w/ Vue or Nuxt CLI
CSSFeatureWEB-48226Tailwind CSS support doesn't work in Yarn PnP projects
BugWEB-48473TailwindCSS plugin doesn't work if "tailwincss" package version is "npm:@tailwindcss/postcss7-compat@^2.0.1" and 'npm' is used as package manager
BugWEB-48329Wrong formatting inside styled-component
BugWEB-48257Tailwind autocomplete doesn't work in JS string templates
BugWEB-48533Tailwind plugin: Preview of 'white' shows wrong color
BugWEB-48428Tailwind CSS support does not work in WSL2
CoffeeScriptBugWEB-38553CoffeeScript: JSX: simultaneous editing is not working for React.Fragment shorthand
DartBugWEB-48717No option to create a new Dart project in IntelliJ IDEA Community Edition (Dart plugin enabled)
BugWEB-48497"Reformat code before commit" option sometimes doesn't work in Dart/Flutter projects.
DebuggerBugWEB-46662Multiprocess nodejs debugger not working with wsl2 node interpreter
BugWEB-46619WSL debugging is not working while using npm run configuration
HTMLBugWEB-28886Unclosed p tag wreaks havoc
BugWEB-48185wrong autocomplete for react fragment shorthand syntax close tag in jsx
BugWEB-48715Quick doc using MDN documentation is broken
BugWEB-47806Incorrect paired tag editing
BugWEB-42725Problem with html tag autocomplete, changes the wrong tag
BugWEB-47551Multicursor Emmet creates broken code
BugWEB-41768Multicursor Emmet unstable behavior
BugWEB-46838Wrong tag autocomplete with several cursors
JavaScriptFeatureWEB-48448Add more meaningful information to breadcrumb
FeatureWEB-38709Automatically add file extensions in imports in files with .mjs extension
FeatureWEB-48502Allow disabling completion suggestions for strings
BugWEB-46879Code completetion doesn't work on destructuring exports with renaming
BugWEB-48008Requiring a module breaks class member intellisense
BugWEB-48551Autocomplete suggestions for properties of an object returned by Object.freeze no longer works in Vue SFC files
BugWEB-47428Code Inspection "Comparison of expressions having incompatible types" does not recognise optional types
BugWEB-47260Snake Case filename convention doesn't work for Typescript
BugWEB-48574function name() template doesn't work in some cases
BugWEB-44409Object methods treated as properties (not functions) when re-exporting with destructuring
BugWEB-47276Some object variables displays as unresolved from another class in node.js
BugWEB-48348JSDoc: Сtrl+click on parameter description shows usages
BugWEB-48400Base-class method is not known by intellisense when class is in separate file
BugWEB-48205Check Regexp intention does not work
BugWEB-48425Preceding exclamation mark in a comment in Array disables RegExp literal recognition (Javascript)
BugWEB-35948module.exports not recognized
BugWEB-48368"Opening file" status does not disappear in Flow toolwindow
BugWEB-47118False positive: onclick unresolved variable event.target.tagName
BugWEB-48603"Insert pair quote" option stops working in `.jsx` after adding any js pattern to "React JSX" file type
BugWEB-47419False "JSDoc comment matches function signature" violation for destructuring parameters if there is a rest parameter with name matching object name
BugWEB-48245JSDoc: infer method parameter types from the jsdoc interface definition
BugWEB-46991Invalid "unresolved variable" warning in JSDoc inside a destructuring object assignment
UsabilityWEB-48501Invoke completion suggestions for strings only after typing 4+ symbols
TaskWEB-47437Support move members refactoring should respect index.js files for folders
JavaScript. FormatterBugWEB-47523AlignOnColon formatting: inconsistent behavior
BugWEB-48237Enter and backspace handling in the beginning of the injection
JavaScript. FrameworksFeatureWEB-31721Vue: support Vue.extend() construction
FeatureWEB-46418Nuxt.js: support component auto-import with @nuxt/components
BugWEB-46889"Go to Declaration" not working for Vue methods (within script block)
BugWEB-48465Language injection not working in <i18n> vue single component file
BugWEB-47948HTML in PHP files is indented according to Vue indentation settings
BugWEB-39057PyCharm, new React project wizard: missing option 'Create TypeScript project'
BugWEB-33866Vue.js: correctly handle lazy loaded Components
BugWEB-48478Vuex: regression in support for namespaced store modules with Nuxt
BugWEB-29018vue files with jade/pug as lang - comments not working!
BugWEB-48461Auto-import for vue component not working with Vue.extend
BugWEB-36312Angular support conflicts with other templating languages
JavaScript. InspectionsBugWEB-48310Add "use strict" pragma quick fix breaks code
JavaScript. RefactoringBugWEB-48437Extract method adds redundant parameter
BugWEB-47263Extract Method > "Selected fragment has multiple exit points"
LintersBugWEB-48468ESLint eslint-plugin-vue 'vue/comment-directive' — error in the end of public/index.html just after vue-cli installation
Live EditBugWEB-48560Live editing external CSS doesn't always work
Node.jsFeatureWEB-38060ESLint report file paths are not clickable
BugWEB-48086Package express successfully upgraded but the version remains unchanged
BugWEB-47427performance - indexing hard links - used by pnpm & @microsoft/rush monorepos
UsabilityWEB-48610Webpack error output not clickable for many types of apps (Vue.js app, Typescript, webpack, etc.)
SASSBugWEB-48499"There is no module with the namespace" error when using "<namespace>." syntax to access variables/functions if @use declaration is preceded with variable declaration
TypeScriptBugWEB-47869Error on generic async methods called get
BugWEB-48407Node-style module resolution shouldn't be applied for vue in *.ts
BugWEB-48579Template type is not believed to be assignable to constraint type in template literal type
TaskWEB-48434Update bundled TypeScript to 4.1
Unit TestsFeatureWEB-13230Can't set environment variables for Cucumber.js tests
BugWEB-48312Can't run Karma with Coverage in @angular/cli@next project
BugWEB-48463Cucumber 7.0.0: can't find cucumber package to set up run configuration
BugWEB-42292Cucumber.js: support for versions 6.0.0+
BugWEB-39983Cucumber.js 5: step definitions can't be matched when using custom parameter types
No subsystemFeatureDBE-12022Set the default dialect after connecting to the data source
DB ConnectivityBugDBE-12078Redshift AWS Profile auth is not working with jdbc driver 1.2.50
BugDBE-12114PostgreSQL SSL connection with CA validation fails after update to 2020.3
UsabilityDBE-12102Validate JDBC URL for AWS Profile authentication for Redshift/Athena
DB ConsoleBugDBE-12118error with select into local variable after latest update DB-203.5981.102
UsabilityDBE-12190Remove 'run 'console.sql'' item from the context menu of the editor in console
DB GeneralUsabilityDBE-3893Allow JSON1 extension in SQLite
DB IntrospectionBugDBE-12176Greenplum - when performing introspect database to rebuild index, An ERROR generated and it stops reindexing
BugDBE-12049Clickhouse introspection requires `SHOW_USERS` grant
DB RefactoringBugDBE-12148Table creator stops showing column being edited after error.
DB Schema ViewsBugDBE-12219The order of the objects in '+' button is annoying: creating data source pattern is broken
Data ViewsFeatureDBE-12137Make field auto-completion available during data loading in data view filter
PL & DDL EditorBugDBE-12170DDL for views in Vertica being truncated
SQL Format and StyleBugDBE-12212Formatter breaks empty parentheses in Egypt style
ExceptionDBE-12213Egypt style pre-set doesn't work
SQL GeneralBugDBE-7361MSSQL: Incorrect read/write access for OUTPUT INTO table in "Find"
BugDBE-6504Incorrect quick fix "Quote identifier" for GOTO statement
UsabilityDBE-7051Usage type for update statements
UsabilityDBE-3840SQL: Sybase: support system stored procedures
SQL GenerationBugDBE-9945WITH block for GreenPlum DDL
SQL HighlightingFeatureDBE-12193Support for SQLite VIRTUAL columns
FeatureDBE-8603Inspection: Deprecated type
BugDBE-10007IDEA doesn't recognize table functions
BugDBE-2489For SQL Server syntax, should recognise 'well-known' stored procedure names
BugDBE-6511Cannot add SUBPARTITION after PARTITION definition when Oracle dialect is used
BugDBE-8907Combined usage of CTE and XMLNAMESPACES
BugDBE-12051False positive inspection "refresh could not take such arguments" in Oracle
BugDBE-11937Exasol: Support elseif - then syntax in function
BugDBE-10078The legacy Transact SQL syntax for index hints like 'from ABC (index = XYZ)' is valid in MSSQL but throws syntax error in Datagrip editor
BugDBE-12191Invalid syntax check for the BigQuery dialect: valid `date_part` being highlighted as invalid
BugDBE-11811BOOLOR_AGG function in Snowflake SQL not recognized
BugDBE-12016Incorrect marking of an error in `where` clause with JSONb value
BugDBE-12058Support create user from external provider syntax
BugDBE-8887Incorrect inline hint
BugDBE-10730Setting statistics with multiple arguments displays syntax error
BugDBE-3810DB2 Add support for "CREATE TABLE AS (...) WITH DATA" syntax
BugDBE-11928ROW_NUMBER is highlighted improperly in SQLite
BugDBE-11260SQLite PRAGMA module_list not recognised
BugDBE-10658SQL inspection warning with more then one CROSS APPLY statement
BugDBE-9090ms sql server dialect errors and missing syntax
BugDBE-12180Unknown function STRTOK()
BugDBE-7432Incorrect syntax error on bulk insert in SQL Server
BugDBE-10422MSSQL set syntax
SQL ResolveBugDBE-11726PostgreSQL function that returns table with capitals in columns names don't autofill correctly
BugDBE-8860False error in CTE with order by and union [Sql Server]
BugDBE-6526Column name not resolved in FOR UPDATE OF clause of DECLARE CURSOR
BugDBE-6524Column name in unique constraint not resolved if no comma between column definition and constraint
BugDBE-6525UPDATE STATISTICS does not resolve indexes as valid statistics name

RubyMine 2020.3 (203.5981.152 build) Release Notes

Lang. ERBUsability RUBY-27224 Update ERB continuation indent from 4 spaces to 2 spaces
Rails. Code InsightBug RUBY-27209 Missing stub methods for ruby 3.0
Remote Interpreters. WSLBug RUBY-27452 Path to the Ruby is shown incorrectly while add WSL sdk
Ruby. Code CompletionCosmetics RUBY-27159 Don't bold class names when invoking completion
Ruby. Code InsightBug RUBY-27249 PP::ObjectMixin is included as an ancestor for all classes when invoking completion
Bug RUBY-27131 parameter info (ctrl-p) not shown for a method that resolves
Ruby. ParsingFeature RUBY-27207 Investigate changes necessary for separation of keyword and positional arguments in ruby 3.0
Feature RUBY-27197 Ruby 3.0 - add support for leading arguments with arguments forwarding
Feature RUBY-27168 Ruby 3.0 - add support for endless method definitions
Feature RUBY-27311 Allow 0-arg endless method definitions without parenthesis
Feature RUBY-27278 Find pattern updates for ruby 3.0
Bug RUBY-27298 Incorrect caret offset after endless method definition
Bug RUBY-27325 RM code reformat splits some endless method definitions to several lines
Bug RUBY-27406 Show error/warning when using setter methods with all endless method definitions
Bug RUBY-27326 RM doesn't show offence when pattern matching incorrectly used with ruby 3.0.0-preview1
Ruby. TestsBug RUBY-27250 Total number of tests is not shown unless the minitest-reporters is included in the bundle
Ruby. Type InferenceFeature RUBY-27205 Ruby 3.0 new method in Hash#except, add type inference support
Ruby. Version ManagersBug RUBY-27175 RM selects different SDKs with same custom configurations
Tools. RuboCopBug RUBY-27235 RuboCop integration strips trailing spaces on save; should use RuboCop's `--stdin` option instead
Code Analysis. Language InjectionBug IDEA-251156 Translate 'Fragment' in tab's name when edit an injection
CoreBug IDEA-253548 JSLanguageLevelPusher.getImmediateValue resolves too many children in search of .idea/misc.xml
Bug IDEA-253683 ClassCastException when open project with Space plugin
Bug IDEA-255312 Can not import a Gradle project due to java.lang.IllegalStateException from workspace project model
Performance IDEA-254450 Slow Gradle project import with 2020.3 EAP
Core. DebuggerBug IDEA-255861 Expanding an array with inline debugger does not start with 0 index
Bug IDEA-256188 Inline watch in Variables view shows wrong line in a file (always -1 from the actual line)
Bug IDEA-256118 'Remove All Watches' causes incorrect behavior and ArrayIndexOutOfBoundsException com.intellij.xdebugger.impl.inline.InlineWatchesRootNode.removeInlineChildren
Bug IDEA-252062 Inline watches: unreadable color combination when hovering over inline watch in current line
Bug IDEA-256109 Inline watches: No inline watches in editor if debugger variable view is not opened
Cosmetics IDEA-252060 Inline watches: bottom toolbar design looks worse than in mockups
Core. DiagramsBug IDEA-254810 No tooltip for UML changes diagram action in VCS toolbar
Core. File SystemFeature IDEA-240351 Support file system notifications for projects opened inside WSL when the IDE is running outside of WSL
Bug IDEA-252892 "Error looking up function NtQueryInformationByName" warning is shown under Windows 8.1
Bug IDEA-253551 VirtualFileManagerImpl.fireAfterRefreshFinish logs ProcessCanceledException
Bug IDEA-252955 Unable to load library 'e2p' in amazoncorretto docker image
Core. IDE SettingsBug IDEA-252609 File Templates For Multiple Files: Copy action for multi-file templates works incorrectly
Bug IDEA-252607 File Templates For Multiple Files: on parent template deleting its children should be deleted also
Bug IDEA-253051 Zulu: SDKMAN detected JDK doesn't include /Contents/Home on macOS failing Gradle import
Bug IDEA-252606 File Templates For Multiple Files: on parent template rename it loses its childs
Bug IDEA-253119 Make Compiler errors non-modal
Usability IDEA-253137 Can't toggle (enable/disable) certain settings with keyboard (without mouse)
Task IDEA-253638 Add an API to prioritize configurables within a group in code style settings
Task IDEA-253357 Search in keymap should take synonyms into account
Core. IDE Settings. SharingBug IDEA-254117 NPE on enabling IDE settings sync
Bug IDEA-254758 Settings repository doesn't apply pulled non-active custom keymap in case of "Merge"
Bug IDEA-252603 File | Manage IDE Settings | Export Settings: it is impossible to choose the target folder to create the exported file in via the path chooser
Bug IDEA-253846 Can't set up IDE settings sync
Bug IDEA-181599 Keymap not imported settings.jar or synced in settings repository across two Webstorm instances
Core. IndexingBug IDEA-248440 Shared indexes are OS-specific
Bug IDEA-252988 File search does not show files, search all does
Bug IDEA-247165 NPE startup error on indexing after Upgrade from 2016.1 to 2020.2
Performance IDEA-253399 IDEA freeze
Usability IDEA-253972 Project specific settings for shared indexes are configured at IDE level
Task IDEA-252012 Group indexing diagnostics per project
Exception IDEA-253396 Shared Indexes: Failed to find path for chunk bundled-js-predefined-ffdd448c697d-de148ed368f5-JavaScript-IU-203.5046
Core. InstallationBug IDEA-254674 Windows 10 icon path in registry typo
Core. LicensingBug IDEA-254049 License source is changed after the IDE restart
Bug IDEA-251927 Strange symbol in the title of license removal dialog on Win and Linux
Bug IDEA-255311 Eval license for commercial plugins in EAP builds should remain the same as the one for release builds
Bug IDEA-245167 License UI should take into account "optional"-licensed plugins when displaying warnings
Task IDEA-252763 Remove product name from the error message in the license dialog
Core. Platform APIBug IDEA-254534 2020.3 EAP SDK break from removed type params for PlaceHolder/PlaceProvider
Core. Plugin ManagementBug IDEA-252873 Plugin enabled for one project is shown as enabled\disabled for all projects if two projects are opened in a separate windows
Bug IDEA-252984 Plugin disabled for one particular project is not loaded when opening other projects
Bug IDEA-253447 Incompatible plugin message contains "version 'null'"
Bug IDEA-254029 Issues after unloading Maven plugin by disabling it for project
Bug IDEA-254176 Icons collision
Bug IDEA-253327 Cannot install or view plugins
Bug IDEA-254484 No opportunity to disable plugin per project via cogwheel menu on the plugin page
Core. Project SettingsBug IDEA-253040 IDEA does not recognise a module, but it is present in modules.xml
Bug IDEA-254157 Sometimes VfsUtilCore.copyFile adds an extra bom to the new file
Bug IDEA-252907 UI Freeze at Space project reimport
Bug IDEA-252791 Facets provided by disabled plugins are saved incorrectly
Bug IDEA-253515 "Invalidate and restart" action deletes content of .idea/libraries directory in projects which use Gradle if Android plugin is enabled
Bug IDEA-253586 Class is not registered: com.intellij.workspaceModel.storage.bridgeEntities.LibraryRoot
Usability IDEA-240999 Suggest to automatically download JDK when "Build Project" action is invoked
Exception IDEA-253589 NoSuchFileException while getting module file
Exception IDEA-189132 Throwable at com.intellij.openapi.roots.ui.configuration.ModulesConfigurator.getOrCreateModuleEditor
Exception IDEA-253686 It's not possible to create a new project at location which was used for another project
Core. Quick DocumentationBug IDEA-253284 "Show on mouse move" is shown as a button with unknown icon in Documentation tool window
Core. Run. ConfigurationsFeature IDEA-233404 Jdk Auto should check run configurations
Bug IDEA-253816 [new run config UI] "Build" Before Launch disappears after modifying the Run Configuration
Bug IDEA-254134 [new run config UI] in Before Launch section it's impossible to add several tasks of the same type
Bug IDEA-255011 [new run config UI] hint on hover for JDK field is shown only if it has focus
Bug IDEA-253893 Unable to specify tags for JUnit5 tests
Bug IDEA-254136 [new run config UI] mnemonics for "command line fields" don't work
Core. Run. TargetsFeature IDEA-252733 In case of failure of preparation run configuration should not proceed to execution
Feature IDEA-251763 Provide browsers from browsable targets to run configurations
Bug IDEA-253753 Run Targets: Turn off run targets functionality for the sub-run-configs of Application
Bug IDEA-253152 Uploading files to a run target should exclude ignored files
Bug IDEA-253345 Run Targets. Docker. Errors by "Rebuild" the same Dockerfile
Bug IDEA-253810 Run targets. Docker. Creation via Settings: it doesn't take the set "language runtime" and doesn't run container introspection
Bug IDEA-252969 Run Targets. Spring Boot. Provide the correct port in the Services view by running on docker targets
Bug IDEA-253321 Run Targets. Changes in the chosen Dockefile should be saved before running build/pull process
Bug IDEA-248360 Adding new target in Manage targets dialog should launch wizard
Bug IDEA-254846 Run Targets. Go language runtime: version is always empty after restart
Bug IDEA-248370 Show an error when no runtime is configured
Bug IDEA-253377 Run Targets: RSync for SSH target not detected in case windows-linux or wsl-linux
Bug IDEA-253428 SSH Target: after failure with upload IDE still tries to upload something
Bug IDEA-252976 Run Targets: application folder field in SSH target is cleared every time target reopened
Bug IDEA-252405 Run Targets: Can't configure maven home for docker run target
Bug IDEA-253343 Run Targets. Run configs: the newly created run target is not selected in the Run Configuration dialog
Bug IDEA-253330 Run Targets. Docker. Run targets creation works wrong because 'Runtime language' step is absent during the target creation.
Bug IDEA-253797 Docker. Run Targets. Copy a docker target action creates a new target without a name and doesn't copy language values
Bug IDEA-253090 Run Targets: Get Maven exception after choosing several targets in maven configuration
Bug IDEA-253711 Run Targets: SSH: attempt to run JUnit 5 run configuration fails on attempt to copy files
Bug IDEA-253624 Run Targets: SSH: the files are copied before the project is built. As a result the application runs without the last changes always (or fails in case of missing local build results)
Bug IDEA-253151 Exception when uploading file to SSH run target
Bug IDEA-253082 Run Targets: Get AWT-EventQueue exception on run java app with SSH target
Bug IDEA-255755 Run configuration never ends after exception on target preparation
Bug IDEA-252404 Run Targets: Hide run on list before wizard
Bug IDEA-252759 Run Targets. Docker. It doesn't work on winOS because of the invalid paths
Bug IDEA-255092 Run Targets. Docker. java.lang.IllegalAccessError: class com.intellij.docker.remote.run.target.configuration.wizard.DockerTargetTerminalStepBase at attempt to create/rebuild docker run target
Bug IDEA-253362 Run Targets. Docker. Add validation for "Run options" field as it for Docker run configs
Bug IDEA-253695 Run Targets: rsync test connection asks for ssh server password, but it is provided
Bug IDEA-253369 Run Targets. Docker. Build args are ignored.
Usability IDEA-253269 Run Targets: SSH: add possibility to select the jdk home path using the path chooser
Usability IDEA-253023 Run Targets. Docker. Provide possibility to re-detect field values(java home stc) for the changed run target
Usability IDEA-253620 Run Targets. Docker. Improve target creation via Settings
Usability IDEA-253274 Run Targets: SSH: provide possibility to select the Maven home path on the remote machine using the path chooser
Usability IDEA-253334 Run Targets. RunConfigs->Manage targets. Add Apply button.
Cosmetics IDEA-254006 Run Targets. Docker. Create via Settings: the 3d step name is present only as `3/3.` instead of `3/3. Configure Java`
Cosmetics IDEA-253693 Run Targets: rsync connected message not visible in dark theme
Cosmetics IDEA-252469 Run Targets: Adjust add language runtime section beneath Advanced Volume Settings
Task IDEA-252711 Run Targets: targets should be project-level
Core. SSHBug IDEA-253288 If ssh password request is shown as a balloon, it can't be shown as a modal window.
Bug IDEA-252300 Entered SSH passphrase isn't applied for deployment configuration
Bug IDEA-253595 When auth type is not openssh+agent, preferred authentications should be updated.
Bug IDEA-254121 AWS generates ssh without passphrase but IDE asks for it
Bug IDEA-253287 SSH password requests are not cancellable.
EditorFeature IDEA-252707 Soft wrap in lightedit
Bug IDEA-253165 --edit command-line option is ignored in case build.gradle/pom.xml
Bug IDEA-253120 Reader mode shouldn't affect inspect.sh
Bug IDEA-252166 "Reader Mode" toggler is shown in editor, though the "Show reader mode toggle in the editor" is unchecked in settings
Bug IDEA-250265 NullPointerException when trying to invoke intention actions for .md files
Bug IDEA-253454 "More about the LightEdit mode" link should open help page for current IDE
Bug IDEA-253601 Bad live-template position near the inlay element.
Usability IDEA-251392 "Go to declaration" in combination with mouse button causes editor selection
Usability IDEA-253084 Reader Mode very surprising the first time you see it
Editor. Diff and MergeBug IDEA-253069 Font ligature settings are being ignored
Editor. Editing TextBug IDEA-251793 After Ctl-Y, the display is positioned wrong
Bug IDEA-251279 Matching brace popup does not honor Background in readonly files setting
Task IDEA-253903 Optimize Copy/Paste processors
Lang. JSONUsability IDEA-241855 schemastore.org schemas drop-down should be using the names and not the url suffix
Lang. RegExpFeature IDEA-96093 highlight string matching portion when checking regexes
Feature IDEA-243794 Highlight matched groups in RegExp tester
Lang. YAMLBug IDEA-248058 Microservices: Incorrect HTTP URL injected to YAML value
Tools. DockerBug IDEA-222853 PROJECT_DIR macro does not seem to work for bind mounts
Bug IDEA-253996 Docker target has two identical Java language runtimes neither of which can be removed
Bug IDEA-255268 Docker. Impossible to re-call the closed Attached console
Usability IDEA-220014 Docker: Terminal, Attached console: provide info if it is disconnected
Usability IDEA-253992 Dockerfile selector in Docker run target settings editor should default to the project home directory
Tools. HTTP ClientBug IDEA-244972 HTTP Client not handled POST redirect automatically
Bug IDEA-255209 HttpClient: after changing color scheme some elements of httpclient in endpoints view tab became in previous color
Bug IDEA-253282 HttpClient: Changes in rest client xml file not taking into account for convert to new http client action
Bug IDEA-250246 HTTP Client: cookies from legacy requests are not converted into the new http client
Bug IDEA-251964 HTTP Client: actions for unsubstituted variable value adding don't work with localized application
Usability IDEA-252424 Headers completion shows already typed text as the top suggestion
Usability IDEA-187044 REST client uses 12-hours clock instead of 24-hours
Tools. TerminalBug IDEA-239094 incorrect terminal line heigth/spacing
Bug IDEA-170763 Some special characters cannot be typed in IDE terminal
Usability IDEA-129396 Terminal should scroll 3 lines per step
Usability IDEA-180370 Darcula default terminal colors
User InterfaceBug IDEA-252882 Console scrollbar is not updated on a theme change
Bug IDEA-253033 Toolbar is presented twice in the View menu
Bug IDEA-254999 The splash screens are kept in caches and thus the obsolete splash screen is shown on startup
Bug IDEA-252804 cannot resize debug tool window when event log is opened next to it
Bug IDEA-255350 Tab highlighting appears on tab pane when splitting tabs with drag-and-drop
Bug IDEA-254732 Pinned service view tab looks the same way as non-pinned tab
Bug IDEA-254085 Splitting tabs by drag-and-drop in detached window sends tab to project frame
Bug IDEA-252805 Can not resize variables in debug tool window
Bug IDEA-236415 "Show memory indicator" toggle doesn't work anymore
Bug IDEA-252868 IconLoader without caching fails to find icons
Bug IDEA-249821 "Copy File Name" action doesn't include part after the last dot
Bug IDEA-253297 Missing action group icon in popup menu in 2020.3 EAP
Bug IDEA-252781 Window titles are light in Darcula, when reopening IDEA with 2 projects
Bug IDEA-253643 Dialogs are too small so the content is collapsed
Bug IDEA-251477 SearchEverywhere: modules are cropped
Bug IDEA-253038 Disable fractional metrics on non-retina monitor
Bug IDEA-252217 Drag and drop doesn't work with new Welcome Screen
Bug IDEA-253824 "Got it" popup shadow does not move with the popup after Analyzing is completed
Bug IDEA-253367 Tool Windows in window mode don't raise when invoked in 203 IDEA
Bug IDEA-252453 Search Everywhere: Filters are not applied on All tab
Bug IDEA-253036 Tab splitted by drag-and-drop becomes pinned if it was located next to pinned tab
Bug IDEA-253839 Big Sur: Custom alerts are invoked instead of native
Bug IDEA-255252 Exception on drag-and-drop What's new tab
Bug IDEA-253263 Shift+Enter opens several splitted tabs if invoked from Recent Files
Bug IDEA-253012 "Show hidden tabs" button remains on tab panel if tabs are shown in multiple rows
Bug IDEA-252457 Search Everywhere: Hint from Actions tab is shown on other tabs after switching from Actions to another tab
Bug IDEA-254608 Reader mode should be disabled for library files or at least important functionality like gutter icons should work
Bug IDEA-253703 Pinned tab does not become unpinned after drag-and-drop to the position before the last tab
Usability IDEA-222531 Services - option to always open in new tab
Usability IDEA-255581 Popup submenu behavior
Usability IDEA-252653 Pinned tabs too narrow
Usability IDEA-251428 [Problems View panel] Mnemonic digit '6' to the left of the panel name always confuses me
Usability IDEA-252995 Hint for "pin" icon of pinned tab is misleading
Usability IDEA-254748 Enable preview tab doesn't work if Open file with single click is unchecked
Cosmetics IDEA-254135 Fix appearance of the dragged files/tab
Cosmetics IDEA-250519 grammatical & typographic errors in notification
Exception IDEA-254377 ISE at com.intellij.ui.popup.AbstractPopup.$$$reportNull$$$0
Exception IDEA-252980 Search everywhere: Somtimes IllegalArgumentException occurs when switching from Classes to Files tab
Exception IDEA-252974 Search Everywhere: IllegalStateException when searching in Symbols
User Interface. AccessibilityBug IDEA-253340 Two buttons in `Settings | Appearance & Behavior | Menus and Toolbars` are not spoken by NVDA screen reader
Bug IDEA-252705 in the list of sources "get from vcs" no elements are not spoken by the screen reader
Bug IDEA-253342 On `Settings | Appearance and Behavior | System Settings`, the NVDA screen reader doesn't speak the "Database" when navigated to the "Database:"'s edit view by using tab
Bug IDEA-253338 "Show help contents" button in settings page can't be spoken by NVDA screen reader
Task IDEA-252706 Release so that the screen reader speaks the source list name on the "get from VCS" screen
User Interface. Action SystemFeature IDEA-253266 Actions popup: show submenu on mouse hover
Bug IDEA-255228 Action popup: do not show submenu for actionable items
Bug IDEA-252496 Pinned tab is not closed with shortcut
User Interface. ArtworkCosmetics IDEA-221920 Strawberry icon looks like a bug
User Interface. ControlsUsability IDEA-254091 Selection in action popup is changed while hovering mouse to submenu
User Interface. Find, Replace, UsagesBug IDEA-212529 Find/Find&Replace in path with newline always matches all whitespace at the beginning on subsequent line, disregarding the search pattern
Bug IDEA-252274 [Find in Files]: Scope background is lost for the line under the hovered one
Bug IDEA-249809 Editor search not showing up
Bug IDEA-252922 Replace and preserve case capitalises replacements of numbers
User Interface. FocusBug IDEA-253238 Right click sometimes sent to and activates the wrong IJ window
Bug IDEA-255026 'Explain shell' refactoring popup - focus is stolen from popup to Editor
Bug IDEA-255557 Create Field without focus
Bug IDEA-190158 Typeahead timeout exception if same shortcut is assigned to multiple actions (Find and Find in Path, or similar case with Goto Class)
User Interface. GraphicsUsability IDEA-202576 Tab pin indicator is hardly visible in many cases
User Interface. Keyboard InputBug IDEA-252282 Regression: Shortcuts with German umlauts stopped working
User Interface. Look and FeelBug IDEA-254333 Custom theme unable to customize icons
User Interface. Project ViewBug IDEA-254773 No More Drag-n-Drop in Project Explorer
Usability IDEA-238064 File structure popup (speed search) Ctrl-C should copy text of selected list item, not the speed search text
User Interface. Services ViewBug IDEA-244057 Services: tab header color for services in a separate tab
Version ControlBug IDEA-231698 Non-modal commit: Author field is not shown inline
Bug IDEA-252307 Rebase modal no longer stores previously selected ref or options
Bug IDEA-252549 Double click on change in commit tab no longer shows inline diff window
Version Control. GitFeature IDEA-91542 Replace Merge with Pull on Remote Branches in VCS Operations | Git Branches view
Feature IDEA-128268 "Create New Branch" name automatic conversion
Feature IDEA-233058 Add Update action for the current branch in Branches popup
Feature IDEA-241680 [Git Panel] "Update Selected button" should work for current branch
Bug IDEA-253313 Can't commit staged deletion
Bug IDEA-255104 Missing Update action in Git Branches popup when called via Quicklist
Bug IDEA-253175 Create New Branch replaces most of the forward slashes/periods with underscores
Bug IDEA-254399 Reword and interactive rebase are failing when commit contains spaces at the beginning
Usability IDEA-251554 Pull-dialog: suggests pulling from the last entered branch, instead from tracked branch
Usability IDEA-223976 Add tooltip to Detached HEAD warning
Usability IDEA-243122 Git popup menus are inconsistent
Usability IDEA-253485 Git Staging Area: Vertical scrollbar covers plus/minus icons
Version Control. GitHubFeature IDEA-252396 Support user and label completion for GitHub Pull Requests search
Bug IDEA-243134 Clone Dialog -> GitHub: Infinite wait if pressing "Log In" with all fields empty
Bug IDEA-252798 Don't remember empty query in github pull requests search
Version Control. LogTask IDEA-252476 Create color key for hovered line in the Log table
No subsystemFeature WEB-47897 TypeScript: Make path to error a hyperlink in yarn output
Feature WEB-29578 Webpack configuration file should be configured per module and per directory instead of per project
Bug WEB-44118 Import quickfix not given for Ant Design icons
Bug WEB-48044 Create React component quick fix for qualified references shouldn't be available
Bug WEB-48150 Empty stub trees are not used from prebuilt shared indexes
Bug WEB-47417 Quick Documentation tooltip shown on mouse move doesn't include a link to external docs
Bug WEB-46865 Directory alias is mysteriously unresolved
Bug WEB-47809 Adding Javascript template project as a new module to IDEA project creates files in the wrong folder
Bug WEB-46790 tslint errors/warnings not clickable
Bug WEB-44521 'Download node' has hard-coded node version, current version for download is 12.13.1
Performance WEB-44334 Minute-long freeze when starting to type inside large mixed php file
Usability WEB-42539 Angular follow to the issue source
Usability WEB-47821 Bypass showing Autocomplete/Suggestion Popup if User typing number
Task WEB-47894 Bundle Feature trainer plugin
Task WEB-47874 Cleanup project generators list
Task WEB-47875 JavaScript: implement lazy indexing for tool packages
Exception WEB-47902 AssertionError
Exception WEB-47780 Throwable at com.intellij.psi.impl.SharedPsiElementImplUtil.getChildIndex
Build toolsFeature WEB-22867 webpack errors output path is not clickable
Usability WEB-36182 webpack aliases are not resolved correctly when config is exported as function
Task WEB-47906 Basic support for mutiple webpack configs
CSSFeature WEB-48151 Support @nuxtjs/tailwindcss
Feature WEB-42792 Tailwind CSS support
Bug WEB-45489 Webstorm format doesn't format the css inside styled-components
Bug WEB-47978 Color preview in code completion popup is too big
DebuggerBug WEB-48092 Debugger: No Hebrew/Arabic support in inline value tooltips
Bug WEB-48396 Expanding an object with inline debugger does not start with first property
Bug WEB-48060 Throwable: fileInfo.url: node:internal/util, url: node:internal/util when debug via node 15
Usability WEB-47823 SmartStepInto: filter library variants when 'do not step into libraries' enabled
HTMLBug WEB-43054 Automatically inserted pair quotes aren't recognized when closing the pair in blade templates in Vue.js projects
Bug WEB-47979 Go to definition for classes in HTML shows the usage itself on the top of the list
JavaScriptFeature WEB-47761 Suggest default imports based on existing imports in the project
Feature WEB-47713 No hint about indirect usages of exports when dynamically imported
Feature WEB-47822 JavaScript: show elements from the structure view in the IDE navigation bar
Feature WEB-48090 Suggest variable names based on file name
Bug WEB-48153 JSDoc: parameters destructuring doesn't work with @typedef
Bug WEB-48173 Imported modules from Vue@3 are not resolved in JavaScript
Bug WEB-44930 "Use directory import" option doesn't work for default exports
Bug WEB-47499 Symbols from .mjs files are not suggested in quick fixes
Bug WEB-47750 Incorrect Inspections that disappear on cut&paste
Bug WEB-41261 Dynamic imports not counted when checking for import usage
Bug WEB-48139 Completion doesn't suggest all available options
Bug WEB-47688 JSDoc: Unresolved variable or type `Dropbox`
Bug WEB-44774 Code completion missing in destructuring statement
Bug WEB-47771 Cannot resolve symbol 'html' from `lit-element` library
Bug WEB-47941 Trailing comma after FlowJS inexact operator is seen as error
Bug WEB-47748 Invalid Range Exception does block Reformat Code
Bug WEB-47925 ES6 module re-exported as "export {default as moduleName}" should be imported as a named module
Bug WEB-47680 Cannot resolve symbol exported import ES6
Bug WEB-48138 Exclude blank and short items from completion
Bug WEB-48031 Go to usages (cmd/ctrl+click) doesn't work with enabled flow service
Bug WEB-47800 JavaScript. parser issues
Bug WEB-47052 Do not add JsFlowSettings to workspace.xml when Flow is not used
Bug WEB-47640 Prefer imports from index file when webpack alias is used
Exception WEB-47828 Exception while navigating to the intention's description from Search everywhere
Exception WEB-48028 Opening the flow project without node_modules causes an exception
JavaScript. FormatterBug WEB-37977 HTML injection isn't working in ES6 tagged string literals in HTML
JavaScript. FrameworksFeature WEB-46511 Vue 3: Support <script setup>
Feature WEB-48010 Import prettier rules with ESLint
Bug WEB-46545 Vue 3 `setup`: Returned properties not recognized in template if `setup` method is defined as `async`
Bug WEB-48169 Angular 11 Schematics do not load correctly
Bug WEB-27844 Importing a folder doesn't resolve platform-specific React Native index imports
Bug WEB-41313 No auto-import suggestions for PropTypes
Bug WEB-46768 Go to Definition for components from web-types.json doesn't work if there are multiple sources (Vue)
Bug WEB-46620 [Vue.js] `template` field does not handled properly in JS files
Bug WEB-46730 Component class exported indirectly is not recognized
Bug WEB-47599 Receiving "JSX is used without importing React" for React 17
Bug WEB-46645 vue-typed-mixins Broken
Bug WEB-47204 Composition API's setup() function cannot be arrow function
Bug WEB-47131 Vue Composition API: components autocomplete does not work
Bug WEB-45616 Case-sensitive completion of React components
Bug WEB-46975 Vue.js: single file components with empty object literal are not shown in autocompletion
Bug WEB-46882 Vuex's mapState does not work when module's state is a function
Usability WEB-34635 Vue.js: single file components with function property are not available in completion
Exception WEB-47998 'Convert to visible line separators' causes 'nonempty text is not covered by block in #Vue #formatter'
Exception WEB-47791 Creating a new angular project causes an exception
JavaScript. InspectionsBug WEB-47844 `Convert to let/const` deletes code in blade.php files
Bug WEB-46999 Common.js imports with require are not suggested in quick fixes
Bug WEB-48121 Incorrect simplification of do while (false) in JavaScript
Cosmetics WEB-48211 typo in switch-tooltip
JavaScript. RefactoringBug WEB-47675 Rename from .jsx to .tsx creates incorrect imports
Bug WEB-48123 Cannot move React function based component to file without warning.
Bug WEB-39255 "Extract Method" refactoring should replace all occurrences of selected expression
LintersFeature WEB-34655 Import typescript code style preferences from .eslintrc
Feature WEB-34649 Import rules from eslint-plugin-vue to Vue code style settings
Bug WEB-43455 Lint TypeScript files with ESLint in Vue CLI project
Live EditBug WEB-47430 Live Edit: "Highlight current element in browser on caret change" does nothing
Node.jsFeature WEB-36956 NPM console: linter errors in webpack output should have code navigation
Feature WEB-44742 tsc -p output doesn't allow direct opening of files with errors
Bug WEB-37265 Missing clickable links in ng lint output
SASSBug WEB-47734 Editing an imported Sass file that has the same name as a neighbor folder doesn't trigger File Watcher
TypeScriptFeature WEB-11418 Add "Insert Var Declaration" quickfix for TypeScript
Bug WEB-45486 Inspection[Typescript]: Attempt to assign to const or readonly variable
Bug WEB-46778 Vue: vuex state inferred on typed parameters
Bug WEB-30387 Auto import is not optimal (top most source)
Bug WEB-48224 TypeScript widget not showing in status bar
Bug WEB-47803 Multiple candidates for the same type variable in contra-variant positions isn't inferred to an intersection type
Bug WEB-46126 TypeScript 4.0 Variadic tuple types support
Bug WEB-47934 First option in completion isnt rendered
Bug WEB-45997 Monorepo: auto-import should prefer package import to the one from src folder
Bug WEB-43070 Types added to modules via module augmentation not available in import completion
Bug WEB-36638 @material-ui: no completion for components in TypeScript files
Bug WEB-44282 Importing an external function that is only used as a variable's declaration is detected as unused
Bug WEB-48179 TypeScript 4.1: Template literal types assignability
Bug WEB-45077 False errors from tsserver on module rename + move
Bug WEB-38508 WebStorm generates .vue.d.ts files from .vue files
Bug WEB-48109 WebStorm TypeScript inspections should support @ts-ignore
Task WEB-47166 Support rendered comments for indexer
Task WEB-48275 TypeScript widget changes
Task WEB-48001 Remove options "Use for projects without tsconfig.json" and "Compile scope" in the TypeScript language server configuration
Exception WEB-48034 Code with Variadic tuple types causes an exception
Unit TestsBug WEB-42164 Test assertion diffs are not shown when using jest-circus runner instead of jest-jasmine2
DB ConnectivityUsability DBE-6729 Data source for embedded (local) databases: if relative file path for database is used use project directory as relative directory rather than <IDE_HOME>/bin
DB ConsoleBug DBE-11734 Do not highlight MongoDB and GraalJS built-in functions as unresolved
DB DiffBug DBE-12007 Diff viewer are not longer working for routine sources
DB IntrospectionBug DBE-11870 Problem refreshing DB connection on old SQL server databases
Exception DBE-12000 Unexpected error (ProcessCanceledException) encountered when performing Introspect database testdb schema dbo (details)
Data ViewsBug DBE-11839 IDE windows/tab system freaks out when database results are dragged to new windows
Bug DBE-6401 H2: Cannot add/edit enum columns
Cosmetics DBE-12001 Grid toolbar icons become visible only after table is loaded (looks like glitch)
SQL CompletionBug DBE-11977 Code completion for collection names containing dots
SQL Format and StyleFeature DBE-11983 OUTPUT clause formatting control
Bug DBE-11975 Formatting of records inside Oracle packages is not implemented
Bug DBE-11953 Unexpected line break after keyword 'member'
SQL GeneralBug DBE-11994 Incorrect inspection for mongo scripts in run configurations
SQL GenerationBug DBE-11786 MS SQL: Script generator forgets to specify asc/desc in a unique index or primary key fields when it declares inside the table declaration
Bug DBE-12040 Oracle Script Generator: empty script for an underlying table of a materialized view
SQL HighlightingFeature DBE-11699 Extend selection
Bug DBE-11833 [BigQuery] Support for `UNION ALL` with subqueries enclosed in parentheses
Bug DBE-11829 Empty string rises an error in query
Bug DBE-10439 ClickHouse: unknown database function
Bug DBE-11778 Support for remote(), remoteSecure(), cluster(), clusterAllReplicas() table functions as ClickHouse dialect
Bug DBE-5387 SQL Server Geometry and Geography types not recognized
SQL ResolveBug DBE-5051 Postgres: function's OUT parameter is unresolved
Bug DBE-11797 Fix UNNEST highlighting in Couchbase
Bug DBE-11832 Fix resolve of Couchbase LET clause

RubyMine 2020.3 RC (203.5981.120 build) Release Notes

Ruby. ParsingFeatureRUBY-27311Allow 0-arg endless method definitions without parenthesis
BugRUBY-27406Show error/warning when using setter methods with all endless method definitions
BugRUBY-27298Incorrect caret offset after endless method definition
Core. DebuggerBugIDEA-256109Inline watches: No inline watches in editor if debugger variable view is not opened
BugIDEA-255861Expanding an array with inline debugger does not start with 0 index
BugIDEA-256118'Remove All Watches' causes incorrect behavior and ArrayIndexOutOfBoundsException com.intellij.xdebugger.impl.inline.InlineWatchesRootNode.removeInlineChildren
BugIDEA-252062Inline watches: unreadable color combination when hovering over inline watch in current line
BugIDEA-256188Inline watch in Variables view shows wrong line in a file (always -1 from the actual line)
Core. Run. TargetsBugIDEA-252759Run Targets. Docker. It doesn't work on winOS because of the invalid paths
BugIDEA-255755Run configuration never ends after exception on target preparation
User InterfaceBugIDEA-254999The splash screens are kept in caches and thus the obsolete splash screen is shown on startup
UsabilityIDEA-255581Popup submenu behavior
User Interface. Action SystemBugIDEA-255228Action popup: do not show submenu for actionable items
User Interface. FocusBugIDEA-255557Create Field without focus
User Interface. Look and FeelBugIDEA-254333Custom theme unable to customize icons
DebuggerBugWEB-48396Expanding an object with inline debugger does not start with first property
BugWEB-48092Debugger: No Hebrew/Arabic support in inline value tooltips

RubyMine 2020.3 BETA2 (203.5981.45 build) Release Notes

Ruby. ParsingBugRUBY-27326RM doesn't show offence when pattern matching incorrectly used with ruby 3.0.0-preview1
BugRUBY-27325RM code reformat splits some endless method definitions to several lines
Tools. RuboCopBugRUBY-27235RuboCop integration strips trailing spaces on save; should use RuboCop's `--stdin` option instead
CoreBugIDEA-255312Can not import a Gradle project due to java.lang.IllegalStateException from workspace project model
PerformanceIDEA-254450Slow Gradle project import with 2020.3 EAP
Core. DebuggerBugIDEA-252062Inline watches: unreadable color combination when hovering over inline watch in current line
CosmeticsIDEA-252060Inline watches: bottom toolbar design looks worse than in mockups
Core. DiagramsBugIDEA-254810No tooltip for UML changes diagram action in VCS toolbar
Core. IDE Settings. SharingBugIDEA-254117NPE on enabling IDE settings sync
BugIDEA-254758Settings repository doesn't apply pulled non-active custom keymap in case of "Merge"
BugIDEA-181599Keymap not imported settings.jar or synced in settings repository across two Webstorm instances
Core. InstallationBugIDEA-254674Windows 10 icon path in registry typo
Core. LicensingBugIDEA-255311Eval license for commercial plugins in EAP builds should remain the same as the one for release builds
Core. Plugin ManagementBugIDEA-254484No opportunity to disable plugin per project via cogwheel menu on the plugin page
Core. Run. ConfigurationsBugIDEA-255011[new run config UI] hint on hover for JDK field is shown only if it has focus
Core. Run. TargetsBugIDEA-253624Run Targets: SSH: the files are copied before the project is built. As a result the application runs without the last changes always (or fails in case of missing local build results)
BugIDEA-255092Run Targets. Docker. java.lang.IllegalAccessError: class com.intellij.docker.remote.run.target.configuration.wizard.DockerTargetTerminalStepBase at attempt to create/rebuild docker run target
CosmeticsIDEA-252469Run Targets: Adjust add language runtime section beneath Advanced Volume Settings
Editor. Editing TextTaskIDEA-253903Optimize Copy/Paste processors
Lang. JSONUsabilityIDEA-241855schemastore.org schemas drop-down should be using the names and not the url suffix
Tools. DockerBugIDEA-255268Docker. Impossible to re-call the closed Attached console
UsabilityIDEA-220014Docker: Terminal, Attached console: provide info if it is disconnected
Tools. HTTP ClientBugIDEA-251964HTTP Client: actions for unsubstituted variable value adding don't work with localized application
BugIDEA-253282HttpClient: Changes in rest client xml file not taking into account for convert to new http client action
BugIDEA-255209HttpClient: after changing color scheme some elements of httpclient in endpoints view tab became in previous color
BugIDEA-244972HTTP Client not handled POST redirect automatically
UsabilityIDEA-252424Headers completion shows already typed text as the top suggestion
Tools. TerminalBugIDEA-255471[Apple Silicon] Convert pty4j binary to universal format
User InterfaceBugIDEA-253824"Got it" popup shadow does not move with the popup after Analyzing is completed
BugIDEA-236415"Show memory indicator" toggle doesn't work anymore
BugIDEA-253643Dialogs are too small so the content is collapsed
BugIDEA-253263Shift+Enter opens several splitted tabs if invoked from Recent Files
BugIDEA-255252Exception on drag-and-drop What's new tab
UsabilityIDEA-254748Enable preview tab doesn't work if Open file with single click is unchecked
CosmeticsIDEA-254135Fix appearance of the dragged files/tab
ExceptionIDEA-254377ISE at com.intellij.ui.popup.AbstractPopup.$$$reportNull$$$0
User Interface. ArtworkCosmeticsIDEA-221920Strawberry icon looks like a bug
User Interface. Find, Replace, UsagesBugIDEA-212529Find/Find&Replace in path with newline always matches all whitespace at the beginning on subsequent line, disregarding the search pattern
User Interface. FocusBugIDEA-255026'Explain shell' refactoring popup - focus is stolen from popup to Editor
User Interface. Keyboard InputBugIDEA-252282Regression: Shortcuts with German umlauts stopped working
User Interface. Project ViewBugIDEA-254773No More Drag-n-Drop in Project Explorer
Version Control. GitBugIDEA-255104Missing Update action in Git Branches popup when called via Quicklist
UsabilityIDEA-223976Add tooltip to Detached HEAD warning
No subsystemBugWEB-44521'Download node' has hard-coded node version, current version for download is 12.13.1
BugWEB-48150Empty stub trees are not used from prebuilt shared indexes
BugWEB-47417Quick Documentation tooltip shown on mouse move doesn't include a link to external docs
DebuggerBugWEB-48060Throwable: fileInfo.url: node:internal/util, url: node:internal/util when debug via node 15
JavaScriptFeatureWEB-47713No hint about indirect usages of exports when dynamically imported
BugWEB-48153JSDoc: parameters destructuring doesn't work with @typedef
BugWEB-48139Completion doesn't suggest all available options
BugWEB-47771Cannot resolve symbol 'html' from `lit-element` library
BugWEB-48173Imported modules from Vue@3 are not resolved in JavaScript
BugWEB-47680Cannot resolve symbol exported import ES6
JavaScript. InspectionsBugWEB-48121Incorrect simplification of do while (false) in JavaScript
CosmeticsWEB-48211typo in switch-tooltip
JavaScript. RefactoringBugWEB-47675Rename from .jsx to .tsx creates incorrect imports
Live EditBugWEB-47430Live Edit: "Highlight current element in browser on caret change" does nothing
TypeScriptFeatureWEB-11418Add "Insert Var Declaration" quickfix for TypeScript
BugWEB-45486Inspection[Typescript]: Attempt to assign to const or readonly variable
BugWEB-48179TypeScript 4.1: Template literal types assignability
BugWEB-45077False errors from tsserver on module rename + move
BugWEB-48109WebStorm TypeScript inspections should support @ts-ignore
BugWEB-48224TypeScript widget not showing in status bar
TaskWEB-48275TypeScript widget changes
DB ConsoleBugDBE-11734Do not highlight MongoDB and GraalJS built-in functions as unresolved
DB DiffBugDBE-12007Diff viewer are not longer working for routine sources
DB IntrospectionExceptionDBE-12000Unexpected error (ProcessCanceledException) encountered when performing Introspect database testdb schema dbo (details)
Data ViewsCosmeticsDBE-12001Grid toolbar icons become visible only after table is loaded (looks like glitch)
SQL CompletionBugDBE-11977Code completion for collection names containing dots
SQL Format and StyleFeatureDBE-11983OUTPUT clause formatting control
SQL GeneralBugDBE-11994Incorrect inspection for mongo scripts in run configurations
UsabilityDBE-12003Run configuration dialog has invalid default size - missing check boxes in the bottom
SQL GenerationBugDBE-12040Oracle Script Generator: empty script for an underlying table of a materialized view
SQL HighlightingBugDBE-5387SQL Server Geometry and Geography types not recognized

RubyMine 2020.3 BETA1 (203.5784.12 build) Release Notes

Ruby. ParsingFeatureRUBY-27278Find pattern updates for ruby 3.0
Ruby. Version ManagersBugRUBY-27175RM selects different SDKs with same custom configurations
Code Analysis. Language InjectionBugIDEA-251156Translate 'Fragment' in tab's name when edit an injection
Core. IDE SettingsBugIDEA-253051Zulu: SDKMAN detected JDK doesn't include /Contents/Home on macOS failing Gradle import
TaskIDEA-253357Search in keymap should take synonyms into account
Core. IndexingUsabilityIDEA-253972Project specific settings for shared indexes are configured at IDE level
Core. Platform APIBugIDEA-2545342020.3 EAP SDK break from removed type params for PlaceHolder/PlaceProvider
Core. Plugin ManagementBugIDEA-254176Icons collision
BugIDEA-253447Incompatible plugin message contains "version 'null'"
Core. Run. ConfigurationsBugIDEA-254134[new run config UI] in Before Launch section it's impossible to add several tasks of the same type
BugIDEA-253893Unable to specify tags for JUnit5 tests
Core. Run. TargetsBugIDEA-254846Run Targets. Go language runtime: version is always empty after restart
Core. SSHBugIDEA-254121AWS generates ssh without passphrase but IDE asks for it
EditorBugIDEA-253454"More about the LightEdit mode" link should open help page for current IDE
Tools. DockerBugIDEA-222853PROJECT_DIR macro does not seem to work for bind mounts
BugIDEA-253996Docker target has two identical Java language runtimes neither of which can be removed
UsabilityIDEA-253992Dockerfile selector in Docker run target settings editor should default to the project home directory
User InterfaceBugIDEA-254732Pinned service view tab looks the same way as non-pinned tab
BugIDEA-254085Splitting tabs by drag-and-drop in detached window sends tab to project frame
BugIDEA-251477SearchEverywhere: modules are cropped
BugIDEA-253367Tool Windows in window mode don't raise when invoked in 203 IDEA
User Interface. Action SystemFeatureIDEA-253266Actions popup: show submenu on mouse hover
User Interface. ControlsUsabilityIDEA-254091Selection in action popup is changed while hovering mouse to submenu
User Interface. Project ViewUsabilityIDEA-238064File structure popup (speed search) Ctrl-C should copy text of selected list item, not the speed search text
CSSFeatureWEB-48151Support @nuxtjs/tailwindcss
HTMLBugWEB-43054Automatically inserted pair quotes aren't recognized when closing the pair in blade templates in Vue.js projects
BugWEB-47979Go to definition for classes in HTML shows the usage itself on the top of the list
JavaScriptFeatureWEB-48090Suggest variable names based on file name
BugWEB-41261Dynamic imports not counted when checking for import usage
BugWEB-48138Exclude blank and short items from completion
BugWEB-47750Incorrect Inspections that disappear on cut&paste
ExceptionWEB-48028Opening the flow project without node_modules causes an exception
JavaScript. FrameworksBugWEB-48169Angular 11 Schematics do not load correctly
BugWEB-47599Receiving "JSX is used without importing React" for React 17
JavaScript. RefactoringBugWEB-48123Cannot move React function based component to file without warning.
BugWEB-39255"Extract Method" refactoring should replace all occurrences of selected expression
Unit TestsBugWEB-42164Test assertion diffs are not shown when using jest-circus runner instead of jest-jasmine2
SQL Format and StyleBugDBE-11975Formatting of records inside Oracle packages is not implemented
BugDBE-11953Unexpected line break after keyword 'member'

RubyMine 2020.3 EAP7 (203.5600.13 build) Release Notes

Lang. ERBUsabilityRUBY-27224Update ERB continuation indent from 4 spaces to 2 spaces
Rails. Code InsightBugRUBY-27209Missing stub methods for ruby 3.0
Ruby. Code CompletionCosmeticsRUBY-27159Don't bold class names when invoking completion
Ruby. Code InsightBugRUBY-27131parameter info (ctrl-p) not shown for a method that resolves
BugRUBY-27249PP::ObjectMixin is included as an ancestor for all classes when invoking completion
Ruby. ParsingFeatureRUBY-27207Investigate changes necessary for separation of keyword and positional arguments in ruby 3.0
FeatureRUBY-27243Ruby 3.0 - add support for rightward assignments
FeatureRUBY-27168Ruby 3.0 - add support for endless method definitions
Ruby. TestsBugRUBY-27250Total number of tests is not shown unless the minitest-reporters is included in the bundle
Ruby. Type InferenceFeatureRUBY-27205Ruby 3.0 new method in Hash#except, add type inference support
CoreBugIDEA-253683ClassCastException when open project with Space plugin
BugIDEA-253548JSLanguageLevelPusher.getImmediateValue resolves too many children in search of .idea/misc.xml
Core. File SystemFeatureIDEA-240351Support file system notifications for projects opened inside WSL when the IDE is running outside of WSL
BugIDEA-253551VirtualFileManagerImpl.fireAfterRefreshFinish logs ProcessCanceledException
BugIDEA-252892"Error looking up function NtQueryInformationByName" warning is shown under Windows 8.1
BugIDEA-252955Unable to load library 'e2p' in amazoncorretto docker image
Core. IDE SettingsBugIDEA-252607File Templates For Multiple Files: on parent template deleting its children should be deleted also
BugIDEA-252606File Templates For Multiple Files: on parent template rename it loses its childs
BugIDEA-252609File Templates For Multiple Files: Copy action for multi-file templates works incorrectly
BugIDEA-253119Make Compiler errors non-modal
UsabilityIDEA-253137Can't toggle (enable/disable) certain settings with keyboard (without mouse)
TaskIDEA-253638Add an API to prioritize configurables within a group in code style settings
Core. IDE Settings. SharingBugIDEA-253846Can't set up IDE settings sync
BugIDEA-252603File | Manage IDE Settings | Export Settings: it is impossible to choose the target folder to create the exported file in via the path chooser
Core. IndexingBugIDEA-252988File search does not show files, search all does
BugIDEA-248440Shared indexes are OS-specific
BugIDEA-247165NPE startup error on indexing after Upgrade from 2016.1 to 2020.2
PerformanceIDEA-253399IDEA freeze
TaskIDEA-252012Group indexing diagnostics per project
ExceptionIDEA-253396Shared Indexes: Failed to find path for chunk bundled-js-predefined-ffdd448c697d-de148ed368f5-JavaScript-IU-203.5046
Core. LicensingBugIDEA-251927Strange symbol in the title of license removal dialog on Win and Linux
BugIDEA-254049License source is changed after the IDE restart
BugIDEA-245167License UI should take into account "optional"-licensed plugins when displaying warnings
TaskIDEA-252763Remove product name from the error message in the license dialog
Core. Plugin ManagementBugIDEA-254029Issues after unloading Maven plugin by disabling it for project
BugIDEA-253327Cannot install or view plugins
BugIDEA-252984Plugin disabled for one particular project is not loaded when opening other projects
BugIDEA-252873Plugin enabled for one project is shown as enabled\disabled for all projects if two projects are opened in a separate windows
Core. Project SettingsBugIDEA-252791Facets provided by disabled plugins are saved incorrectly
BugIDEA-252907UI Freeze at Space project reimport
BugIDEA-253586Class is not registered: com.intellij.workspaceModel.storage.bridgeEntities.LibraryRoot
BugIDEA-253040IDEA does not recognise a module, but it is present in modules.xml
BugIDEA-253515"Invalidate and restart" action deletes content of .idea/libraries directory in projects which use Gradle if Android plugin is enabled
BugIDEA-254157Sometimes VfsUtilCore.copyFile adds an extra bom to the new file
UsabilityIDEA-240999Suggest to automatically download JDK when "Build Project" action is invoked
ExceptionIDEA-253589NoSuchFileException while getting module file
ExceptionIDEA-253686It's not possible to create a new project at location which was used for another project
ExceptionIDEA-189132Throwable at com.intellij.openapi.roots.ui.configuration.ModulesConfigurator.getOrCreateModuleEditor
Core. Quick DocumentationBugIDEA-253284"Show on mouse move" is shown as a button with unknown icon in Documentation tool window
Core. Run. ConfigurationsBugIDEA-253816[new run config UI] "Build" Before Launch disappears after modifying the Run Configuration
Core. Run. TargetsFeatureIDEA-251763Provide browsers from browsable targets to run configurations
FeatureIDEA-252733In case of failure of preparation run configuration should not proceed to execution
BugIDEA-253343Run Targets. Run configs: the newly created run target is not selected in the Run Configuration dialog
BugIDEA-248360Adding new target in Manage targets dialog should launch wizard
BugIDEA-252404Run Targets: Hide run on list before wizard
BugIDEA-253321Run Targets. Changes in the chosen Dockefile should be saved before running build/pull process
BugIDEA-253428SSH Target: after failure with upload IDE still tries to upload something
BugIDEA-253345Run Targets. Docker. Errors by "Rebuild" the same Dockerfile
BugIDEA-253362Run Targets. Docker. Add validation for "Run options" field as it for Docker run configs
BugIDEA-253082Run Targets: Get AWT-EventQueue exception on run java app with SSH target
BugIDEA-253810Run targets. Docker. Creation via Settings: it doesn't take the set "language runtime" and doesn't run container introspection
BugIDEA-253797Docker. Run Targets. Copy a docker target action creates a new target without a name and doesn't copy language values
BugIDEA-248370Show an error when no runtime is configured
BugIDEA-252969Run Targets. Spring Boot. Provide the correct port in the Services view by running on docker targets
BugIDEA-253151Exception when uploading file to SSH run target
BugIDEA-253152Uploading files to a run target should exclude ignored files
BugIDEA-253711Run Targets: SSH: attempt to run JUnit 5 run configuration fails on attempt to copy files
BugIDEA-253695Run Targets: rsync test connection asks for ssh server password, but it is provided
BugIDEA-252405Run Targets: Can't configure maven home for docker run target
BugIDEA-253369Run Targets. Docker. Build args are ignored.
BugIDEA-253330Run Targets. Docker. Run targets creation works wrong because 'Runtime language' step is absent during the target creation.
BugIDEA-253090Run Targets: Get Maven exception after choosing several targets in maven configuration
BugIDEA-253377Run Targets: RSync for SSH target not detected in case windows-linux or wsl-linux
BugIDEA-252976Run Targets: application folder field in SSH target is cleared every time target reopened
UsabilityIDEA-253334Run Targets. RunConfigs->Manage targets. Add Apply button.
UsabilityIDEA-253274Run Targets: SSH: provide possibility to select the Maven home path on the remote machine using the path chooser
UsabilityIDEA-253269Run Targets: SSH: add possibility to select the jdk home path using the path chooser
UsabilityIDEA-253620Run Targets. Docker. Improve target creation via Settings
CosmeticsIDEA-253693Run Targets: rsync connected message not visible in dark theme
CosmeticsIDEA-254006Run Targets. Docker. Create via Settings: the 3d step name is present only as `3/3.` instead of `3/3. Configure Java`
TaskIDEA-252711Run Targets: targets should be project-level
Core. SSHBugIDEA-252300Entered SSH passphrase isn't applied for deployment configuration
BugIDEA-253288If ssh password request is shown as a balloon, it can't be shown as a modal window.
BugIDEA-253287SSH password requests are not cancellable.
BugIDEA-253595When auth type is not openssh+agent, preferred authentications should be updated.
EditorFeatureIDEA-252707Soft wrap in lightedit
BugIDEA-253165--edit command-line option is ignored in case build.gradle/pom.xml
BugIDEA-252166"Reader Mode" toggler is shown in editor, though the "Show reader mode toggle in the editor" is unchecked in settings
BugIDEA-250265NullPointerException when trying to invoke intention actions for .md files
BugIDEA-253120Reader mode shouldn't affect inspect.sh
BugIDEA-253601Bad live-template position near the inlay element.
UsabilityIDEA-251392"Go to declaration" in combination with mouse button causes editor selection
UsabilityIDEA-253084Reader Mode very surprising the first time you see it
Editor. Editing TextBugIDEA-251793After Ctl-Y, the display is positioned wrong
BugIDEA-251279Matching brace popup does not honor Background in readonly files setting
Lang. RegExpFeatureIDEA-96093highlight string matching portion when checking regexes
FeatureIDEA-243794Highlight matched groups in RegExp tester
Lang. YAMLBugIDEA-248058Microservices: Incorrect HTTP URL injected to YAML value
Tools. HTTP ClientBugIDEA-250246HTTP Client: cookies from legacy requests are not converted into the new http client
UsabilityIDEA-187044REST client uses 12-hours clock instead of 24-hours
Tools. TerminalBugIDEA-239094incorrect terminal line heigth/spacing
BugIDEA-170763Some special characters cannot be typed in IDE terminal
UsabilityIDEA-180370Darcula default terminal colors
UsabilityIDEA-129396Terminal should scroll 3 lines per step
User InterfaceBugIDEA-252805Can not resize variables in debug tool window
BugIDEA-252457Search Everywhere: Hint from Actions tab is shown on other tabs after switching from Actions to another tab
BugIDEA-252453Search Everywhere: Filters are not applied on All tab
BugIDEA-253703Pinned tab does not become unpinned after drag-and-drop to the position before the last tab
BugIDEA-252868IconLoader without caching fails to find icons
BugIDEA-252781Window titles are light in Darcula, when reopening IDEA with 2 projects
BugIDEA-253297Missing action group icon in popup menu in 2020.3 EAP
BugIDEA-252882Console scrollbar is not updated on a theme change
BugIDEA-253036Tab splitted by drag-and-drop becomes pinned if it was located next to pinned tab
BugIDEA-249821"Copy File Name" action doesn't include part after the last dot
BugIDEA-252804cannot resize debug tool window when event log is opened next to it
BugIDEA-253012"Show hidden tabs" button remains on tab panel if tabs are shown in multiple rows
BugIDEA-253038Disable fractional metrics on non-retina monitor
BugIDEA-253033Toolbar is presented twice in the View menu
BugIDEA-252217Drag and drop doesn't work with new Welcome Screen
BugIDEA-253839Big Sur: Custom alerts are invoked instead of native
UsabilityIDEA-251428[Problems View panel] Mnemonic digit '6' to the left of the panel name always confuses me
UsabilityIDEA-252653Pinned tabs too narrow
UsabilityIDEA-252995Hint for "pin" icon of pinned tab is misleading
UsabilityIDEA-222531Services - option to always open in new tab
CosmeticsIDEA-250519grammatical & typographic errors in notification
TaskIDEA-252636What's new in Editor
ExceptionIDEA-252974Search Everywhere: IllegalStateException when searching in Symbols
ExceptionIDEA-252980Search everywhere: Somtimes IllegalArgumentException occurs when switching from Classes to Files tab
User Interface. AccessibilityBugIDEA-253338"Show help contents" button in settings page can't be spoken by NVDA screen reader
BugIDEA-253342On `Settings | Appearance and Behavior | System Settings`, the NVDA screen reader doesn't speak the "Database" when navigated to the "Database:"'s edit view by using tab
BugIDEA-252705in the list of sources "get from vcs" no elements are not spoken by the screen reader
BugIDEA-253340Two buttons in `Settings | Appearance & Behavior | Menus and Toolbars` are not spoken by NVDA screen reader
TaskIDEA-252706Release so that the screen reader speaks the source list name on the "get from VCS" screen
User Interface. Action SystemBugIDEA-252496Pinned tab is not closed with shortcut
User Interface. Find, Replace, UsagesBugIDEA-170925Find in Path dialog - default to directory of current file
BugIDEA-252274[Find in Files]: Scope background is lost for the line under the hovered one
BugIDEA-249809Editor search not showing up
BugIDEA-252922Replace and preserve case capitalises replacements of numbers
User Interface. FocusBugIDEA-190158Typeahead timeout exception if same shortcut is assigned to multiple actions (Find and Find in Path, or similar case with Goto Class)
BugIDEA-253238Right click sometimes sent to and activates the wrong IJ window
User Interface. Services ViewBugIDEA-244057Services: tab header color for services in a separate tab
Version ControlBugIDEA-231698Non-modal commit: Author field is not shown inline
BugIDEA-252307Rebase modal no longer stores previously selected ref or options
BugIDEA-252549Double click on change in commit tab no longer shows inline diff window
Version Control. GitFeatureIDEA-241680[Git Panel] "Update Selected button" should work for current branch
FeatureIDEA-128268"Create New Branch" name automatic conversion
FeatureIDEA-233058Add Update action for the current branch in Branches popup
FeatureIDEA-91542Replace Merge with Pull on Remote Branches in VCS Operations | Git Branches view
BugIDEA-253313Can't commit staged deletion
BugIDEA-253175Create New Branch replaces most of the forward slashes/periods with underscores
UsabilityIDEA-243122Git popup menus are inconsistent
UsabilityIDEA-253485Git Staging Area: Vertical scrollbar covers plus/minus icons
UsabilityIDEA-251554Pull-dialog: suggests pulling from the last entered branch, instead from tracked branch
Version Control. GitHubFeatureIDEA-252396Support user and label completion for GitHub Pull Requests search
BugIDEA-243134Clone Dialog -> GitHub: Infinite wait if pressing "Log In" with all fields empty
BugIDEA-252798Don't remember empty query in github pull requests search
Version Control. LogTaskIDEA-252476Create color key for hovered line in the Log table
No subsystemFeatureWEB-47897TypeScript: Make path to error a hyperlink in yarn output
BugWEB-46790tslint errors/warnings not clickable
BugWEB-44118Import quickfix not given for Ant Design icons
BugWEB-48044Create React component quick fix for qualified references shouldn't be available
BugWEB-46865Directory alias is mysteriously unresolved
BugWEB-47809Adding Javascript template project as a new module to IDEA project creates files in the wrong folder
UsabilityWEB-42539Angular follow to the issue source
UsabilityWEB-47821Bypass showing Autocomplete/Suggestion Popup if User typing number
TaskWEB-47894Bundle Feature trainer plugin
TaskWEB-47874Cleanup project generators list
TaskWEB-47875JavaScript: implement lazy indexing for tool packages
ExceptionWEB-47780Throwable at com.intellij.psi.impl.SharedPsiElementImplUtil.getChildIndex
ExceptionWEB-47902AssertionError
Build toolsFeatureWEB-22867webpack errors output path is not clickable
UsabilityWEB-36182webpack aliases are not resolved correctly when config is exported as function
TaskWEB-47906Basic support for mutiple webpack configs
CSSBugWEB-45489Webstorm format doesn't format the css inside styled-components
BugWEB-47978Color preview in code completion popup is too big
DebuggerUsabilityWEB-47823SmartStepInto: filter library variants when 'do not step into libraries' enabled
JavaScriptFeatureWEB-47761Suggest default imports based on existing imports in the project
FeatureWEB-47822JavaScript: show elements from the structure view in the IDE navigation bar
BugWEB-47640Prefer imports from index file when webpack alias is used
BugWEB-47748Invalid Range Exception does block Reformat Code
BugWEB-48031Go to usages (cmd/ctrl+click) doesn't work with enabled flow service
BugWEB-44774Code completion missing in destructuring statement
BugWEB-47052Do not add JsFlowSettings to workspace.xml when Flow is not used
BugWEB-47925ES6 module re-exported as "export {default as moduleName}" should be imported as a named module
BugWEB-47688JSDoc: Unresolved variable or type `Dropbox`
BugWEB-47941Trailing comma after FlowJS inexact operator is seen as error
BugWEB-47800JavaScript. parser issues
BugWEB-47499Symbols from .mjs files are not suggested in quick fixes
BugWEB-44930"Use directory import" option doesn't work for default exports
ExceptionWEB-47828Exception while navigating to the intention's description from Search everywhere
JavaScript. FormatterBugWEB-37977HTML injection isn't working in ES6 tagged string literals in HTML
JavaScript. FrameworksFeatureWEB-48010Import prettier rules with ESLint
FeatureWEB-46511Vue 3: Support <script setup>
BugWEB-47131Vue Composition API: components autocomplete does not work
BugWEB-27844Importing a folder doesn't resolve platform-specific React Native index imports
BugWEB-45616Case-sensitive completion of React components
BugWEB-41313No auto-import suggestions for PropTypes
BugWEB-46645vue-typed-mixins Broken
BugWEB-46545Vue 3 `setup`: Returned properties not recognized in template if `setup` method is defined as `async`
BugWEB-46768Go to Definition for components from web-types.json doesn't work if there are multiple sources (Vue)
BugWEB-46730Component class exported indirectly is not recognized
BugWEB-46975Vue.js: single file components with empty object literal are not shown in autocompletion
BugWEB-46620[Vue.js] `template` field does not handled properly in JS files
BugWEB-47204Composition API's setup() function cannot be arrow function
BugWEB-46882Vuex's mapState does not work when module's state is a function
UsabilityWEB-34635Vue.js: single file components with function property are not available in completion
ExceptionWEB-47998'Convert to visible line separators' causes 'nonempty text is not covered by block in #Vue #formatter'
ExceptionWEB-47791Creating a new angular project causes an exception
JavaScript. InspectionsBugWEB-46999Common.js imports with require are not suggested in quick fixes
BugWEB-47844`Convert to let/const` deletes code in blade.php files
LintersFeatureWEB-34649Import rules from eslint-plugin-vue to Vue code style settings
FeatureWEB-34655Import typescript code style preferences from .eslintrc
BugWEB-43455Lint TypeScript files with ESLint in Vue CLI project
Node.jsFeatureWEB-44742tsc -p output doesn't allow direct opening of files with errors
FeatureWEB-36956NPM console: linter errors in webpack output should have code navigation
BugWEB-37265Missing clickable links in ng lint output
SASSBugWEB-47734Editing an imported Sass file that has the same name as a neighbor folder doesn't trigger File Watcher
TypeScriptBugWEB-46126TypeScript 4.0 Variadic tuple types support
BugWEB-45997Monorepo: auto-import should prefer package import to the one from src folder
BugWEB-36638@material-ui: no completion for components in TypeScript files
BugWEB-47803Multiple candidates for the same type variable in contra-variant positions isn't inferred to an intersection type
BugWEB-38508WebStorm generates .vue.d.ts files from .vue files
BugWEB-46778Vue: vuex state inferred on typed parameters
BugWEB-30387Auto import is not optimal (top most source)
BugWEB-44282Importing an external function that is only used as a variable's declaration is detected as unused
BugWEB-47934First option in completion isnt rendered
BugWEB-43070Types added to modules via module augmentation not available in import completion
TaskWEB-48001Remove options "Use for projects without tsconfig.json" and "Compile scope" in the TypeScript language server configuration
TaskWEB-47166Support rendered comments for indexer
ExceptionWEB-48034Code with Variadic tuple types causes an exception
DB ConnectivityUsabilityDBE-6729Data source for embedded (local) databases: if relative file path for database is used use project directory as relative directory rather than <IDE_HOME>/bin
DB IntrospectionBugDBE-11870Problem refreshing DB connection on old SQL server databases
Data ViewsBugDBE-11839IDE windows/tab system freaks out when database results are dragged to new windows
BugDBE-6401H2: Cannot add/edit enum columns
SQL GenerationBugDBE-11786MS SQL: Script generator forgets to specify asc/desc in a unique index or primary key fields when it declares inside the table declaration
SQL HighlightingBugDBE-11833[BigQuery] Support for `UNION ALL` with subqueries enclosed in parentheses
BugDBE-10439ClickHouse: unknown database function
BugDBE-11829Empty string rises an error in query
BugDBE-11778Support for remote(), remoteSecure(), cluster(), clusterAllReplicas() table functions as ClickHouse dialect
SQL ResolveBugDBE-5051Postgres: function's OUT parameter is unresolved
BugDBE-11832Fix resolve of Couchbase LET clause
BugDBE-11797Fix UNNEST highlighting in Couchbase

RubyMine 2020.3 EAP6 (203.5419.9 build) Release Notes

Lang. ERBUsabilityRUBY-27224Update ERB continuation indent from 4 spaces to 2 spaces
Ruby. Code InsightBugRUBY-27131parameter info (ctrl-p) not shown for a method that resolves
BugRUBY-27249PP::ObjectMixin is included as an ancestor for all classes when invoking completion
CoreBugIDEA-253683ClassCastException when open project with Space plugin
BugIDEA-253548JSLanguageLevelPusher.getImmediateValue resolves too many children in search of .idea/misc.xml
Core. File SystemBugIDEA-252892"Error looking up function NtQueryInformationByName" warning is shown under Windows 8.1
BugIDEA-253551VirtualFileManagerImpl.fireAfterRefreshFinish logs ProcessCanceledException
BugIDEA-252955Unable to load library 'e2p' in amazoncorretto docker image
Core. IDE SettingsBugIDEA-252606File Templates For Multiple Files: on parent template rename it loses its childs
BugIDEA-252609File Templates For Multiple Files: Copy action for multi-file templates works incorrectly
BugIDEA-252607File Templates For Multiple Files: on parent template deleting its children should be deleted also
BugIDEA-253119Make Compiler errors non-modal
UsabilityIDEA-253137Can't toggle (enable/disable) certain settings with keyboard (without mouse)
Core. IDE Settings. SharingBugIDEA-252603File | Manage IDE Settings | Export Settings: it is impossible to choose the target folder to create the exported file in via the path chooser
Core. IndexingBugIDEA-248440Shared indexes are OS-specific
BugIDEA-252988File search does not show files, search all does
BugIDEA-247165NPE startup error on indexing after Upgrade from 2016.1 to 2020.2
PerformanceIDEA-253399IDEA freeze
ExceptionIDEA-253396Shared Indexes: Failed to find path for chunk bundled-js-predefined-ffdd448c697d-de148ed368f5-JavaScript-IU-203.5046
Core. LicensingBugIDEA-245167License UI should take into account "optional"-licensed plugins when displaying warnings
BugIDEA-251927Strange symbol in the title of license removal dialog on Win and Linux
TaskIDEA-252763Remove product name from the error message in the license dialog
Core. Plugin ManagementBugIDEA-252984Plugin disabled for one particular project is not loaded when opening other projects
BugIDEA-252873Plugin enabled for one project is shown as enabled\disabled for all projects if two projects are opened in a separate windows
BugIDEA-253327Cannot install or view plugins
Core. Project SettingsBugIDEA-252907UI Freeze at Space project reimport
BugIDEA-253586Class is not registered: com.intellij.workspaceModel.storage.bridgeEntities.LibraryRoot
BugIDEA-252791Facets provided by disabled plugins are saved incorrectly
BugIDEA-253515"Invalidate and restart" action deletes content of .idea/libraries directory in projects which use Gradle if Android plugin is enabled
UsabilityIDEA-240999Suggest to automatically download JDK when "Build Project" action is invoked
ExceptionIDEA-253589NoSuchFileException while getting module file
Core. Quick DocumentationBugIDEA-253284"Show on mouse move" is shown as a button with unknown icon in Documentation tool window
Core. Run. ConfigurationsBugIDEA-253816[new run config UI] "Build" Before Launch disappears after modifying the Run Configuration
Core. Run. TargetsFeatureIDEA-251763Provide browsers from browsable targets to run configurations
FeatureIDEA-252733In case of failure of preparation run configuration should not proceed to execution
BugIDEA-253343Run Targets. Run configs: the newly created run target is not selected in the Run Configuration dialog
BugIDEA-248360Adding new target in Manage targets dialog should launch wizard
BugIDEA-253345Run Targets. Docker. Errors by "Rebuild" the same Dockerfile
BugIDEA-253151Exception when uploading file to SSH run target
BugIDEA-253711Run Targets: SSH: attempt to run JUnit 5 run configuration fails on attempt to copy files
BugIDEA-253321Run Targets. Changes in the chosen Dockefile should be saved before running build/pull process
BugIDEA-253082Run Targets: Get AWT-EventQueue exception on run java app with SSH target
BugIDEA-253330Run Targets. Docker. Run targets creation works wrong because 'Runtime language' step is absent during the target creation.
BugIDEA-252969Run Targets. Spring Boot. Provide the correct port in the Services view by running on docker targets
BugIDEA-253152Uploading files to a run target should exclude ignored files
BugIDEA-253428SSH Target: after failure with upload IDE still tries to upload something
BugIDEA-252976Run Targets: application folder field in SSH target is cleared every time target reopened
UsabilityIDEA-253620Run Targets. Docker. Improve target creation via Settings
Core. SSHBugIDEA-253595When auth type is not openssh+agent, preferred authentications should be updated.
BugIDEA-253288If ssh password request is shown as a balloon, it can't be shown as a modal window.
EditorBugIDEA-250265NullPointerException when trying to invoke intention actions for .md files
BugIDEA-252166"Reader Mode" toggler is shown in editor, though the "Show reader mode toggle in the editor" is unchecked in settings
BugIDEA-253120Reader mode shouldn't affect inspect.sh
BugIDEA-253165--edit command-line option is ignored in case build.gradle/pom.xml
BugIDEA-253601Bad live-template position near the inlay element.
UsabilityIDEA-253084Reader Mode very surprising the first time you see it
UsabilityIDEA-251392"Go to declaration" in combination with mouse button causes editor selection
Editor. Editing TextBugIDEA-251279Matching brace popup does not honor Background in readonly files setting
BugIDEA-251793After Ctl-Y, the display is positioned wrong
Lang. YAMLBugIDEA-248058Microservices: Incorrect HTTP URL injected to YAML value
Tools. HTTP ClientBugIDEA-250246HTTP Client: cookies from legacy requests are not converted into the new http client
UsabilityIDEA-187044REST client uses 12-hours clock instead of 24-hours
Tools. TerminalBugIDEA-170763Some special characters cannot be typed in IDE terminal
BugIDEA-239094incorrect terminal line heigth/spacing
UsabilityIDEA-129396Terminal should scroll 3 lines per step
UsabilityIDEA-180370Darcula default terminal colors
User InterfaceBugIDEA-252804cannot resize debug tool window when event log is opened next to it
BugIDEA-252805Can not resize variables in debug tool window
BugIDEA-253703Pinned tab does not become unpinned after drag-and-drop to the position before the last tab
BugIDEA-253012"Show hidden tabs" button remains on tab panel if tabs are shown in multiple rows
BugIDEA-252868IconLoader without caching fails to find icons
BugIDEA-252882Console scrollbar is not updated on a theme change
BugIDEA-252217Drag and drop doesn't work with new Welcome Screen
BugIDEA-253033Toolbar is presented twice in the View menu
BugIDEA-252457Search Everywhere: Hint from Actions tab is shown on other tabs after switching from Actions to another tab
BugIDEA-253036Tab splitted by drag-and-drop becomes pinned if it was located next to pinned tab
BugIDEA-253038Disable fractional metrics on non-retina monitor
BugIDEA-253297Missing action group icon in popup menu in 2020.3 EAP
BugIDEA-249821"Copy File Name" action doesn't include part after the last dot
BugIDEA-252453Search Everywhere: Filters are not applied on All tab
UsabilityIDEA-252995Hint for "pin" icon of pinned tab is misleading
UsabilityIDEA-222531Services - option to always open in new tab
UsabilityIDEA-251428[Problems View panel] Mnemonic digit '6' to the left of the panel name always confuses me
UsabilityIDEA-252653Pinned tabs too narrow
ExceptionIDEA-252980Search everywhere: Somtimes IllegalArgumentException occurs when switching from Classes to Files tab
ExceptionIDEA-252974Search Everywhere: IllegalStateException when searching in Symbols
User Interface. AccessibilityBugIDEA-252705in the list of sources "get from vcs" no elements are not spoken by the screen reader
BugIDEA-253338"Show help contents" button in settings page can't be spoken by NVDA screen reader
TaskIDEA-252706Release so that the screen reader speaks the source list name on the "get from VCS" screen
User Interface. Action SystemBugIDEA-252496Pinned tab is not closed with shortcut
User Interface. Find, Replace, UsagesBugIDEA-252922Replace and preserve case capitalises replacements of numbers
BugIDEA-252274[Find in Files]: Scope background is lost for the line under the hovered one
BugIDEA-249809Editor search not showing up
BugIDEA-170925Find in Path dialog - default to directory of current file
User Interface. FocusBugIDEA-253238Right click sometimes sent to and activates the wrong IJ window
User Interface. Services ViewBugIDEA-244057Services: tab header color for services in a separate tab
Version Control. GitFeatureIDEA-91542Replace Merge with Pull on Remote Branches in VCS Operations | Git Branches view
FeatureIDEA-128268"Create New Branch" name automatic conversion
FeatureIDEA-241680[Git Panel] "Update Selected button" should work for current branch
FeatureIDEA-233058Add Update action for the current branch in Branches popup
BugIDEA-253175Create New Branch replaces most of the forward slashes/periods with underscores
UsabilityIDEA-243122Git popup menus are inconsistent
Version Control. GitHubFeatureIDEA-252396Support user and label completion for GitHub Pull Requests search
BugIDEA-252798Don't remember empty query in github pull requests search
No subsystemFeatureWEB-47897TypeScript: Make path to error a hyperlink in yarn output
BugWEB-44118Import quickfix not given for Ant Design icons
BugWEB-46865Directory alias is mysteriously unresolved
BugWEB-47809Adding Javascript template project as a new module to IDEA project creates files in the wrong folder
BugWEB-46790tslint errors/warnings not clickable
UsabilityWEB-47821Bypass showing Autocomplete/Suggestion Popup if User typing number
UsabilityWEB-42539Angular follow to the issue source
TaskWEB-47874Cleanup project generators list
TaskWEB-47875JavaScript: implement lazy indexing for tool packages
TaskWEB-47894Bundle Feature trainer plugin
ExceptionWEB-47902AssertionError
Build toolsFeatureWEB-22867webpack errors output path is not clickable
TaskWEB-47906Basic support for mutiple webpack configs
CSSBugWEB-47978Color preview in code completion popup is too big
BugWEB-45489Webstorm format doesn't format the css inside styled-components
DebuggerUsabilityWEB-47823SmartStepInto: filter library variants when 'do not step into libraries' enabled
JavaScriptFeatureWEB-47822JavaScript: show elements from the structure view in the IDE navigation bar
FeatureWEB-47761Suggest default imports based on existing imports in the project
BugWEB-47688JSDoc: Unresolved variable or type `Dropbox`
BugWEB-47800JavaScript. parser issues
BugWEB-47499Symbols from .mjs files are not suggested in quick fixes
BugWEB-47052Do not add JsFlowSettings to workspace.xml when Flow is not used
BugWEB-44774Code completion missing in destructuring statement
BugWEB-47640Prefer imports from index file when webpack alias is used
BugWEB-44930"Use directory import" option doesn't work for default exports
BugWEB-47748Invalid Range Exception does block Reformat Code
BugWEB-47941Trailing comma after FlowJS inexact operator is seen as error
BugWEB-47925ES6 module re-exported as "export {default as moduleName}" should be imported as a named module
ExceptionWEB-47828Exception while navigating to the intention's description from Search everywhere
JavaScript. FormatterBugWEB-37977HTML injection isn't working in ES6 tagged string literals in HTML
JavaScript. FrameworksBugWEB-46730Component class exported indirectly is not recognized
BugWEB-47204Composition API's setup() function cannot be arrow function
BugWEB-46645vue-typed-mixins Broken
BugWEB-46620[Vue.js] `template` field does not handled properly in JS files
BugWEB-46768Go to Definition for components from web-types.json doesn't work if there are multiple sources (Vue)
BugWEB-27844Importing a folder doesn't resolve platform-specific React Native index imports
BugWEB-46882Vuex's mapState does not work when module's state is a function
BugWEB-45616Case-sensitive completion of React components
BugWEB-46975Vue.js: single file components with empty object literal are not shown in autocompletion
BugWEB-46545Vue 3 `setup`: Returned properties not recognized in template if `setup` method is defined as `async`
BugWEB-41313No auto-import suggestions for PropTypes
BugWEB-47131Vue Composition API: components autocomplete does not work
UsabilityWEB-34635Vue.js: single file components with function property are not available in completion
ExceptionWEB-47791Creating a new angular project causes an exception
JavaScript. InspectionsBugWEB-47844`Convert to let/const` deletes code in blade.php files
LintersFeatureWEB-34649Import rules from eslint-plugin-vue to Vue code style settings
FeatureWEB-34655Import typescript code style preferences from .eslintrc
BugWEB-43455Lint TypeScript files with ESLint in Vue CLI project
Node.jsFeatureWEB-44742tsc -p output doesn't allow direct opening of files with errors
FeatureWEB-36956NPM console: linter errors in webpack output should have code navigation
BugWEB-37265Missing clickable links in ng lint output
SASSBugWEB-47734Editing an imported Sass file that has the same name as a neighbor folder doesn't trigger File Watcher
TypeScriptBugWEB-30387Auto import is not optimal (top most source)
BugWEB-45997Monorepo: auto-import should prefer package import to the one from src folder
BugWEB-46778Vue: vuex state inferred on typed parameters
BugWEB-38508WebStorm generates .vue.d.ts files from .vue files
BugWEB-46126TypeScript 4.0 Variadic tuple types support
BugWEB-43070Types added to modules via module augmentation not available in import completion
BugWEB-36638@material-ui: no completion for components in TypeScript files
BugWEB-47934First option in completion isnt rendered
TaskWEB-47166Support rendered comments for indexer
DB ConnectivityUsabilityDBE-6729Data source for embedded (local) databases: if relative file path for database is used use project directory as relative directory rather than <IDE_HOME>/bin
Data ViewsBugDBE-6401H2: Cannot add/edit enum columns
SQL GenerationBugDBE-11786MS SQL: Script generator forgets to specify asc/desc in a unique index or primary key fields when it declares inside the table declaration
SQL HighlightingBugDBE-11829Empty string rises an error in query
BugDBE-11778Support for remote(), remoteSecure(), cluster(), clusterAllReplicas() table functions as ClickHouse dialect
BugDBE-10439ClickHouse: unknown database function
BugDBE-11833[BigQuery] Support for `UNION ALL` with subqueries enclosed in parentheses
SQL ResolveBugDBE-5051Postgres: function's OUT parameter is unresolved
BugDBE-11797Fix UNNEST highlighting in Couchbase
BugDBE-11832Fix resolve of Couchbase LET clause

RubyMine 2020.3 EAP5 (203.5251.42 build) Release Notes

Lang. ERBUsabilityRUBY-27224Update ERB continuation indent from 4 spaces to 2 spaces
Ruby. Code InsightBugRUBY-27131parameter info (ctrl-p) not shown for a method that resolves
Core. File SystemBugIDEA-252955Unable to load library 'e2p' in amazoncorretto docker image
BugIDEA-252892"Error looking up function NtQueryInformationByName" warning is shown under Windows 8.1
Core. IDE SettingsBugIDEA-252607File Templates For Multiple Files: on parent template deleting its children should be deleted also
BugIDEA-253119Make Compiler errors non-modal
BugIDEA-252606File Templates For Multiple Files: on parent template rename it loses its childs
BugIDEA-252609File Templates For Multiple Files: Copy action for multi-file templates works incorrectly
Core. IDE Settings. SharingBugIDEA-252603File | Manage IDE Settings | Export Settings: it is impossible to choose the target folder to create the exported file in via the path chooser
Core. IndexingBugIDEA-248440Shared indexes are OS-specific
BugIDEA-247165NPE startup error on indexing after Upgrade from 2016.1 to 2020.2
ExceptionIDEA-253396Shared Indexes: Failed to find path for chunk bundled-js-predefined-ffdd448c697d-de148ed368f5-JavaScript-IU-203.5046
Core. LicensingBugIDEA-245167License UI should take into account "optional"-licensed plugins when displaying warnings
BugIDEA-251927Strange symbol in the title of license removal dialog on Win and Linux
TaskIDEA-252763Remove product name from the error message in the license dialog
Core. Plugin ManagementBugIDEA-253327Cannot install or view plugins
BugIDEA-252984Plugin disabled for one particular project is not loaded when opening other projects
Core. Project SettingsBugIDEA-252907UI Freeze at Space project reimport
BugIDEA-252791Facets provided by disabled plugins are saved incorrectly
UsabilityIDEA-240999Suggest to automatically download JDK when "Build Project" action is invoked
Core. Run. TargetsFeatureIDEA-252733In case of failure of preparation run configuration should not proceed to execution
BugIDEA-252969Run Targets. Spring Boot. Provide the correct port in the Services view by running on docker targets
BugIDEA-252976Run Targets: application folder field in SSH target is cleared every time target reopened
BugIDEA-253082Run Targets: Get AWT-EventQueue exception on run java app with SSH target
BugIDEA-248360Adding new target in Manage targets dialog should launch wizard
EditorBugIDEA-253120Reader mode shouldn't affect inspect.sh
BugIDEA-252166"Reader Mode" toggler is shown in editor, though the "Show reader mode toggle in the editor" is unchecked in settings
UsabilityIDEA-251392"Go to declaration" in combination with mouse button causes editor selection
Editor. Editing TextBugIDEA-251793After Ctl-Y, the display is positioned wrong
BugIDEA-251279Matching brace popup does not honor Background in readonly files setting
Lang. YAMLBugIDEA-248058Microservices: Incorrect HTTP URL injected to YAML value
Tools. HTTP ClientBugIDEA-250246HTTP Client: cookies from legacy requests are not converted into the new http client
UsabilityIDEA-187044REST client uses 12-hours clock instead of 24-hours
Tools. TerminalBugIDEA-239094incorrect terminal line heigth/spacing
BugIDEA-170763Some special characters cannot be typed in IDE terminal
UsabilityIDEA-129396Terminal should scroll 3 lines per step
User InterfaceBugIDEA-252453Search Everywhere: Filters are not applied on All tab
BugIDEA-253012"Show hidden tabs" button remains on tab panel if tabs are shown in multiple rows
BugIDEA-252804cannot resize debug tool window when event log is opened next to it
BugIDEA-252457Search Everywhere: Hint from Actions tab is shown on other tabs after switching from Actions to another tab
BugIDEA-252882Console scrollbar is not updated on a theme change
BugIDEA-252805Can not resize variables in debug tool window
BugIDEA-253033Toolbar is presented twice in the View menu
BugIDEA-253038Disable fractional metrics on non-retina monitor
BugIDEA-252868IconLoader without caching fails to find icons
UsabilityIDEA-252653Pinned tabs too narrow
UsabilityIDEA-222531Services - option to always open in new tab
UsabilityIDEA-251428[Problems View panel] Mnemonic digit '6' to the left of the panel name always confuses me
ExceptionIDEA-252974Search Everywhere: IllegalStateException when searching in Symbols
ExceptionIDEA-252980Search everywhere: Somtimes IllegalArgumentException occurs when switching from Classes to Files tab
User Interface. AccessibilityBugIDEA-252705in the list of sources "get from vcs" no elements are not spoken by the screen reader
TaskIDEA-252706Release so that the screen reader speaks the source list name on the "get from VCS" screen
User Interface. Action SystemBugIDEA-252496Pinned tab is not closed with shortcut
User Interface. Find, Replace, UsagesBugIDEA-252922Replace and preserve case capitalises replacements of numbers
BugIDEA-252274[Find in Files]: Scope background is lost for the line under the hovered one
User Interface. Services ViewBugIDEA-244057Services: tab header color for services in a separate tab
Version Control. GitFeatureIDEA-233058Add Update action for the current branch in Branches popup
FeatureIDEA-91542Replace Merge with Pull on Remote Branches in VCS Operations | Git Branches view
FeatureIDEA-241680[Git Panel] "Update Selected button" should work for current branch
FeatureIDEA-128268"Create New Branch" name automatic conversion
BugIDEA-253175Create New Branch replaces most of the forward slashes/periods with underscores
UsabilityIDEA-243122Git popup menus are inconsistent
Version Control. GitHubFeatureIDEA-252396Support user and label completion for GitHub Pull Requests search
BugIDEA-252798Don't remember empty query in github pull requests search
No subsystemFeatureWEB-47897TypeScript: Make path to error a hyperlink in yarn output
BugWEB-46865Directory alias is mysteriously unresolved
BugWEB-47809Adding Javascript template project as a new module to IDEA project creates files in the wrong folder
BugWEB-46790tslint errors/warnings not clickable
UsabilityWEB-42539Angular follow to the issue source
UsabilityWEB-47821Bypass showing Autocomplete/Suggestion Popup if User typing number
TaskWEB-47874Cleanup project generators list
TaskWEB-47894Bundle Feature trainer plugin
TaskWEB-47875JavaScript: implement lazy indexing for tool packages
Build toolsFeatureWEB-22867webpack errors output path is not clickable
DebuggerUsabilityWEB-47823SmartStepInto: filter library variants when 'do not step into libraries' enabled
JavaScriptFeatureWEB-47822JavaScript: show elements from the structure view in the IDE navigation bar
FeatureWEB-47761Suggest default imports based on existing imports in the project
BugWEB-44930"Use directory import" option doesn't work for default exports
BugWEB-47640Prefer imports from index file when webpack alias is used
BugWEB-47800JavaScript. parser issues
BugWEB-47688JSDoc: Unresolved variable or type `Dropbox`
BugWEB-47748Invalid Range Exception does block Reformat Code
BugWEB-47499Symbols from .mjs files are not suggested in quick fixes
ExceptionWEB-47828Exception while navigating to the intention's description from Search everywhere
JavaScript. FormatterBugWEB-37977HTML injection isn't working in ES6 tagged string literals in HTML
JavaScript. FrameworksBugWEB-41313No auto-import suggestions for PropTypes
BugWEB-46975Vue.js: single file components with empty object literal are not shown in autocompletion
ExceptionWEB-47791Creating a new angular project causes an exception
JavaScript. InspectionsBugWEB-47844`Convert to let/const` deletes code in blade.php files
LintersFeatureWEB-34649Import rules from eslint-plugin-vue to Vue code style settings
FeatureWEB-34655Import typescript code style preferences from .eslintrc
BugWEB-43455Lint TypeScript files with ESLint in Vue CLI project
Node.jsFeatureWEB-44742tsc -p output doesn't allow direct opening of files with errors
FeatureWEB-36956NPM console: linter errors in webpack output should have code navigation
BugWEB-37265Missing clickable links in ng lint output
SASSBugWEB-47734Editing an imported Sass file that has the same name as a neighbor folder doesn't trigger File Watcher
TypeScriptBugWEB-38508WebStorm generates .vue.d.ts files from .vue files
BugWEB-45997Monorepo: auto-import should prefer package import to the one from src folder
BugWEB-36638@material-ui: no completion for components in TypeScript files
DB ConnectivityUsabilityDBE-6729Data source for embedded (local) databases: if relative file path for database is used use project directory as relative directory rather than <IDE_HOME>/bin
SQL GenerationBugDBE-11786MS SQL: Script generator forgets to specify asc/desc in a unique index or primary key fields when it declares inside the table declaration

RubyMine 2020.3 EAP4 (203.4818.9 build) Release Notes

Ruby. Code CompletionBugRUBY-26998Non-existent completion suggestions
Ruby. Code InsightBugRUBY-27111invalid "cannot find declaration for field" inspection
BugRUBY-25385Don't count `Rake` as ancestors in files different from Rakefile
Ruby. InspectionsBugRUBY-27102invalid "nil deref" inspection
BugRUBY-25508False positive 'Incorrect call argument count' inspection
BugRUBY-27125False "redundant 'return' keyword" warning
Ruby. Version ManagersBugRUBY-27091With zsh RM requires full path to direnv to add SDK
Code Analysis. Structural SearchBugIDEA-247689Make predefined templates not refer to others by name
CoreBugIDEA-252225AdvancedProxy.ourFactories -> ProxyDescription.mySuperClass leaks reference to classloader of unloaded plugin
BugIDEA-252232DefaultJDOMExternalizer.fieldCache leaks references to classloader of unloaded plugin
BugIDEA-243091Pending highlighting passes can cause leaks on plugin unload
Core. File SystemFeatureIDEA-246515Implement detecting directory case-sensitivity in refresh
Core. IDE SettingsBugIDEA-246581How it works link on System Settings page opens Finder instead of documentation
UsabilityIDEA-252538Live Template cannot be deleted via the Context Menu
Core. IndexingFeatureIDEA-247480shared index: add FileBasedIndexExtension#needsForwardIndexWhenSharing() to metadata and filter out unsuitable shared indexes
BugIDEA-252771shared indexes: after upgrade from older IDE build do not throw IOException if locally available shared index chunk is incompatible with the new IDE build
UsabilityIDEA-252426Pre-built indexes action links are inactive in the Event Log
Core. InstallationBugIDEA-252826Provide the correct version and description for the bundled Lombok plugin
TaskIDEA-249381IDEA doesn't respect --wait option when opening file in non-project mode on macOS
Core. Plugin ManagementBugIDEA-252825Multiple exceptions from Lombok plugin
BugIDEA-250726LineMarkerInfo not cleared on unloading
CosmeticsIDEA-252141Project icon should not be shown
Core. Project SettingsBugIDEA-252425Eclipse project fails to open since EAP 2 of v2020.3
BugIDEA-252237Cannot download JDK after enabling Wifi
UsabilityIDEA-251967JDK download dialog: show only major version
Core. Run. ConfigurationsBugIDEA-252570Unnamed run configuration is created when you choose to store a template in the project directory
BugIDEA-252039Search in the create new run configuration dialog is not working
Core. SSHBugIDEA-252356Ide freezes on attemp to use ssh remote tool without entered passphrase
EditorBugIDEA-249382IDEA doesn't respect --wait option when opening non-existing file
TaskIDEA-252281Add "-e" ("--edit") command line option to open files in LightEdit mode
Editor. Code CompletionFeatureIDEA-124283Add new function methodParametersTypes() to Template Variables
Editor. Code Completion. MLFeatureIDEA-251876Add types/names similar features and TS/JS
Editor. Editing TextBugIDEA-251157Commenting annotation right after rendered doc comment comments the doc block instead
Editor. Error HighlightingBugIDEA-250725Editor leaks HighlightInfos
Lang. MarkdownFeatureIDEA-213051Add an action to comment a text
Tools. HTTP ClientBugIDEA-252202HttpClient: Submit request from endpoints view change PSI directory structure
User InterfaceBugIDEA-252678Project Structure dialog: empty text for problems is shown
BugIDEA-248925Cyclic scrolling through items is unavailable if there's a last disabled item
BugIDEA-252511Split button is broken in Push dialog
BugIDEA-252261Search Everywhere: Empty line in Filter list
BugIDEA-252557Library editor in Project Structure dialog shows internal class names
BugIDEA-252270Reader mode flag is stored in a shared project file
User Interface. Action SystemExceptionIDEA-252543StackOverflowException on expand collapsed action toolbar
User Interface. FocusFeatureIDEA-252575Add an action to enable/disable logging of focus requests in JBR
User Interface. GraphicsBugIDEA-250363Font rendering in macOS sheet dialogs becomes broken after theme switch or changing antialiasing
User Interface. NavigationFeatureIDEA-252294Support hex/octal/binary numbers in Search Everywhere Calculator
BugIDEA-250447"Start Focus Tracing" in Search Everywhere results disappear when typing the complete name
Version ControlBugIDEA-252350Opening solution with git repo when git is not installed causes GitNotInstalledException
Version Control. GitBugIDEA-251761No branch name on commit tab after project cloning
Version Control. GitHubFeatureIDEA-243961Add filter "reviewer" to Pull Requests lists
UsabilityIDEA-246949Default filter for GitHub pull requests
Build toolsBugWEB-23602"Show npm Scripts" action should work if package.json is not a context file
CSSFeatureWEB-30704@apply is deprecated and only supported by PostCSS, use more lenient parsing
DartBugWEB-47516Dart: Exception while opening Settings with Japanese language pack installed
DebuggerBugWEB-38642'Smart step into' fails to step into library functions
BugWEB-45897'Smart Step Into' ignores constructors
BugWEB-47719'Smart step into' don't work with function expressions.
BugWEB-45586'Smart Step Into' resumes execution on node.js
File WatchersTaskWEB-47521Remove File Watcher templates names from bundles
JavaScriptFeatureWEB-47761Suggest default imports based on existing imports in the project
BugWEB-47762JavaScript: undefined token is showing twice in completion pupup
BugWEB-47671JSDoc: After a JSDoc generation IDEA resolves an object type as "built-in, es5" instead of a real one
BugWEB-47725WebStorm 2020.2 say "unused constant" when use same name in switch/case (in JS it works fine)
BugWEB-47714Array keys from required JSON not resolved
BugWEB-47676JSDoc/Code Inspection Deterioration
TaskWEB-36078Unify ES6 and TypeScript auto-imports
ExceptionWEB-47730Show usages of namespace Debug causes an exception
JavaScript. FrameworksBugWEB-41745Support proper lexing and parsing of <textarea> and <title> tags
JavaScript. InspectionsBugWEB-44188"Convert to let/const" cuts off code with quotes in PHP injection
BugWEB-47616Convert let/const break code if php tag exist on same line
LintersCosmeticsWEB-47739ESLint: icons overlap hint text in Working directories setting
Node.jsFeatureWEB-47642Make npm install/yarn install action for the root package.json always available via Find Action
TypeScriptBugWEB-47454Vue files with no script section have incorrect typings
BugWEB-47646Missing `as` keyword in TypeScript code completion
BugWEB-45878TypeScript Service fail to start under WSL (2) because it expects mounts under /mnt/
DB ConnectivityFeatureDBE-8312Connect to Azure SQL database with Active Directory authentication from Linux
BugDBE-11690IDE doesn't show that data source missing jdbc driver
DB ConsoleUsabilityDBE-11672Help file 'help/sflake-help.zip' not found
DB IntrospectionFeatureDBE-11748MS SQL Server: support indices options
BugDBE-11705H2: primary key columns introspection fails if column name contains space
Data Import & ExportFeatureDBE-11694Add pipe separated value as import format
BugDBE-11728Extractors - Save Our NumericText (use better way to check if a value should be quoted)
Data ViewsFeatureDBE-7591SQL table view: Missing ability to copy column name
BugDBE-11721Big `Limit page size` cause OOM
SQL Format and StyleBugDBE-11405Fix quoted identifiers formatting in BigQuery (and make them on the same level in the PSI)
SQL HighlightingFeatureDBE-11754[BigQuery] unknown functions safe_offset and json_extract_array
BugDBE-11715`MOD` is not detected as built in function in BigQuery dialect.
BugDBE-11743Support Redshift external table syntax
BugDBE-11759[BigQuery] Support nested parentheses for `from` statement
BugDBE-11700support ILIKE for ClickHouse dialect (supported since 20.6 version)

RubyMine 2020.3 EAP3 (203.4449.23 build) Release Notes

Core. ConsolesCosmeticsRUBY-27137Update pry Run/Debug Configurations so it won't use IRB in it
TaskRUBY-27138Add Run Anything intention for pry so it behave similar as irb
Ruby. TestsBugRUBY-26970Tests: progress bar doesn't show the actual state
BugRUBY-27056undefined method `runner=' for Minitest::Unit:Class
Ruby. Version ManagersBugRUBY-27077RM selects all same path SDKs with different configurations
BugRUBY-27078After restart RM ignores created environment configuration
TaskRUBY-27082Add help button in Custom configuration dialogue
Code Analysis. InspectionBugIDEA-251451AutoCloseable inspection should detect resource escaping in more cases
Core. IndexingFeatureIDEA-247422shared stub index should be invalidated only partially when IStubFileElementType#getStubVersion updated
FeatureIDEA-250972Shared Indexes Plugin: load more than one *.ijx file
BugIDEA-251831Shared index for js.string.literal.words.index is always empty
BugIDEA-251695BindingXmlIndex is not shareable
BugIDEA-247403shared-indexes: commit-backed project shared index selection
PerformanceIDEA-251642Indexing dependncies hangs
UsabilityIDEA-249128Shared index configurable can be application based and shown without any open project
Core. LicensingBugIDEA-251482I18n for license activation dialog is broken
Core. Navigation and SearchBugIDEA-246795Todo View doesn't update on scope change
Core. Plugin ManagementBugIDEA-252007Unable to make plugin dynamic
BugIDEA-251036Actions to enable or disable for current project should not be available for plugins that can't be unloaded without restart
UsabilityIDEA-251766Add Extensions as a synonym for Plugins
Core. Project SettingsBugIDEA-251779Newly created JARs are shown as invalid in IDE until project is reopened
Core. RefactoringsPerformanceIDEA-251661Introduce Parameter runs expensive search in EDT with no progress
Core. Run. ConfigurationsBugIDEA-251823@argfile shortening method isn't available in run configuration templates
BugIDEA-245100RunManagerImpl.workspaceSchemeManager leaks references to run configurations from unloaded plugins
Core. Run. TargetsBugIDEA-237866[run.targets] Unable to find image after pulling an image without a tag
BugIDEA-226641[run.targets] Java LR doesn't detect version with a built image
EditorBugIDEA-251431"Reader mode" toggle is shown in Editor Preview, but takes no effect
BugIDEA-251637Wrong parameter info position in injected fragment
Editor. Error HighlightingUsabilityIDEA-249640Inspection widget does not indicate when the highlighting level is set to Syntax
Editor. Intention ActionsBugIDEA-252083Intention settings tree is not sorted alphabetically
Lang. Shell ScriptBugIDEA-252035Run gutter doesn't work for shebang files
Tools. DockerBugIDEA-250366i18n Docker and Clouds
Tools. HTTP ClientBugIDEA-251828HttpClient: Get java.lang.Throwable: Write-unsafe context! exception in httpClient tab in endpoints view after failed request
BugIDEA-251829HttpClient: variables from completion inserted into request with single {
Tools. TerminalBugIDEA-245745Windows: select on terminal show warn message `System clipboard is unavailable`
User InterfaceBugIDEA-251732Table: "Highlight line on hover" should not highlight lines after the mouse was moved out of table
BugIDEA-251234Plugin page doesn't fully reflect to theme changing
BugIDEA-251734Bulb button stays above the Problems view after switching to "Project Errors"
BugIDEA-251719Several tabs are not opened in right split with Shift+Enter
BugIDEA-198032Can't evaluate a product when using unusual email domain
BugIDEA-251727"Open in split tab" action is available for directories
BugIDEA-251961Rename "Find in Path" to "Find in Files" in Notifications settings
UsabilityIDEA-55988Trees (Project view): successive node selection shifts horizontal scrollbar on every selection change that is quite annoying
UsabilityIDEA-251809Extend search field in Keymap settings
UsabilityIDEA-251941Rename "Remove Selected from Welcome Screen" action in Recent Project popup
UsabilityIDEA-113402Detach editor feature is undiscoverable
UsabilityIDEA-246946Visual indication on changing IDE font size is missing
CosmeticsIDEA-251743New Project template description has html tags unprocessed
User Interface. ControlsBugIDEA-250876Big Sur: Wrong action is triggered on pressing Esc button in "Invalidate Caches" alert
BugIDEA-248210"Find" and "Replace" don't remember text area size
CosmeticsIDEA-240687Apply button doesn't become pressed on press in Inspection settings view
User Interface. Find, Replace, UsagesFeatureIDEA-251776Results preview doesn't show the context in case of too long line
User Interface. Keyboard InputBugIDEA-251386Keymap plugins for macos have conflicts with ... macos
UsabilityIDEA-231795Eclipse keymap - Missing key binding Ctrl+1
User Interface. Project ViewUsabilityIDEA-130039IDEA should not expose .iml and .idea files
Version Control. GitBugIDEA-251949Git in Search Everywhere: search result doesn't include branches that contains searching symbols in the middle or at the end
BugIDEA-251346Rebase dialog doesn't remember modify options if it was invoked from search everywhere
BugIDEA-251613Missing --no-verify option in git merge and git pull dialogs
UsabilityIDEA-251616Git rebase: Allow to rebase with --root option when no base is selected
UsabilityIDEA-252086Git Search Everywhere: provide some label for all git-related results
CosmeticsIDEA-251981Git in Search Everywhere: Long commit message overlaps hash in search result
Version Control. GitHubBugIDEA-243828Github Pull Requests Search: allow `#<Number>` in Search
JSONBugWEB-47682JSON: "JSON Schema conflicting mappings" message is corrupted
JavaScriptFeatureWEB-47066Merge React JSX language level with ES6+ in the JavaScript settings
BugWEB-47637Find usages don't work if TODO patterns are removed
JavaScript. FrameworksBugWEB-47200WebStorm ignores srcDir setting in nuxt.config.js, cannot resolve path to Vuex store
BugWEB-47543Preview on Vue formatting page is boken
BugWEB-47679CSS syntax is not recognised in the style section of .vue file
BugWEB-47073Vuex: `import * as module from module.js` syntax not supported
BugWEB-46293Auto-indent comments in Vue Single File Component HTML-section
PerformanceWEB-47479Angular: performance issues in attribute value provider
UsabilityWEB-36206Vue: new Vue component action is missing in some cases
LintersFeatureWEB-47135Allow to configure working directory for ESLint process
Live EditPerformanceWEB-45199High CPU usage with Live Edit plugin
Data Import & ExportBugDBE-10729Support extended JSON for UUID in MongoDB
Data ViewsBugDBE-3183Can't edit hstore column in Postgres
SQL HighlightingBugDBE-11647'PARQUET' format option is not supported
BugDBE-11636Unknown database function 'CONCAT_WS' - Snowflake

RubyMine 2020.3 EAP2 (203.4203.30 build) Release Notes

No subsystemCosmeticsRUBY-25494Remove the 'Template' word from the test templates names for consistency with other templates
Core. ConsolesFeatureRUBY-9302Use pry instead of irb when gem is available
RailsBugRUBY-25960.generators and .rakeTasks files are not placed into .idea folder in case there're Rails engines and multiple Gemfiles
ExceptionRUBY-27090IDE Exception after generator invocation
Rails. Code InsightFeatureRUBY-25012ActiveRecord: Unresolved Ruby Reference inspection incompatible with active_record.schema_format = sql
FeatureRUBY-26232FEATURE REQUEST: Support structure.sql in Rails Entity Navigation
Rails. ParamDefsBugRUBY-27086Symbol or String is expected inspection for routes with option 'only' in routes.rb
Ruby. Code CoverageBugRUBY-27046RM unable to run tests with coverage if not empty .simplecov presented
Ruby. FormatterUsabilityRUBY-27088Update default code style settings to match RuboCop
Ruby. TestsBugRUBY-27053Minitest runner with Spring doesn't work with spaces in test file path
BugRUBY-26331"Go to test" now always prompts to choose tests, even if there is only one found.
CosmeticsRUBY-26978MiniTest in the context menu is written with a small letter T
Code Analysis. DependenciesBugIDEA-249578'Related problems' left after problem resolved
Code Analysis. InspectionExceptionIDEA-168236NPE invoking "Edit settings" for delete profile
CoreBugIDEA-242599Pending "run when smart" tasks are not cleared on unload of plugin which registered them, leading to leaks
BugIDEA-242571Not created lazy listeners are not cleared when the plugin is unloaded
Core. DebuggerBugIDEA-251309Wrong soft wrapping and unnecessary scrolling while stepping in the debugger
BugIDEA-251433Inline debugger: value renderer moves to the new line if you press enter at the end of line
Core. IDE SettingsFeatureIDEA-227299IDEA IDEs do not identify file types for files without extensions
BugIDEA-250355Settings are not reset after "Restore Default Settings" action
BugIDEA-251416Ambiguous message when importing settings
BugIDEA-242589Scheme managers are leaked on plugin unload
BugIDEA-236885Config-serialized object reference is not cleared on plugin unloading
BugIDEA-222660Can't delete inspection profile
CosmeticsIDEA-251495Refactoring preferences wording/grammar issue: unnecessary article
ExceptionIDEA-250858"Import IntelliJ IDEA Settings" dialog throws error
Core. LicensingBugIDEA-249812License dialog is too wide and cannot be narrowed
Core. Plugin ManagementBugIDEA-250738Can't disable plugin for current project
BugIDEA-250713Plugin enabled for current project has label "Enabled for all projects" and cannot be actually enabled for all projects
Core. Project SettingsFeatureIDEA-251026Provide a way to update downloaded JDK to a newer version
BugIDEA-250878Apply button is enabled without any modifications
UsabilityIDEA-240999Suggest to automatically download JDK when "Build Project" action is invoked
Core. Run. ConfigurationsFeatureIDEA-65915Allow to store Run Configuration Templates as files to be able to share them through VCS
UsabilityIDEA-250342[new run config UI] Add a way to edit run configuration from the run/debug tool window
Core. Run. TargetsBugIDEA-251276"Generate" button next to "Temporary files root" does nothing
Core. SSHBugIDEA-247283SSH can't juxtapose a public key file with a public key from the agent if there's no private key file
EditorBugIDEA-251566Status bar notification: switching between dark/light scheme doesn't refresh tooltip font color
BugIDEA-247921FileAssociationException when trying to add file types association
BugIDEA-251567Status bar notification: gear icon in Recent Project popup
UsabilityIDEA-248254Add status bar notification about the LightEdit mode
TaskIDEA-236909LightEdit: Add "Reload File from Disk" option
Editor. Code CompletionBugIDEA-249709Parameter Info shortcut does not work when the completion popup is displayed
UsabilityIDEA-167114Parameter info looks obsolete functionality into lookup(at least for Java)
Editor. Diff and MergeBugIDEA-249139Git Diff Viewer - No marks near the scroll
UsabilityIDEA-250957Confusing terminology in diff view: "Highlight symbols"
Editor. Editing TextFeatureIDEA-80498Action to transpose characters
UsabilityIDEA-248168Make Parameter Info work during indexing
Lang. Shell ScriptUsabilityIDEA-251075Shell script configurations always make "Terminal" panel take focus, no option to run in the background
Tools. DockerFeatureIDEA-186648Enable custom code folding regions for docker and docker-compose files.
BugIDEA-239070Clicking image links in docker compose files for Official Images opens wrong URL
Tools. TerminalBugIDEA-233949Possibility to change terminal's "Clear Buffer" action keyboard shortcut
BugIDEA-182846Idea sets empty ZDOTDIR env var
BugIDEA-174688Nested zsh in terminal does not load variables and functions from "$HOME/.zshenv"
BugIDEA-182470terminal ignores $ZDOTDIT/.zshrc
BugIDEA-233196IDE fails to activate venv when it has spaces in its path and ZSH is used
BugIDEA-245380Zsh startup files are read in the wrong order and counter to rcs and global_rcs options
BugIDEA-176888IDE drops "/usr/local/bin" from PATH in built-in terminal if zsh is used
User InterfaceBugIDEA-189795Find Action: Doesn't consider dynamic text
BugIDEA-251534Can't close tabs or open new files from the project view with the mouse after closing the first split editor
BugIDEA-251355StackOverFlowError when clicking a link in "Updates" dialog in master
BugIDEA-250976Strange boxes in new menu during inplace rename
BugIDEA-246442Incorrect symbol for drop down list
BugIDEA-241815Duplicated "New" items in Find Action
BugIDEA-249229New welcome screen: the bottom part of `New project` tab isn't changed after changing the theme (WebStorm)
UsabilityIDEA-195188Open folder with project in Explorer from Welcome to IntelliJ IDEA window
UsabilityIDEA-251372Download Library window is too small and could be easily increased
CosmeticsIDEA-251281small (unscaled?) splash screen for 2020.3 running on Windows 7 with 150% desktop scaling
ExceptionIDEA-249795Exception after selecting "Sync with OS" for the first time after start
User Interface. AccessibilityBugIDEA-250871Class import menu items are not spoken
TaskIDEA-251132Add an accessible name to the Idea settings tree
TaskIDEA-251134Add an accessible name to the project structure tree
User Interface. Embedded Browser (JCEF)BugIDEA-250937forward jcef log to user home
TaskIDEA-250780inform about missing native libs for JCEF on linux
User Interface. Find, Replace, UsagesBugIDEA-250552"Find" and "Replace" fields should expand when the text doesn't fit in them
User Interface. Look and FeelTaskIDEA-250796Change lightSelectionBackground colors for both themes
User Interface. NavigationFeatureIDEA-251021Search Everywhere should be able to evaluate simple mathematical expressions
FeatureIDEA-145804request: immediate "go to test" hotkey option
User Interface. Project ViewFeatureIDEA-184468Navigate up and down between siblings in trees
Version ControlFeatureIDEA-92793Use the same format of created patch files as Git does - without IDEA special tags
FeatureIDEA-251285Show "no commit message", "no changes to commit" errors inline
BugIDEA-251473No branch name on Commit tab on the first opening commit toolwindow
BugIDEA-251551Commit checks warning doesn't appear on opening project while indexing is in progress
UsabilityIDEA-251400Commit and Push button isn't reachable by Tab key
TaskIDEA-251368Show inline warning to indicate that commit checks are not available in dumb mode
TaskIDEA-251226Update non-modal commit panel layout
ExceptionIDEA-250814IncorrectOperationException: "ChangesViewCommitPanel" will never be disposed
Version Control. GitFeatureIDEA-249904Add --root option to the rebase dialog
UsabilityIDEA-157902Duplicated git items in "Find Action"
ExceptionIDEA-251349Git Rebase: Exception on performing rebase with --root option
Version Control. GitHubFeatureIDEA-191512Sync protected branches from GitHub
CosmeticsIDEA-237967Mark .yml files in .github/workflows with special icon
No subsystemUsabilityWEB-47473Duplicated mnemonics with Apply/Close in Run/Debug Configurations
CSSBugWEB-47498CSS inspector recommends outdated value for speak property
DebuggerBugWEB-47465'Smart step into' skips some breakpoints
HTMLBugWEB-47613Editing inside script tag in HTML is broken
JavaScriptFeatureWEB-8187Inject JavaScript inside eval
FeatureWEB-17325Please provide a way to give a hint to WebStorm that variable is a reference to something and get auto-completion, validation and documentation via jsdoc
FeatureWEB-47467Suggest words from other string literals
FeatureWEB-47593Suggest words from template literals
BugWEB-46019JSDoc @mixin / @mixes tags don't work in modules
BugWEB-47553JSDoc: can't resolve variable according to the JSDoc if Readonly is used
UsabilityWEB-45968Do no show dynamic usages in Find Usages preview shown on Ctrl+click
JavaScript. FrameworksBugWEB-47394All Angular schematics do not show up. Error while loading schematics info
BugWEB-37193Schematics options aren't respected when creating a new component
CosmeticsWEB-42140Replace all the "functional component" texts to "function component"
Node.jsBugWEB-47433Execute using IDE tools (Ctrl+Enter) in the terminal doesn't keep the CWD
BugWEB-39812yarn isn't set as a default manager when yarn.lock and package.json are inside a subdirectory
TaskWEB-47575Update JSON schema for package.json
TypeScriptFeatureWEB-47397TypeScript 4.1: Syntax support for template literal types and mapped type 'as' clauses
TaskWEB-47111Update bundled TypeScript to 4.0
Unit TestsBugWEB-46734Jest integration: Never ending test, works in jest cli
BugWEB-44058Single Karma test is not running
DB ConnectivityBugDBE-11613Cannot change integrated security setting in database tool
DB ConsoleBugDBE-11663Couchbase PREPARE statement should not show parameters dialog
DB IntrospectionBugDBE-11653Error introspecting Greenplum database
BugDBE-11657Oracle 12: sometimes DataGrip shows arguments of package routines with wrong direction
BugDBE-11272Update 2020.2 has regression in MemSQL
BugDBE-11627MariaDB: Error encountered when performing Introspect schema xxx: Cannot proceed, because event scheduler is disabled
Data Import & ExportFeatureDBE-5470Add enconding information to data extractor scripts
BugDBE-10563cassandra cql generator uuid with qoutes
UsabilityDBE-10957add the option "Never" to "Quote values"
Data ViewsBugDBE-11642`numrange` with fractional numbers is not supported in the editor
BugDBE-11569Implement reformatted mode for Value Editor
UsabilityDBE-5272Shrink selection does not work in tables
Navigation & SearchBugDBE-11445Full Text Search: Invalid input value for enum
SQL GeneralBugDBE-11641`->` operator is not supported by Apache Spark dialect
SQL HighlightingBugDBE-11623SQL parser complains about missing parentheses
BugDBE-11609STORAGE INTEGRATION not recognised in Snowflake SQL dialect
BugDBE-11450ADD CONSTRAINT is incorrectly highlighted
BugDBE-11615Add support for CREATE OR REPLACE MATERIALIZED VIEW in ClickHouse SQL dialect
BugDBE-11618Snowflake create api integration not supported
BugDBE-11661Couchbase accessing schema `system` gives warning "system is a reserved keyword"

RubyMine 2020.3 EAP1 (203.3645.12 build) Release Notes

No subsystemBugRUBY-27030Terminal keyboard stopped to work
CoreFeatureRUBY-27014WebP Filetype Unsupported
BugRUBY-26821Cannot control Node version launched from Rails process
BugRUBY-26862Infinite indexing on twofish gem
BugRUBY-26870RM ignores template value of Execute in the context of Rails
UsabilityRUBY-18411Web projects are treated as Ruby modules
Lang. LiquidFeatureRUBY-26691Implement filter name insert handler for Liquid
RailsFeatureRUBY-16916Routing completion
FeatureRUBY-25840Allow navigating to routes file from a controller method/view via related symbols
BugRUBY-17186'post' does not get the same styling treatment as get, resources, root... in routes.rb
BugRUBY-26734rake db:migrate isn't presented in Run Anything
BugRUBY-22202Add support for Rails routes with on: :member and on: :collection
BugRUBY-9168Namespaced Routes fail inspection
Rails. Code InsightFeatureRUBY-14955Shortcut to go from route method name to method
FeatureRUBY-25836Allow navigating via Related Symbols between Helpers and Mailers
BugRUBY-25858fails to resolve partial layouts
BugRUBY-16289Routes have yellow underlines because it can't follow a namespace
BugRUBY-25058Incorrect #index routes generation when name is singular
BugRUBY-26788Add route recognition for `patch`
BugRUBY-26783Fix support for `shallow` and `shallow_prefix` in routes
BugRUBY-26787Fix route recognition/parsing of only/except options
BugRUBY-26145Some rails methods (post, delete) are highlighted differently then the others
BugRUBY-26921RubyMine always assumes ActiveRecord model id to be an integer
BugRUBY-21809Rails routes - Wrong path autocomplete with a singular resource with a plural name
Rails. ParamDefsPerformanceRUBY-25404Move resolve logic out of `RSymbol#getReference` & `RStringLiteral#getReference`
Remote InterpretersBugRUBY-25949Default option in Configure Remote Ruby Interpreter dialog is not configurable
UsabilityRUBY-26099SSH saving configuration message is unclear
UsabilityRUBY-26101SSH configuration selected in the Remote Interpreter dialog is not selected after switch between other options
RubyBugRUBY-26121RM 2020.2 doesn't populate path to ruby on Windows when Add Ruby SDK selected
Ruby. Code CoverageFeatureRUBY-26934Add options to enable/disable branch coverage and subprocesses coverage
Ruby. Code InsightFeatureRUBY-26620Missing types in standard library stubs (Enumerable)
FeatureRUBY-24223Add support for enum _prefix and _suffix options
BugRUBY-26887ctrl click on "super" doesn't go to the super method
BugRUBY-24552Ranges `first`, `last`, `end`... type inference support
Ruby. DebuggerBugRUBY-26990Attaching debugger blocks and does not honor timeout
Ruby. InspectionsBugRUBY-27017Incorrect "Duplicate argument name" warning for method with "capture all" arguments
BugRUBY-26901Quotes are not ignored by spellchecker
Ruby. Intention ActionsBugRUBY-26772Sorting hash by key works incorrectly for beginless ranges with integers and strings mixed
BugRUBY-26952"Remove unnecessary parentheses" intention unavailable in specific situation
BugRUBY-26953Don't offer "Convert block to method reference" intention for safe-navigation calls
Ruby. Quick DocumentationBugRUBY-26634Add support for Escaping when rendering documentation
BugRUBY-26632Add support for Label lists when rendering documentation
BugRUBY-26635Add support for Conversion of characters when rendering documentation
BugRUBY-26637Polish support of rendering documentation feature
BugRUBY-26631Add support for Lists when rendering documentation
Ruby. RefactoringsBugRUBY-27018Incorrect items showing in "Override methods dialog"
BugRUBY-26694Broken hash keys after "inline method" refactoring
UsabilityRUBY-25656Improve organisation of "Override Method" dialog
Ruby. TestsBugRUBY-26971Tests tree view: it's not possible to navigate to passed or failed tests
BugRUBY-27032Context menu on test folders shows incorrect run configuration name
Ruby. Tests. CucumberBugRUBY-26328Cannot run feature with Cucumber 4.0.0.rc6
Ruby. Tests. Factory BotFeatureRUBY-25887Allow navigating from a factory back to the class via related symbols
FeatureRUBY-26957Add completion/resolve for attribute methods in factory bot strategy methods
BugRUBY-26955Don't show a warning on class names for nested factories
Ruby. Type InferenceBugRUBY-26909Return type of `Integer(x)` is reported to be incompatible with everything, including Class<Integer>
Ruby. Version ManagersBugRUBY-26988RubyMine tries to use Project SDK for Terminal when remote RVM is used
Tools. BundlerBugRUBY-27016Text for "gem not found" "Run ''bundle install''" has the quotes doubled-up
Tools. PuppetBugRUBY-26879No name for puppet module in "New file" dialog (right click on project view)
Tools. RuboCopCosmeticsRUBY-26932Disable capitalisation for Install 'rubocop' and Re Enable popup
Code Analysis. DependenciesBugIDEA-242613Broken usages disappears after removing comment
Code Analysis. InspectionFeatureIDEA-249403Support @Nls @NonNls and @NlsSafe annotations on function parameter in Kotlin
FeatureIDEA-247443Option to ignore camel-case strings in i18n inspection
FeatureIDEA-248175i18n for groupPath in InspectionEP
BugIDEA-247998InspectionProfileEntry.cleanup() not called when batch inspection has result
BugIDEA-247986Absence of an expected warning of "Hard coded strings" inspection
BugIDEA-52705False positive on "suspicious indentation after control statement without braces"
UsabilityIDEA-232279Improve the `Next highlighted error` UX on analysis
Code Analysis. Language InjectionBugIDEA-250291Language Injection settings are not properly reloaded when dynamic plugins changed
BugIDEA-241419intelliLang.Configuration$App leaks PatternCompilerImpl$LazyPresentablePattern
Code Analysis. Structural SearchFeatureIDEA-249515Automatically open replacement window when importing replace pattern
FeatureIDEA-244837Custom SSR filters
BugIDEA-244045Can't find tools for "e0bda819..." in the profile "Project Default" on switching to existing template
BugIDEA-245668NPE at pointing 'Find usages' in menu after adding SSR inspection
BugIDEA-246940Can't find lambda parameter
BugIDEA-244784Filters remain disabled when script filter has problem on opening of dialog
BugIDEA-249295Structural search: some filters applicable for variable appear only on the second call
BugIDEA-244786Filters & Scope should be available in Dumb mode
BugIDEA-245028NPE when text cursor is on replacement variable
CosmeticsIDEA-244617Render templates list in inspection as disabled when inspection is disabled
TaskIDEA-247138Get rid of "Words" check box in text filter
ExceptionIDEA-247874Constraint inSmartMode cannot be satisfied
Code Analysis. Syntax (PSI)BugIDEA-246747Excessive memory consumption
CoreBugIDEA-244431PatternCompilerImpl leaks references to classloaders from unloaded plugins
BugIDEA-245099File type of unloaded plugin can be leaked due to file type caching
BugIDEA-249530Out of Memory Alert dialog is shown when memory is not a problem
TaskIDEA-247475API for HTML concatenations
Core. DiagramsBugIDEA-248404New Module Dependencies Diagram does nothing
Core. File SystemFeatureIDEA-246514Implement VirtualFIle.isCaseSensitive()
Core. IDE SettingsBugIDEA-244849Custom font is not applied to settings element after Apply changes
BugIDEA-250776Use ApplicationNamesInfo.getScriptName() instead of ApplicationNamesInfo.getProductName() when generating custom VM options file name
BugIDEA-237376Android RenderScript file type instead of Rust one on 2020.1
BugIDEA-247310Changes in HashBang Patterns are not saved
BugIDEA-2093842018.3.5 importing from 2.4 causes "Antialiasing->subpixel" setting to not stick between runs
UsabilityIDEA-202548Can't Export Settings when IDE settings sync is enabled
Core. IndexingBugIDEA-247316Pausing Indexing Applies to All Windows Rather than Current Project
BugIDEA-249792SharedIndexes: indexes should be recalculated on shared index plugin disabling.
PerformanceIDEA-247070Find Usages has become slower in 2020.2
PerformanceIDEA-249369Add an option to choose only distinct files to generate indexes
ExceptionIDEA-248099IndexNotReadyException when try to use indexes in one project (with finished indexing) during indexing process in another project
Core. InstallationFeatureIDEA-250333Show comprehensible error message if user tries to start IDE under Java 8
BugIDEA-245844License server before proxy settings
BugIDEA-231075jbr directory is not completely deleted on IDEA uninstall
TaskIDEA-250978Bundle Kotlin 1.4.10 with IntelliJ IDEA 2020.3
Core. LicensingBugIDEA-246636'br' tag is wrongly shown in "Thank you for evaluating {0}. Your evaluation license expires in {1}" message
Core. Navigation and SearchFeatureIDEA-135112Search for actions by synonyms
BugIDEA-244647Rerunning a pinned search opens a new result window
BugIDEA-234172Enter / Exit / Toggle Distraction free mode via find action doesn't work
BugIDEA-247358Navigate to file: wrong item is focused in the Project View with "Always Select Open File" enabled
PerformanceIDEA-245035Goto Implementation works very slow from a SAM method usage
Core. Platform APIBugIDEA-248823PsiElement.contextOfType does not support the strict flag from PsiTreeUtil.getContextOfType.
UsabilityIDEA-245298Tooltip for StatusBarWidget is not set unless StatusBar::updateWidget is called
Core. Plugin ManagementFeatureIDEA-247472Show plugins from custom repositories on top of Marketplace search result list
BugIDEA-215935"Plugins supporting *.md files found" doesn't suggest disabled plugin
BugIDEA-247117Error updating plugin
BugIDEA-248037Disable button disappears after resizing plugin settings window
BugIDEA-224874Frame around plugin description appears after installing theme plugin
BugIDEA-244865Hibernate plugin requires restart on disabling
BugIDEA-247627Editor scheme is lost after updating a theme plugin if the jar name of the new version differs from the name of the old version
BugIDEA-246111'Plugins supporting filetype' notification shown for already-supported filetypes (IJ UE 2020.1.2)
BugIDEA-246710Disabled bundled plugins are not listed in the log
BugIDEA-246822Detect plugins incompatibilities before downloading IDE upgrade
ExceptionIDEA-246976java.lang.NoClassDefFoundError: gnu/trove/TObjectHashingStrategy
ExceptionIDEA-242828NPE at com.intellij.ide.plugins.newui.MyPluginModel.removeProgress
ExceptionIDEA-249972IllegalArgumentException: Missing extension point: com.intellij.languageBundle in container Application (containerState=PRE_INIT)
Core. Project SettingsBugIDEA-250999Gradle project import: ISE: "ServiceManager.getServic…rkspaceModel::class.java) must not be null" at WorkspaceModel$Companion.getInstance()
BugIDEA-246772Module already exists error on cloning project with new project model.
BugIDEA-245615Artifact build ignores specified manifest
BugIDEA-250171Explicitly assigned module groups are lost after opening project
BugIDEA-247042Maven project imported with 'store project files externally' ON can't be built
BugIDEA-248714i18n: html link in Project Structure -> Problems
BugIDEA-246731If missing JDK is installed it isn't recognized until the project is reopened
BugIDEA-246621Cannot import project with iml file
BugIDEA-222480IDEA hangs on startup while initializing ProjectJdkTable
PerformanceIDEA-245991UI freeze in RootsChangeWatcher after changing many project configuration files
ExceptionIDEA-246874ArrayIndexOutOfBoundsException may be thrown in FacetEventsPublisher
ExceptionIDEA-244663PAEE at com.intellij.workspaceModel.storage.impl.WorkspaceEntityStorageBuilderImpl.addEntity
ExceptionIDEA-246786Module-level libraries in unloaded modules lead to exception on opening project
Core. Quick DocumentationUsabilityIDEA-170168Show method quick doc on modifiers
Core. RefactoringsBugIDEA-227176Can't refactor a certain project
BugIDEA-248815Can't Refactor Rename Java Variable in IntelliJ IDEA When There Are Code and String Occurrences to a Combined Number Over 200
BugIDEA-246628VariableInplaceRenameHandler: misleading method contract
BugIDEA-245589Broken compatibility between IntelliJ IDEA 2020.2 and Kotlin plugin 1.3.72 202: NoSuchMethodError at org.jetbrains.kotlin.idea.refactoring.suggested.KotlinSuggestedRefactoringUI.extractNewParameterData
BugIDEA-240885fileType extension couldn't be unload after file rename
Core. Run. ConfigurationsBugIDEA-247288[new run config UI] expand field option is broken
BugIDEA-248113Run/Debug Configuration window is black in nightly
BugIDEA-247956Don't pass DESKTOP_STARTUP_ID environment variable to launched processes on Linux
BugIDEA-248997Can't exclude classes/packages from coverage in Run configurations
BugIDEA-248180Renamed JDKs are shown without names in the Run configurations JDK dropdown
BugIDEA-250318Unable to run/debug existing test in dumb mode
BugIDEA-247287[new run config ui] not an editor font in the fields
BugIDEA-249997[new run config UI] Form broken when code coverage options are added
BugIDEA-245965Default JRE for modules which use module-specific JDK is shown incorrectly in new UI
BugIDEA-247392[new run config UI] Shortcuts are duplicated in the hints
BugIDEA-246862[new run configs UI] with enlarged font the Main class field looks unreadable
BugIDEA-239627Macros `$MODULE_WORKING_DIR$` and/or `$MODULE_DIR$` are missing
BugIDEA-250341[new run config UI] Different fonts in the UI
UsabilityIDEA-245875[new run config UI] Option tags are confusing to users
UsabilityIDEA-245305[new run config UI] Make hotkey for 'Manage Options' more visible
UsabilityIDEA-249925[new run config UI] Fields appear 'below the fold', without indication that the user could scroll down
CosmeticsIDEA-247760[new run config UI] Replace '+' icon with the dialog icon for adding macros
CosmeticsIDEA-249103[new run config UI] Try new more rounded tags form
CosmeticsIDEA-245398[new run config UI] improve JDK field displaying
CosmeticsIDEA-249664"Add Before Launch Task" popup title should be "Add New Task" instead of "Add New Configuration"
TaskIDEA-249170[new run config UI] Please change the 'Edit <run config>' context menu item
Core. Run. External ToolsBugIDEA-239635[Settings Keymap] when searching for some action, External Tools are always shown
ExceptionIDEA-244452NPE in Remote SSH External Tools plugin when cancel choosing of tool
EditorFeatureIDEA-237297LightEdit: Opening a file that does not exist should create a blank editor
FeatureIDEA-245762Show empty boxes for newer emojis if the installed emoji font doesn't contain these
BugIDEA-250462Project file isn't opened from command line when another project is already opened and Light Edit frame is focused
BugIDEA-231946LightEdit: Project menu is shown instead of LightEdit mode menu on Win 10
BugIDEA-245580Light Edit Mode: getCurrentTextEditor and getCurrentFileEditor methods of StatusBarUtil return null
BugIDEA-246399Quick doc pane is opened when clicking external links in rendered Doc
BugIDEA-238700Code vision: "Implementations" sounds odd in case of classes inheritance
BugIDEA-246113LightEdit: exception while trying to change file encoding
BugIDEA-232371Dialog to save files doesn't appear when pressing Cmd + S for a new created file
BugIDEA-246047Reader Mode shouldn't be available in Previews
BugIDEA-237793LightEdit: disable "Select Opened File" in "Save As" dialog
BugIDEA-250312Scroll to Center action doesn't work if "refrain from scrolling" is programmatically set
BugIDEA-247170LightEdit: files with the same name are displayed without a path in File | Open Recent
BugIDEA-246372No documentation found in quickDoc
BugIDEA-248406External annotations and code vision hints aren't shown if javadoc comment is shown in rendered form
BugIDEA-238020LightEdit: order of recent files in popup differs from file order in main menu
BugIDEA-245320Folded code preview doesn't show the last line
BugIDEA-237080Light Edit: "Window" menu is missing (macOS)
BugIDEA-250262Unable to open file from Light Editor when file extension isn't specified in list to open
UsabilityIDEA-236857Close Welcome screen when light editor is opened
CosmeticsIDEA-233516LightEdit: Don't suggest to save an empty file, don't show changed status
CosmeticsIDEA-248692Make line numbers and annotation text of wrapped lines stick to top on scrolling
CosmeticsIDEA-238010LightEdit: underscore is overlapped by the following characters in recent files list
TaskIDEA-233497LightEdit: Enable "Find Actions"
TaskIDEA-234009Restore Light Edit session
Editor. Code CompletionBugIDEA-242758IntelliSense/Code Completion for EditorConfig doesn't propose "unset" as a possible value
CosmeticsIDEA-196835Different font used in code completion list for Korean
Editor. Color SchemesTaskIDEA-249851Internationalise color scheme names
Editor. Diff and MergeBugIDEA-193373Diff in Commit Changes: cannot resize TTF preview below some limit
UsabilityIDEA-246407Revert button icon
UsabilityIDEA-236763Close diff editor tab if there are no changes after commit
Editor. Editing TextFeatureIDEA-73585drag and drop editor tabs to split vertically / split horizontally
BugIDEA-247039Add Carets to Ends of Selected Lines adds the caret in the middle of a line of the caret is there
BugIDEA-247210PyCharm overwrites the mouse-highlight clipboard when I backspace an indentation
PerformanceIDEA-24442918K occurences, Select all occurrences, typing is slow
UsabilityIDEA-244142Make double-click and drag text selection treat every symbol as separate word
Editor. Error HighlightingBugIDEA-246273Highlight Usages action shows incorrect usage counter
UsabilityIDEA-243927Bad code green: enum constant without argument list
Editor. FormatterFeatureIDEA-119281Add option to remove blank lines at end of file on Save
BugIDEA-225147NPE when trying to reformat code with specific wrapping settings
BugIDEA-215770EditorConfig: ij_visual_guides option appears in the created .editorconfig only if it is enabled in settings
TaskIDEA-244897Default value for empty Code Style options in generated .editorconfig
TaskIDEA-244626Some HTML Code Style options don't appear in generated .editorconfig when these settings are empty
Editor. Intention ActionsCosmeticsIDEA-249522Flip arguments around comma should warn about semantic changes
ExceptionIDEA-248085IOE at com.intellij.openapi.util.ObjectTree.register
Lang. MarkdownFeatureIDEA-213096Support auto-scroll using a mouse wheel for the 'Markdown Support' plugin
FeatureIDEA-213097Add Support for Rendering of Mermaid.js in Markdown Preview
BugIDEA-210173Support color themes for Markdown plugin
BugIDEA-220660Markdown: Shell script highlighting for 'bash' or 'sh'
BugIDEA-216229Markdown plugin should obey line length
BugIDEA-220392Markdown hard line wrap inserting whitespace at beginning of new line
BugIDEA-244546Error on completion in code blocks
BugIDEA-244817Shell script is not highlighted in preview of Markdown
TaskIDEA-243531Support reformatting for Markdown
Lang. RegExpBugIDEA-241270Regexp false position inspection in ternary expression
Lang. Shell ScriptFeatureIDEA-245850"Shell Script" run/debug configuration provides no easy way to set environment variables
FeatureIDEA-226750Update shellcheck to latest (currently 0.7)
FeatureIDEA-247440Feature request: Make Shell configurations execute in the Run window like BashSupport
BugIDEA-243154Shell: Find usages broken with latest 2020.2 EAP
BugIDEA-243118Broken syntax highlighting: backslash escaped quotation marks
BugIDEA-244312Shell: test command breaks highlighting
UsabilityIDEA-238259Shell script support does not recognize executable files with shebang
TaskIDEA-216508[Shell Script] Provide folding
Lang. XMLTaskIDEA-248591i18n: internationalize XML and HTML support
Tools. DockerFeatureIDEA-212147Docker. Support --init command line option
BugIDEA-243967Docker: images completion doesn't work
BugIDEA-250305Refactoring of folder name replaces entire line when checking for references
BugIDEA-248828Dockerfile Error: <path segment> expected, got '@'
Tools. HTTP ClientFeatureIDEA-246759API for 'indexing' HTTP Client scratches
FeatureIDEA-143889REST Client Needs Export as Curl Option
FeatureIDEA-239332HTTP Client: Provide completion for 'application/yaml' Content-Type
BugIDEA-246989HttpClient: After change env name in scratches, it not changes in http client right away
BugIDEA-239250REST Client exception with Content-Length header
UsabilityIDEA-247296Ability to Run (new) Http Client from the "Find Action"
TaskIDEA-247690RestClient internationalization
TaskIDEA-239388Provide action to convert legacy HTTP Client files to the new format
TaskIDEA-239387Test RESTfull Web Services action must create new HTTP Client file
ExceptionIDEA-249122IAE at com.intellij.codeInsight.highlighting.BackgroundHighlighter.$$$reportNull$$$0
ExceptionIDEA-249112java.lang.IllegalArgumentException at "Generate HTTP request" action
Tools. TerminalBugIDEA-208328CTRL-C in terminal does not work in IDEA JDK 11 but works fine on IDEA JDK 8 (Mac)
BugIDEA-201379Line spacing for console font has no effect in Terminal
BugIDEA-250490Moving tool window terminal tab to editor shows confirmation dialog about closing it
BugIDEA-236794Cannot open terminal in Linux on ARM
BugIDEA-118877Terminal: not able to rename tab in Editor
UsabilityIDEA-199122Custom shortcuts do not work in Terminal
User InterfaceFeatureIDEA-164238Provide an easier way to clear the status bar
FeatureIDEA-127464Editor Tabs options: Keep pinned tabs on top left of tab bar.
FeatureIDEA-242373Implement notification for breakpoint hit action
BugIDEA-246622CSS styles do not update after theme switch
BugIDEA-251030Icons are not shown in Database toolwindow popup menu
BugIDEA-248447Keyboard shortcuts don't work when Russian keyboard layout is active
BugIDEA-249212GoLand new project wizard: title of new project window was changed from `New Project` to `New Project...`
BugIDEA-250690"Close button position" setting is not applied
BugIDEA-246421New Color Picker: make the hex field focused by default
BugIDEA-250834No "View Mode" group in tool window menu
BugIDEA-250138Wrong icon in confirmation dialogs on macOS
BugIDEA-244086macOS native menu is misaligned
BugIDEA-229319`Command + ~` doesn't work if non-focused popup is active
BugIDEA-223082Toggling distraction free mode continuously increases size of bottom tool panel until it eclipses editor
BugIDEA-246624Table header expands awkwardly
BugIDEA-247600Missing additional actions on Welcome Screen
BugIDEA-134723Column alignment incorrect in 'distraction free mode' when using split editor
BugIDEA-247601New project button doesn't work
BugIDEA-243695Load context: context isn't restoring editor tabs on a second monitor/display
BugIDEA-249801Darcula theme is not applied when if "Sync with OS" option is selected while macOS theme is dark
BugIDEA-247257Low-resolution taskbar icon on Windows
BugIDEA-237643Add hints to options tooltips in Find
BugIDEA-248756Drag and drop doesn't work with new Welcome Screen
BugIDEA-246207"Clear Event Log" action is disabled after running a test
BugIDEA-186748Debug toolbar doesn't stay hidden
UsabilityIDEA-219212Option to disable merging main menu into window title
UsabilityIDEA-230328Search everywhere popup opens partially offscreen
UsabilityIDEA-233887Is hex format in color picker valid?
UsabilityIDEA-230715Double click in treeview shouldn't expand / collapse the node
UsabilityIDEA-248766New Welcome Screen: It's hard to see current IDE version
UsabilityIDEA-244580Change name of closing tabs options to match Google Chrome, Firefox and Safari
UsabilityIDEA-242906Better representation for long inspection description.
UsabilityIDEA-153814Horizontal scrolling is accidentally applied when scrolling vertically with touchpad
UsabilityIDEA-247607All settings are not equal to settings for new project (only application-level settings are shown)
UsabilityIDEA-108043Action "Reopen last closed tab" fails with no open tabs
UsabilityIDEA-246526Find action: show Reformat code on top of the list when typing `Format code` / add synonym
UsabilityIDEA-247948Error dialog "Running tests is disabled during index update" has no title
UsabilityIDEA-237473It's not clear that `Check for updates` does nothing in case of using Toolbox
UsabilityIDEA-209250Cannot open file in detached window via Project View
UsabilityIDEA-246635Custom UI theme keys are missing for occurrence filenames in Find in Path
UsabilityIDEA-246224Text of "Pre-built Maven shared indexes" notification is unclear
CosmeticsIDEA-246463Newer IDE versions may... not fully shown
CosmeticsIDEA-248490Status line and menu - different row/:column separator shown
User Interface. AccessibilityBugIDEA-250268Exception on loading Settings when NVDA screen reader is launched
BugIDEA-245470When the focus is on the collapsed combobox, NVDA does not speak the selected item.
BugIDEA-245472In the VCS Log window, when the focus is on the commit filter buttons, the screen reader speaks the word "panel" instead of filters
User Interface. ControlsBugIDEA-248445Inspection widget: Wrong traffic light icon
BugIDEA-244623"Sorry but parent has already been disposed" in ThreeComponentsSplitter
TaskIDEA-250699Unify toolbar popups with action popups
User Interface. Embedded Browser (JCEF)BugIDEA-241604Cmd+C does not copy text in markdown preview
BugIDEA-247743JCEF on linux: Doubled keys when typing in search everwhere
User Interface. Find, Replace, UsagesFeatureIDEA-19888highlight usages of element at caret: don't wait for reparsing if nothing changed
FeatureIDEA-246023Support multiple choice popup menu: state of dependant actions should be shown in UI immediately.
BugIDEA-242557Navigate to file/Search everywhere doesn't place the exact match on the top
BugIDEA-238647Find In File (ctrl-F) changes cursor position in editor if search was cancelled
User Interface. FocusBugIDEA-199755Focus doesn't go to editor split after switching from other application
BugIDEA-196575No cursor in editor when opening file from project view with Enter
BugIDEA-204581Shortcut conflict for Ctrl+F5 in Find view
BugIDEA-198293Missed focus on IDE window on breakpoint
User Interface. Keyboard InputBugIDEA-197762Shift and layer 4 on the neo layout do not work together in Idea
User Interface. Look and FeelFeatureIDEA-203554Propose to switch IDE appearance theme (Light/Dark) to match operating system theme
BugIDEA-236214Setting Checkbox and Radiobox background color does not have any effect for a custom light UI theme
BugIDEA-250338Plugin theme is applied when "Sync with OS" theme is set
CosmeticsIDEA-203820Old-styled question icon appears on dialogs
User Interface. NavigationBugIDEA-223194Strange pattern matching when searching for action
BugIDEA-216720"Ctrl+E" shortcut is displayed in "Recent Files" popup if it was removed from the keymap
UsabilityIDEA-216170Add mnemonic for "Appearance" item in View menu
User Interface. Project ViewUsabilityIDEA-249246'Enter' on a module source or content root opens Project Structure dialog
Version ControlBugIDEA-249948New git repositories do not show up in VCS dialog
BugIDEA-189479Check TODOs should check only in commited chunks
BugIDEA-216828Non-modal commit: file name completion in the commit message field doesn't work after switching off/on non-modal commit option
BugIDEA-244969Mnemonic not shown for "Amend" in new commit tool window
BugIDEA-249292VCS: Squashing comments in rebase dialog takes into account only 1st comment
BugIDEA-250251VCS Editor gutter markers do not work with "Render documentation comments" option
BugIDEA-247324New Git main menu: Wrong name for VCS menu on Mercurial/SVN/Perforce project opening
BugIDEA-247848Japanese placeholder is not properly displayed in commit window
UsabilityIDEA-233754Branch selection shouldn't update branch filters in Log
UsabilityIDEA-220868Add action "VCS Commits tree" to the Main Menu -> VCS
CosmeticsIDEA-246727Use different icon for Restore size in Branches popup
TaskIDEA-244040Add display ID for VCS notifications
TaskIDEA-228969Change the VCS Main menu to Git
TaskIDEA-249269Cleanup unused properties in VCS bundles
TaskIDEA-250208VCS i18n in forms
Version Control. GitFeatureIDEA-249119Remember selected options in Git Pull Dialog
FeatureIDEA-241520Collapse custom config parameters of git command in Console
BugIDEA-242834Rider and Android studio Git token problem
BugIDEA-244887Project tree doesn't update if dropped commit contains renaming file
BugIDEA-250008Incorrect branch name in notification about branch renaming
BugIDEA-246077Delete tracked branch link does not expire
BugIDEA-248332git pull --rebase executes only rebase
BugIDEA-250697Incorrect branch is using on performing git merge/pull/rebase actions if branch was typed manually
BugIDEA-248536Git rebase: incorrect branch name in Rebase Successful notification on performing rebase with --root option
BugIDEA-244214Compare Branches: the tab is displayed at incorrect place in Recent Files
BugIDEA-248796Git Merge Dialog: considers all roots with the same name as a single one.
BugIDEA-244472Pull dialog appears second time after press on button Pull (master)
BugIDEA-152902Git4Idea doesn't work on windows if home directory contains whitespaces
BugIDEA-249256Push Commits dialog contains raw HTML in commit message tooltip
BugIDEA-245047Git menu: on first opening the menu is doubled
UsabilityIDEA-242330Map "Copy revision number" action to shortcut of "Copy reference" by default
UsabilityIDEA-122424Consider renaming Annotate to Blame
UsabilityIDEA-232141Branches: improve Selected Branch Updated message
UsabilityIDEA-248378Git Rebase dialog: onto help popup covers old base when start typing in empty field
UsabilityIDEA-250551Put caret into the branch selection field
UsabilityIDEA-247704Branches: group nodes don't collapse/expand by Enter
UsabilityIDEA-250735Git Merge/Pull/Rebase dialogs: Missed placeholders in fields with branch completion
UsabilityIDEA-250775Git Merge/Pull/Rebase dialogs: Unuseful spellchecking in branches comboboxes
UsabilityIDEA-250742Branch completion is covered by dropdown list when start typing in empty field.
UsabilityIDEA-247456Fetch should be visible even if there are no remotes
UsabilityIDEA-247286Branch completion in Git Pull, Git Merge, and Git Rebase dialogs
UsabilityIDEA-145065Better handling of specifying shell (e.g. git-cmd) as a git executable
UsabilityIDEA-249240The default branch in the merge dialog should be chosen more intelligently
UsabilityIDEA-248375Git Rebase dialog: onto help button is not reachable by keyboard
UsabilityIDEA-160372Flatten git context menu
UsabilityIDEA-250579Pull dialog: missed update info in branch dropdown list
UsabilityIDEA-244777Add action "edit" when double click emitted on item
UsabilityIDEA-159217Add filtering to dropdown for "Onto" and "From" in "Rebase branch" dialog
UsabilityIDEA-250101Do not auto-center Branches list
TaskIDEA-248666Git internationalization
ExceptionIDEA-250113Exception on new branch creation
ExceptionIDEA-250502IllegalArgumentException on perfoming git pull action without modify options
ExceptionIDEA-248374Exception is thrown on rebase action invocation
Version Control. LogFeatureIDEA-238847Set minimal size for the panes in Log and History
BugIDEA-245715DVCS Log tab can permanently lose the ability to refresh
Version Control. SubversionBugIDEA-244031Unable to click 'Fix working copy' popup
BugIDEA-248635filter svn history does not work when choose filter by user
No subsystemFeatureWEB-42706Mark .next folder as excluded by default
BugWEB-47350Nested injections cause misleading errors
BugWEB-46943i18n: internationalize JSON code style settings
BugWEB-46941i18n: internationalize 'Punctuation' tab in Code Style JS/TS settings
TaskWEB-46962JSHint: update the bundled version to 2.12.0
TaskWEB-47030NodeJS internationalization
TaskWEB-46940i18n: internationalize HTML code style settings
CSSFeatureWEB-47335Can we add support for the css font-size: xxx-large?
BugWEB-46938i18n: internationalize tab 'Other' in Code Style | Style Sheets
BugWEB-46939i18n: internationalize fields in "Minimum blank lines" from Code style | Style Sheets
TaskWEB-47045CSS internationalization
TaskWEB-47063PostCSS internationalization
TaskWEB-46840Do not show deprecated system color keywords in completion
DartTaskWEB-47031Dart internationalization
DebuggerBugWEB-46876Console shows wrong duplicated label
TaskWEB-47382Remove the default browser option from the JavaScript debug configuration
File WatchersBugWEB-46232Localized scopes in File Watchers dialog cause 'unknown scope' error.
UsabilityWEB-47300Ensure that settings search can find File Watchers templates
TaskWEB-47299Provide explanatory text in File Watchers settings page
TaskWEB-47056File Watchers plugin internationalization
HTMLBugWEB-43892'Inspections | HTML' section is shown twice
TaskWEB-46921RelaxNG internationalization
JSONBugWEB-46080SchemaStore schemas should be matched against project-relative paths
JavaScriptFeatureWEB-46234TypeScript: Move members refactoring should respect index.js files
BugWEB-47289Javascript MDN documentation is broken
BugWEB-46149Don't show Array method names in completion within `[]`
BugWEB-25367@callback-defined @type of function misinterpret as @param
BugWEB-46297Incorrectly creating a function from "Compare" window
JavaScript. FormatterFeatureWEB-28540Support formatting injections with more than one part in JS strings
FeatureWEB-31028Code style for JS6 destructured object lacks settings in wrapping and braces
JavaScript. FrameworksFeatureWEB-34901Create a React component from usage
BugWEB-47181Unnecessary file codeStyleConfig.xml under .idea is created for new projects if Vue plugin is enabled
PerformanceWEB-46800High CPU usage when breadcrumbs are enabled
TaskWEB-46935Vuejs internationalization
TaskWEB-46920AngularJS internationalization
JavaScript. InspectionsFeatureWEB-36319More inspections related to 'switch' statements
BugWEB-46702No inspection ('Use of caller property') while use caller property
BugWEB-46118Array.prototype.reduce inspection thinks that it takes only 1 argument
BugWEB-46910Inspection 'Anonymous function' doesn't appear in return expression
CosmeticsWEB-46709Improve tooltip for arrow function triggered by inspection ‘Anonymous function’
JavaScript. RefactoringBugWEB-46750Link to the essential plugin in the intention description window leads to nowhere
UsabilityWEB-47338TypeScript Inline Renaming for Generics never works.
LESSTaskWEB-47084Less internationalization
LintersTaskWEB-47062Prettier internationalization
Node.jsFeatureWEB-46471Automatically set pnpm as package manager if pnpm-lock.yaml is in the project root
FeatureWEB-46881Use interactive terminal console for Node.js run/debug tool window
BugWEB-45414IntelliJ does not find global pnpm installation managed by pnpm itself
BugWEB-46804Detect asdf pnpm installations
BugWEB-47366Support ESLint and TypeScript with Yarn PnP and Node.js 10.x
BugWEB-46803Add "pnpm" package manager alias
BugWEB-47250Broken hyperlink in "Cannot find package manager"
SASSBugWEB-37203Bracketed lists not parsed correctly in sass files
TaskWEB-47046Sass internationalization
StylusTaskWEB-47047Stylus internationalization
TypeScriptFeatureWEB-45890TypeScript 4.0: this-property assignments should use autoType in constructor
BugWEB-46896Find usages in ts work incorrectly
PerformanceWEB-47089Awful performance of TypeScript with optics-ts
TaskWEB-47343TypeScript 4.1: Syntax support for "export * as default"
Unit TestsFeatureWEB-46360Jest not be detected when just open a package as workspace of lerna project packages
BugWEB-45801Jest failed to transform files with which have failed tests if running from IDE
BugWEB-46993Jest: "Click to update snapshot" link is not responsible when rerunning failed tests
BugWEB-47306Jest: support running individual tests when using @testdeck/jest decorators
BugWEB-47021"nyc" added as production dependency when using yarn
BugWEB-47328Jest: escape square brackets in test name pattern when running individual tests
DB ConnectivityFeatureDBE-11284Make an embedded shell command like DBeaver has
FeatureDBE-11601Couchbase: add a default bucket option to the jdbc connection string template
FeatureDBE-9112Add ability to connect to a Snowflake account using a key pair
FeatureDBE-11378Support DNS Seedlist Connection Format for MongoDB as Connection Type
BugDBE-11410MongoDB: incorrect keep alive query
BugDBE-11409MongoDB: fail test connection for ssl enabled data source if no valid keys provided and for disabled ssl on client side
DB ConsoleBugDBE-1895Explain Plan tab requires horizontal scroll or wrapping the mouse over popup text
BugDBE-11463Schema picker dropdown in editor does not show schemas from multiple connections
DB DiagramFeatureDBE-8440Is there any way to display column's comment when using `Diagrams -> Show Visualisation...`.
DB IntrospectionFeatureDBE-5399Introspect OWNER, TABLESPACE, INDEX METHOD for Postgres
FeatureDBE-7207Postgres: Support event triggers
BugDBE-421Database tool window: Oracle: overloaded package procedures are shown as one item
BugDBE-11347DataGrip doesn't understand INCLUDE constraints on PostgreSQL
BugDBE-10711MongoDB is not introspected when new collection is created
BugDBE-6813schemas tables, routines not updated after changes
BugDBE-5139Incorrect DDL script creation for triggers
DB RefactoringBugDBE-2462Modifying a table doesn't refresh the DDL view
DB Schema ViewsBugDBE-11165Highlight the changed routines in a schema tree, just like with files in a project
Data Import & ExportFeatureDBE-11211Bundle two more extractors
Data ViewsFeatureDBE-9896make transpose the default table view
BugDBE-11510Database DataViews Limit page size to not working
BugDBE-11387Tree view: the row is stuck after filtering
BugDBE-11311MySQL BLOB Fields are not editable anymore
UsabilityDBE-9763Change keyboard shortcut DOWN ARROW to ALT+DOWN ARROW in the table data grid FILTER window to show the filter history
PL & DDL EditorCosmeticsDBE-11289Preview of changes from Database Changes tool window shouldn't be scrolled to the bottom
SQL CompletionFeatureDBE-10668Add an intention to flip 2 sides of a comparison
SQL GeneralFeatureDBE-11173Missing Index Suggestion
BugDBE-11529Show correct Couchbase type names in SQL
BugDBE-11169Support SEARCH INDEX syntax for Cassandra (DataStax Enterprise)
SQL HighlightingFeatureDBE-11383ClickHouse SQL does not know SYSTEM STOP TTL MERGES
BugDBE-11525Don't highlight unresolved fields in Couchbase insert statement
BugDBE-11541Couchbase: don't highlight target field in UPDATE statement as unresolved
BugDBE-11356Redshift dialect doesnt regognize key word GENERATED
BugDBE-9899Add support to KILL QUERY syntax highlight for Clickhouse dialect
BugDBE-11433Snowflake Geospatial Function Support
BugDBE-10662DataGrip does not behave correctly about overloaded functions/procedures in packages
BugDBE-11380Unknown database function 'sysdate' - Snowflake JDBC
BugDBE-11118DateTime64 column type cannot be recognized
BugDBE-11493Add BOOLEAN type to BigQuery grammar
BugDBE-11432DataGrip stopping valid syntax on Redshift
BugDBE-11544Support Trailing commas for BigQuery
BugDBE-11545Support window statement in BigQuery
BugDBE-11375SQLite syntax "VACUUM INTO 'file'" is not recognized
BugDBE-11533RATIO_TO_REPORT() function not recognized in Snowflake dialect
BugDBE-11385PostgreSQL Statement level trigger - Syntax Highlighting Issue
BugDBE-11550Couchbase UPDATE statement parser error
SQL ResolveBugDBE-11551Couchbase table reference inside `meta()` is unresolved
BugDBE-11528Couchbase and Cassandra resolves duplicate field prefix
BugDBE-11523Resolve Couchbase fields when FROM clause contains map literal

  • No labels