Skip to end of metadata
Go to start of metadata

You are viewing an old version of this page. View the current version.

Compare with Current View Page History

« Previous Version 2 Next »

RubyMine 2020.1 EAP2 (201.4515.22 build) Release Notes

Code CoverageUsabilityRUBY-14333Coverage report in the IDE differs from report in the HTML browser
Code InsightPerformanceRUBY-25487Suboptimal caching due to recursion prevention during symbol hierarchy traversal
UsabilityRUBY-3397Find usages of new call should find all new instance creations of given class
CompletionFeatureRUBY-24577Override method by typing it's name in derived class
DebuggerBugRUBY-25618ruby vm crash on a step into
BugRUBY-25679ruby vm crash on a step
DockerUsabilityRUBY-25193Service field in docker-compose sdk dialog is shown without placeholder
EditingExceptionRUBY-25652IDE exception when trying to double click inside a HEREDOC
IDEBugRUBY-25298Echoed input and duplicated prompt in IRB and Rails consoles
UsabilityRUBY-25518Remove the 'Run with sudo' option for Bundler since it should not be run as root
RailsBugRUBY-25761Rails console doesn't start in 2020.1 EAP
RefactoringsBugRUBY-25648Calling `Override Methods...` inside methods doesn't work the way it's expected
BugRUBY-25650Visibility isn't inhereted in `Override method` action
UsabilityRUBY-25649Don't run template on `Override method` action
Core. IDE SettingsBugIDEA-230500Fail to change the sync account after I delete the account
TaskIDEA-169262Settings: move "Tooltip initial delay" option under registry key
Core. IDE Settings. SharingTaskIDEA-231281Fix Sync Settings to JBA options location in the Main menu
Core. InstallationBugIDEA-231073Uninstalling IDEA doesn't delete caches and config
UsabilityIDEA-230819Installed custom plugins are lost after updating if custom idea.config.path is used
Core. Navigation and SearchBugIDEA-230721Method name in "Recent Locations" is truncated unnecessarily
UsabilityIDEA-147434Navigation bar: File list should use natural sort order
Core. Platform APIFeatureIDEA-230423Allow to call commitDocument in background threads for documents with non-physical files
TaskIDEA-230811Report IDE error when the same reference resolves to non-equivalent results in different threads
Core. Plugin ManagementBugIDEA-229772IDE freezes after updating plugins
Core. Project SettingsCosmeticsIDEA-227208Grammatical error in IDEA UI for setting up project
Core. Quick DocumentationBugIDEA-230513Parameter Info doesn't work for Java and Kotlin methods
BugIDEA-231385External documentation providers shouldn't be running under read lock
Core. Run. ConfigurationsBugIDEA-230605The beforeRun Maven tasks before run Application
UsabilityIDEA-231069Edit Run Configurations dialog: new RC adding doesn't work when you use quick search for navigation to node with subnodes
Editor. Editing TextBugIDEA-231047Auto-import on the fly doesn't work in files modified in non-default changelist
Editor. Intention ActionsFeatureIDEA-222636Intention preview
Lang. Shell ScriptBugIDEA-231408Shell Script plugin: Bash Terminal rewrites script file path in a way that bash shell can't read it
BugIDEA-227953Shell script: terminal tabs are not respecting the run configuration title
Lang. XPath and XSLTUsabilityIDEA-230950XPath in language injection fragments is highlighted with confusing red color in Darcula
Tools. DockerFeatureIDEA-190810Support for multiple tags when building
Tools. TerminalBugIDEA-231032Cannot open new terminal tab in RubyMine
ExceptionIDEA-231286"Open in Terminal" action fails to run
User Interface. ControlsBugIDEA-230825Color Scheme UI: field with color value is always showing truncated text
User Interface. Embedded Browser (JCEF)BugIDEA-230863JCEF white flash on load
User Interface. Find, Replace, UsagesBugIDEA-209596"Invoke Show Usages again to search in all files" doesn't work
BugIDEA-231072intellij idea incorrect processing of regex: “regular expression matches empty string”
BugIDEA-230545'Search Accessors' dialog is shown simultaneously with 'Show Usages' results popup
User Interface. Look and FeelBugIDEA-228042Project description floats freely on screen
User Interface. NavigationUsabilityIDEA-11943Navigation bar: Alt-F1 should immediately open list
User Interface. Services ViewExceptionIDEA-231056AE at com.intellij.database.dataSource.DataSourceStorage.readState
Version Control. GitBugIDEA-228523When cherry-picking with git, the automatically opened Commit dialog deselects the first file
BugIDEA-231282Throwable at com.intellij.vcs.log.impl.PostponableLogRefresher.addLogWindow
BugIDEA-230743Clone button stays disabled after installing Git
Version Control. LogCosmeticsIDEA-228572Git log: two different colors for link rendering
No subsystemBugWEB-43484'Introduce variable' breaks for 'as' type casts in TypeScript if no whitespace after parentheses
ExceptionWEB-43488NullPointerException when enable prettier plugin
HTMLBugWEB-43422"Insert closing tag on tag completion" can't be unchecked & saved
JSONBugWEB-43447Java process of IDE stays alive after ide is closed if project contains JS files
JavaScriptFeatureWEB-43397JavaScript: enable completion autopopup in string literals if the context type is an union type with string literals
BugWEB-43327React.js: "Expand selection" works incorrectly in Redirect tag expression
BugWEB-43443syntax error on object spread with `in` and conditional operator
BugWEB-41899Do not suggest Class as a class name after the `class` keyword
BugWEB-20508Quick Definition of default item imported via ES6 import statement results in viewing import statement not definition in actual import
BugWEB-43375'Extract field' doesn't insert element with this when invoking inside array or indexer
BugWEB-43307"Extract constant" does not work when selecting incomplete part of the expression in a function return
BugWEB-43351'Extract variable' does not work when selecting the last part of the expression with minus
PerformanceWEB-43493IDE Freeze in 2019.3.2
UsabilityWEB-43369Popup 'Extract field' jumps to first occurrence
UsabilityWEB-41072Show file path in "Choose declaration" popup
JavaScript. FormatterUsabilityWEB-43227Improve action name in the intentions popup when suggesting to import code style
JavaScript. FrameworksBugWEB-42012jsconfig.json is not supported in *.vue files
BugWEB-38949'Closing Tag' suggestion box incorrectly suggests tags which have already been properly closed in JSX files
BugWEB-42439Live Templates: Angular: correctly expand a template invoked in the class context
BugWEB-43348Code completion doesn't work unless React typings are installed
JavaScript. InspectionsBugWEB-42349'Assignment used as condition' should not be reported for mutable loop conditions
UsabilityWEB-43346Improve warning in the Potentially invalid constructor usage inspection
JavaScript. RefactoringBugWEB-43332Introduce Variable leaves unnecessary parentheses
BugWEB-39734Extract field: should introduce after the initialization in constructor
BugWEB-43435Introduce variable fails with parenthesized expressions in return in if-else without braces
BugWEB-39972Move module member: should not be available when caret is on reference to readonly library file
BugWEB-43309'Introduce variable' adds braces in the wrong sequence for arrow functions nested in invocations
BugWEB-38311'Change signature' doesn't work with tagged template usages
BugWEB-43483'Extract variable' removes parent expression when called on a string without quotes
BugWEB-43344Introduce field: wrong scope detection when extracting a constant substring of a template literal referencing inner vars
ExceptionWEB-39078Exception when invoking in-place introduce var from expression with parenthesized occurrences
ExceptionWEB-42437'Extract variable' causes an exception in script tag in HTML
LintersBugWEB-43396Support Prettier with Yarn PnP >= 2.0.0-rc23
BugWEB-43384Support ESLint with Yarn PnP >= 2.0.0-rc23
Node.jsFeatureWEB-38187IntelliJ IDEA cannot find Yarn binary when Yarn is installed with Yarn Version Manager
BugWEB-43414Support Mocha with Yarn PnP >= 2.0.0-rc23
BugWEB-43298Can't install packages with yarn 2.0.0-rc22
SASSBugWEB-43264SASS/SCSS inspection error when using '#' with '$'
TypeScriptFeatureWEB-43379Support using ttypescript as Typescript language service
BugWEB-40099TypeScript - incorrect "Remove unused field" quick fix
BugWEB-43352TypeScript: mapping between ".ts" and ".d.ts" files works incorrectly for variables
BugWEB-42061Typescript code completion (For casting return type)
BugWEB-40535Quick documentation for import types in TypeScript TSDoc
BugWEB-43431Completion should autopopup for object type members
BugWEB-43406Improve completion after 'readonly' in types
BugWEB-43238'Generate destructuring patterns' fails on assignment property of enum
BugWEB-40503TS: Incorrect completion in generics
BugWEB-42139Add JSON files to Typescript import completion
BugWEB-42812Add `declare` Property Modifier to completion
PerformanceWEB-43333TS: Auto-import quick-fix consumes a lot of EDT time
UsabilityWEB-41913Impossible to differentiate entries with same name in the same-named files in Search Everywhere, Go to Class, and Go to Symbol
TaskWEB-42637Investigate support for TypeScript with Yarn 2
Unit TestsBugWEB-43355In failed karma tests links follow to localhost, not to the file system
BugWEB-43290Running single Jest test fails if a project directory is a symlink
DB DiagramBugDBE-9903DB Diagram shows constraint differently in 2019.3 version
DB IntrospectionBugDBE-9980Auto sync is not working if create schema and objects from console
DB Schema ViewsUsabilityDBE-7219"Import from sources" action is unclear
SQL CompletionPerformanceDBE-9844Huge freeze during autocomplete database table names in joins

RubyMine 2020.1 EAP1 (201.3803.68 build) Release Notes

No subsystemBugRUBY-25492RubyMine 2019.3 freezes or "grey outs" after a few minutes
Code InsightFeatureRUBY-25529Add "Namespace declaration" usage type classification for modules
FeatureRUBY-25514Improve text-based resolve to consider parameters and call arguments
FeatureRUBY-25512Add text-resolve to `super` for inside modules
FeatureRUBY-24976as a fallback, symbol to method resolution support should be available everywhere
BugRUBY-25206RubyMine does not handle overridden predicate and bang methods
BugRUBY-22865Group BasicObject children with Object/Kernel in auto completion
BugRUBY-22562YARD - RubyMine adds excessive lines between @params tags generated for a method
BugRUBY-24915`super` type isn't recognized
BugRUBY-24935RubyMine think that empty singleton method returns `Class`
BugRUBY-21841add type prioritization during type inference.
BugRUBY-23950File.open not correct type inference depending on whether block passed or not
BugRUBY-15259Support Module#module_function
BugRUBY-24546`Class` type isn't recognized correctly
BugRUBY-25269instance_eval/instance_exec context type inference
BugRUBY-16379Type hinting doesn't work proper inside a block (YARD)
BugRUBY-18296Find usages for method does not respect super calls
BugRUBY-24988Overridden Object#class Object#to_s Class#new method wrong type inference
BugRUBY-25226YARD can't recognize top level namespace like "::Kernel", "::String"
BugRUBY-24729"Add @param tag" bugs
BugRUBY-18544trailing comma in a method call is not flagged as an error
BugRUBY-25044RubyMine doesn't expand constant conditions in ternary operators
BugRUBY-24759First method declaration is opened automatically if multiple declarations are available
BugRUBY-24146"go to implementations" for constants does not work
BugRUBY-25271fails to resolve symbols passed to Object#method
UsabilityRUBY-24560Tidy up resolve of `self`/`nil`/`true`/`false`
CosmeticsRUBY-25375Go to declaration display is different for dynamic elements
TaskRUBY-23434Factory Bot - remove dependency on ModelSymbol
TaskRUBY-24760Remove `RTypeWithContext`
CucumberBugRUBY-24324Cucumber tags are coloured white and not teal as before
DebuggerFeatureRUBY-25397Debase-0.3.0.beta19 doesn't install with ruby-2.7.0-preview3
FeatureRUBY-24510Obtain ruby collections elements lazily
FeatureRUBY-16846rails console in the debugger should have a separate debugger console
BugRUBY-24961F7 does not step into super
BugRUBY-24839"connecting to debugger" dialog that flashes too briefly to be read, every time you debug, is not helpful
BugRUBY-24105hash string value inspections are not quoted
BugRUBY-24992Debugger doesn't enter while, if and until blocks
BugRUBY-24940Pause program button doesn't work with ruby-debug-ide 0.8.0.beta6
BugRUBY-25398Pause program button doesn't work when debugger attached to project
BugRUBY-25176Debugger couldn't stop on the breakpoint
BugRUBY-25664Segfault when trying to run irb/rails console in debug mode with ruby 2.7.0
BugRUBY-25155debugger loop stepping problems
BugRUBY-25478Debugger error when debugging multithread rails app
BugRUBY-24895Attach to process doesn't stop on previously created breakpoints
BugRUBY-24993Debugger doesn't step into .call method
BugRUBY-24836hash inspection does not show a nil key
BugRUBY-25048Debugger works incorrectly with rescue ensure block
BugRUBY-25290IDE Exception when debugging
BugRUBY-20930Ruby Debug IDE GEM fails to install from RubyMine with system Ruby
BugRUBY-25477Debugger crash when debugging multithreading app
BugRUBY-24991Set breakpoin All options selects only single line
BugRUBY-25030Debugger doesn't stop in controllers
BugRUBY-24983F7 on `begin` steps into the method invoked on the next line and steps out back to the begin line
BugRUBY-25028Debug fails when debug view templates
BugRUBY-25641an earlier breakpoint prevents a later one from breaking
BugRUBY-25619smart step into does not step, resumes
BugRUBY-24984ruby 2.4.6 vm crash stepping into a method in an if block in a begin block
BugRUBY-17357debugger callstack frames don't show correct names for meta-programming defined methods
BugRUBY-24797Attach to local process doesn't work
BugRUBY-25029Debugger doesn't show next line correctly
BugRUBY-24781"Uncaught exception: uninitialized constant" when starting a Rails app in debug mode
BugRUBY-25107Interactive console cuts output at 1000 chars
BugRUBY-24688Got Exception : DebuggerThread are not supposed to be traced... with new Ruby-debug-ide 0.8.0 beta3
BugRUBY-24981F7 does not step into initialize
BugRUBY-25442debase 0.3.0.beta19 Segmentation Fault on Ruby 2.6.5 when introducing syntax errors
BugRUBY-25135RubyMine does not allow to perform Smart Step Into using Shift+F7 when 'Always perform smart step into' is disabled
BugRUBY-24834step into gets stuck on "Can't step into method because it has a c-level implementation"
BugRUBY-25163Debugger doesn't step into super with variables
BugRUBY-24831Experimental debugger doesn't stop on breakpoints with ruby 2.7.0-preview1
BugRUBY-25039The new experimental debugger does not stop at the breakpoint in RSpec test running with Spring and ruby 2.6.3.
BugRUBY-24982New Debugger ignores breakpoints in rescue blocks
BugRUBY-25336Debugger fails to start with jruby-9.2.9.0
UsabilityRUBY-25234Add styling to symbols in debug variables screen
UsabilityRUBY-25020Message about installation debug gems mentions only debase
DockerBugRUBY-25421IP Address in Rails run configuration is 127.0.0.1 instead of 0.0.0.0 on Windows
BugRUBY-25236Docker: working dir is not passed in case of exec mode
BugRUBY-25500NPE if run app in debug with Docker sdk
BugRUBY-19694Server pid is not removed after stop remote debug with docker-sdk
BugRUBY-25431Breakpoints are not hit in case of multi-module project with docker-compose SDK
ExceptionRUBY-25335RM unable to fetch gems with docker SDK
EditingUsabilityRUBY-25454[REGRESSION] Space after hash for line comment
CosmeticsRUBY-25341Consider removing "Edit Ruby19RegExp fragment" intention action
IDEFeatureRUBY-11850Option to filter variables in the Structure view
FeatureRUBY-8054Feature Request: Add the IDEA Copyright plugin to RM ...
FeatureRUBY-24658Offer to search for the parent method when invoking find usages
FeatureRUBY-24906Multi line todo's no longer work
FeatureRUBY-25554Update "Go to Super" to offer all candidate super methods, not just the immediate
BugRUBY-25090Run Anything remember text in command which wasn't run
BugRUBY-24615Find usages of a fake YARD element has strange text in the tab
BugRUBY-24997Redundant options in Tools menu
BugRUBY-22179Possible to install Ruby plugin to RubyMine
BugRUBY-25095Search `rake migrat` doesn't display rake db:migrate in Run anything
BugRUBY-24290Switch Rake tasks/Rails Generators to Run Anything
BugRUBY-25476Search everywhere doesn't search through yml files via YAML path
BugRUBY-25323Export Settings doesn't work
BugRUBY-18758Ruby SDK and Gems list refresh produce visual glitching
BugRUBY-25305Run/Debug options not presented in context menu right after toggle breakpoint
BugRUBY-25026RM Internal Error with clean initial configuration
BugRUBY-25483[RubyMine 2019.3][File and Code Templates] Predefined template variables were replaced as empty string after files created
BugRUBY-21440New Rails project wizard: rendering issue and constant refreshing while typing the app's name
BugRUBY-25073RM projects moved below Web Projects in Create New Project wizard
BugRUBY-24845move cursor to code block end/begin does not work for opened singleton classes
BugRUBY-24396Update ruby class/module/method & other relevant elements to support "ctrl click/hover" for "Show usages of X"
BugRUBY-25313Ctrl hover with mouse shows wrong tooltip for undefined superclass clauses
BugRUBY-25366Keymaps in 2019.3 are changed
PerformanceRUBY-25391IDE is extremly slow and freezing during regular work
UsabilityRUBY-24575Tidy up our inspection/intention settings text and groupings
UsabilityRUBY-25093Add filter include undocumented for Rake tasks/Rails Generators in Run Anything
UsabilityRUBY-25520Provide the capability to install Bundler whose version differs from installed in SDK
UsabilityRUBY-25247Ensure help commands in Run Anything are sorted logically
UsabilityRUBY-25036Custom matcher for rails generate and space after rails g
CosmeticsRUBY-25145Update remaining Ruby File templates to use new template selection dialog
CosmeticsRUBY-24670Move "Run Rails Generator..." below "Ruby File/Class" in new dialog
CosmeticsRUBY-25212Rename "New Scratch File" to just "Scratch File" in project view "New" context menu
TaskRUBY-24291Change Ruby plugin file version from date to the build number
TaskRUBY-25351Remove old Darcula migration code
InspectionsFeatureRUBY-23098Implement possibility to configure RuboCop severeties mapping
FeatureRUBY-24386Add warnings for lambdas without blocks in 2.7 and above
BugRUBY-24951noinspection comments do not function when tab is used as indentation
BugRUBY-25235Incorrect warning: return statement inside class or module body
BugRUBY-24716'Add @param tag' inspections displays in search by inspection results block's variable as not annotated
BugRUBY-24156super in initialize shows arguments for class not super class. flagged as error
BugRUBY-25389%w inspection uses parens when it should use brackets
BugRUBY-24273Super call with no super classes actually defined. False positive. Dynamic class initialization
BugRUBY-25320Duplicate spellchecker warnings for classes, modules and alias statements
BugRUBY-24874Incorrect "Don't put space before arguments parentheses" with range as array declaration
BugRUBY-25634invalid "super call with no superclass defined" for a Module.new{} block
BugRUBY-24865Incorrect "Safe navigation can be omitted" inspection
BugRUBY-24801Ruby parser error
BugRUBY-25270"!" and "?" method suffixes are not ignored by the spell-checker
BugRUBY-22401Useless assignment inspection incorrectly deletes assignment when last line in a method
UsabilityRUBY-25043Update texts for intentions
UsabilityRUBY-25371Update elements that intentions can be invoked on
ExceptionRUBY-25184IDE exception while code writing
ParsingBugRUBY-24756Parser finds fault with valid block parameters
BugRUBY-22349Lexer/Parser sometimes does not reparse "corrected" syntaxes
BugRUBY-24780Trailing comma is not allowed in method definition
BugRUBY-24827Unexpected syntax error in changing inherit class
ProfilerBugRUBY-23795'Attach to' doesn't show any process for profiler on Windows
BugRUBY-25031ruby-level calls color in profiler graph changed to blue
RailsFeatureRUBY-15415default Property Key for I18n string value creation
FeatureRUBY-25325Rails 6 raises deprecation warning after running an application with the explicitly specified server
BugRUBY-25091YAML error on value with embedded Ruby code
BugRUBY-24928IDE Error when trying to run Tools|Run Rails Generator...
BugRUBY-24752YAML editor reports invalid property key
BugRUBY-19092Class names are not recognized when prefixed with "::"
BugRUBY-24949Rails Generators action is available for non-rails projects
BugRUBY-25285Don't show "Rails console" in Run Anything for non-rails projects
BugRUBY-13581Navigate to test file does not work when model is in nested folder
ExceptionRUBY-25248No suggestion in rails console when application stopped on breakpoint in rails view
ExceptionRUBY-24694Exception renaming a class
Rails. Code InsightFeatureRUBY-3953Type support for fixtures call
FeatureRUBY-12472Support autocomplete for additional column types and options in create model/migration
BugRUBY-24931Incorrect name resolve when used with db migration file
BugRUBY-24095'Missing argument' raised when using ActiveRecord "take" method
BugRUBY-24163False warning "Extra call argument" for order method
BugRUBY-25293RM doesn't resolve routes
BugRUBY-24957fails to resolve a method symbol passed to .try!, when the method is otherwise resolvable
BugRUBY-25274Gutter icon for name-spaced classes is missing
BugRUBY-24970symbols passed to rails `delegate` don't resolve
BugRUBY-25434RubyMine hang frequently
BugRUBY-24404invalid "extra call argument" inspection for has_one assoc
BugRUBY-16272editor fails to resolve partials in view folders of superclasses
BugRUBY-24954fails to resolve :unless attribute symbols on validation helper methods
BugRUBY-25410Completion contains incorrect "instance_predicate" value from "class_attribute"
BugRUBY-25190Add self-type support in rails syntactic sugar methods `test '' do ... end` & friends
BugRUBY-25611"Unexpected parameter value for method call" when delegating to a Ruby expression
BugRUBY-24651Fix support for find usages on rails enums
BugRUBY-25469Treating valid YAML as invalid ruby code in Rails locale file
BugRUBY-24129ActionMailer: Wrong autocompletion, nonexistent create_* and deliver_* methods
BugRUBY-21636polymorphic associations support does not work with concerns
Rails. ParamdefsBugRUBY-23300Ensure used association references in parameters support polymorphic associations
RakeFeatureRUBY-23953Gutter run icons for Rake tasks missing
BugRUBY-25252Rake tasks could be not uploaded into Run Anything popup
RefactoringsBugRUBY-22561Delegate call type creates references that refer to the call, not the arguments - this impacts rename refactoring, find usages, etc.
BugRUBY-15023Cannot Rename overrided methods
Ruby Version ManagersCosmeticsRUBY-24753Infinite Updating message when using rbenv-gemset in Settings section
Ruby. FormatterFeatureRUBY-24792Feature request: Code Style option to choose between inline or multiline empty class
FeatureRUBY-17293option to align method chains to the start of the chain (initial receiver)
BugRUBY-24748Extra indentation added for second & subsequent arguments in class methods
BugRUBY-20969New line in multi-line hash definition is not indented when typing
BugRUBY-24524Minitest do block has spaces instead of the tabs as in settings
RubyGemsBugRUBY-25354vendor cached git gems are not shown in external libraries
BugRUBY-19743External libraries still shows global version of git gem if it's located in vendors/cache and global libraries simultaneously
TestsFeatureRUBY-23649Navigating to test via command should create test file if not existing
BugRUBY-9998Mailer related tests/specs are not found
BugRUBY-25118Rerun failed tests doesn't work for minitest
BugRUBY-25011`subject` local variable is mixed up with RSpec's `subject`
BugRUBY-25230Set "test" and "spec" as default "test source" folders for simple ruby applications, and gems
BugRUBY-25228Create new "Ruby Test" for Minitest/Test::Unit should ensure test files end with "Test"
BugRUBY-25035Debug 'All Specs in […]': default file name mask does not work (surplus apostrophes)
BugRUBY-16131Ruby plugin doesn't detect methods of described_class in specs
BugRUBY-25064Minitest tests: there're no run gutters in the Editor
UsabilityRUBY-20386No detection which Test Framework is used in the project
UsabilityRUBY-24174Test run Configurations show list of loaded files which is useless
UsabilityRUBY-20915Running Single Tests with shoulda gem and minitest is not possible
TaskRUBY-24742Do not show menu Item to run Minitest on RSpec files and vice versa
Type InferenceBugRUBY-25630Incompatible types: Class <-> Object
WSLBugRUBY-25284Gem downloading hangs after adding WSL as a remote interpreter
Code Analysis. DuplicatesBugIDEA-221014Many "JavaScript/TypeScript" entries in duplicate settings.
Code Analysis. InspectionFeatureIDEA-227586Warn on returning Nullable from Flux/Mono transformation should support method reference
BugIDEA-218302On pressing F2 only one problem is shown in the inspections tooltip
BugIDEA-227840Intention does nothing when rethrow exception
BugIDEA-229184@Contract falsely report warning for methods that contain unchecked casts
BugIDEA-227141Quickfixes in the Inspections view are reordered
BugIDEA-222909Typo that selected in Inspection Results tree is not highlighted in batch editor
BugIDEA-229617NullPointerException in ex.GlobalInspectionContextImpl
BugIDEA-198830Slow inspections in IDEA
BugIDEA-230363Freeze in StreamApiMigrationInspection when StringBuilder-append-loop is followed by append to another StringBuilder
BugIDEA-220740Run Inspection -> Custom Scope value is not persisted
BugIDEA-224533Inspections from command line fail with "TFBlockNameValidness descriptionUrl==TFBlockNameValidness "
PerformanceIDEA-220137Do not run inspection iterations if LocalInspectionTool returned PsiElementVisitor.EMPTY_VISITOR
UsabilityIDEA-221001Quick fixes on an inspection warning should have higher priority than Run/Debug actions
UsabilityIDEA-227280Running Inspections From Command Line: Errors logged for every missing description
Code Analysis. Language InjectionFeatureIDEA-217838Text blocks: edit injection fragment should trim left spaces
FeatureIDEA-221416AssertJ language injection rules as built-in rules
FeatureIDEA-106449Support template language injection
FeatureIDEA-230418Apache DbUtils: add language injections for AsyncQueryRunner
BugIDEA-230409jOOQ: DSLContext.batch() injections disappear at adding comma before the next `string` param
BugIDEA-223046Strange highlighting in injected HTML text block
BugIDEA-218402Database plugin - SQL syntax highlighting is not working in JavaScript strings if DECLARE is used
ExceptionIDEA-221436NullPointerException when move folders in project tree
Code Analysis. Structural SearchFeatureIDEA-203910Find enhanced switch statements and switch expressions
FeatureIDEA-229632Support regex type filter and allow to select/switch in UI
FeatureIDEA-223337Search for Java methods should find methods with receiver parameter
BugIDEA-225633matching multiple fields in single declaration fails
BugIDEA-224120Replace element with unmatched annotation variable fails
BugIDEA-219700'Search Structurally' with selection uses scope different from selected in UI
BugIDEA-227210Extra semicolon inserted on replace
BugIDEA-196360Replace structurally removes spaces between repeated elements
BugIDEA-65982Structural search and replace doesn't correctly substitute annotation parameters
BugIDEA-226256Can't find comments in XML/HTML
BugIDEA-221361Replace variable number of parameters with fixed type correctly
BugIDEA-223146PsiInvalidElementAccessException: Element class : on SSR replacing annotation
BugIDEA-224957Searching for javadoc with text and doc tag ignores text
BugIDEA-227675Structural search doesn't work with JSX
BugIDEA-226388Existing template "<li> not contained in <ul> or <ol>" doesn't work
BugIDEA-221558SSR inline preview does't get updated on editor document change
BugIDEA-224871"does not match anything" warning when searching string literal
Core. DebuggerBugIDEA-224914move watch up/down doesn't work
BugIDEA-220181Debugger ignores stepping filters when using new directed step-into
UsabilityIDEA-225449View action for multiline strings in debugger
CosmeticsIDEA-222515Doubled single quote: Source file changed or found source file does not correspond to the breakpoint''s file
ExceptionIDEA-227153NPE at com.intellij.xdebugger.impl.evaluate.quick.XDebuggerInstanceTreeCreator$InstanceEvaluatorTreeRootVal ue.computeChildren
Core. DiagramsFeatureIDEA-229795Support record creation on UML diagrams
BugIDEA-223512UML Diagram: missing "Save as UML" button on a toolbar
BugIDEA-210021Undo is not afailable for file after some diagram is shown for it
ExceptionIDEA-222053NewJavaDiagram action causes NPE
Core. File SystemFeatureIDEA-224971fsnotifier: support osxfs mounts
FeatureIDEA-152607Non-destructive "safe write" mode
BugIDEA-224079Open File or Project only showing one directory in home
BugIDEA-228441"Must not intern long path" exception when importing a Maven project
PerformanceIDEA-218043Freezes in scheduleInitialVfsRefresh
Core. IDE SettingsFeatureIDEA-26855Store IDEA caches under LOCALAPPDATA directory by default
FeatureIDEA-22407Follow XDG directories on Linux
FeatureIDEA-215428Add relative file path live template function
BugIDEA-221456Options for Inlay Hints are rendered too slow
BugIDEA-219420"Editor | Inlay Hints" settings are not persisted between restarts
BugIDEA-211157File and Code Templates shows incorrect include header for Default scheme
BugIDEA-228645Some of the bundled plugins only show up when searched for in the actions panel and not in the Plugins page.
BugIDEA-221939Settings for new project are applying only after restart
BugIDEA-222803Customize Menus - Navigation Bar popup menu items are not saving
BugIDEA-227350Deleted projects automatically reappear on welcome screen after restart
BugIDEA-198276Registry returns default values (not the user ones) at early stages of application loading
BugIDEA-225446Make inlay hint list in settings searchable
ExceptionIDEA-223425Shell environment not loaded
Core. IDE Settings. SharingBugIDEA-220697Intellij 2019.2 cannot sync settings on linux
BugIDEA-229449Settings sync via JetBrains Account broken after update
BugIDEA-219853Cannot enable nor trigger IDE Settings Sync
UsabilityIDEA-208370"Invalid credentials. Click to authorize" tooltip should make it clear which credentials exactly are invalid
CosmeticsIDEA-207765Illegible small font on regular DPI monitor for dialog IDE Settings: Sync Plugin
Core. IndexingFeatureIDEA-225580Make "find in path" work in dumb mode via TrigramIndex, IdIndex
PerformanceIDEA-219456Contentless indices load file content due to file type detection
UsabilityIDEA-227471IDE unusable after copying a folder from explorer to project
ExceptionIDEA-224749Possible `IndexNotReadyException` when adding package-info.java
Core. InstallationFeatureIDEA-194011Turn vcs.log.graph module into a healthy maven dependency
BugIDEA-206343[JRE 11 installers] There is suggestion to download jre for 32bit launchers, but it is jre 8
BugIDEA-224100Windows launcher is fragile under externally-imposed SetDllDirectory context
BugIDEA-224371Allow to use custom size for spalsh image in launcher.
BugIDEA-228606IDEA community lacks "Community" in the installation path
BugIDEA-222834Cannot open project by relative path across different IDEA instances
BugIDEA-196722Toolbox idea shell script is no longer able to understand relative paths on macOS
BugIDEA-230993Relocate application directories on macOS
UsabilityIDEA-206803Restart WildFly server after update despite canceling
TaskIDEA-220738Bundle Kotlin 1.3.50 with IntelliJ IDEA
TaskIDEA-224517Add additional logging to macOS launcher to find out why bundled JBR is not picked up
TaskIDEA-219542Enable Bytecode Verification by default
TaskIDEA-227756Bundle Kotlin 1.3.61 with IntelliJ IDEA
TaskIDEA-191884Extract platform classes to separate JARs in IDEs distributions
TaskIDEA-224889Please add release/eap/nightly flag to product-info.json
TaskIDEA-224508Bundle Kotlin 1.3.60 with IntelliJ IDEA
Core. LicensingBugIDEA-227677dotTrace and dotCover losing license from License Server after Rider restart
BugIDEA-227355New license dialog: different license info
BugIDEA-227707Critical startup error related to the license server registration
PerformanceIDEA-222244IDE start takes several minutes when there is no network connection
UsabilityIDEA-230372Trim spaces in credentials fields
Core. Navigation and SearchFeatureIDEA-160274Field Call Hierarchy
FeatureIDEA-222802Feature request: Quick Type Declaration
BugIDEA-221398Go to Declarations and Usages from popup doesn't jump to class definition
BugIDEA-2252112019.3 EAP unable to find file with "Content Root Path"
BugIDEA-227390Cannot see hierarchy of subclasses with the same name loaded from different modules
Core. Platform APIFeatureIDEA-203508Provide an API for mixing goto results from different sources
FeatureIDEA-219946API to determine a command-line, which started current IDEA
BugIDEA-223074IDEA has to report regarding corrupted files / plugins
BugIDEA-229061WinProcessListHelper.exe crashes on Windows 7
BugIDEA-225026submitTransaction code shouldn't be executed inside just appeared progresses
BugIDEA-223894PluginException trying to use ServiceManager to get service with multiple constructors
BugIDEA-219855Unable to build an empty IDEA plugin project with 2019.2 target
BugIDEA-226561Disposer.register should be documented to throw IncorrectOperationException when the parent disposable is disposed
BugIDEA-225641Large soft-reference cache (1.3GB) on ResolveCache.myPhysicalMaps
BugIDEA-220169Bug in matching words with the same ending and starting letters in pair words by MinusculeMatcher
BugIDEA-228530False positive "Suspicious package-private access" with unrelated package-private no-arg superconstructor
BugIDEA-223709RubyMine 2013.EAP creating more than 800 threads on opening, freezing the IDE and slowing the computer for several seconds
UsabilityIDEA-212107Need a way to respond to file edit without creating a FileEditor in a plugin
TaskIDEA-228809Fail tests when a recursion prevention leads to prohibited caching
TaskIDEA-224840Move ApiStatus annotations to java-annotations library
Core. Plugin ManagementBugIDEA-231059IDEA UI Freeze on disabling dynamic plugin
BugIDEA-225468"Notification group Profiling is already registered" on installing first theme plugin
BugIDEA-229608Custom Plugin Repositories dialog: Just entered link is empty after reopening dialog
BugIDEA-226071'null' values instead of Settings tabs are displayed on clicking "Cancel" in Settings dialog after installing a keymap
BugIDEA-224020dialog IDE and Plugin Updates doesn't appear on installing a plugin and closing the Plugins dialog
BugIDEA-224401"Updatable" plugin is duplicated in plugins list until restart
BugIDEA-222461Plugins management: incompatible plugins reporting is incorrect
BugIDEA-224881Color scheme is available upon IDEA restart after uninstalling theme plugin
BugIDEA-224223Theme plugins installed from disk disappear after update
BugIDEA-231059IDEA UI Freeze on disabling dynamic plugin
BugIDEA-225120Search bar in Plugins Marketplace does not react to some search query changes
BugIDEA-225613Theme plugin installed from welcome screen on first start is not available until restart
BugIDEA-222061plugin can not be installed just after IDEA downloading and installing
BugIDEA-222960Plugin conflict between included plugin and Markdown Navigator
BugIDEA-225451IDEA dies with low memory on updating the applied theme plugin
BugIDEA-224408No label on enable/disable theme plugin after clicking on Apply
BugIDEA-226516Null pointer exception in `IdeaPluginDescriptorImpl.readDependencies` when installing the official Rust plugin.
BugIDEA-219259Queries in plugin list unavailable during indexing
BugIDEA-224230Updating theme plugin from incompatible version requires IDE restart to apply changes
BugIDEA-198510Action "Install plugin from disk" is not found in Find Action
BugIDEA-226962Can't install Rust plugin on 2020.1 nightly
BugIDEA-225552Plugin.xml parsing: strip whitespace from <depends> plugin ID tag value
BugIDEA-224855Plugin Manager: a lot of plugins are falsely marked as uncompatible
BugIDEA-225615Theme plugin is shown as uninstalled after disabling
BugIDEA-223587Plugin Settings: No way to disable dependent plugins once the user pressed "cancel" in the corresponding question dialog
BugIDEA-225789Keymap is not added if Apply button is pressed after keymap plugin installation
BugIDEA-224220Theme is partially changed after uninstalling plugin
BugIDEA-226608"ReSharper (macOS)" keymap is applied on Windows by default after installing Resharper keymap plugin
BugIDEA-225295Theme is reset to broken "IntelliJ" theme after uninstalling light theme plugin which was installed over dark theme
BugIDEA-209769Transitive optional plugin XML dependency does not work
BugIDEA-229856Settings of a plugin aren't saved if the plugin is unloaded without restart
BugIDEA-223517Can't disable plugin with missing dependency
UsabilityIDEA-226216On theme plugin updating the theme is applied automatically though the different look'n'feel has been used before
UsabilityIDEA-218479Text on plugin pages with images is cut by right border, no horizontal scrollbar is available
UsabilityIDEA-205043Plugin Manager Dialog steals focus when the Settings dialog is opened
CosmeticsIDEA-218594Plugins: ugly dialogs on downloading failure
TaskIDEA-225980Remove JB modifier from plugin logos
ExceptionIDEA-224191AE at com.intellij.application.options.colors.ColorAndFontOptions.initAll
ExceptionIDEA-224649Throwable at com.intellij.ide.plugins.newui.MyPluginModel.applyEnableDisablePlugins
ExceptionIDEA-224976Exception in dynamic plugin loader on installing a theme plugin after first IDE start
ExceptionIDEA-224650NPE at com.intellij.ide.plugins.newui.MyPluginModel.addProgress
Core. Project SettingsBugIDEA-222246Inspection settings are not saved
BugIDEA-223248No VCS tab in Settings for New Projects in fresh EAP instance
BugIDEA-221596JavaDoc and annotations paths may be reordered in *.iml file on save
BugIDEA-221500New module created in Project Structure dialog may get explicit module group assigned breaking grouping by module names
BugIDEA-226998IllegalStateException error when clicking "create new project" link.
BugIDEA-227598Editor - Duplicates - settings for Kotlin, Javascript, Typescript and Actionscript reset after reopening Phpstorm in default settings and in project settings
BugIDEA-223730java.util.ConcurrentModificationException at com.intellij.openapi.projectRoots.impl.UnknownSdkType.getInstance(UnknownSdkType.java:31)
BugIDEA-223363IDE deletes newly added library configuration files if external storage is enabled
BugIDEA-217659On new project creating the file withe name "$PRODUCT_WORKSPACE_FILE$" is created in .idea
BugIDEA-186751Repository library: disallow manual editing of library with transitiveDeps=true
UsabilityIDEA-94764Import Project from Existing Sources: source roots and module roots are incorrectly detected
TaskIDEA-177242Run FrameworkDetector#detect on background thread
ExceptionIDEA-222934Cyclic service initialization for bookmarks
Core. Quick DocumentationBugIDEA-225727QuickDoc works incorrectly with getCustomDocumentationElement API
BugIDEA-220127Anchor links within the same document don't work sometimes
BugIDEA-216893Quick documentation is shown even without moving the mouse
BugIDEA-205986QuickDoc popup is not restored in the Editor from the Tool Window
BugIDEA-226374Constant String field evaluation shows PsiType prefix
BugIDEA-227429QuickDoc doesn't update after selecting a different item for selection popup of "Implement method" and "Use existing implementation" intentions
BugIDEA-212331Anchor links do not work in QuickDoc
BugIDEA-228532Hard to get inspection error description when documentation popup is opened as a tool windows
UsabilityIDEA-225426Quick doc on hover doesn't work with injections
UsabilityIDEA-225722Quick doc popup font is either too small or too big
CosmeticsIDEA-225391Labels in the documentations popup are not properly aligned
ExceptionIDEA-218404Edit Source in QuickDoc popup toolbar throws NPE
Core. RefactoringsFeatureIDEA-129547Rename module and directory at the same time
BugIDEA-222073Error:build: Cannot determine build data storage root for project C:/Users/timur.yuldashev/IdeaProjects/Jigsaw/CannotBuild
BugIDEA-224673ProjectImpl leaked when IDE is closed during in-place refactoring
PerformanceIDEA-214780TouchBar action update freezes UI thread for a long time
UsabilityIDEA-227118Show modal dialog with progress on attempt to invoke non dumb aware action during indexing
ExceptionIDEA-219687"java.lang.Throwable: AWT events are not allowed inside write action" on Undo during Rename operation
Core. Run. ConfigurationsBugIDEA-183885Maven goals executed as 'run before/after' tasks are not run in the Services view despite settings for maven run configurations
BugIDEA-215194Run console toolbar is not separated from console editor when new tabs is enabled
BugIDEA-222962Run Anything: invocations history is lost after new command entering
BugIDEA-222233Copy-paste behavior in the Environment Variables editor
BugIDEA-219327Run/Debug actions on toolbar aren't shown until 'Edit Configurations' dialog is opened
BugIDEA-216291No paste button in Tomcat Run/Debug configuration Startup/Connection
BugIDEA-93940Run/Debug Folders: DnD should support multiple items
BugIDEA-157989"Stop" button does not work when the IDE is launched as a background task
BugIDEA-216053A UI freeze on every opening of a run configuration with a custom JRE
BugIDEA-224132Run Configurations: the tasks added as beforeRun tasks seem to be executed in parallel
BugIDEA-210252[Environment variables] when pasting smth in addition to the existing value - the whole value is replaced
BugIDEA-215196Runner content ui has left border when its toolbar is not visible and new tabs is enabled.
BugIDEA-131597Filtering is not applied to "irrelevant" run configurations
PerformanceIDEA-219923Avoid running run configuration producers on EDT
UsabilityIDEA-220223Group run configuration templates
UsabilityIDEA-182361Make the new Run Dashboard Visible by default under View - Tool Windows -
CosmeticsIDEA-227160Add text disclaimer to run/debug configuration template page
ExceptionIDEA-200833Exception occurs on clicking run configuration after renaming Main class
Core. Run. TargetsFeatureIDEA-224928Add 'Manage Targets' to the Run menu
FeatureIDEA-224139Add pre-filled values for language runtime paths
BugIDEA-225182Java debug does not work for Docker target for JDK 9+
Core. SSHBugIDEA-224997FileNotFoundException when no permissions for reading ~/.ssh/known_hosts
BugIDEA-220081SSHJ: Hash hosts in known_hosts file setting ignored
Core. StatisticsExceptionIDEA-228826ERROR when open GoLand 2020.1 with plugin that defines registry key
Core. Task ManagementFeatureIDEA-155327Improvement to automated Branch Name in the Open Task dialog
FeatureIDEA-64464Tasks plugin should also save bookmarks list in task context
BugIDEA-101254Time tracking: Suspend delay setting has effect only on project reopening
BugIDEA-222401[Task Management] some controls are hidden after the server settings window resizing
BugIDEA-138917Time Tracking broken
BugIDEA-224295Commit from local changes doesn't show task autocompletion
BugIDEA-134603When switch from task to task with branch having new files these previously opened files are not reopened
Editor. Code CompletionFeatureIDEA-55066Add Live Template macros to insert file path
BugIDEA-223091IntelliJ keeps freezing when editing story files
BugIDEA-219161Empty bottom advertisement text in non-completion lookups
BugIDEA-182741Completion works for one row only when you're in column selection mode and opened Insert Live Template dialog
BugIDEA-223713CNFE: com.intellij.codeInsight.completion.CompletionPhaseListener: Can't run 1.3.60-dev-2580-IJ2019.2-1 with IDEA Nightly IU-193.3938
BugIDEA-220191How do you customize the CompletionPopup background color?
BugIDEA-223033Different Live Templates differing by case only may shadow each other
PerformanceIDEA-198887MinusculeMatcher can be very slow on long prefix and name
UsabilityIDEA-221804Reword setting name for ML code completion
ExceptionIDEA-219655NSEE at kotlin.collections.MapsKt__MapWithDefaultKt.getOrImplicitDefaultNullable
Editor. Color SchemesExceptionIDEA-216690Exception occurs on importing a color scheme if a color scheme is incompatible
Editor. CopyrightFeatureIDEA-215615Copyright is not pasted into newly created SQL file
BugIDEA-226263EPs to make dynamic
BugIDEA-225973Copyright plugin doesn't add any copyright into plain text file
Editor. Diff and MergeFeatureIDEA-224803Possibility to diff arbitrary ZIPs
FeatureIDEA-1025223 way Merge dialog & multiple files merge dialog should show details about affected commits (at the left and at the right)
FeatureIDEA-204040Show changes per-changelist in Unified View
FeatureIDEA-218189Show scope background color in Diff window files popup
FeatureIDEA-203246Show breadcrumbs in diff window
BugIDEA-229059Blinking highlighting when editing in Unified view
BugIDEA-224804ZIP-differ does not allow to change any ZIP file, but only JARs
BugIDEA-223218Default focus on file list in 'Diff Between' window
BugIDEA-220960Compare files doesn't respect Soft wrap option
BugIDEA-224802ZIP/directory-differ does not allow to change between archive / directory
BugIDEA-220681Wrong Differences ignored label
BugIDEA-223924Shortcut for Include Lines into Commit do not work in the Unified diff
UsabilityIDEA-220861Merge dialog: Actions buttons should be disabled if file is not selected
ExceptionIDEA-220582NPE at com.intellij.diff.tools.simple.SimpleDiffModel.updateGutterActions
Editor. Editing TextFeatureIDEA-225455$SELECTION$ does not work in Live Template when part of another variable
FeatureIDEA-125325Join lines in custom file type should handle end-of-line comments
FeatureIDEA-223034Add support for for block caret-friendly braces highlighting and navigation
FeatureIDEA-218836New editor command to sort lines alphabetically
BugIDEA-215896Folded property value editing: incorrect cursor after Expand invocation in case of long property value text
BugIDEA-221610Need to click twice to unselect identifier that is being renamed
BugIDEA-221642Incorrect parameter popup highlighting range
BugIDEA-227963"Enter/Smart indent" option sets "AUTOCOMPLETE_ON_SMART_TYPE_COMPLETION" instead of "SMART_INDENT_ON_ENTER"
BugIDEA-223891TODO regex are broken
BugIDEA-221958Quickly pressing Cmd-V and then Cmd-G to jump to next search result doesn't work correctly
BugIDEA-223715Todo pattern matching not working correctly when using ö (o with two dots)
BugIDEA-217406Paste multiline text into text box should keep indents
BugIDEA-210020Search highlight color does not change when changing theme
BugIDEA-217073Burmese language literals irreversibly break the editor
BugIDEA-181263Block comment messes up auto-indentation below it
BugIDEA-224887Extending selection strange highlights text block content
BugIDEA-217353Paste inside text block should escape opening/closing quotes
BugIDEA-221995Undo removing after rename refactor glitch
BugIDEA-15855Auto-import is too pushy
BugIDEA-226412column mode is not revealed on status bar (regression)
BugIDEA-219307Chinese font BUG
BugIDEA-215899Folded property value editing: if PasteFromHistory (Ctrl-Shift-V) is invoked in value editor, Esc closes editor instead of ChooseContentToPaste dialog
BugIDEA-227271InlayHints not properly disabled
BugIDEA-227376The "File Structure" popup no longer correctly locates the function you select when dealing with collapsed areas
BugIDEA-226837Caret jumps to another line when moving using left/right arrows
BugIDEA-220417Expand Selection doesn't select text block contents correctly
BugIDEA-220956Error tooltip shown on F2 stays longer than it should, and obscures editor contents
BugIDEA-216967Folded values of properties from resource bundles are not changed on property value changing in *.properties file
PerformanceIDEA-226443Calculate method parameter hint info in non UI thread
UsabilityIDEA-223760Rendering of whitespace in editor too noticeably
UsabilityIDEA-215414Toggle Case action must preserve selection if changed text expands
UsabilityIDEA-81802Drag'n'Drop functionality in editor unexpectedly begins dragging selected text even if nothing selected is under the cursor
UsabilityIDEA-211165Line number converter function cannot set current line to zero
CosmeticsIDEA-185041Tabs rendering for show whitespaces are too intrusive, and space rendering look too much like periods.
Editor. Error HighlightingBugIDEA-217862False code inspection on methode reference on protected class for inheritence in different package
Editor. FormatterBugIDEA-223416Regression: overriding FileIndentOptionsProvider no longer works when .editorconfig is present
BugIDEA-223408Java ij_java_imports_layout setting in .editorconfig not working properly
BugIDEA-173076Unable to disable formatter using JSP comments (<%-- --%>)
BugIDEA-188412Formatter markers don't prevent formatting selection when placed after annotation
BugIDEA-218720EditorConfig: Open File to Preview Code Style OpenFileDialog opens in different project (MacOS)
BugIDEA-223939Formatter results are inconsistent. Tabs and spaces in indention appear in different runs
BugIDEA-165776VCS automatic pre-commit reformat option use a wrong default format preferences
BugIDEA-219572New | EditorConfig action should not be available when the context directory is undefined
BugIDEA-224183IDEA takes into account formatting markers with the disabled "Enable formatter markers in comments" option
PerformanceIDEA-218532Freezes in CodeStyle.getSettings
UsabilityIDEA-216088EditorConfig: consider making "Add properties as comments" off by default
CosmeticsIDEA-218180JavaScript language level is used in the Configure indents action name instead of JavaScript
ExceptionIDEA-222855'Adjust code style' on the value of variable causes an exception
ExceptionIDEA-227185AssertionError: Already disposed: Project from CodeStyleCachedValueProvider$AsyncComputation
Editor. Intention ActionsFeatureIDEA-229247Add intention Copy string to the clipboard
BugIDEA-219577Create File intention popup does not support speed search in the options popup
BugIDEA-218163CreateFileFix creates files in sources instead of resources locations in Gradle / Maven projects
BugIDEA-220487Create File Intention: in the target roots drop-down the inconsistent slashes are used (in case of missing directories)
PerformanceIDEA-227453Freeze on showing available intentions
CosmeticsIDEA-221475Incorrect spelling in the "Add on-demand static import..." context action
ExceptionIDEA-226405Java plugin is not recognized as a production of JetBrains
Editor. TextMate BundlesBugIDEA-226563Navigating to php/bin/set_error_handler after find-in-path locks up
BugIDEA-220388Disabled Insert paired brackets is ignored
Lang. JSONFeatureIDEA-223598provide context to x-intellij-language-injection in json schemas
FeatureIDEA-228220Option to add description for enum values in JSON SCHEMA
BugIDEA-228283Ability to set a custom value for a max JSON schema file size
BugIDEA-221552Unit Test fails for custom plugin when trying to load a JSON file
BugIDEA-226522Sort properties alphabetically breaks indentation in JSON
Lang. MarkdownBugIDEA-227021Reference link is not rendered properly in Markdown preview
CosmeticsIDEA-221369Make grayscale antialiasing the default in Markdown preview
ExceptionIDEA-228789Markdown changes PSI/document/model during highlighting
Lang. RegExpBugIDEA-144332False positive: Annotator: Unknown character category: \p{Block=CombiningDiacriticalMarks}+
Lang. Shell ScriptFeatureIDEA-223844Run shell scripts from context menu
BugIDEA-222424Execute shell script without ENTER confirmation
BugIDEA-219544shell script format problems with locale
BugIDEA-215936Shell Plugin :: Tab Size In Editor Doesn't Match Size Configured In Settings
BugIDEA-216493[ShellScript] 'Rename all occurrences' is available on keywords
BugIDEA-220421Java classes are suggested in completion popup
BugIDEA-215997[Shell script Run config] "Main" configuration doesn't run if Shell script config in Before Launch section
BugIDEA-218250Cant define working directory for ShConfigurationType
BugIDEA-219427Shell Script command appended to current Terminal command line
BugIDEA-224147Inject language shell creates fakes Run Line marker
BugIDEA-223938[Shell Script] working directory couldn't be changed in run configurations
BugIDEA-230061Parsing error when a function test is defined in a script
BugIDEA-222093Shellcheck instances aren't killed
BugIDEA-230393Explainshell action does not properly escape plus and ampersand
BugIDEA-221031Shell script removes '/' slash from execution command
Lang. XMLBugIDEA-229461Help Resolving XML Catalog URIs
BugIDEA-219411Settings | Languages & Frameworks | Schemas and DTDs: all paths to schema files appear in red though are properly resolved from xml
BugIDEA-210737XSD Generator crashes IDEA
BugIDEA-226310XSD validation ignores "anyAttribute"
PerformanceIDEA-212283DOM: xinclude performance problem
Lang. XPath and XSLTBugIDEA-220836Show Unique XPath is not working well
Lang. YAMLFeatureIDEA-224404Make YAML metatype engine be able to complete inside quoted values
FeatureIDEA-212876Made an option to disable (or change) key sequence paste feature
BugIDEA-223349Problems validating sequences using Metamodel engine
BugIDEA-225873Yaml completion of numeric properties by JSON schema doesn't jump to the value
BugIDEA-226689Helm. java.lang.AssertionError: Should come here only for YAMLKeyValue with no value and a following indent at adding a missing key from values.schema.json
BugIDEA-222915Invalid errors in injections into Java
BugIDEA-229869prometheus.yml -> Required: null, Actual: null
Tools. DockerFeatureIDEA-198286Support docker build target option
FeatureIDEA-194510Docker: Allow to specify custom context folder which contains separate unrelated Dockerfile
FeatureIDEA-178495compose YAML: add editor support for typed arrays (v3)
FeatureIDEA-200863Ability to inspect the image of the running Docker container.
FeatureIDEA-218063Progress handling in Docker deploy log console
BugIDEA-214766Incorrect error highlighting for function arguments used in string interpolation inside a BASH function in a RUN statement in Dockerfile
BugIDEA-226467Docker. Absent errors in case of running a container with already allocated ports
BugIDEA-163279Support logging of transport level interaction with docker daemon
BugIDEA-226401DockerCompose: Deploy log is absent at running a compose file
BugIDEA-227975Doing an docker-compose down using the Docker services panel causes named volumes to be removed/deleted (new in 2019.3)
BugIDEA-227717Packages added in remote Python interpreter are not available for code completion
BugIDEA-226434Can't parse run CLI options: Unrecognized option: --group-add
BugIDEA-224069Dockerfile highlighting breaks on multiline RUN with quotes
BugIDEA-226460Docker. FileChooser. F1 should lead to `Docker` section instead of `Services Tool Window` .
BugIDEA-223502Docker: impossible to create a new exec command for a container: "Create..." doesn't work
BugIDEA-218353False positive on external network name in docker compose
BugIDEA-230073Cannot start Docker: only error message is "Cannot connect: java.io.FileNotFoundException"
BugIDEA-227705Add *.dockerfile file type pattern for dockerfile.
BugIDEA-214932docker-compose inspection doesn't recognize "unless-stopped" as valid value
BugIDEA-224747Compose Run config: java.lang.IllegalArgumentException: Got empty dockerComposeFilePaths at expanding Services in case of absent compose file
BugIDEA-228861Docker: connection Url is not checked if contains spaces
BugIDEA-201787Docker: DockerView hangs after running tomee/tomcat
BugIDEA-227236Dockerfile, image: the deployed container doesn't have log if chosen in another project
BugIDEA-226332Docker: if docker run configuration is launched while docker is not connected, deployment node is missing
BugIDEA-203230Docker. Save container changes: all tabs display "Log" info until choosing "Attached Console"
BugIDEA-212488Docker settings do not keep path to docker executable
BugIDEA-223616Docker. Show sensible tooltip for an image
BugIDEA-222645Docker volumes are not removed on stop
BugIDEA-222447Docker: Impossible to call "Create..." a container for an image in case of existing run configurations
BugIDEA-193559DockerCompose. Run Configuration: impossible to choose services to run
BugIDEA-180157Docker Run configuration : replace JSON file with explicitly listed options in CLI format
PerformanceIDEA-218894Constant recreation of log consoles if the same container log is opened in two projects, eventually leading to OOM
UsabilityIDEA-210917Docker image run configuration. Rename "Image ID" field to "Image ID/Name"
UsabilityIDEA-215626Services. Docker. Absent easy start possibility to create a docker connection from DockerView .
UsabilityIDEA-226409Improve text when Docker is not connected
UsabilityIDEA-226469DockerCompose. Editor. Completion for keys known as arrays should insert "-"
UsabilityIDEA-218156Extra spaces are not trimmed in the API URL in Docker server settings
UsabilityIDEA-155563Docker. Provide possibility of navigation from/to containers to/from the corresponding image.
UsabilityIDEA-226393Docker. Root node it selected instead of the container, which run via image/Dockerfile
UsabilityIDEA-156211Docker. Create a container from an image. Don't show the second "Create...".
UsabilityIDEA-178719Docker: Docker run configuration. Process the case of a Dockerfile with a big context folder in a more user-friendly way.
UsabilityIDEA-226452Docker. Display no additional tabs for a container after delete and redeploy
UsabilityIDEA-217957Docker. Expand docker node after connection
CosmeticsIDEA-190344DockerCompose: Avoid green DeployLog tab by "down" of our compose node
CosmeticsIDEA-223630Docker: Make names of container tabs in the same low/upper case style
CosmeticsIDEA-218123Docker: Green pane by down the compose app
CosmeticsIDEA-178001Docker. Run Configuration. Delete "Create new" from "Server" listbox.
CosmeticsIDEA-226534Docker: Correct "Attached console" and "Container Port" tab/column names to be in the same low/upper case style
ExceptionIDEA-225084java.util.ConcurrentModificationException in Docker plugin
ExceptionIDEA-227252RuntimeExceptionWithAttachments in idea.log at docker-compose down
ExceptionIDEA-223856Docker. Mark the field red by running an empty exec on a container
ExceptionIDEA-226366IOException: Pipe broken when stop Docker container
Tools. TerminalFeatureIDEA-116253font zooming does not work in terminal tool window
BugIDEA-225759Terminal smart `diff` command execution
BugIDEA-222498Cannot move focus to next window when terminal is active
BugIDEA-220774Terminal failed to start on Windows (blocked by antivirus)
BugIDEA-180204Terminal output garbled after specific file has been printed out
BugIDEA-141263When changing Theme to Darcula Terminal view remains white
BugIDEA-223117Cannot move focus to next project using by IDEA hotkey when terminal is active
BugIDEA-219379Terminal sessions are lost on every major update
BugIDEA-230321When opening link from IDE Terminal extra characters (e.g. s, ms, 5ms) are added intermittently to the link
BugIDEA-2195992019.2 JBTerminal throws java.lang.Throwable: Directory index may not be queried for default project
BugIDEA-223264WSL paths are not clickable in terminal
BugIDEA-227054Fish terminal integration loads functions after conf.d (unlike fish itself)
UsabilityIDEA-223286`git log` in terminal switches to Version Control tab
CosmeticsIDEA-217612Terminal rename session minimizes the terminal window
ExceptionIDEA-163345"Could not set clipboard: cannot open system clipboard" (#171.584)
User Interface. AccessibilityCosmeticsIDEA-186539Rework UI text for I18nize Hardcoded Strings dialog
User Interface. Action SystemBugIDEA-225712Checkbox actions are no longer disabled. When searching editor `Words` option is enabled even if `Regex` option is checked
BugIDEA-224276"Commit" action is not searchable by "checkin" pattern
BugIDEA-228620Mouse event logged instead of Keyboard event for menu actions
BugIDEA-221936Enter Full Screen action is missing
BugIDEA-223815intellij-community latest snapshot build causes exception when displaying Generate action popup
BugIDEA-220573It takes a long time for context menu to appear when right-clicking on 1000 files in a directory
BugIDEA-217670Mnemonics for Replace -> Replace all (Alt + A) doesn't work in macro when there is an action with same shortcut is defined
PerformanceIDEA-225060First "Go to action" is too long
ExceptionIDEA-204565Throwable at com.intellij.ide.impl.DataManagerImpl$MyDataContext.getData
User Interface. Console ViewBugIDEA-184208Console horizontal scroll position lost on output
BugIDEA-70016error mixing stdout/stderr
BugIDEA-124688Console scroll to the end - jumps on the end of the line sometimes
User Interface. ControlsBugIDEA-223501Hover over Tool Window toggle button broken
BugIDEA-147414Project Area can't resize
BugIDEA-222661Drop-down list size is not adjusted to the list size
CosmeticsIDEA-214806"JRE" combobox is cut in Maven Runner Settings
User Interface. Find, Replace, UsagesFeatureIDEA-146832Add the "In selection" checkbox on the find tool equals to the replace tool
BugIDEA-172063find in path preview hides file extension if filter mask is set, even if several extensions are allowed
BugIDEA-215838Memory leak in FindPopupPanel
BugIDEA-199657RegExp: named groups don't work in Find/Replace in Path
BugIDEA-192260Toggling "Merge usages from the same line" in find references popup cycles between more than 2 different result lists???
BugIDEA-214836IDE freezes in "Find in path" while scrolling through found files
BugIDEA-225181Empty tooltip in 'Find in Path' popup for button in the corner
BugIDEA-173424Find in Path results sorting in random order
BugIDEA-191582FindInPath & ReplaceInPath: Regexp: incorrect behavior in case of malformed replacement string
BugIDEA-202674IntelliJ froze after trying to open result from find in path dialog
BugIDEA-227990Resizing preview in Find in Path doesn't always work on macOS
BugIDEA-224319Forget the previous search fragment when a new multiline fragment was selected
BugIDEA-166862Find/Replace: Do Refactor button disappears
BugIDEA-226984Search field in editor bug (when two lines are pasted in)
UsabilityIDEA-56579Find Usages dialog could preserve option values
TaskIDEA-225632EPs to make dynamic
User Interface. FocusBugIDEA-222801MacOS: Opening a recent project from fullscreen results in switching to Desktop
BugIDEA-221394Focus is lost when switching project using "Recent projects"
BugIDEA-227732Focus is not returned to Editor after closing Commit dialog
BugIDEA-223740[Debugger tool window] Focus is lost when switching tabs via "Show List of Tabs" on Linux
BugIDEA-218418IDE remains in background when invoked Jump to source (F4) from another window
BugIDEA-223548RecentLocations: focus is lost on navigating to different file
BugIDEA-214538UI freeze caused by java focus API, Ubuntu 18.04, two monitors
BugIDEA-227102Focus lost after closing tool window if editor tabs are splitted
BugIDEA-222477Unable to open/hide tool window in some cases
BugIDEA-221988Escape key does not return focus to the Editor
BugIDEA-223806After closing the Find view, keyboard focus is nowhere
BugIDEA-224810Nothing has focus after closing Version Control tool window
BugIDEA-229146Fix for JBR-2021 on IDEA-side
BugIDEA-227001Focus jumps from Tool Window to Editor on opening tool windows in a row
User Interface. Keyboard InputBugIDEA-228793Shortcut VS mnemonic collision
BugIDEA-222847Invoking Ctrl-Alt-O ("Optimise Imports") while indexing prints a character
BugIDEA-223678Deadkeys not working anymore
BugIDEA-2249082019.3 EAP build 193.4386.10 Linux: macOS keymap missing
BugIDEA-227295Unable to use arrow buttons to expand/collapse recent projects group on welcome screen
BugIDEA-220414"Jump Outside Current Bracket/Quote" does not work with Emacs Tabs
User Interface. Look and FeelFeatureIDEA-228866Preview while changing themes
BugIDEA-221356"Cannot set High contrast theme" error on attempt to set High contrast theme
BugIDEA-216556IntelliJ LaF: disabled combo background looks incorrect
BugIDEA-216753IntelliJ LaF: tool window headers have increased font size on Mac
BugIDEA-225247Incorrect tooltips for indent and GoTo line widgets
BugIDEA-201293Some colors are not changed on switching theme
BugIDEA-216658IntelliJ LaF: context menu triangle icon
BugIDEA-231105Color scheme is reset to "IntelliJ Light" in 2020.1 if a custom color scheme was set in 2019.3
UsabilityIDEA-219108Checkboxes for plugins are right next to scrollbar, leading to frequent operator error
CosmeticsIDEA-229812Blue frame of "Create new project" on Welcome screen is thin
TaskIDEA-226805Move Windows and macOS themes to plugins
TaskIDEA-230997Bundle macOS Light Theme and Windows 10 Light Theme plugins with all JetBrains IDEs
TaskIDEA-216580IntelliJ LaF: Help button on Windows and Linux
TaskIDEA-217993Rename color scheme/theme actions in Quick Switch Scheme popup
TaskIDEA-201463IntelliJ LaF: change inactive selection background color
TaskIDEA-216616Update LaF for IntelliJ / Darcula slider
User Interface. NavigationBugIDEA-226761Switch tab shortcut skips one file with Tab limit = 1
BugIDEA-229306Goto Class should prefer start matches
BugIDEA-224660Search Everywhere: start matches should be prioritized
BugIDEA-220990Configuration 'Use "CamelHumps" words' does not appear in 'Find Action...' window
BugIDEA-228670Recent Files: restoring scrolling position broken?
BugIDEA-217535Focus stays on the the latest active element in the popup action list when cursor is on disabled item
BugIDEA-223322Bookmarks with mnemonics is lost after project reopen
UsabilityIDEA-224071Switcher opens a tab in the previous split when tabs placement is set to none
UsabilityIDEA-220792"Recent Files" popup no longer remembers it's dimensions
UsabilityIDEA-222570Recent files toggles between 3 files, not 2 as it was previously
ExceptionIDEA-225233NPE on 'Show error info' after navigation to next error
User Interface. Project ViewFeatureIDEA-223834Add ability to "Copy path" relative to repository root
FeatureIDEA-227694"Go to link target" command should work for files under linked directories
BugIDEA-225460Project tool window button context menu should not show icons for checkbox items
BugIDEA-206056In Project Files, adorn symlink to folder with arrow in corner?
BugIDEA-226539Only one file is opened after drag-and-drop several files to the Editor
BugIDEA-224258Show in Dolphin doesn't work on Kubuntu
PerformanceIDEA-217348UI Freeze when deleting file (StructureTreeModel update in non-interruptible read action)
PerformanceIDEA-192253Hangup on rendering project view containing Unicode file names
UsabilityIDEA-223758Project view popup appears to the few pixels left
CosmeticsIDEA-171222Module uses wrong icon in project tree
TaskIDEA-178054Problem with understanding hierarchy in directory tree
User Interface. Services ViewBugIDEA-220472Services View: for the Compound Run Configuration Debug is disabled
BugIDEA-220601Services: text in speed search popup is red even if the tree contains matched nodes
BugIDEA-226739Services: OpenEachTypeInNewTab action is available in the empty view but doesn't affect the behavior when configurations are added
BugIDEA-226557Services: after hiding running configuration from Services it is still presented in the tree
BugIDEA-227195Unable to remove Services tool window from panel
BugIDEA-222134Kubernetes. Services view is absent after setting "kubernetes.view" registry key to true
BugIDEA-223118Application Servers run configurations appear in the default list of RC to be run in Services after restart only
BugIDEA-226737Services: RestoreHiddenConfigurations action should be available always when some configurations are hidden
UsabilityIDEA-219486Services View: make the ability to run configurations in Services discoverable
UsabilityIDEA-220113Bring Status filter back to Services
CosmeticsIDEA-226054[Services view] tabs and toolbar buttons are not aligned
Version Control. GitFeatureIDEA-81532Git: support force add for gitignored files
FeatureIDEA-208517Unified Checkout action for remote branches
FeatureIDEA-209996Show "Incoming/Outgoing commits" indicator for current branch in the status bar
FeatureIDEA-205386Add a refresh (fetch) option to Git Branches popup
FeatureIDEA-124890Feature Request: Add Colour hint to git branch menu when in Merging state
FeatureIDEA-219087Local .gitignore - An action to ignore via .git/info/exclude
FeatureIDEA-173936Smart checkout could use shelf instead of stash
BugIDEA-211338Git: incoming/outgoing changes checking always fails for the private github repositories
BugIDEA-223904After cancelling a commit, "Commit" button stays disabled
BugIDEA-207187Incoming Changes indicator in branches popup doesn't disappear after update
BugIDEA-220907Git Update Project Info doesn't share recent filters with the main Log instance
BugIDEA-224742Conflicts details: commit list is not scrollable
BugIDEA-220998Cherry-pick without dialog doesn't synchronize file system changes to the VFS
BugIDEA-230378Trying to resolve conflicts between unrelated histories fails
BugIDEA-176615Endless loop of "git rebase" on update project
BugIDEA-230806Git installation is not detected on Windows if not in the PATH
BugIDEA-220504Git | Pull is broken because missing some GitBundle properties
BugIDEA-227242Deleting directory with unversioned files (by action from Project View) does not remove corresponding unversioned files from Local Changes
BugIDEA-222091When changing themes VCS Diff empty panel stays unchanged
BugIDEA-223970Rewording git commit should not run commit hooks
BugIDEA-216931Use consistent sort order for Version Control > Shelf and Diff window
BugIDEA-222440In multi-repository project with synchronous branch control current branch is listed among Common Local Branches with all branch actions
BugIDEA-217872Changing the Update Info Filter in the Settings doesn't activate the "Apply" button
BugIDEA-190333(Git) UnStash Changes dialog does not open if there is a stash with message without colon
BugIDEA-206427IO commits: No 'update fail' message after unsuccessful attempt of authentication
BugIDEA-221660Git | Branches | Show Diff with Working Tree should be a Frame
BugIDEA-224741Conflicts details: Details are shown for the incorrect commit
BugIDEA-211334Git: incoming/outgoing changes checking is not performed after successful pull
BugIDEA-226627Git Clone Dialog: Trim the URL
PerformanceIDEA-221003Git integration should refresh only the files which actually have changed
PerformanceIDEA-220438Don't use reflection to read git config via ini4j
PerformanceIDEA-222365"Find commit by hash" takes too much time
UsabilityIDEA-171626Ability to create new branch that already exists in some repositories
UsabilityIDEA-209664Git double-dot: add 'Swap branches' action to the Compare with Current branch action
UsabilityIDEA-228776Do not propose Force Add for directories
UsabilityIDEA-199553Offer to update command line tools when getting error: invalid active developer path after MacOS update
UsabilityIDEA-224204"Add to .git/info/exclude" should add content root path, not just file name
UsabilityIDEA-223827Preselect commits in the details
UsabilityIDEA-132259Multi-repo sync setup: Checkout common remote branch as local fails if one of repositories is already on such branch
UsabilityIDEA-152791File with reverted staged changes is highlighted as changed (blue)
UsabilityIDEA-226783Extend existing "New Branch From Selected…" branches popup action to allow create a new branch without checkout
UsabilityIDEA-221787"New Branch" and "New Tag" in Git log context menu should be top-level items
UsabilityIDEA-224034Rename Reword action to Edit (Commit) Message
UsabilityIDEA-192646Option for Commit Date rather than Author Date in File History and Annotations
UsabilityIDEA-216382"Compare with Current" could produce confusing results
UsabilityIDEA-220048Add a setting to select Shelf or Stash as a preferable method to preserve local changes
UsabilityIDEA-193354Git | Branches | "Checkout as" always makes new branch track selected branch
CosmeticsIDEA-229854Git Checkout Problem dialog: change text about stashing changes
CosmeticsIDEA-221248Typo in the description of interactive rebase.
CosmeticsIDEA-224054Push dialogue elements are improperly placed / aligned
CosmeticsIDEA-221703Tag dialog: change tooltip text on Validate button
TaskIDEA-163444Remove "Branch Default" update method
ExceptionIDEA-222952Throwable: Assertion failed: Repositories have unexpectedly diverged
ExceptionIDEA-222017Throwable: Assertion failed at org.jetbrains.git4idea.ssh.GitXmlRpcHandlerService.getXmlRcpPort on Rebase action
ExceptionIDEA-221695Throwable at org.jetbrains.git4idea.ssh.GitXmlRpcHandlerService.getXmlRcpPort
Version Control. GitHubBugIDEA-223309New GitHub dialog does not respect "clone using SSH" setting
BugIDEA-224239GitHub PullRequests: content is not shown if user logged in from toolwindow
BugIDEA-224323GitHub PullRequests: Refresh notification does not appear automatically
CosmeticsIDEA-224329GitHub PullRequests: add space between file name and its path
Version Control. Local HistoryBugIDEA-229351Undo doesn't work for "copy file" action
UsabilityIDEA-73911Implement user-friendly method toString in class com.intellij.history.core.revisions.RecentChange
CosmeticsIDEA-195993Recent Changes dialog needs some spacing
CosmeticsIDEA-220623Recent Changes dialog design
Version Control. LogBugIDEA-227019Git log tab bug with a branch named with parenthesis
BugIDEA-209131If the project name contains an underscore '_', the underscore does not appear in the Log Paths combobox.
BugIDEA-225553Filter by "me" incorrectly matches email.
BugIDEA-219575memory leak
PerformanceIDEA-217125Git log component update is very slow
PerformanceIDEA-217010VcsLogManager leaks project
PerformanceIDEA-219710IntelliJ 2019.2 high cpu usage (with git) at idle.
UsabilityIDEA-164276Show progress while executing Git Log indexing
UsabilityIDEA-193806Display errors which affect displayed information in the Log
ExceptionIDEA-217847Sometimes the UI breaks after clicking "View Commits" from the Event Log
ExceptionIDEA-229187Clicking on Log tab of Git tool window generates exception (intellij-community master branch)
Version Control. MercurialBugIDEA-228035Authentication script does not work with pyhton 3
BugIDEA-220350Push commits dialog (mercurial): should enter remote URL on every push
UsabilityIDEA-73341Mercurial: allow adding ignored files
Version Control. PerforceBugIDEA-221889Exception when saving a merge result in perforce
Version Control. SubversionBugIDEA-224516Intellij IDEA never ends (or as best, is very slow) "performing VCS refresh". Se attached image. Problem appears in all 2019.3 versions. Not a problem in version 2019.2.3.
BugIDEA-226333SVN (possibly other VCS too?) version control in an infinite refresh loop
BugIDEA-223635GetFilesFromVersionControl: CheckOut from Subversion fails silently
BugIDEA-125032Stuck in endless loop of modal SVN Authentication Required Dialog
UsabilityIDEA-219245Add Subversion ignore action to Unversioned Files Dialog
No subsystemFeatureWEB-35796Vue.js: support style element src attributes with support vue-loader
FeatureWEB-25666Add option to configure injected fragment background for each language separately
FeatureWEB-41489Curly braces not autocomplete in JSX tags
FeatureWEB-43061jsconfig.json baseUrl is not supported
FeatureWEB-41530"Run anything" should offer scripts from package.json without typing "npm run"
FeatureWEB-42408[Web Types] Display new lines in quick doc description
FeatureWEB-37464vue.js missing autocompletion for v-slot
FeatureWEB-32255Vue.js - single file components with external script file not resolving
FeatureWEB-14385syntax highlighting of mime type text/ractive in scripts for Ractivejs
BugWEB-41925Cordova: exception while creating "platforms" directory
BugWEB-41971Import-types are not properly resolved in case of ambient modules
BugWEB-41421Incorrect 'narrowed to' highlighting if type is not fully expanded yet
BugWEB-25969Vue.js $event and $emit should be ignored by inspections inside template tags in vue files.
BugWEB-40288No 'Download Node.js' action if there is one (or more) invalid node
BugWEB-42167Completion is different if you move cursor before or after a statement
BugWEB-41957End-of-line LT expression is parsed as generic parameter list in some cases
BugWEB-42045"stringifies" is marked as a typo
BugWEB-37995Higher-order function generic inference should work for lambdas invoking generic functions
BugWEB-42727502 bad gateway is shown on the first request after project reopenning
BugWEB-41923Typescript: Auto complete for function parameters not working correctly for keyof readonly properties
BugWEB-41817Async generators: create a for-await loop in corresponding postfix template
BugWEB-42756Typescript: Attempt to assign to const or readonly variable, when assigning to variable with union type
BugWEB-31859Sporadic 502 when loading pages with the built-in web server
BugWEB-41746Sort properties alphabetically goes into an infinite loop on malformed JSON
BugWEB-41938Should not allow to inline destructuring rest
BugWEB-41531"Run anything" is not working if package.json is not in the root folder
BugWEB-41803Please add "screenshot" to the dictionary
BugWEB-40746Add "parallelization" to the dictionary
BugWEB-42872'Infer parameter types from usage' duplicates types
BugWEB-42511'Run anything' shows scripts from wrong package.json
BugWEB-38768React: collapsed fragment shows as 'xml'
BugWEB-41368Inlay hints are always visible in TypeScript
BugWEB-42670Invalid destructuring type evaluation for an arrow function parameter with explicit annotation
BugWEB-41789Standard code completion insert handler is not invoked for items in optional chains
BugWEB-42382JavaScript "Local variable 'X' is redundant" is not that redundant
BugWEB-41807Warning is wrapped in exclamation point (! symbol)
BugWEB-40777Run anything: yarn is not shown in the list of available commands
BugWEB-41478"Quote property names" too aggressive when working with selected properties
BugWEB-42822TS / Context Action: Change To 'absolute path src/components/etc' no longer available?
BugWEB-39386weridly behaving typos hints
BugWEB-42052"expectedly" is marked as a typo
PerformanceWEB-17638Joining Lines works extremely slow
UsabilityWEB-40818Create package.json in the project root when using Install dependency quick fix
UsabilityWEB-41215Allow editing textboxes containing list of element names, instead of requiring clunky "Add"/"Remove" diaiog
UsabilityWEB-33143closing tag should be smarter
UsabilityWEB-32948JSX onClick prop autocompletion not correct
UsabilityWEB-39664Improve in-dialog documentation for parameter hints blacklist
UsabilityWEB-40899Don't re-evaluate webpack config if there are syntax errors
CosmeticsWEB-41731The name of Handlebars/Mustache folding category is truncated
TaskWEB-41910Change "Replace with the shortened form" to "Replace with a shorter path"
TaskWEB-42926Rearrange inspections in the settings: TypeScript/JavaScript categories
ExceptionWEB-41499PluginException: Exception in plugin Java Server Pages (JSP)
ExceptionWEB-41076PluginException: Cyclic service initialization when open project
Build toolsBugWEB-42270Can't execute Gulp tasks from IDE - getting an error with com.intellij.execution.ExecutionException
BugWEB-40782'Run Anything': List scripts from package.json when typing `npm` or `yarn` regardless what tool is set in preferences
BugWEB-38986Don't debug npm before launch tasks
CSSFeatureWEB-24298Add quote style settings for CSS
FeatureWEB-31724Adding Bootstrap Autocompletion from CDN
FeatureWEB-10023Need ability to download external stylesheets
BugWEB-41795Download CSS library from CDN: disabling in Preferences - Libraries has no effect on completion
BugWEB-42973Color picker in CSS doesn't update the color of the gutter icon
BugWEB-37978Webpack aliases not resolved in URLs in CSS properties
BugWEB-8044Move statement on CSS block no working as expected
BugWEB-8045Move statement on CSS line no working as expected
BugWEB-35236Import of css files with webpack aliases is not resolved in case of '@import url()'
BugWEB-40898CSS padding property hint auto is invalid
BugWEB-43153Color Picker dialog issues: wrong traversal order on tab, not updated colors.
PerformanceWEB-42613CSS: CssColorGutterRenderer can cause freezes
UsabilityWEB-41796Download CSS library from CDN: show shorter name for the location in completion popup
TaskWEB-43231Make css.supportedFileTypesProvider extension point dynamic
TaskWEB-43006Remove information about CSS level and browser support from completion popup
CoffeeScriptBugWEB-34310CoffeeScript: "Change signature" refactoring doesn't work
DartFeatureWEB-41912Support Dart web apps debugging using 'webdev daemon'-based workflow and VM Service protocol (like Dart DevTools)
FeatureWEB-41609Dart formatter: use dartfmt tool when reformatting file parts, not only the whole file
BugWEB-42526NPE from DartServerRootsHandler.getEnclosingDartPackageDirectory()
BugWEB-41978NPE on autocompletion for Dart (SDK 2.2 or 2.3)
TaskWEB-41628Dart formatter: use dartfmt tool always, remove legacy formatting settings
DebuggerFeatureWEB-21626watch method return value not implemented in webstorm 2016.1.2?
BugWEB-42156JS debugger breakpoints not shared between symlinked files.
BugWEB-36471WebStorm Debugger variable set value error.
BugWEB-30889JavaScript Debug is not working for version 2017.3.3
BugWEB-36015Debugger attaches to "Before Launch" gulp script, application not launched
BugWEB-43008"Open Source" in Scripts view doesn't work
BugWEB-40496Node Debugger doesn't always start properly on re-running
BugWEB-41684Protractor stops on the wrong line, tooltips are not shown
BugWEB-41007Can't debug node.js - get error 'URI is not hierarchial'
BugWEB-21719NodeJS Remote Debugging Doesn't Allow Breakpoints
BugWEB-42932Debugger is not attached when debugging NPM script with explicitly specified debug options
BugWEB-12527Django/JavaScript Debugging Broken in 3.4
BugWEB-42331Breakpoints in excluded node modules don't work
BugWEB-42360Start execution on attaching to process waiting for debugger
BugWEB-42393Support debugger frames for dependencies installed with Yarn PnP
BugWEB-40694Debugger doesn't stop on a breakpoint in Kotlin/JS project
BugWEB-42661Debugging with an async hook enabled is broken
BugWEB-42536Node.js debugger doesn't stop at breakpoint if the code was live-edited
BugWEB-41834Debugger opens incorrect file (same-named instead of the file with breakpoint)
BugWEB-13411Node.js: can't set value in debugger
BugWEB-42370Breakpoints in .ts files intermittently not hit in simple project
BugWEB-41716'Hide frames from libraries' does nothing
BugWEB-41719TraceableDisposable.ObjectNotDisposedException when close IDE while debugging
BugWEB-41598Breakpoints don't work after app is reloaded by webpack
PerformanceWEB-41324Throwable: LEAK: {}.release()
PerformanceWEB-36752Large page in Elements View slows down IDE
PerformanceWEB-38989Optimize memory used for source maps
File WatchersFeatureWEB-36668Allow enabling global file watchers for all new projects
BugWEB-42549"Enable File Watcher" is suggested for files inside node_modules
BugWEB-41091Incorrect path is used if file watcher's Working Directory field is left empty
BugWEB-40982'Failed to run File Watcher' error is displayed several times in the event log
BugWEB-43079Extremely wide File Watcher dialog (if Unit File Support plugin is enabled)
BugWEB-40636Strange intention actions: just 'Yes' and 'No'
BugWEB-29424Race condition between saving file and file watcher execution
HTMLFeatureWEB-41487HTML tags including attributes in JSX blocks can't autocomplete the closing tag
BugWEB-41994Repetition of the result of intention 'Missing required attribute'
BugWEB-42723Start tag has wrong closing tag
BugWEB-378PHP code in conditional comments
BugWEB-40570JavaScript fragments weirdly converts apostrophes and quotes
BugWEB-37786JSX Emmet: wrong expand of the comment filter
BugWEB-40511Completion for `type` attribute in `input` element doesn't work in Angular templates
BugWEB-36211Custom "data-" attributes on SVG elements in HTML are reported as not allowed
BugWEB-42029Broken documentation for TS/JS library symbols in HTML files
UsabilityWEB-41780Show class name label when collapsing JSX tags
CosmeticsWEB-43036Remove tag background in IntelliJ Light theme
ExceptionWEB-42795Exception when I Reformat code
ExceptionWEB-41600Invalid file name lib/intellij-xml.jar!/resources/html5-schema/html5chars.ent
JSONFeatureWEB-41515Add editor action for "Copy JSON Pointer to clipboard"
FeatureWEB-38070Complete statement could add quotes on JSON
FeatureWEB-35787JSON: Smarter colon/comma handling before the closing quote (disabled by default)
BugWEB-40292x-intellij-language-injection doesn't function in yaml for array items
BugWEB-40927Editor is breaking JSON syntax when inserting new line after key-value pair
TaskWEB-42249Add `babel.config.json` to system schema map
JavaScriptFeatureWEB-2089Implement AMD declaration linking
FeatureWEB-39273'Make private/make public should be available for ES6 private fields
FeatureWEB-40240Suggest awaited items in code completion for promises
FeatureWEB-22664Delete ECMAScript 3 JavaScript version
FeatureWEB-43013JavaScript: provide completion for object literal properties with "this." prefix
FeatureWEB-42183Make JavaScript 1.8.5 disabled in the list of JavaScript language versions
FeatureWEB-41553Don't show unexported symbols from libraries in the Go to definition popup
FeatureWEB-43074ES6 imports navigation can work in dumb (indexing) mode
FeatureWEB-38663Add parentheses and implement the body when completing `constructor` keyword
FeatureWEB-38886IntelliJ IDEA cannot find test case when using template string with variable
FeatureWEB-41508Highlight await once the caret is on async.
FeatureWEB-42028Name suggestions: add unresolved names from the current scope to the list of suggestions
FeatureWEB-38784Support Promise.allSettled
FeatureWEB-41908Bundle language injection for paper.js
FeatureWEB-41373Support optional chaining in TypeScript and in the type system
FeatureWEB-40267Add intention: Convert to optional chaining and/or nullish coalescing
FeatureWEB-40404Extract single property from object as a shorthand property, not as spreadElements
FeatureWEB-32472Validate duplicate ES6 exports in JS
FeatureWEB-21053ES6 Template Strings Don't Collapse
BugWEB-42431JSdoc: Better coverage of @implements with external files
BugWEB-40662Intention: Incorrect replacing const with let in for-of loop
BugWEB-36893Better mapping of file names to class names in code completion based on file name
BugWEB-42109Unexpected "not assignable to type T" warning in JavaScript
BugWEB-41403WebStorm 2019.3 EAP - After a while IDE show warning "unused constant"
BugWEB-43345'Extract variable' creates duplicate code fragment when invoking the whole line
BugWEB-38392False 'unused definition' when re-defining a property initialized in constructor
BugWEB-31714Make field public QF should change all usages of this field (remove # symbol)
BugWEB-41249'Replace nested calls with pipe expressions' is incorrectly applied in Jasmine tests
BugWEB-41764Optional chain tail is not evaluated properly
BugWEB-41668False positive "Readonly<T> is not assignable to type {}" for the state inside react component constructors
BugWEB-41252'Replace nested calls with pipe expressions' looses parameters
BugWEB-36802'Safe delete parameter' should check for usages inside function and show conflicts dialog
BugWEB-41991Readonly check that shows a dialog is invoked from the availability check in ES6MoveModuleMembersHandler
BugWEB-41303JQuery.proxy warning
BugWEB-40492Unicode code points are not supported in JS identifiers
BugWEB-42106Highlight "arguments" as parameter
BugWEB-40962"Script is not in strict mode" when using "use strict" pragma with escaped quotes in injection
BugWEB-39777JSX: completion item is used instead of emmet abbreviations
BugWEB-41980Global resolve works differently inside a class and on the top level
BugWEB-40520'Split into declaration and initialization' drops type annotations or creates red code in Flow with destructuring
BugWEB-41610Javascript: Unresolved variable
BugWEB-40285'Split into declaration and initialization and move to scope start' duplicates variable initialization in for-in loop
BugWEB-42662Color methods in optional chains as normal methods
BugWEB-20955ES6: re-exported binding resolve support (ESNext proposal)
BugWEB-42888Rendering of enum members with non-identifier names is incorrect in 'specify type explicitly'/hints/other features
BugWEB-39875JS Intentions: JS: Converting arrow function to anonymous function breaks on IIFE
BugWEB-41399No completion on Express req/res parameters
BugWEB-38545Invalid highlighting for JS Classes after including via require
BugWEB-40637Replace with indexer access produces malformed code in HTML context
BugWEB-41956Can't decline name suggestion for the last parameter when using `function` live template
BugWEB-21935Wrong highlighting for 'del' word in gulpfile.js
BugWEB-42466Unwanted autocomplete on rest operator for args collecting
BugWEB-42873'Infer parameter types from usage' incorrectly infers rest parameter type
BugWEB-42125Moving destructured items via keyboard shortcuts doesn't work for function parameters
BugWEB-40538Exception when file has several default exports
BugWEB-43082Overridden is shown twice while actually it's overridden once
BugWEB-41041Wrong highlighting for braces in template literals
BugWEB-41927PhpStorm didn't show inferred parameter type in JavaScript
BugWEB-40713WebStorm don't consider super() return type as this
BugWEB-43274WebStorm shows debug information inside hover doc popup
BugWEB-40527Flow module resolution (Cannot resolve module)
BugWEB-42593Type of Map entries iterated with for..of inferred as any
BugWEB-28080Extends ES5 classes with ES6 classes is not supported
BugWEB-40393'Create Directory/File' fixes don't work with relative paths in 2019.3
BugWEB-28204'Create variable' quick-fix shown when not applicable (in variable type annotation)
BugWEB-38414Auto import in Flow adds path to the IDE bundled definitions for React instead of the project ones
BugWEB-42816JavaScript: add loop live templates with better names
BugWEB-42866'Infer parameter from usage' should not be invoke many times in JavaScript
BugWEB-24105'Surround with' doesn't work for object properties with attached JSDoc comment
BugWEB-40776Code completion doesn't work for modules imported using require function created with Node.js createRequire
BugWEB-40312"Invalid number of arguments, expected 0" when passing message to superclass Error
BugWEB-32591Autocompletion not working after importing class instance that was instantiated via factory
BugWEB-43146No completion for `function` keyword after `new Classname` without semicolon
BugWEB-41954JS support require calls with references
BugWEB-42659Import statement is marked as deprecated
BugWEB-32695The documentation tool window breaks text in wrong places
BugWEB-42196Incorrect processing of destructuring arrays in rest elements
BugWEB-42074'Flip ,' works incorrectly with rest parameters
BugWEB-41382Show 'forof' postfix template instead of 'forin' for ES6 typed arrays
BugWEB-42890JavaScript: for-of -> for-indexed conversion doesn't work for inferred types
BugWEB-40655Duplicate 'Simplify' items in Alt+Enter for conditional
BugWEB-41728Resolve default import when .d.ts has no default export
BugWEB-41958Extra # shown in completion items rendering for #-private fields
BugWEB-43014JavaScript: "insert this" quick fix doesn't work for object literals and class fields
BugWEB-43041JavaScript: make JS parser more tolerant to typos
BugWEB-36461Double `flip if-else` results in double parenthesis
BugWEB-40659Intention "Extract increment" in for loop generates invalid code
BugWEB-24720JSX parsing in flow javascript language is broken if tag contains a namespaced tag or attribute.
BugWEB-41270Incorrect JavaScript warning: 'Value assigned to primitve will be lost'
BugWEB-41410Javascript autocomplete for JsDoc @typedef {typeof import('./somefile')} not working anymore in PHPStorm 2019.2
BugWEB-30569ES6 classes: Generated code doesn't take comments at the end of the class into account
BugWEB-42672Global definitions are not resolved in strict mode
BugWEB-40023Quick fix: JS: shouldn't invoke action of converting "for-in" to "forEach" on object
BugWEB-41793Remove 'package-lock.json' from import/require completion
BugWEB-42791False positive "Method expression is not of Function type"
BugWEB-41995'Make private using #' cannot be invoked for getters in pure JS
BugWEB-42469<br>, <em>, <strong> and <u> do not work in JavaScript quick documentation
BugWEB-38794Incorrect import when copy/pasting code in javascript (only aplies to some imports)
BugWEB-31971Support TypeScript import()-types in JSDoc
PerformanceWEB-42708outOfMemory on tuple types analyzing
PerformanceWEB-11215large concatenated JS file causes hang
PerformanceWEB-42985Memory and processor consuption peaks on a node project with 4 files and 4 libs
PerformanceWEB-42509PhpStorm takes an extremely long time to run code analysis and inspections on javascript files
PerformanceWEB-41810Freeze in EDT on type evaluation
UsabilityWEB-40096Quick Fix: JS/TS: "Join Concatenated String Literals" duplicates the functionality of "Compute Constant Value "
UsabilityWEB-40964Mismatch settings with the editor for examples in dialog 'Inlay hints'
UsabilityWEB-41044Lack of clear sorting of object properties in output type hints
UsabilityWEB-41727'Method expression is not of Function type' should be 'Method expression is possibly null/undefined' where appropriate
UsabilityWEB-38439Typing semicolon doesn't move caret after statement
UsabilityWEB-41094Allow to move switch-cases with 'Move statement'
UsabilityWEB-41542Show type hints for Promise.allSettled-like repeating tuples more conveniently
CosmeticsWEB-28832Structure diagram shows right arrow buttons when there are no sub members to that item
TaskWEB-37382JS/TS suggest variable names: improve UX and enable by default where that's safe
TaskWEB-40421Support having decorators after the 'export' keyword
TaskWEB-42498Remove intention 'Swap method call arguments'
TaskWEB-40821Enable type hints by default for function parameters
TaskWEB-42591Remove old JavaScript versions from the list of languages for scratch files
TaskWEB-40895Implement JSControlFlowProcessor using CF graph
ExceptionWEB-20585com.intellij.openapi.project.IndexNotReadyException on Refactor - Move of node_modules
ExceptionWEB-41675NullPointerException when call 'Split into multiple declarations'
ExceptionWEB-34766"Convert to forEach call on array" exception on invalid code
ExceptionWEB-42867'infer parameters from usage' doesn't work with export
ExceptionWEB-42865'infer parameters from usage' inserts generics after the variable name when applied to function expressions
ExceptionWEB-42268Destructuring using the postfix template fails with "cannot be cast to class" exception
JavaScript. FormatterBugWEB-39888Formatter does not respect TypeScript code style settings for VueJS components using typescript in <script> tag.
BugWEB-38347Formatting unindents comments in braceless ifs
BugWEB-13538Wrong indent for comments in chained function calls
BugWEB-28301Formatter: support Rearrange Code action inside script tag
BugWEB-41063Quote style from javascript is not applied to postfix completion
BugWEB-38291Reformat Code (Ctrl + Alt + L) deletes empty space between curly brace and 'from' keyword
BugWEB-40900EditorConfig doesn't apply to <script></script> in .vue file
BugWEB-40497TypeScript - when 'function declaration parameters' wraps the parameters it unneccesarily wraps lambda function passed as a argument
JavaScript. FrameworksFeatureWEB-42242Angular: support Schematics with Angular CLI 9.0.0
FeatureWEB-32274Support Vue components defined using separate JavaScript, HTML and CSS files
FeatureWEB-42016Vue.js: support completion for custom modifiers from web-types
FeatureWEB-32487Vue.js. Support local and global filters
FeatureWEB-42869create-react-app 3.3: use `npx --ignore-existing` when generating a project
FeatureWEB-41476Vue.js: code completion for source components slot names
FeatureWEB-41576Slots are not resolved (slot, v-slot)
FeatureWEB-42083Vue.js: support precise documentation on directives
FeatureWEB-42868create-react-app 3.3: use `--template typescript` for generating TypeScript app
FeatureWEB-40973Vue.js : support components defined in several files via @WithRender decorator
FeatureWEB-42113Vue: Provide better type inference when using v-for with an object
FeatureWEB-42220Angular: support new representation of metadata in Angular
FeatureWEB-28442Vue.js: scoped slots support
FeatureWEB-40909Vue.js: support named slots shorthand
FeatureWEB-42315Resolve imports for .native.js and web.js file names
FeatureWEB-40545Implement quick documentation for vue symbols
FeatureWEB-27946WebStorm complains about attributes on <svg:g> elements
FeatureWEB-41320Angular 8 SVG template unsupported
FeatureWEB-40277Vue: support vuex-class decorators
BugWEB-41827Cannot resolve imported properties in Vue component
BugWEB-41541No Auto Closing Parenthesis in Vue Single File Components
BugWEB-36502Vue.js: warn about empty tag bodies instead of self-closed tags in compiled vue templates
BugWEB-41917Vue.js: 'lang' attribute isn't suggested for completion
BugWEB-41647vuejs computed values resolved as functions instead of values
BugWEB-42387Angular template: false "Unused variable" when using @ViewChildren in Component
BugWEB-41544Vue Class Components: Mixin properties are not resolved in template when using uppercase Mixins from 'vue-property-decorator'
BugWEB-40644Missing usage of private members in Vue components
BugWEB-41073Vue.js: instance properties/events from plugins not resolved in templates
BugWEB-41717Can't type closing tag in Vue file while indexing is in progress
BugWEB-37146Webstorm incorrectly complains that "data-" attribute is not allowed on Angular element
BugWEB-41713Vue: missing syntax coloring within <script type="text/x-template">
BugWEB-42824PhpStorm freezes while deleting characters from doctrine XML files
BugWEB-31785React: `props.<props_name>` not resolved unless there is explicit `propTypes` declaration
BugWEB-42112Vue: variables created by v-for are marked as unresolved
BugWEB-37854Typescript - issues with generic inference from index signatures
BugWEB-41366Vue is missed in 'File | New'
BugWEB-41564Vue Mixin Fields Glitches
BugWEB-42458WebStorm complains about abstract class not being in Angular module
BugWEB-41026Vuejs v-for index is resolved as array type instead of number
BugWEB-39230Angular i18n. Support for i18n-* attributes
BugWEB-41422Angular: inputs without brackets are reported as unknown if the property type is not explicitly specified
BugWEB-40489Invalid comment detection and syntax highlighting issue in JS (React JSX) file
BugWEB-41477Vue.js: attribute name is not in code completion on slot tag
BugWEB-41620Angular: attributes from selectors in ng-content marked as not recognized
BugWEB-23401TODO not recognized in JSX comments
BugWEB-41883"Undefined binding" inspection's severity is ignored when inspecting events.
BugWEB-31286Tabbing on live template $VAR$s in JSX is hijacked by autocomplete
BugWEB-42492Angular: stale state of Angular project detection
BugWEB-42721Meteor: incorrect warnings for some packages
BugWEB-41397Too many identical results in Add Angular Schematic popup after refreshing content
BugWEB-42758Directly exported jsx classes do not show in code completion.
BugWEB-40248Async pipe incorrectly infers the type of nested Observable in template
BugWEB-29103JSX comment out on simple arrow functions (without {...})
BugWEB-41020After 2019.2.1 update Vue + TypeScript + Decorators stopped working
BugWEB-40955Vue.js: vuetify `v-col` component is reported as unknown
BugWEB-42213No completion of custom directives in component with splited template and script
BugWEB-30600Vue.js: Component binded with v-model should not warn when the prop definition for value is defined as required
BugWEB-41409Vue component with script in another file: duplicated info in popup
BugWEB-42634Webstorm 2019.3 RC throws "XML tag has empty body" warning for Vue components
BugWEB-41349No completion and refactoring for slot props
BugWEB-41654Specify variable type explicitly doesn't produce any changes in code
BugWEB-42565Relative paths in HTML and other files are broken in WebPack projects in IDEA
BugWEB-42269Vue: Vuetify VLayout justify-center attribute reports "Wrong attribute value"
BugWEB-40929Vuex store state/getters/etc are not resolved in attribute values in templates
BugWEB-41782Completion for v-bind - attribute href is missed
BugWEB-42230Disable 'Introduce variable', 'Introduce constant' and 'Introduce field' for vue expressions
BugWEB-40926Pressing tab for autocompleting object property in TSX/JSX file creates element instead of finishing the name
BugWEB-42108Enable "copy-paste with imports" support for vue
PerformanceWEB-41427XmlTagNameSynchronizer freezes IDEA due to synchronous angular resolve
UsabilityWEB-41765Vue.js: background color for <script> tag causes usability issues
ExceptionWEB-41365NoSuchElementException: Sequence is empty. when type in .vue file
ExceptionWEB-42076IncompatibleClassChangeError when add .hbs file in vue project
ExceptionWEB-41547IllegalArgumentException: PsiElement(XML_ATTRIBUTE_VALUE).isValidHost() when resolve to file
ExceptionWEB-41704'IllegalArgumentException: Argument for @NotNull parameter' when open the certain project
ExceptionWEB-41350PsiInvalidElementAccessException when call completion in vue.js expression
JavaScript. InspectionsFeatureWEB-40394Duplicate declaration inspection for export (specifiers/aliases)
FeatureWEB-42870JavaScript: enable "Import can be shortened" inspection
FeatureWEB-26818Add inspection for converting let to const when possible
FeatureWEB-40586TS. Accessibility modifier already seen inspection
BugWEB-32647Duplicate case inspection works incorrectly for side-effect expressions
BugWEB-40911False 'missing await' for async generators
BugWEB-40666Add errors for variable count/initializers and lhs expressions in for-of and for-in loops
BugWEB-41879'Specify variable type explicitly' shouldn't specify raw literal types in Flow
BugWEB-25157"Unnecessary semicolon" inspection quickfix removes trailing line breaks
BugWEB-41362"Pointless statement or boolean expression" inspection offers incorrect suggestion
BugWEB-42478Changed Inspection Severity Level to Error for Duplication Javascript declaration doesn't work
BugWEB-41679'Duplicate case label' should work with string literals in different quotes
BugWEB-40150Unresolved variable
BugWEB-30908Use arrow functions when converting loop to forEach call
BugWEB-27499'var to let/const' produces invalid result in 'for' loop
BugWEB-43015Invalid 'Comparison of expressions having incompatible types' warning when using remainder operator with BigInt
BugWEB-25169'Flip ,' works incorrectly for destructuring arrays
BugWEB-42129Unnecessary semicolon in if/else statement (Vue, TypeScript 3.7, Prettier)
BugWEB-24660unresolved file name quickfix cannot create file inside not existed folder
BugWEB-43117Webpack schema validation incorrectly flagging cacheGroups as shorthand format
TaskWEB-39873Intention actions "Merge Parallel For Loops" and "Merge Parallel For-In Loops" - either rethink, or remove
JavaScript. RefactoringFeatureWEB-41816JS. Replace for..of with indexed intention
FeatureWEB-42979Inplace 'Introduce variable/field/parameter' when having subexpressions
FeatureWEB-39691Can't inline variable in destructuring (expected: convert to property access)
FeatureWEB-33038"move function 'myFunc' to 'myFunc.ts'" intention action
FeatureWEB-42951Inplace 'Introduce field' refactoring for JavaScript/TypeScript
FeatureWEB-14450Provide "Extract Constant" refactoring
FeatureWEB-34116Can't create/extract constant to the top level of the file
FeatureWEB-31939'Introduce variable' should add braces for arrow functions when needed
FeatureWEB-38972Quick-fix: Convert const to let. remove readonly modifier
BugWEB-30408Refactoring: Extract Superclass: static method should not be marked as abstract
BugWEB-39368'Introduce variable' is available on invalid selection and breaks code
BugWEB-40769Don't inline variables with default values in object destructuring
BugWEB-29335'Extract superclass', 'Pull members up' should move comments around members
BugWEB-39746'Extract superclass' creates invalid code when extracting from already extending class
BugWEB-42065'await new Promise' can be converted to pipe expression
BugWEB-41811Tooltip in 'Introduce constant' isn't shown at the location where the declaration is actually inserted
BugWEB-39748Extract superclass: making 'abstract' for pure JS throws and also doesn't work with TS fields
BugWEB-25137WebStorm allows to extract variable with breaking the operator precedence
BugWEB-41849"Extract Constant" from substring doesn't enforce 'const' and reuses the var type from 'Extract Variable'
BugWEB-42534'Extract superclass' creates double 'super()'
BugWEB-40042'Introduce variable' deletes the preceding comment
BugWEB-41876'Generate destructuring patterns' fails on a property of already existing pattern
BugWEB-37665Replace if-else with ?: is not working with variable initialization
BugWEB-38409'Introduce parameter' shouldn't suggest anonymous callback scope
BugWEB-7439Extract JavaScript variable fails if using multiple declarations chained in a single 'var' statement
BugWEB-41961Extract Method refactoring shouldn't suggest outer scopes when having private #-references
BugWEB-41723Extracting a variable immediately assigns an auto-generated name to the new variable
BugWEB-39798'Change signature' should handle arrow functions in class hierarchy
BugWEB-40910'Introduce parameter' shouldn't work with the yield expressions
BugWEB-40919Extracting a generator method from a field assigned to a generator breaks code due to ASI not allowed
BugWEB-42957Inlining shorthand array type erases the array part of the type if type has a generic that "extends"
BugWEB-41916'Introduce constant' shouldn't suggest global scope if having await expressions
BugWEB-40833Checking/unchecking 'Optional parameter' in the popup fails for 'Introduce parameter'
BugWEB-43087'Propagate to destructuring declaration' inconsistent availability
BugWEB-40957Invalid result of 'Introduce variable' when react function returns parenthesized HTML
BugWEB-40040TypeScript - Change method signature is wrong when passing "this"
BugWEB-42324Better validation of names for file name <-> class name matching
BugWEB-38305Implement all members doesn't respect quote style setting
BugWEB-38246'Extract method' doesn't check for member accessibility in case of static members
BugWEB-41960Introduce field should not change other classes
BugWEB-41103Extract Angular animation into a variable fails
BugWEB-37162'Introduce local variable' produces red when invoked in 'export default' with decorators
BugWEB-40959Inappropriate suggestion to replace string with template string inside flow/typescript type declaration
BugWEB-42023Extract field: don't suggest to initialize in constructor when creating directly from a field initializer
BugWEB-41845"Extract Constant" refactoring shouldn't work with ECMAScript 5.1 and earlier
BugWEB-35616Comment for typescript class last field is broken after applying intention "Create field"
BugWEB-41989Private (#) references are not updated when 'Extract superclass'
BugWEB-31704'Extract method' for generators should extract generators when possible with updating usages to 'yield * newFunc()'
UsabilityWEB-43151Problems with name suggestions when using Extract interface or type alias
UsabilityWEB-17564Refactoring: Extract variable: empty line is added on switching between radiobuttons inside popup
UsabilityWEB-28271Change signature should better handle TypeScript parameter-properties
UsabilityWEB-41258Do not show refactoring preview when renaming a new file using the "Rename file to match class name" fix
JavaScript. TemplatesBugWEB-12164Collapse/expand html code in script templates
BugWEB-41895Handlebars: Code is disappearing while editing handlebars fragment
Live EditBugWEB-7093File is saving after every keypress when using Live Edit
CosmeticsWEB-41338LiveEdit plugin description is outdated
Node.jsFeatureWEB-35034Compatibililty with Yarn PnP (Plug and Play) feature
FeatureWEB-42784Coding assistance for environment variables stored in .env files
FeatureWEB-40015Code auto completion for environment variables stored in nodemon.json
FeatureWEB-37505Use .env files to set environment variables for projects
BugWEB-42312Yarn PnP: Exception while trying to apply code style from Eslint
BugWEB-21914angular-cli: Cannot find angular-cli package
BugWEB-43279Unable to run Node.js with UNC WSL paths
BugWEB-42577Support nvm aliases in .nvmrc
BugWEB-42738Environment variables configured in run configuration are undefined when using WSL node interpreter
BugWEB-42295Grunt with Yarn PnP: Autofilled run configuration is incorrect
BugWEB-42440Download Node.js: update version to the latest LTS
BugWEB-43123Node express via npx: RC isn't created with project
BugWEB-42248Can't run yarn scripts: command\script not found
BugWEB-23329Output of stdout and stderr are not properly coordinated in Run console
BugWEB-43088NodeJS 13.5.0 Can not enable [Coding assistance for Nodejs]
BugWEB-42403Node.js: Cannot Debug Docker Compose configuration
BugWEB-40947package.json "Latest version" in quick documentation doesn't refresh
BugWEB-42327Linux: package manager yarn not recognized through nodejs snap
BugWEB-42175Yarn PnP: Imports show long path to a package
BugWEB-42997IllegalStateException when change node interpreter in RC
BugWEB-42909"yarn install" gets incorrectly replaced with "yarn add"
BugWEB-42171Yarn's version is not shown in 'Preferences for New Projects | Languages & Frameworks | Node.js and NPM'
BugWEB-41749Globally installed packages not always appear NPM packages list window
BugWEB-43022Can't set project in Run anything
BugWEB-40907Rider: Scripts from package.json are not shown in 'Run anything' dialog
BugWEB-38601Windows: Electron does not show console output when run from npm run configuration
BugWEB-42176Yarn PnP: Can't run Jest tests
BugWEB-41095package.json homepage url issues
UsabilityWEB-40794Prevent concurrent NPM install
UsabilityWEB-38864No possibility to show notifications about installing dependencies for a package.json if previously dismissed
UsabilityWEB-43103RecordModuleIntoPackageJsonQuickFix should add existing version instead of latest
TaskWEB-42280Support standard with Yarn PnP
TaskWEB-42131Do not suggest adding node_modules folder to Git
TaskWEB-42476Yarn PnP: Support for stylelint
ExceptionWEB-43096New Project Wizard fails with 'settings.nodejs.name' is not found
ProfilingBugWEB-41449NullPointerException when attempting to load heap snapshot
Pug (ex-Jade)BugWEB-27894No folding in PUG in VueJS files
BugWEB-41891Pug's path resolver should not use hard-coded and old extension name
BugWEB-21974jade: unbuffered javascript code not correctly indented
SASSFeatureWEB-41729Add support for new @use and @forward at-rules
FeatureWEB-38529Vue.js ::v-deep support
BugWEB-41886SCSS imports with webpack aliases: wrong 'Cannot resolve directory` warnings shown for packages with `@` prefix
BugWEB-42783Sass built-in modules not recognised
BugWEB-36975SCSS: Webstorm incorrectly reports "mismatched property value" error if function is called `l()`
BugWEB-42416@use in SCSS file doesn't resolve webpack aliases (`~@/...`)
BugWEB-41982SASS: import path completion doesn't work when using webpack aliases
BugWEB-42252Parameters in Sass functions in scratch files are marked as unresolved variables
BugWEB-42158Import scss from node_modules - cannot resolve module node_modules (Vue, SCSS)
BugWEB-42000SCSS in HTML snippet in Markdown file: false error for @import '~npm-module/some-file'
BugWEB-42250SASS/SCSS trailing comma incorrectly seen as error
StylusBugWEB-41389Stylus: hex color code for opacity not correctly treated
TypeScriptFeatureWEB-43125Support TypeScript 3.8 type-only imports/exports: syntax-only
FeatureWEB-41033Update bundled TypeScript to 3.6
FeatureWEB-42054Allow moving Union types via keyboard shortcuts
FeatureWEB-40793Default type parameters should be omitted
FeatureWEB-40667Enable duplicate declaration for type parameters
FeatureWEB-40352TypeScript: provide quick fix to insert/remove type arguments for extends/implements case
FeatureWEB-40032TypeScript: provide quick fix to insert/remove type arguments
FeatureWEB-40789Enable duplicate declaration for union/intersection types
FeatureWEB-36079Add intention 'infer parameters from usage'
FeatureWEB-41436Support TS control flow assertions and type flow with never-returning calls
FeatureWEB-40270Support TS 3.6 improved type checking for generators
FeatureWEB-41526No auto complete suggestions for ts import in jsdoc
FeatureWEB-40531Duplicate declaration for default exports.
FeatureWEB-42630Support `declare` Property Modifier
FeatureWEB-29437Refactor / Extract Field: add readonly field
FeatureWEB-42328Update bundled TypeScript to 3.7
BugWEB-40276Variable types in 'extends' clause are not properly evaluated for base types
BugWEB-41602Container type is computed incorrectly for destructuring in a for-of loop
BugWEB-39714Code completion in TypeScript should show types in code completion for generic arguments of incomplete new-invocation
BugWEB-41562Default generic value is not substituted in 'extends'
BugWEB-42103TS Classes sometimes moved to Symbols in Search Everywhere
BugWEB-41689Typescript unreachable 'case' branch when exporting enum
BugWEB-41569Completion in class, which implements extended interface with Omit, should suggest all properties
BugWEB-26888TypeScript: Change Signature dialog: error when adding parameters with initializer
BugWEB-43385Wrong highlighting for errors from the TypeScript service
BugWEB-41802Typescript import generated with warning (Organize Imports then generates error)
BugWEB-43192Resource import query string lost when moving TypeScript file
BugWEB-42594Promise<T> generic argument in return type not inferred from context for awaited calls
BugWEB-40454"Add braces to arrow function" should not prepend return if method is void
BugWEB-41738TypeScript: completion for import() in type context
BugWEB-40908False positive symbol assignment
BugWEB-42414Array spread operator prevents inference of return type of map callback
BugWEB-41466Insert type arguments completion handler should work only in TS files
BugWEB-42603Invalid 'Contents of collection never queried' warning for set with type declaration
BugWEB-40657TypeScript. Insert type arguments completion handler
BugWEB-43090TS non-null assertions should be affected by type guards (currently are not)
BugWEB-40944Angular - "Make public" quick fix does not work if Decorator is present
BugWEB-43209Importing tsconfig file in IDE produces SOE
BugWEB-40300TypeScript - don't collapse single line comment
BugWEB-42093Static fields are not evaluated properly when referenced as a qualified name (for instance, in typeof types)
BugWEB-40893Incorrect indentation for switch-cases code completion: should reindent the inserted case-label automatically
BugWEB-32227TypeScript: show error on initializing optional parameters
BugWEB-41623'Surround with type guard' should suggest "in" type guards when applicable
BugWEB-42081Type guard. Narrow string to string literal
BugWEB-40228Type duplication in inlay hints for union types
BugWEB-43174Contents of collection are updated, but never queried
BugWEB-41889Complete current statement inserts parens before explicit generic arguments
BugWEB-42114Wrong inferred type, invalid 'type mismatch' highlighting when using spread with Partial
BugWEB-40928False positive type checking error with optional properties
BugWEB-39617Cypress & Typescript IntelliSense not working properly
BugWEB-43228Double "Create getter/setter" intention for ts files
BugWEB-41724'Propagate to destructuring declaration' should not be available on parameter properties
BugWEB-41464Rested destructured parameter is typed to any if nothing else is destructured
BugWEB-40935TypeScript: incorrect type inference when we pass optional parameter to a method
BugWEB-40264TypeScript - Observable type is unknown if takeUntil used as last pipable operator
BugWEB-41948Type is inferred as T | any[] when TypeScript infers just T, causing slowness
BugWEB-40481Autocompletion bails for rest parameter typed w/ intersected arrays
BugWEB-42564Incorrect unused marking
BugWEB-40795Don't provide auto-complete suggestions for keys in object when you have defined them already (it is non-operation)
BugWEB-41490Class fields with non-null assertion are parsed incorrectly
BugWEB-40449@internal not suggested as JSDoc comment
BugWEB-40485results of type narrowing outside of shorthanded functions are ignored inside said functions
BugWEB-41333Missing typescript suggestion of extended "this" object
BugWEB-40897Incorrect "prototype" property in the static type of a enum
BugWEB-40864Overloads don't work after re-exporting
BugWEB-43178False warning "Unused assignment" on Optional Chaining
BugWEB-41940Type assertions don't work if we reset null / not null state with the statement
BugWEB-42974Property name completion picks up unrelated properties based on parameter name
BugWEB-41667Incorrect resolving in merging ambient class and function
BugWEB-42855Wrong Parameter Info for static overloaded method
BugWEB-41597Intention to generate destructuring pattern should generate parameter list parenthesis when needed
BugWEB-43012Typescript - Wrong type inference when using a partial record
BugWEB-42808Import on copy paste happens from wrong place
BugWEB-41892Spurious "Missing await" inspection warning when a nontrivial expression is being returned
BugWEB-42801Add compiler options "useDefineForClassFields" to tsconfig
BugWEB-42013Typescript file with ts-node shebang is treated as js
BugWEB-40615Enum fields with dot in the name are treated incorrectly
BugWEB-41509Incorrect type when destructuring value in arrow function
BugWEB-42689TypeScript import prefers longer wildcard mapping over shorter exact mapping.
BugWEB-42581TypeScript: missing class property type in suggestions
BugWEB-40580TS. Extract method should set the parameter type
BugWEB-41086Wrong type inferring in typescript
BugWEB-42105Property completion only provides already inserted items
BugWEB-41606Infinite re-indexing of node_modules/
BugWEB-42194'Generate destructuring patterns' doesn't work on a property to which is assigned enum
BugWEB-41480Renaming a property doesn't update usages when using const assertions
BugWEB-40914TypeScript: Property optionality is not processed in some cases
BugWEB-40250Props from parent component are not resolved: incorrect overload is chosen
BugWEB-42982TypeScript: code that compiles with `tsc` does not compile in WebStorm
BugWEB-42955No autocompletion for properties accessed with [] on generic interface
BugWEB-42060"Module is not listed in package.json" error when importing assets into a Typescript Vue component
BugWEB-41661Missing for-of array postfix when iterating over a local
BugWEB-41042Type hints for variable show redundant information in object destructuring with enum
BugWEB-41966Postfix template shouldn't appear in completion in type annotation
BugWEB-41003TypeScript: incorrect error message for incompatible members
BugWEB-43236Properties in class constructor shouldn't resolve to lib.dom.d.ts
BugWEB-42078Deleting/adding "less-than sign" should automatically delete/add "greater-than sign" for generic calls
BugWEB-41035Completion for declare keyword after export in TypeScript
BugWEB-43084Excluding ".d.ts"/".js" files with a ".ts" sibling works unreliable
BugWEB-42858"Override methods" doesn't generate "super" call when extending a class declared in d.ts file
BugWEB-40922TypeScript: incorrect smart cast to never
BugWEB-42047TypeScript auto-imports should respect project references
BugWEB-41388Incorrect type inference in TypeScript
BugWEB-40436Field refactoring doesn't pick usage
BugWEB-41856Type of response of awaiting supertest function is any (should be response)
BugWEB-41374Wrong "statement expected" error when using computed property with decorator
BugWEB-42149Incorrect type hint
BugWEB-42753Regression: Inspection "JavaScript | Probable bugs | Result of method call returning a promise is ignored" does not work in async functions anymore
BugWEB-42340IteratorResult in presence of node.js typings
BugWEB-40970TypeScript 3.6. ambient class and function can merge
BugWEB-42050WebStorm resolves tuple type param in jest.each to any
BugWEB-40903TypeScript: false positive type-checking error (and wrong navigation)
BugWEB-39652Refactor inferred params
BugWEB-35903Inspection 'Fix all 'Import can be shortened' problems in this file' doesn't work
BugWEB-37898Literals from switch-cases typed by an enum should have references to their source values
BugWEB-40966Higher-order type inference fails for mapped types
BugWEB-42067Type guard. Narrow unknown type to string literal
BugWEB-42579Completion of generic method inserts arguments in wrong place when replacing method expression
BugWEB-43069Type guard is incorrectly evaluated for a destructuring variable with default value
BugWEB-42311TypeScript: Types references are unresolved
BugWEB-40827Path mappings aren't used on auto-import if a pattern with wildcard is mapped to exact file name
BugWEB-42807Invalid 'Type mismatch' warning with callback, generic constraints and destructuring parameters
BugWEB-42683tsserver not started, code analysis can't be completed because of problems parsing include patterns in tsconfig.json
BugWEB-40117TypeScript - cannot auto-complete "readonly" in generic type
BugWEB-39678TypeScript: Problem with type inference in redux(store.dispatch)
BugWEB-29309'Inline' refactoring: allow getter inlining
BugWEB-40660TypeScript. Fix failed if one of the parameters has extends/keyof word
BugWEB-34084Suggestions incomplete for React components when there is an Omit (Pick and Exclude) structure in the type hierarchy
BugWEB-41884False positive warning for TypeScript type guard function
BugWEB-41543Getting complete IDE freeze randomly, requiring force quit and restart
PerformanceWEB-42611UI Freezes on selecting 'Directories' in Preferences
PerformanceWEB-42657High CPU usage when editing TSX component with style-components
PerformanceWEB-42835TypeScript lead to high memory leak & high cpu usage
PerformanceWEB-42053Type hints cause StackOverFlow exception in TypeScript 3.7 due to type recursion
PerformanceWEB-41653High CPU Usage in TypeScript project on Mac
UsabilityWEB-41345First item isn't pre-selected in completion popup
UsabilityWEB-42623TypeScript: show inferred class property type in suggestions
UsabilityWEB-41430Don't show 'delete' keyword in completion in call arguments
UsabilityWEB-42813Name completion is not suggesting the expected class/interface name
UsabilityWEB-41591Don't show variables in code completion for 'implements' clause
UsabilityWEB-41693Merged methods considered as properties in code completion and parameter info
UsabilityWEB-41082Improve string literal completion: don't suggest dynamics when not needed and add icons for prop keys
UsabilityWEB-26722TypeScript: merge inspections/intentions if both provide the same result
CosmeticsWEB-42068intellijIdeaRulezzz in completion in TS enums
CosmeticsWEB-41652There are two same-named inspections 'TypeScript | Redundant type'
TaskWEB-41495More tests for recursive typescript types
TaskWEB-41771Support optional chaining narrowing in common CFA equality guards
TaskWEB-41519TypeScript: better globs support in "includes" / "excludes" options in tsconfig
TaskWEB-42404TypeScript: enable 'export * as ns from' syntax (coming in TS 3.8)
ExceptionWEB-42049Error in JS code of typescript service: this.projectService.refreshInferredProjects is not a function
Unit TestsFeatureWEB-28462mocha: can't run single test if test name is an expression (nothing here)
FeatureWEB-35869WebStorm doesn't detect "function-value named" Jest tests
FeatureWEB-41079Add the ".unit" extension to test files patterns
FeatureWEB-35970WebStorm does not recognize Jest tests in nested functions
FeatureWEB-19963Cucumber.js: all step references are shown as undefined if feature is written using non-US language
BugWEB-32426Jest: testNamePattern does not handle template string
BugWEB-32050Run mocha test with template literal describe description gives "Empty test suite"
BugWEB-42752Latest Karma plugin claims that a regular angular.json is invalid
BugWEB-42729Testing with react-scripts does not work since update
BugWEB-41875Support Cucumber steps defined using TypeScript annotations
BugWEB-42463Mocha is used for running tests in Vue-cli project despite Jest being configured in dependencies
BugWEB-43208Mocha: show nyc coverage for .tsx files for default configuration
BugWEB-40351Highlight failed line in the test for shorthanded properties
BugWEB-43168Mocha tests not recognized when being wrapped in "parallel()" call
BugWEB-42279'Cannot find runner' when selecting a recent test session from Test History
BugWEB-42474Incorrect test runner name in gutter
BugWEB-32774Some Jest describe statements are not recognized
BugWEB-41514jest running no longer works properly in IntelliJ (reports tests as skipped)
BugWEB-34951Tests with describe.skip.* dont detected as tests
BugWEB-35107Jest: describe.each and test.each are not recognized
BugWEB-40585`Rerun failed tests` runs successful tests under failed group (describe)
BugWEB-31065mocha/testing: generated suites aren't detected for gutter icons
ExceptionWEB-42471Cannot run Karma tests with disabled "JavaScript Debugger" plugin
DB ConnectivityBugDBE-9623Datagrip SSH port channel recover issue
BugDBE-9448Driver files entries order is not saved
BugDBE-2684call trim() on connection dialog fields
UsabilityDBE-9323Connection exception is cut off in the main window
CosmeticsDBE-9357test connection to db - window which is not resizable - inconsistency
DB ConsoleFeatureDBE-5373Add EXPLAIN ANALYZE in context menu for PostgreSQL
FeatureDBE-1734Need a way to execute stored procedures
BugDBE-9478AzureSQL regression in 2019.2.6 - "Unable to verify FIPS mode settings" exception
BugDBE-9728Some MySQL queries show wrong table column names
BugDBE-9523NEXT VALUE FOR [sequence] is no longer working after latest update.
BugDBE-9550DataGrip: Error when trying to use Quick Documentation on tables containing SQL foreign keys (part 3)
BugDBE-3546Database Console doesn't reopen when statement is executed
BugDBE-9434Explain Analyse (Raw) action is broken
DB DiffBugDBE-7250Schema compare yields inequalities for seemingly equal attributes
DB GeneralBugDBE-9401Data source corruption in recent builds
DB IntrospectionFeatureDBE-5036Create "fake" foreign key reference
BugDBE-9850Entire database synchronized every time there is a DDL commit
BugDBE-9329PostgreSQL 12 generated columns feature breaks introspection
BugDBE-5061DDL for Postgresql trigger misses OF columns block
BugDBE-9406Introspection error on Greenplum 6. Source code of routines is not available.
BugDBE-9755NPE on fetching database schema
BugDBE-9433database schemas current schemas can't select
BugDBE-9897Wrong parameter names for Oracle system procedure
BugDBE-9474H2 view columns are not introspected
BugDBE-9457DataGrip 2019.2.2 does not show DISTRIBUTED BY section for Greenplum v 6 table via "SQL Scripts --> Source Editor"
BugDBE-9539Database panel loses database information (metadata) and behaves badly
BugDBE-9454multiple-column indexes
DB RefactoringBugDBE-9892Using DELETE statement instead of TRUNCATE with Cassandra Table
BugDBE-9743Wrong schema is chosen when adding foreign key constraint to a table (fixed in DataGrip)
DB Schema ViewsBugDBE-9267Misleading 'drop schema' handling on insufficient rights
UsabilityDBE-9928Collapse descendant nodes in the DB tree
Data Import & ExportFeatureDBE-6749dynamically name mysqldump output file based on time and database name
FeatureDBE-1313console-like output (plain-text-friendly data exporter)
BugDBE-9548Creating new table from results contains ambiguous column names
BugDBE-9499CSV export exports Minus sign as html code
BugDBE-9901JSON-Groovy fails on MongoDB database
Data ViewsFeatureDBE-2516Use Data Editor for editable views
BugDBE-9704Cannot Use ObjectId to find one record in MongoDB
BugDBE-9322Error in 'Load Data' view
BugDBE-8196Remove schema qualification from the data editor query
BugDBE-9714Right-click on column header does not show menu in DataGrip 2019.3 Windows
BugDBE-9613MongoDB: JavaScript regular expression objects are not supported in the filter field
BugDBE-9593MongoDB collection view: ISODate truncated to just YYYY-MM-DD format
BugDBE-9873Table Editor Go to related data F4 not working
BugDBE-9736Table filter is cleared when navigating from Database View
BugDBE-9445H2 views cannot be sorted by column
BugDBE-9516`Transpose` action is absent
BugDBE-985Select on Zerofill column
PerformanceDBE-9886IDE hangs when opening table with lots of columns ~4000 (important for MongoDB)
PerformanceDBE-9835"Copy" command in right-click menu (right click on a cell) freezes Datagrip 2019.3.1
PerformanceDBE-9604Scrolling very slow/sluggish in database table view/editor with many columns
UsabilityDBE-6587Database editor tab: focus lost after entering date field
UsabilityDBE-9549Option to disable autocompletion in Data Editor
Navigation & SearchFeatureDBE-9622Ability to set 'current data source' in the search scope
PL DebuggerBugDBE-9324Oracle PL debugger: Sometimes debuggers doesn't pick the modified code on second start
TaskDBE-9299Oracle PL debugger: support Type Body
TaskDBE-9274Do not allow to start several debug sessions at once for the same DB console
ExceptionDBE-9297Oracle PL debugger: when a sessions is disconnect, DG throws an unexpected exception "Connection refused to host: 127.0.0.1"
SQL CompletionFeatureDBE-8743Update ClickHouse MergeTree SQL dialect
FeatureDBE-9708Add editor option to autocomplete SQL join clause without table name
FeatureDBE-3146Postgres: no completion for function's language
BugDBE-9504Suggest only "BY" for "ORDER " or "GROUP "
BugDBE-9829Bad completion for table aliases in DDL commands
BugDBE-9759Insert code template
BugDBE-9354select always qualifies the column with table name
BugDBE-9129PG10+: False positive inspection for logical replication queries
BugDBE-9757Add new auto fix for `Insertion into identity/autoincrement column is not supported`.
BugDBE-9800Postgres: bad completion
BugDBE-9651Automatic INSERT list completion ignores code style
BugDBE-9869Snowflake syntax doesn't recognize EXCEPT
BugDBE-9912MS SQL: useless autocompletion of type name in declare @variable
UsabilityDBE-9534Better completion for LIKE
UsabilityDBE-9535Better completion for LIKE in the filter field
UsabilityDBE-9533Higher priority for tables in completion
SQL Format and StyleBugDBE-9458SQL Server query formatting issue: the TOP N clause causes formatter to insert a lot of unnecessary line breaks
BugDBE-9888Semicolon is placed on a new line after 'go'
BugDBE-9680PostgreSQL doesn't handle CREATE TYPE
BugDBE-9692SQL formatter: Placing ON/USING under JOIN doesn't work
SQL GeneralFeatureDBE-9393Support DDL for TASKs
FeatureDBE-9450Snowflake SQL Dialect Should recognize // style comments
FeatureDBE-9871Add in-line variable names for scripts
BugDBE-9464PostgreSQL 12 COMMIT/ROLLBACK AND CHAIN syntax not recognized
BugDBE-9877SQL PostgreSQL dialect doesn't recognize \gset in sql-scripts
BugDBE-8682Snowflake syntax doesn't recognize USING keyword
BugDBE-9463PostgreSQL 12 REINDEX CONCURRENTLY feature not supported
SQL GenerationFeatureDBE-7976Modify table from data editor
BugDBE-9352Command "Generate DDL to Clipboard" shows incorrect info about fulltext index.
BugDBE-9619IDEA reports incorrect column definitions
BugDBE-5030Foreign Key Creation Doesn't Like Schemas
BugDBE-7247Postgres Trigger Definition Does Not Show WHEN condition
SQL HighlightingFeatureDBE-9597Report missing returns in SQL functions
FeatureDBE-9596Allow disabling "DELETE/UPDATE without WHERE" inspection for temporary tables
FeatureDBE-9573Inspection: Insert NULL into NOT NULL column
FeatureDBE-9734Support MySQL new grants (SESSION_VARIABLES_ADMIN)
FeatureDBE-9024Ability to suppress sql resolve inspection for the function
FeatureDBE-9595Inspection for missing column aliases
FeatureDBE-3779SQL: inspection for null values
FeatureDBE-9944Inspection about ROLLBACK and COMMIT in triggers
FeatureDBE-9616Improvement of "Aggregate-related problems" inspection with CUBE and ROLLUP
FeatureDBE-8402Inspection and intention for unicode columns in MSSQL
FeatureDBE-9735Support MySQL 8 SRID argument on GEOMETRY columns
FeatureDBE-8688Unreachable code inspection for COALESCE
FeatureDBE-9598Add "Misleading reference" inspection
BugDBE-9890Redundant argument name hint
BugDBE-9019Code error in valid mysql 8+ regarding functional indexes
BugDBE-9660Snowflake dialect: QUALIFY does not work correctly in a WITH clause
BugDBE-9569Intellij shows false error for 'COMPRESS ADVANCED'
BugDBE-9345Max identifier length inspection
BugDBE-9659Exasol PARTITION BY clause
BugDBE-9336Intentions is not working in existing routines
BugDBE-4267PostgreSQL: CURRENT_USER should be accepted wherever a username is
BugDBE-9467Datagrip syntax checker/linter do not understand the expression "ANALYZE SELECT"
BugDBE-9827Add support for AggregateFunction with parameters in ClickHouse dialect
BugDBE-9468Oracle SQL syntax false error: TRUNCATE TABLE ... CASCADE
BugDBE-9771Bad inspection ("select from procedure call") for jsonb_to_recordset
BugDBE-9658Exasol IFNULL() function support
BugDBE-9564DB console for oracle dialect does falsely reports issue with empty grouping set as : '(' or <expression> expected, got ')'
BugDBE-9531ORDER BY in subqueries should be highlighted
BugDBE-9767DROP CHECK incorrectly marked as error for MySQL.
BugDBE-9905SQLite INSTR function is not supported
BugDBE-9679Inline parameter hint provider for DB routines
BugDBE-9682Oracle: Allow identifier syntax for password values (e.g. REPLACE clause)
BugDBE-9512Missing syntax highlighting/autocomplete for clickhouse
BugDBE-9902Confusing folding for injected SQL queries
BugDBE-9931MySQL - MEMBER OF unexpected keyword
BugDBE-9611Field named `values` in nested query
BugDBE-9446Add syntax highlighting for command EXPLAIN ANALYZE in Mysql Database
BugDBE-9542Always true inspection does not work on constants
BugDBE-9410T-SQL: Unknown database function 'concat_ws'
BugDBE-9667Add support [GLOBAL] [ANY|ALL] [INNER|LEFT|RIGHT|FULL|CROSS] [OUTER] JOIN (subquery)|table USING columns_list for ClickHouse dialect
BugDBE-9473MariaDB. Unknown database function error for window functions.
BugDBE-9492Replace DISTINCT with GROUP BY
BugDBE-9281Aggregate-related problems inspection false positive when grouped by primary key
BugDBE-3815No inspection suppression option for specific unresolved SQL reference?
BugDBE-9913Error message near 'cross join ... on' is not very user-friendly
UsabilityDBE-9543Quick fix should delete COALESCE statement in the first argument cannot be null
SQL RefactoringFeatureDBE-9428Intention to convert JOIN ON to JOIN USING
BugDBE-9568Intention works not correct
SQL ResolveBugDBE-9503DataGrip crashes and CPU consumption is high
BugDBE-9601Escaped table names breaking column name recognition in injected SQL
BugDBE-9803Asterisk behavior inside aggregate functions
BugDBE-9470PostgreSQL: ORDER BY fields not resolved in a TABLE statement
BugDBE-9453CQL highlighting doesnt understand custom types
BugDBE-9880PostgreSQL-dialect doesn't recognize jsonb_ops for gin-index

 

  • No labels