Skip to end of metadata
Go to start of metadata

You are viewing an old version of this page. View the current version.

Compare with Current View Page History

« Previous Version 8 Next »

RubyMine 2019.3 EAP6 (193.4697.22 build) Release Notes

No subsystemExceptionRUBY-25125Ruby plugin generates `ClassCastException`
Code not correct type inference depending on whether block passed or not
BugRUBY-25044RubyMine doesn't expand constant conditions in ternary operators
DebuggerBugRUBY-20930Ruby Debug IDE GEM fails to install from RubyMine with system Ruby
BugRUBY-24688Got Exception : DebuggerThread are not supposed to be traced... with new Ruby-debug-ide 0.8.0 beta3
DockerBugRUBY-19694Server pid is not removed after stop remote debug with docker-sdk
IDEFeatureRUBY-8054Feature Request: Add the IDEA Copyright plugin to RM ...
InspectionsBugRUBY-24156super in initialize shows arguments for class not super class. flagged as error
RailsBugRUBY-25091YAML error on value with embedded Ruby code
Rails. Code InsightFeatureRUBY-3953Type support for fixtures call
RefactoringsBugRUBY-15023Cannot Rename overrided methods
Code Analysis. InspectionBugIDEA-224533Inspections from command line fail with "TFBlockNameValidness descriptionUrl==TFBlockNameValidness "
Code Analysis. Language InjectionBugIDEA-223046Strange highlighting in injected HTML text block
Core. IDE Settings. SharingUsabilityIDEA-208370"Invalid credentials. Click to authorize" tooltip should make it clear which credentials exactly are invalid
Core. IndexingExceptionIDEA-224749Possible `IndexNotReadyException` when adding
Core. InstallationBugIDEA-215497jbr/bin/java Access Denied during update from IC-192.4205.45 to IC-192.4488.21
BugIDEA-224371Allow to use custom size for spalsh image in launcher.
BugIDEA-223576Impossible to update Pycharm 2019.1
Core. Platform APIFeatureIDEA-219946API to determine a command-line, which started current IDEA
Core. Plugin ManagementBugIDEA-224408No label on enable/disable theme plugin after clicking on Apply
BugIDEA-224401"Updatable" plugin is duplicated in plugins list until restart
BugIDEA-224220Theme is partially changed after uninstalling plugin
ExceptionIDEA-224649Throwable at com.intellij.ide.plugins.newui.MyPluginModel.applyEnableDisablePlugins
ExceptionIDEA-224650NPE at com.intellij.ide.plugins.newui.MyPluginModel.addProgress
Core. Run. ConfigurationsPerformanceIDEA-219923Avoid running run configuration producers on EDT
Core. Task ManagementBugIDEA-101254Time tracking: Suspend delay setting has effect only on project reopening
BugIDEA-138917Time Tracking broken
Editor. FormatterBugIDEA-224183IDEA takes into account formatting markers with the disabled "Enable formatter markers in comments" option
Lang. YAMLBugIDEA-223349Problems validating sequences using Metamodel engine
Tools. DockerFeatureIDEA-178495compose YAML: add editor support for typed arrays (v3)
BugIDEA-214766Incorrect error highlighting for function arguments used in string interpolation inside a BASH function in a RUN statement in Dockerfile
BugIDEA-224069Dockerfile highlighting breaks on multiline RUN with quotes
User Interface. Console ViewBugIDEA-70016error mixing stdout/stderr
User Interface. Find, Replace, UsagesBugIDEA-224319Forget the previous search fragment when a new multiline fragment was selected
User Interface. FocusBugIDEA-223806After closing the Find view, keyboard focus is nowhere
User Interface. Look and FeelTaskIDEA-201463IntelliJ LaF: change inactive selection background color
User Interface. NavigationBugIDEA-224660Search Everywhere: start matches should be prioritized
Version Control. GitFeatureIDEA-208517Unified Checkout action for remote branches
PerformanceIDEA-221003Git integration should refresh only the files which actually have changed
UsabilityIDEA-171626Ability to create new branch that already exists in some repositories
UsabilityIDEA-132259Multi-repo sync setup: Checkout common remote branch as local fails if one of repositories is already on such branch
UsabilityIDEA-193354Git | Branches | "Checkout as" always makes new branch track selected branch
TaskIDEA-163444Remove "Branch Default" update method
Version Control. GitHubBugIDEA-224239GitHub PullRequests: content is not shown if user logged in from toolwindow
BugIDEA-224323GitHub PullRequests: Refresh notification does not appear automatically
CosmeticsIDEA-224329GitHub PullRequests: add space between file name and its path
Version Control. PerforceBugIDEA-221889Exception when saving a merge result in perforce
No subsystemFeatureWEB-27946WebStorm complains about attributes on <svg:g> elements
FeatureWEB-14385syntax highlighting of mime type text/ractive in scripts for Ractivejs
BugWEB-40288No 'Download Node.js' action if there is one (or more) invalid node
BugWEB-41817Async generators: create a for-await loop in corresponding postfix template
BugWEB-41807Warning is wrapped in exclamation point (! symbol)
BugWEB-39386weridly behaving typos hints
BugWEB-41789Standard code completion insert handler is not invoked for items in optional chains
BugWEB-40746Add "parallelization" to the dictionary
BugWEB-41746Sort properties alphabetically goes into an infinite loop on malformed JSON
BugWEB-41803Please add "screenshot" to the dictionary
CosmeticsWEB-41731The name of Handlebars/Mustache folding category is truncated
CSSBugWEB-8045Move statement on CSS line no working as expected
BugWEB-41795Download CSS library from CDN: disabling in Preferences - Libraries has no effect on completion
BugWEB-8044Move statement on CSS block no working as expected
UsabilityWEB-41796Download CSS library from CDN: show shorter name for the location in completion popup
DebuggerBugWEB-41719TraceableDisposable.ObjectNotDisposedException when close IDE while debugging
HTMLExceptionWEB-41600Invalid file name lib/intellij-xml.jar!/resources/html5-schema/html5chars.ent
JavaScriptFeatureWEB-39273'Make private/make public should be available for ES6 private fields
FeatureWEB-38663Add parentheses and implement the body when completing `constructor` keyword
BugWEB-40023Quick fix: JS: shouldn't invoke action of converting "for-in" to "forEach" on object
BugWEB-32591Autocompletion not working after importing class instance that was instantiated via factory
BugWEB-41610Javascript: Unresolved variable
BugWEB-31714Make field public QF should change all usages of this field (remove # symbol)
BugWEB-41793Remove 'package-lock.json' from import/require completion
PerformanceWEB-41810Freeze in EDT on type evaluation
JavaScript. FrameworksFeatureWEB-32487Vue.js. Support local and global filters
FeatureWEB-41320Angular 8 SVG template unsupported
BugWEB-41782Completion for v-bind - attribute href is missed
BugWEB-41654Specify variable type explicitly doesn't produce any changes in code
BugWEB-36502Vue.js: warn about empty tag bodies instead of self-closed tags in compiled vue templates
PerformanceWEB-41427XmlTagNameSynchronizer freezes IDEA due to synchronous angular resolve
UsabilityWEB-41765Vue.js: background color for <script> tag causes usability issues
JavaScript. InspectionsBugWEB-25157"Unnecessary semicolon" inspection quickfix removes trailing line breaks
BugWEB-25169'Flip ,' works incorrectly for destructuring arrays
BugWEB-41775JS. Replace foreach with indexed for intention
JavaScript. RefactoringFeatureWEB-41816JS. Replace for..of with indexed intention
BugWEB-41876'Generate destructuring patterns' fails on a property of already existing pattern
BugWEB-40040TypeScript - Change method signature is wrong when passing "this"
BugWEB-41723Extracting a variable immediately assigns an auto-generated name to the new variable
BugWEB-30408Refactoring: Extract Superclass: static method should not be marked as abstract
UsabilityWEB-28271Change signature should better handle TypeScript parameter-properties
Node.jsBugWEB-41749Globally installed packages not always appear NPM packages list window
BugWEB-21914angular-cli: Cannot find angular-cli package
BugWEB-23329Output of stdout and stderr are not properly coordinated in Run console
TypeScriptBugWEB-41724'Propagate to destructuring declaration' should not be available on parameter properties
BugWEB-26888TypeScript: Change Signature dialog: error when adding parameters with initializer
BugWEB-29309'Inline' refactoring: allow getter inlining
BugWEB-40795Don't provide auto-complete suggestions for keys in object when you have defined them already (it is non-operation)
BugWEB-40893Incorrect indentation for switch-cases code completion: should reindent the inserted case-label automatically
Unit TestsBugWEB-41875Support steps defined by annotations
No subsystemBugDBE-9285Inspections from commandline: SqlCaseVsCoalesceInspection fails with "registers INFORMATION level problem in batch mode"
DB ConsoleFeatureDBE-2344DB2: not possible to enable DBMS_OUTPUT
SQL CompletionUsabilityDBE-9307SQL: MySQL: code completion could suggest ALTER TABLE
UsabilityDBE-8957Misleading icon in a completion list
SQL HighlightingBugDBE-9293Sybase: unable to resolve "GO" symbol

RubyMine 2019.3 EAP5 (193.4386.6 build) Release Notes

DebuggerBugRUBY-24992Debugger doesn't enter while, if and until blocks
BugRUBY-25107Interactive console cuts output at 1000 chars
IDEFeatureRUBY-24906Multi line todo's no longer work
BugRUBY-25073RM projects moved below Web Projects in Create New Project wizard
BugRUBY-22179Possible to install Ruby plugin to RubyMine
RailsFeatureRUBY-15415default Property Key for I18n string value creation
SlimBugRUBY-25067cannot resolve symbol for custom html tags in slim templates
Code Analysis. InspectionBugIDEA-222909Typo that selected in Inspection Results tree is not highlighted in batch editor
Code Analysis. Language InjectionFeatureIDEA-221416AssertJ language injection rules as built-in rules
Code Analysis. Structural SearchBugIDEA-224120Replace element with unmatched annotation variable fails
Core. File SystemBugIDEA-224079Open File or Project only showing one directory in home
Core. IDE SettingsFeatureIDEA-215428Add relative file path live template function
Core. InstallationBugIDEA-224100Windows launcher is fragile under externally-imposed SetDllDirectory context
Core. Platform APIFeatureIDEA-203508Provide an API for mixing goto results from different sources
BugIDEA-220169Bug in matching words with the same ending and starting letters in pair words by MinusculeMatcher
Core. Plugin ManagementBugIDEA-224230Updating theme plugin from incompatible version requires IDE restart to apply changes
BugIDEA-224223Theme plugins installed from disk disappear after update
ExceptionIDEA-224191AE at com.intellij.application.options.colors.ColorAndFontOptions.initAll
Core. Project SettingsBugIDEA-186751Repository library: disallow manual editing of library with transitiveDeps=true
Core. Quick DocumentationBugIDEA-205986QuickDoc popup is not restored in the Editor from the Tool Window
Core. Task ManagementFeatureIDEA-155327Improvement to automated Branch Name in the Open Task dialog
FeatureIDEA-64464Tasks plugin should also save bookmarks list in task context
BugIDEA-222401[Task Management] some controls are hidden after the server settings window resizing
BugIDEA-224295Commit from local changes doesn't show task autocompletion
Editor. Code CompletionFeatureIDEA-55066Add Live Template macros to insert file path
Editor. Diff and MergeBugIDEA-223924Shortcut for Include Lines into Commit do not work in the Unified diff
Editor. Editing TextFeatureIDEA-218836New editor command to sort lines alphabetically
BugIDEA-223715Todo pattern matching not working correctly when using ö (o with two dots)
BugIDEA-223891TODO regex are broken
Editor. FormatterBugIDEA-219572New | EditorConfig action should not be available when the context directory is undefined
BugIDEA-223408Java ij_java_imports_layout setting in .editorconfig not working properly
Editor. Intention ActionsCosmeticsIDEA-221475Incorrect spelling in the "Add on-demand static import..." context action
Lang. Shell ScriptFeatureIDEA-223844Run shell scripts from context menu
BugIDEA-224147Inject language shell creates fakes Run Line marker
BugIDEA-223938[Shell Script] working directory couldn't be changed in run configurations
Tools. DockerBugIDEA-163279Support logging of transport level interaction with docker daemon
User Interface. Action SystemBugIDEA-224276"Commit" action is not searchable by "checkin" pattern
User Interface. FocusBugIDEA-223740[Debugger tool window] Focus is lost when switching tabs via "Show List of Tabs" on Linux
BugIDEA-222477Unable to open/hide tool window in some cases
Version Control. GitFeatureIDEA-219087Local .gitignore - An action to ignore via .git/info/exclude
BugIDEA-223970Rewording git commit should not run commit hooks
UsabilityIDEA-224204"Add to .git/info/exclude" should add content root path, not just file name
UsabilityIDEA-224034Rename Reword action to Edit (Commit) Message
CosmeticsIDEA-224054Push dialogue elements are improperly placed / aligned
No subsystemTaskWEB-41494Support nullish coalescing in TypeScript
CSSFeatureWEB-31724Adding Bootstrap Autocompletion from CDN
FeatureWEB-10023Need ability to download external stylesheets
DebuggerBugWEB-41716'Hide frames from libraries' does nothing
JavaScriptBugWEB-41728Resolve default import when .d.ts has no default export
BugWEB-41382Show 'forof' postfix template instead of 'forin' for ES6 typed arrays
BugWEB-41764Optional chain tail is not evaluated properly
BugWEB-41668False positive "Readonly<T> is not assignable to type {}" for the state inside react component constructors
BugWEB-41410Javascript autocomplete for JsDoc @typedef {typeof import('./somefile')} not working anymore in PHPStorm 2019.2
UsabilityWEB-41094Allow to move switch-cases with 'Move statement'
UsabilityWEB-41727'Method expression is not of Function type' should be 'Method expression is possibly null/undefined' where appropriate
UsabilityWEB-41542Show type hints for Promise.allSettled-like repeating tuples more conveniently
ExceptionWEB-41675NullPointerException when call 'Split into multiple declarations'
JavaScript. FrameworksFeatureWEB-41576Slots are not resolved (slot, v-slot)
FeatureWEB-41476Vue.js: code completion for source components slot names
FeatureWEB-40973Vue.js : support components defined in several files via @WithRender decorator
BugWEB-41713Vue: missing syntax coloring within <script type="text/x-template">
BugWEB-41717Can't type closing tag in Vue file while indexing is in progress
BugWEB-38082PropTypes.shape should support warn on missing required prop inside 'shape'
ExceptionWEB-41704'IllegalArgumentException: Argument for @NotNull parameter' when open the certain project
JavaScript. InspectionsBugWEB-41679'Duplicate case label' should work with string literals in different quotes
JavaScript. RefactoringFeatureWEB-39691Can't inline variable in destructuring (expected: convert to property access)
BugWEB-40769Don't inline variables with default values in object destructuring
UsabilityWEB-41258Do not show refactoring preview when renaming a new file using the "Rename file to match class name" fix
LintersBugWEB-40937tslint.json file in subdirectory no longer recognized
Node.jsUsabilityWEB-38864No possibility to show notifications about installing dependencies for a package.json if previously dismissed
TypeScriptFeatureWEB-41526No auto complete suggestions for ts import in jsdoc
BugWEB-40827Path mappings aren't used on auto-import if a pattern with wildcard is mapped to exact file name
BugWEB-41689Typescript unreachable 'case' branch when exporting enum
BugWEB-40264TypeScript - Observable type is unknown if takeUntil used as last pipable operator
BugWEB-41667Incorrect resolving in merging ambient class and function
BugWEB-41543Getting complete IDE freeze randomly, requiring force quit and restart
BugWEB-41738TypeScript: completion for import() in type context
BugWEB-35903Inspection 'Fix all 'Import can be shortened' problems in this file' doesn't work
UsabilityWEB-26722TypeScript: merge inspections/intentions if both provide the same result
UsabilityWEB-41693Merged methods considered as properties in code completion and parameter info
CosmeticsWEB-41652There are two same-named inspections 'TypeScript | Redundant type'
TaskWEB-41771Support optional chaining narrowing in common CFA equality guards
DB ConnectivityUsabilityDBE-9247Adding data source via the explorer is confusing
DB ConsoleFeatureDBE-5373Add EXPLAIN ANALYZE in context menu for PostgreSQL
BugDBE-9260Running "Execution Plan" on a recursive SQL results in java.lang.StackOverflowError"
DB IntrospectionBugDBE-9262Mysql - No autosync - introspect schema doesn't introspect
BugDBE-8000sqlserver table comments or column commnets was truncated
DB Schema ViewsFeatureDBE-8608Cannot reassign "drop" database object shortcut key
UsabilityDBE-9248Tables are not loading with the schema selected without refreshing
Data ViewsFeatureDBE-5970Transposed table in a table editor don't allow to resize a column name
BugDBE-8904Transpose collapses field names
SQL CompletionFeatureDBE-9252Completion: option to suggest only objects from current database/schema
BugDBE-7033Bad completion for subquery
BugDBE-6024Database completion/object navigation should not show filtered out objects
SQL Format and StyleBugDBE-9249PostgreSQL formatting: the "Keep new line after THEN, ELSE" options doesn't work
SQL HighlightingBugDBE-9264Named parameters in SQL function calls are marked as syntax errors and broken by auto-format
BugDBE-9271PL/SQL: "Unable to resolve column 'sqlerrm'" at exception block
SQL ResolveUsabilityDBE-9261Unable to select schema in SQL Resolution Scopes dialog

RubyMine 2019.3 EAP4 (193.4099.3 build) Release Notes

DebuggerBugRUBY-24961F7 does not step into super
BugRUBY-24993Debugger doesn't step into .call method
BugRUBY-24981F7 does not step into initialize
Rails. Code InsightFeatureRUBY-12472Support autocomplete for additional column types and options in create model/migration
BugRUBY-24931Incorrect name resolve when used with db migration file
Rails. Project ViewBugRUBY-24692Rails view in the Project Panel Constantly Closes the App Folder
Code Analysis. Structural SearchBugIDEA-223146PsiInvalidElementAccessException: Element class : on SSR replacing annotation
BugIDEA-221558SSR inline preview does't get updated on editor document change
BugIDEA-223337Search for Java methods should find methods with receiver parameter
Core. DebuggerBugIDEA-220181Debugger ignores stepping filters when using new directed step-into
Core. DiagramsBugIDEA-223512UML Diagram: missing "Save as UML" button on a toolbar
Core. InstallationFeatureIDEA-194011Turn vcs.log.graph module into a healthy maven dependency
Core. Password ManagementBugIDEA-223257java.lang.NoSuchMethodError: 'void com.intellij.credentialStore.CredentialAttributes.<init>(java.lang.String, java.lang.String, java.lang.Class, boolean, int, kotlin.jvm.internal.DefaultConstructorMarker)'
Core. Platform APIBugIDEA-223894PluginException trying to use ServiceManager to get service with multiple constructors
BugIDEA-223709RubyMine 2013.EAP creating more than 800 threads on opening, freezing the IDE and slowing the computer for several seconds
BugIDEA-223074IDEA has to report regarding corrupted files / plugins
Core. Plugin ManagementBugIDEA-209769Transitive optional plugin XML dependency does not work
BugIDEA-222461Plugins management: incompatible plugins reporting is incorrect
CosmeticsIDEA-218594Plugins: ugly dialogs on downloading failure
Core. Project SettingsBugIDEA-223363IDE deletes newly added library configuration files if external storage is enabled
BugIDEA-223730java.util.ConcurrentModificationException at com.intellij.openapi.projectRoots.impl.UnknownSdkType.getInstance(
Core. Quick DocumentationBugIDEA-222946identifier tooltip - due to scrollbar the tooltip window is not large (height) enough when there is only 1 or 2 lines in the tooltip. So the text is always obscured.
Core. RefactoringsPerformanceIDEA-214780TouchBar action update freezes UI thread for a long time
Core. Run. ConfigurationsBugIDEA-210252[Environment variables] when pasting smth in addition to the existing value - the whole value is replaced
BugIDEA-222233Copy-paste behavior in the Environment Variables editor
Core. Task ManagementBugIDEA-134603When switch from task to task with branch having new files these previously opened files are not reopened
Editor. Code CompletionBugIDEA-223033Different Live Templates differing by case only may shadow each other
BugIDEA-223091IntelliJ keeps freezing when editing story files
BugIDEA-223713CNFE: com.intellij.codeInsight.completion.CompletionPhaseListener: Can't run 1.3.60-dev-2580-IJ2019.2-1 with IDEA Nightly IU-193.3938
PerformanceIDEA-198887MinusculeMatcher can be very slow on long prefix and name
Editor. Diff and MergeBugIDEA-223218Default focus on file list in 'Diff Between' window
Editor. FormatterBugIDEA-223416Regression: overriding FileIndentOptionsProvider no longer works when .editorconfig is present
Lang. XPath and XSLTBugIDEA-220836Show Unique XPath is not working well
Tools. DockerBugIDEA-193559DockerCompose. Run Configuration: impossible to choose services to run
BugIDEA-223502Docker: impossible to create a new exec command for a container: "Create..." doesn't work
CosmeticsIDEA-178001Docker. Run Configuration. Delete "Create new" from "Server" listbox.
Tools. TerminalCosmeticsIDEA-217612Terminal rename session minimizes the terminal window
User Interface. Action SystemBugIDEA-223815intellij-community latest snapshot build causes exception when displaying Generate action popup
User Interface. Keyboard InputBugIDEA-222847Invoking Ctrl-Alt-O ("Optimise Imports") while indexing prints a character
User Interface. Project ViewBugIDEA-206056In Project Files, adorn symlink to folder with arrow in corner?
UsabilityIDEA-223758Project view popup appears to the few pixels left
CosmeticsIDEA-171222Module uses wrong icon in project tree
Version Control. GitFeatureIDEA-124890Feature Request: Add Colour hint to git branch menu when in Merging state
UsabilityIDEA-192646Option for Commit Date rather than Author Date in File History and Annotations
ExceptionIDEA-222952Throwable: Assertion failed: Repositories have unexpectedly diverged
Version Control. SubversionBugIDEA-125032Stuck in endless loop of modal SVN Authentication Required Dialog
BugIDEA-223635GetFilesFromVersionControl: CheckOut from Subversion fails silently
No subsystemBugWEB-41478"Quote property names" too aggressive when working with selected properties
BugWEB-37995Higher-order function generic inference should work for lambdas invoking generic functions
UsabilityWEB-33143closing tag should be smarter
Build toolsBugWEB-38986Don't debug npm before launch tasks
DartFeatureWEB-41609Dart formatter: use dartfmt tool when reformatting file parts, not only the whole file
TaskWEB-41628Dart formatter: use dartfmt tool always, remove legacy formatting settings
DebuggerBugWEB-41598Breakpoints don't work after app is reloaded by webpack
BugWEB-21719NodeJS Remote Debugging Doesn't Allow Breakpoints
BugWEB-36015Debugger attaches to "Before Launch" gulp script, application not launched
PerformanceWEB-38989Optimize memory used for source maps
JSONFeatureWEB-38070Complete statement could add quotes on JSON
FeatureWEB-35787JSON: Smarter colon/comma handling before the closing quote (disabled by default)
FeatureWEB-41515Add editor action for "Copy JSON Pointer to clipboard"
JavaScriptFeatureWEB-41508Highlight await once the caret is on async.
FeatureWEB-41553Don't show unexported symbols from libraries in the Go to definition popup
BugWEB-41403WebStorm 2019.3 EAP - After a while IDE show warning "unused constant"
PerformanceWEB-11215large concatenated JS file causes hang
JavaScript. FormatterBugWEB-40900EditorConfig doesn't apply to <script></script> in .vue file
JavaScript. FrameworksBugWEB-41477Vue.js: attribute name is not in code completion on slot tag
BugWEB-41564Vue Mixin Fields Glitches
JavaScript. RefactoringBugWEB-29335'Extract superclass', 'Pull members up' should move comments around members
BugWEB-35616Comment for typescript class last field is broken after applying intention "Create field"
Node.jsBugWEB-38601Windows: Electron does not show console output when run from npm run configuration
TypeScriptBugWEB-41569Completion in class, which implements extended interface with Omit, should suggest all properties
BugWEB-41562Default generic value is not substituted in 'extends'
BugWEB-41661Missing for-of array postfix when iterating over a local
BugWEB-41606Infinite re-indexing of node_modules/
BugWEB-41602Container type is computed incorrectly for destructuring in a for-of loop
BugWEB-41597Intention to generate destructuring pattern should generate parameter list parenthesis when needed
BugWEB-39678TypeScript: Problem with type inference in redux(store.dispatch)
BugWEB-40300TypeScript - don't collapse single line comment
UsabilityWEB-41430Don't show 'delete' keyword in completion in call arguments
UsabilityWEB-41591Don't show variables in code completion for 'implements' clause
TaskWEB-41519TypeScript: better globs support in "includes" / "excludes" options in tsconfig
DB ConnectivityBugDBE-5559H2 embedded: mv.db extension as appended to the database file each time
BugDBE-3272H2 Data Source: automatic detection of database files for MV_STORE format (.mv.db)
DB DiffBugDBE-9226Compare tool generates invalid mariadb sql for drop index when generating migration script
Data ViewsBugDBE-9217When I press forward or backward button, Index is increased or decreased. But This can't renew the table. I think it is bug. Please fix this.
UsabilityDBE-9179Thousands separator in results rows count view
SQL GeneralBugDBE-2667"Quote identifier" should choose correct case
SQL HighlightingBugDBE-8924False warning about number of values when selecting identity column
BugDBE-5819Bad SQL is green: MySQL `delete * from`
BugDBE-9193Good code is red when using dots in PostgreSQL CREATE VIEW WITH() option names
BugDBE-3688SQL: MySQL: support correct limitations for CAST and CONVERT arguments
BugDBE-9210Inspection ['Delete' statement without 'where' clears all data in the table] should not be shown when selection made by JOIN
BugDBE-9160DataGrip: Error indicated if trying to execute SQL Server procedure using user parameters to pass value

RubyMine 2019.3 EAP3 (193.3793.18 build) Release Notes

DebuggerBugRUBY-25028Debug fails when debug view templates
BugRUBY-25030Debugger doesn't stop in controllers
BugRUBY-24834step into gets stuck on "Can't step into method because it has a c-level implementation"
BugRUBY-24981F7 does not step into initialize
IDEBugRUBY-24997Redundant options in Tools menu
InspectionsBugRUBY-24951noinspection comments do not function when tab is used as indentation
ProfilerBugRUBY-25031ruby-level calls color in profiler graph changed to blue
Rails. Code InsightBugRUBY-24957fails to resolve a method symbol passed to .try!, when the method is otherwise resolvable
BugRUBY-24970symbols passed to rails `delegate` don't resolve
BugRUBY-24954fails to resolve :unless attribute symbols on validation helper methods
Core. IDE SettingsExceptionIDEA-223425Shell environment not loaded
Core. InstallationBugIDEA-222834Cannot open project by relative path across different IDEA instances
Core. Plugin ManagementBugIDEA-222960Plugin conflict between included plugin and Markdown Navigator
Core. Project SettingsExceptionIDEA-222934Cyclic service initialization for bookmarks
Core. Run. ConfigurationsBugIDEA-93940Run/Debug Folders: DnD should support multiple items
BugIDEA-222962Run Anything: invocations history is lost after new command entering
Core. SSHCosmeticsIDEA-222955Error message cannot be fully read
Core. Task ManagementBugIDEA-222938Can't uncheck "Enable Cache" in `Settings -> Tools -> Task`
Editor. Color SchemesExceptionIDEA-216690Exception occurs on importing a color scheme if a color scheme is incompatible
Editor. Editing TextFeatureIDEA-223034Add support for for block caret-friendly braces highlighting and navigation
BugIDEA-221958Quickly pressing Cmd-V and then Cmd-G to jump to next search result doesn't work correctly
Editor. FormatterExceptionIDEA-222855'Adjust code style' on the value of variable causes an exception
Lang. Shell ScriptBugIDEA-216493[ShellScript] 'Rename all occurrences' is available on keywords
Lang. XMLBugIDEA-219411Settings | Languages & Frameworks | Schemas and DTDs: all paths to schema files appear in red though are properly resolved from xml
Lang. YAMLBugIDEA-222915Invalid errors in injections into Java
Tools. DockerBugIDEA-201787Docker: DockerView hangs after running tomee/tomcat
Tools. TerminalBugIDEA-223264WSL paths are not clickable in terminal
BugIDEA-223117Cannot move focus to next project using by IDEA hotkey when terminal is active
UsabilityIDEA-223286`git log` in terminal switches to Version Control tab
User Interface. ControlsBugIDEA-222661Drop-down list size is not adjusted to the list size
User Interface. NavigationUsabilityIDEA-222570Recent files toggles between 3 files, not 2 as it was previously
User Interface. Services ViewBugIDEA-223118Application Servers run configurations appear in the default list of RC to be run in Services after restart only
Version Control. GitPerformanceIDEA-222365"Find commit by hash" takes too much time
Version Control. LogUsabilityIDEA-164276Show progress while executing Git Log indexing
No subsystemFeatureWEB-35796Vue.js: support style element src attributes with support vue-loader
FeatureWEB-41489Curly braces not autocomplete in JSX tags
BugWEB-25969Vue.js $event and $emit should be ignored by inspections inside template tags in vue files.
BugWEB-41421Incorrect 'narrowed to' highlighting if type is not fully expanded yet
BugWEB-41531"Run anything" is not working if package.json is not in the root folder
UsabilityWEB-40899Don't re-evaluate webpack config if there are syntax errors
ExceptionWEB-41499PluginException: Exception in plugin Java Server Pages (JSP)
DebuggerFeatureWEB-21626watch method return value not implemented in webstorm 2016.1.2?
PerformanceWEB-41324Throwable: LEAK: {}.release()
HTMLFeatureWEB-41487HTML tags including attributes in JSX blocks can't autocomplete the closing tag
BugWEB-40570JavaScript fragments weirdly converts apostrophes and quotes
BugWEB-378PHP code in conditional comments
JavaScriptBugWEB-41303JQuery.proxy warning
JavaScript. FrameworksBugWEB-41422Angular: inputs without brackets are reported as unknown if the property type is not explicitly specified
BugWEB-41026Vuejs v-for index is resolved as array type instead of number
BugWEB-41544Vue Class Components: Mixin properties are not resolved in template when using uppercase Mixins from 'vue-property-decorator'
BugWEB-41541No Auto Closing Parenthesis in Vue Single File Components
BugWEB-30600Vue.js: Component binded with v-model should not warn when the prop definition for value is defined as required
BugWEB-40757Can't create @vue/cli@next project (v4.0.0-beta.3)
BugWEB-23401TODO not recognized in JSX comments
PerformanceWEB-41087vuejs autocomplete of tags is slow, taking 3-8 seconds to bring up results
ExceptionWEB-41547IllegalArgumentException: PsiElement(XML_ATTRIBUTE_VALUE).isValidHost() when resolve to file
JavaScript. InspectionsFeatureWEB-40586TS. Accessibility modifier already seen inspection
BugWEB-32647Duplicate case inspection works incorrectly for side-effect expressions
BugWEB-41362"Pointless statement or boolean expression" inspection offers incorrect suggestion
ProfilingBugWEB-41449NullPointerException when attempting to load heap snapshot
StylusBugWEB-41389Stylus: hex color code for opacity not correctly treated
TypeScriptFeatureWEB-41436Support TS control flow assertions and type flow with never-returning calls
BugWEB-41509Incorrect type when destructuring value in arrow function
BugWEB-40228Type duplication in inlay hints for union types
BugWEB-39225TypeScript - rxjs pipe type inference issue
BugWEB-41464Rested destructured parameter is typed to any if nothing else is destructured
BugWEB-41086Wrong type inferring in typescript
BugWEB-41466Insert type arguments completion handler should work only in TS files
BugWEB-41480Renaming a property doesn't update usages when using const assertions
BugWEB-41490Class fields with non-null assertion are parsed incorrectly
UsabilityWEB-41345First item isn't pre-selected in completion popup
TaskWEB-41495More tests for recursive typescript types
Unit TestsBugWEB-41514jest running no longer works properly in IntelliJ (reports tests as skipped)
DB GeneralBugDBE-8736Don't write database model on EDT
DB IntrospectionBugDBE-6627Sequences are not displayed in database structure for H2 databases
Data ViewsBugDBE-9157Quick documentation for database rows produce invalid queries
SQL CompletionUsabilityDBE-9070Option to disable smart join completion
SQL Format and StyleBugDBE-9185Unable to format correctly a view creation query that uses a "With query"
SQL HighlightingBugDBE-9167Snowflake SQL Dialect parsing error
BugDBE-9108Support SONAME syntax
SQL ResolveBugDBE-6494rowversion type is not recognized by Datagrip

RubyMine 2019.3 EAP2 (193.3519.13 build) Release Notes

Code InsightBugRUBY-24988Overridden Object#class Object#to_s Class#new method wrong type inference
BugRUBY-22562YARD - RubyMine adds excessive lines between @params tags generated for a method
BugRUBY-24729"Add @param tag" bugs
BugRUBY-16379Type hinting doesn't work proper inside a block (YARD)
DebuggerFeatureRUBY-16846rails console in the debugger should have a separate debugger console
BugRUBY-24462F7 should at least optionally remain normal step-into
BugRUBY-24982New Debugger ignores breakpoints in rescue blocks
BugRUBY-24781"Uncaught exception: uninitialized constant" when starting a Rails app in debug mode
BugRUBY-24984ruby 2.4.6 vm crash stepping into a method in an if block in a begin block
BugRUBY-24839"connecting to debugger" dialog that flashes too briefly to be read, every time you debug, is not helpful
BugRUBY-24983F7 on `begin` steps into the method invoked on the next line and steps out back to the begin line
IDEBugRUBY-18758Ruby SDK and Gems list refresh produce visual glitching
InspectionsBugRUBY-24716'Add @param tag' inspections displays in search by inspection results block's variable as not annotated
BugRUBY-24978Missing argument other_ary2 for a number of Array methods
Rails. Code InsightBugRUBY-24163False warning "Extra call argument" for order method
BugRUBY-24404invalid "extra call argument" inspection for has_one assoc
Code Analysis. InspectionUsabilityIDEA-221001Quick fixes on an inspection warning should have higher priority than Run/Debug actions
Code Analysis. Language InjectionFeatureIDEA-217838Text blocks: edit injection fragment should trim left spaces
CoreBugIDEA-218430Freeze forever if use `runProcessWithProgressSynchronously` during processing window focus events on JDK11 (SequencedEvent)
Core. DebuggerCosmeticsIDEA-222515Doubled single quote: Source file changed or found source file does not correspond to the breakpoint''s file
Core. Diagrams (UML)BugIDEA-210021Undo is not afailable for file after some diagram is shown for it
ExceptionIDEA-222053NewJavaDiagram action causes NPE
Core. IDE SettingsBugIDEA-221939Settings for new project are applying only after restart
BugIDEA-221456Options for Inlay Hints are rendered too slow
UsabilityIDEA-221387Configure Gutter Icons opens Settings For New Projects
Core. LicensingPerformanceIDEA-222244IDE start takes several minutes when there is no network connection
Core. Plugin ManagementBugIDEA-222061plugin can not be installed just after IDEA downloading and installing
UsabilityIDEA-205043Plugin Manager Dialog steals focus when the Settings dialog is opened
Core. Project SettingsBugIDEA-217659On new project creating the file withe name "$PRODUCT_WORKSPACE_FILE$" is created in .idea
Core. Quick DocumentationExceptionIDEA-218404Edit Source in QuickDoc popup toolbar throws NPE
Core. RefactoringsBugIDEA-222073Error:build: Cannot determine build data storage root for project C:/Users/timur.yuldashev/IdeaProjects/Jigsaw/CannotBuild
Core. Run | Debug. ConfigurationsBugIDEA-183885Maven goals executed as 'run before/after' tasks are not run in the Services view despite settings for maven run configurations
Editor. Editing TextBugIDEA-221667Pressing Option-Enter on warning while info popup is displayed and previous warning hasn't been cleared causes cursor to jump in editor
BugIDEA-220417Expand Selection doesn't select text block contents correctly
BugIDEA-221995Undo removing after rename refactor glitch
BugIDEA-217406Paste multiline text into text box should keep indents
BugIDEA-220956Error tooltip shown on F2 stays longer than it should, and obscures editor contents
Editor. Formatter and Code StyleBugIDEA-188412Formatter markers don't prevent formatting selection when placed after annotation
BugIDEA-165776VCS automatic pre-commit reformat option use a wrong default format preferences
BugIDEA-173076Unable to disable formatter using JSP comments (<%-- --%>)
UsabilityIDEA-216088EditorConfig: consider making "Add properties as comments" off by default
Plugin. Settings RepositoryBugIDEA-219853Cannot enable nor trigger IDE Settings Sync
BugIDEA-220697Intellij 2019.2 cannot sync settings on linux
Plugin. Shell ScriptBugIDEA-222424Execute shell script without ENTER confirmation
BugIDEA-215997[Shell script Run config] "Main" configuration doesn't run if Shell script config in Before Launch section
BugIDEA-222093Shellcheck instances aren't killed
Plugin. Task ManagementBugIDEA-216363Broken password authentication when using JIRA Cloud
Plugin. TerminalBugIDEA-222498Cannot move focus to next window when terminal is active
BugIDEA-141263When changing Theme to Darcula Terminal view remains white
Plugin. TextMate BundlesBugIDEA-220388Disabled Insert paired brackets is ignored
BugIDEA-221617TextMate freezes during Find in Path
ServicesBugIDEA-220860Services View: when grouping by both status and type wrong configurations are run if run is invoked on status node
UsabilityIDEA-220113Bring Status filter back to Services
Services. DockerBugIDEA-222447Docker: Impossible to call "Create..." a container for an image in case of existing run configurations
BugIDEA-221970Docker plugin errors with Docker Enterprise
UsabilityIDEA-156211Docker. Create a container from an image. Don't show the second "Create...".
Services. Password ManagementFeatureIDEA-163275Allow storing passwords using KWallet
ExceptionIDEA-185926Password storage doesn't work: secret_password_store_sync error code 32576
Services. SSHBugIDEA-222345Allow users to update known_hosts in a one click
BugIDEA-220958SSHJ: ConnectTimeout option is being read from config as milliseconds but should be read as seconds
User InterfaceFeatureIDEA-69682Make scrollbars more visible
BugIDEA-222526Esc doesn't close Evaluate Expression window
BugIDEA-220770Services View: when grouping by both status and type is used, the toolbar buttons are disabled for the collapsed top nodes and enabled for expanded ones
BugIDEA-220837Cannot switch between the Debug Console tab and Debugger tab using keybindings anymore
BugIDEA-167805Keyboard navigation in debug tool window
BugIDEA-216416Plugins changelog is missing
BugIDEA-222403UI in Presentation mode is broken after switching from full screen to presentation mode
BugIDEA-221666"Copy Reference..." -> "Absolute Path" or "Content Root Path" does nothing if called from Project tree context menu.
BugIDEA-222310Unify Dark Appearance
TaskIDEA-221926Always show the newest progress text in the status bar, do not group it with older processes
ExceptionIDEA-217476NPE at com.intellij.openapi.actionSystem.impl.ActionButton.performAction
User Interface. Action SystemBugIDEA-221936Enter Full Screen action is missing
User Interface. Console ViewBugIDEA-124688Console scroll to the end - jumps on the end of the line sometimes
BugIDEA-184208Console horizontal scroll position lost on output
User Interface. ControlsBugIDEA-147414Project Area can't resize
User Interface. Find, Replace, UsagesFeatureIDEA-146832Add the "In selection" checkbox on the find tool equals to the replace tool
BugIDEA-216936"Find in Path" called with a selected changelist does not set Scope
UsabilityIDEA-212226Find in Path dialog: option to open results in a separate tab should be keyboard-accessible
User Interface. FocusBugIDEA-221988Escape key does not return focus to the Editor
BugIDEA-200078Double Shift activates wrong main window
User Interface. GraphicsBugIDEA-220577Menu icons in Presentation mode are large
User Interface. NavigationBugIDEA-217535Focus stays on the the latest active element in the popup action list when cursor is on disabled item
User Interface. Project ViewPerformanceIDEA-217348UI Freeze when deleting file (StructureTreeModel update in non-interruptible read action)
Version ControlBugIDEA-222352Checkout dialog with preselected Git does not show inputs at once
BugIDEA-222654Actions are duplicated in Commit Dialog
BugIDEA-222387Non-modal commit: Decrease indent before node
BugIDEA-196619Move to another changelist action only offers changelists not assigned to the file chunks
UsabilityIDEA-222144Get from Version Control should default to Git not CVS
UsabilityIDEA-216547Resolve Conflicts: keep focus in the files list after resolving conflicts by Accepting Yours/Theirs
UsabilityIDEA-163530Preselect VCS in Enable VCS integration
UsabilityIDEA-216646Non-modal commit: confusing checkboxes on empty changelists
UsabilityIDEA-219936Ignore file update should work through document, not PSI
Version Control. GitBugIDEA-222125Update project notification incorrectly considers recents when calculating number of commits matching filter
BugIDEA-220499Git merge --no-commit still perfroms a commit if conflicts occur
BugIDEA-222091When changing themes VCS Diff empty panel stays unchanged
BugIDEA-190333(Git) UnStash Changes dialog does not open if there is a stash with message without colon
BugIDEA-221660Git | Branches | Show Diff with Working Tree should be a Frame
BugIDEA-222440In multi-repository project with synchronous branch control current branch is listed among Common Local Branches with all branch actions
BugIDEA-220907Git Update Project Info doesn't share recent filters with the main Log instance
UsabilityIDEA-216382"Compare with Current" could produce confusing results
UsabilityIDEA-221787"New Branch" and "New Tag" in Git log context menu should be top-level items
UsabilityIDEA-209664Git double-dot: add 'Swap branches' action to the Compare with Current branch action
Version Control. SubversionUsabilityIDEA-219245Add Subversion ignore action to Unversioned Files Dialog
No subsystemFeatureWEB-37464vue.js missing autocompletion for v-slot
FeatureWEB-32255Vue.js - single file components with external script file not resolving
BugWEB-41368Inlay hints are always visible in TypeScript
UsabilityWEB-41215Allow editing textboxes containing list of element names, instead of requiring clunky "Add"/"Remove" diaiog
UsabilityWEB-40818Create package.json in the project root when using Install dependency quick fix
ExceptionWEB-41076PluginException: Cyclic service initialization when open project
CSSFeatureWEB-24298Add quote style settings for CSS
DartBugWEB-41017File sync issue with the Dart Plugin
DebuggerPerformanceWEB-36752Large page in Elements View slows down IDE
File WatchersBugWEB-41091Incorrect path is used if file watcher's Working Directory field is left empty
BugWEB-40982'Failed to run File Watcher' error is displayed several times in the event log
JavaScriptFeatureWEB-41373Support optional chaining in TypeScript and in the type system
BugWEB-41393Обновился до 2019.2 и сломался анализ кода
BugWEB-40713WebStorm don't consider super() return type as this
BugWEB-40520'Split into declaration and initialization' drops type annotations or creates red code in Flow with destructuring
BugWEB-24105'Surround with' doesn't work for object properties with attached JSDoc comment
BugWEB-40962"Script is not in strict mode" when using "use strict" pragma with escaped quotes in injection
BugWEB-41252'Replace nested calls with pipe expressions' looses parameters
BugWEB-19393ajax beforeSend falsely reported as unused function
BugWEB-41249'Replace nested calls with pipe expressions' is incorrectly applied in Jasmine tests
BugWEB-41041Wrong highlighting for braces in template literals
BugWEB-41399No completion on Express req/res parameters
BugWEB-41270Incorrect JavaScript warning: 'Value assigned to primitve will be lost'
UsabilityWEB-41044Lack of clear sorting of object properties in output type hints
UsabilityWEB-40964Mismatch settings with the editor for examples in dialog 'Inlay hints'
UsabilityWEB-38439Typing semicolon doesn't move caret after statement
TaskWEB-40895Implement JSControlFlowProcessor using CF graph
ExceptionWEB-34766"Convert to forEach call on array" exception on invalid code
JavaScript. FormatterBugWEB-41063Quote style from javascript is not applied to postfix completion
JavaScript. FrameworksFeatureWEB-32274Support Vue components defined using separate JavaScript, HTML and CSS files
FeatureWEB-28442Vue.js: scoped slots support
FeatureWEB-40909Vue.js: support named slots shorthand
FeatureWEB-40277Vue: support vuex-class decorators
BugWEB-40955Vue.js: vuetify `v-col` component is reported as unknown
BugWEB-40929Vuex store state/getters/etc are not resolved in attribute values in templates
BugWEB-41366Vue is missed in 'File | New'
BugWEB-41349No completion and refactoring for slot props
BugWEB-41020After 2019.2.1 update Vue + TypeScript + Decorators stopped working
ExceptionWEB-41365NoSuchElementException: Sequence is empty. when type in .vue file
ExceptionWEB-41350PsiInvalidElementAccessException when call completion in vue.js expression
JavaScript. InspectionsBugWEB-40150Unresolved variable
JavaScript. RefactoringFeatureWEB-33038"move function 'myFunc' to 'myFunc.ts'" intention action
FeatureWEB-34116Can't create/extract constant to the top level of the file
FeatureWEB-14450Provide "Extract Constant" refactoring
BugWEB-40042'Introduce variable' deletes the preceding comment
BugWEB-38305Implement all members doesn't respect quote style setting
BugWEB-41103Extract Angular animation into a variable fails
BugWEB-40833Checking/unchecking 'Optional parameter' in the popup fails for 'Introduce parameter'
Live EditBugWEB-7093File is saving after every keypress when using Live Edit
Node.jsBugWEB-41095package.json homepage url issues
BugWEB-40947package.json "Latest version" in quick documentation doesn't refresh
UsabilityWEB-40794Prevent concurrent NPM install
TypeScriptFeatureWEB-29437Refactor / Extract Field: add readonly field
FeatureWEB-41033Update bundled TypeScript to 3.6
BugWEB-41035Completion for declare keyword after export in TypeScript
BugWEB-40970TypeScript 3.6. ambient class and function can merge
BugWEB-41388Incorrect type inference in TypeScript
BugWEB-41374Wrong "statement expected" error when using computed property with decorator
BugWEB-41042Type hints for variable show redundant information in object destructuring with enum
BugWEB-41333Missing typescript suggestion of extended "this" object
BugWEB-40481Autocompletion bails for rest parameter typed w/ intersected arrays
BugWEB-40615Enum fields with dot in the name are treated incorrectly
UsabilityWEB-41082Improve string literal completion: don't suggest dynamics when not needed and add icons for prop keys
Unit TestsFeatureWEB-41079Add the ".unit" extension to test files patterns
No subsystemBugDBE-9124«Modify Table» dialog (⌘F6) shows several DDL commands even when a user didn't modify something
DB ConnectivityBugDBE-9052Error: "No subject alternative DNS name matching localhost found." when connecting to Redshift with "Use SSL" enabled
DB ConsoleBugDBE-9068Can't execute selected part of SQL query in .cs file
DB RefactoringBugDBE-9050Invalid Nullable type composition for ClickHouse LowCardinality
Data Import & ExportBugDBE-9098Can't import data from a CSV that includes IDENTITY column data to a SQL Server table
Data ViewsFeatureDBE-7980Set NULL via typing
SQL GenerationFeatureDBE-7893Procedure is missed in Generate menu
SQL HighlightingBugDBE-9105SQL error when using quoted shame and a table name starting with a number on 2019.2.2
BugDBE-9084IDE don't recognize 'VALUES (expression) table value constructor' in MariaDB 10.3 and above
BugDBE-9095Syntax highlight for ASYMMETRIC KEY
BugDBE-9056Columns referenced from PostgreSQL variables with RECORD data type result in unresolved reference error
SQL RefactoringBugDBE-9093Intention 'Replace IN expression...' corrupts code

RubyMine 2019.3 EAP1 (193.2956.44 build) Release Notes

Code InsightFeatureRUBY-19766Go To > Declaration and Navigate > Class do not work with class/module constant assignment
BugRUBY-24546`Class` type isn't recognized correctly
BugRUBY-24637EA-145326 exception when invoking convert if to ternary operator
BugRUBY-21841add type prioritization during type inference.
BugRUBY-18544trailing comma in a method call is not flagged as an error
BugRUBY-21964activeadmin gem breaks resolution of `create` methods
BugRUBY-24146"go to implementations" for constants does not work
TaskRUBY-24363Create tests for Ruby Standard Library
CucumberUsabilityRUBY-24584Escape in Create New Step Definition file dialog doesn't close the dialog immediately
DebuggerTaskRUBY-24491Test that bundled `debase` gem c-sources are obfuscated
IDEBugRUBY-24845move cursor to code block end/begin does not work for opened singleton classes
BugRUBY-24396Update ruby class/module/method & other relevant elements to support "ctrl click/hover" for "Show usages of X"
CosmeticsRUBY-24670Move "Run Rails Generator..." below "Ruby File/Class" in new dialog
TaskRUBY-24291Change Ruby plugin file version from date to the build number
InspectionsFeatureRUBY-23098Implement possibility to configure RuboCop severeties mapping
BugRUBY-24865Incorrect "Safe navigation can be omitted" inspection
BugRUBY-24151invalid "unused variable" inspection
BugRUBY-24874Incorrect "Don't put space before arguments parentheses" with range as array declaration
BugRUBY-24150invalid "variable can be uninitialized" inspection
BugRUBY-24801Ruby parser error
ParsingBugRUBY-22349Lexer/Parser sometimes does not reparse "corrected" syntaxes
BugRUBY-24780Trailing comma is not allowed in method definition
BugRUBY-24756Parser finds fault with valid block parameters
BugRUBY-24827Unexpected syntax error in changing inherit class
QuickDocBugRUBY-24701Documentation text should be shown for attributes and named structs
RailsFeatureRUBY-24026Allow specifying Stimulus and Elm as the JavaScript library for new Rails projects
BugRUBY-24949Rails Generators action is available for non-rails projects
BugRUBY-24752YAML editor reports invalid property key
ExceptionRUBY-24694Exception renaming a class
Rails. Code InsightBugRUBY-24526Rails 5.1: bigint cannot be resolved in schema.rb
BugRUBY-24129ActionMailer: Wrong autocompletion, nonexistent create_* and deliver_* methods
BugRUBY-21636polymorphic associations support does not work with concerns
BugRUBY-24651Fix support for find usages on rails enums
BugRUBY-24095'Missing argument' raised when using ActiveRecord "take" method
BugRUBY-16272editor fails to resolve partials in view folders of superclasses
Rails. ParamdefsBugRUBY-23045Joins assoc paramdef takes the assoc names from the current class, not the context when nested
RefactoringsFeatureRUBY-20974ruby > "extract mehtod" default use "public", not private
BugRUBY-22561Delegate call type creates references that refer to the call, not the arguments - this impacts rename refactoring, find usages, etc.
BugRUBY-24712Name of the factory file corresponding to the old factory name is not renamed
BugRUBY-24632Possible to extract rescue, ensure and else blocks
Ruby. FormatterBugRUBY-23864"Use indents relative to expression start" doesn't work for begin-rescue-end
BugRUBY-24748Extra indentation added for second & subsequent arguments in class methods
BugRUBY-24524Minitest do block has spaces instead of the tabs as in settings
BugRUBY-20969New line in multi-line hash definition is not indented when typing
UsabilityRUBY-24679When using chain calls with prefix dot, typing is inconsistent with re-formatting
Run ConfigurationsUsabilityRUBY-23186Make as many run configurations as possible dumb aware
TestsBugRUBY-9998Mailer related tests/specs are not found
TaskRUBY-24355Remove all uses of RailsConstraint and replace with GemSuite.Constraint
Code Analysis. DuplicatesBugIDEA-221014Many "JavaScript/TypeScript" entries in duplicate settings.
Code Analysis. InspectionFeatureIDEA-214558Reactor inspection: Warn when returning nulls from Flux/Mono transformation functions
BugIDEA-188820Out of memory when exporting code analysis to HTML
BugIDEA-217597Clicking on checkbox in the Inspections tree leads to `profileChanged` event in `ProfileChangeAdapter.TOPIC`
BugIDEA-220740Run Inspection -> Custom Scope value is not persisted
PerformanceIDEA-220137Do not run inspection iterations if LocalInspectionTool returned PsiElementVisitor.EMPTY_VISITOR
Code Analysis. Language InjectionBugIDEA-218402Database plugin - SQL syntax highlighting is not working in JavaScript strings if DECLARE is used
ExceptionIDEA-221436NullPointerException when move folders in project tree
Code Analysis. Structural SearchFeatureIDEA-216174SSR: Auto-insert pair $ when editing search/replace template
BugIDEA-218006SSR: AssertionError at com.intellij.structuralsearch.impl.matcher.JavaMatchingVisitor.visitClass
BugIDEA-65982Structural search and replace doesn't correctly substitute annotation parameters
BugIDEA-204454Structural Replace doesn't have replacement variables anymore
BugIDEA-221361Replace variable number of parameters with fixed type correctly
UsabilityIDEA-81912SSR - Restore the last text in the SSR dialog
UsabilityIDEA-201471SSR: Do not use default input field focus for the Text Area
UsabilityIDEA-216177SSR: Don't show intention actions in Search Template field
UsabilityIDEA-210319SSR: Irrelevant completion variants when typing $
CosmeticsIDEA-201475SSR: Darcula: Use the same border for the template editor and the variables filters pane
CosmeticsIDEA-216180SSR: Don't show quick doc on hover in Search Template field
CosmeticsIDEA-218151Baseline for filter hint is lower than other text
ExceptionIDEA-218193MalformedPatternException occurs when specifying malformed search template
Core. Diagrams (UML)BugIDEA-216951Repaint Maven/Gradle diagram only once per selection change in "Show Paths: Root->Selection" mode
ExceptionIDEA-218015Attempt to export any diagram to svg image fails with NPE
Core. File SystemFeatureIDEA-152607Non-destructive "safe write" mode
PerformanceIDEA-218043Freezes in scheduleInitialVfsRefresh
Core. IDE SettingsBugIDEA-211157File and Code Templates shows incorrect include header for Default scheme
BugIDEA-217321IOException - 'example/path' is not a directory in VFS
BugIDEA-124684Customize menu and toolbar not persisting/broken
BugIDEA-198276Registry returns default values (not the user ones) at early stages of application loading
BugIDEA-219420"Editor | Inlay Hints" settings are not persisted between restarts
UsabilityIDEA-217609UI cleanup for Settings | Editor | Smart Keys
UsabilityIDEA-136209"Small labels in editor tabs" should be in "Editor Tabs" configuration section
UsabilityIDEA-207984Ambiguous description: small labels in editor tabs
Core. IndicesBugIDEA-216643wrong TODO counter for database console
PerformanceIDEA-219456Contentless indices load file content due to file type detection
TaskIDEA-216231Research on possible advantages of a common map for SerializedStubTree & IndexedStubs
Core. JSONBugIDEA-221552Unit Test fails for custom plugin when trying to load a JSON file
Core. Navigation and SearchFeatureIDEA-160274Field Call Hierarchy
BugIDEA-221398Go to Declarations and Usages from popup doesn't jump to class definition
PerformanceIDEA-211967IDEA 2019.1 freezes while searching for Todo items
Core. Platform APIFeatureIDEA-215436Method with experimental\internal parameter or return type should be considered experimental\internal on its own
FeatureIDEA-218478Register ConcatenationInjectorManager service in the platform
BugIDEA-215432Internal\experimental API member usage inspection must check if declaring class or package is marked internal\experimental
BugIDEA-216172Profiler says that ApiUsageUastVisitor#isInsideImportStatement may be slow
BugIDEA-219855Unable to build an empty IDEA plugin project with 2019.2 target
UsabilityIDEA-212107Need a way to respond to file edit without creating a FileEditor in a plugin
TaskIDEA-217639Get rid of reflective access in `com.intellij.ide.ClassUtilCore#clearJarURLCache`
Core. Plugin ManagementBugIDEA-219259Queries in plugin list unavailable during indexing
Core. ProfilerFeatureIDEA-217015Need own time in methods list
FeatureIDEA-219359Provide "Callees list" in addition to "Back Traces" and "Merged Callees"
FeatureIDEA-218137Profiler: to open zipped collapsed async profiler dumps
BugIDEA-221007Profiler call tree: strange horizontal scroll state after jumping from flame graph to call tree
BugIDEA-221005Profiler flamechart: one pixel line on the right of component isn't updated
Core. Project SettingsBugIDEA-111848Move of .iml file does not update the reference in modules.xml
BugIDEA-222246Inspection settings are not saved
BugIDEA-221500New module created in Project Structure dialog may get explicit module group assigned breaking grouping by module names
BugIDEA-221596JavaDoc and annotations paths may be reordered in *.iml file on save
PerformanceIDEA-216510Freezes in ConversionServiceImpl.getProjectFilesMap
Core. Quick DocumentationBugIDEA-216893Quick documentation is shown even without moving the mouse
BugIDEA-220127Anchor links within the same document don't work sometimes
BugIDEA-218115QuickDoc popup changes its user-defined size on navigating by links
BugIDEA-212331Anchor links do not work in QuickDoc
UsabilityIDEA-189703Documentation doesn't appear on hover on the element with warning
Core. RefactoringsFeatureIDEA-129547Rename module and directory at the same time
BugIDEA-216354com.intellij.codeInsight.hint.ShowParameterInfoHandler#getHandlers doesn't respect "order" attribute
ExceptionIDEA-219687"java.lang.Throwable: AWT events are not allowed inside write action" on Undo during Rename operation
Core. Run | Debug. ConfigurationsFeatureIDEA-182193Intention to create a new Run configuration for executable class
BugIDEA-219327Run/Debug actions on toolbar aren't shown until 'Edit Configurations' dialog is opened
BugIDEA-215196Runner content ui has left border when its toolbar is not visible and new tabs is enabled.
BugIDEA-215194Run console toolbar is not separated from console editor when new tabs is enabled
BugIDEA-157989"Stop" button does not work when the IDE is launched as a background task
BugIDEA-131597Filtering is not applied to "irrelevant" run configurations
BugIDEA-215363Generate JavaDoc passes java11 style --source-path to java8 javadoc binary
BugIDEA-216291No paste button in Tomcat Run/Debug configuration Startup/Connection
Core. XMLBugIDEA-192427Invalid URI resolution for dependent external resources with absolute path (XML schema files)
BugIDEA-215634com.intellij.util.xml.DomFileDescription#isMyFile: parameter module is always null
PerformanceIDEA-212283DOM: xinclude performance problem
EditorBugIDEA-221335Exception in plugin aborts the whole Copy/Cut operation
BugIDEA-217903Inlay Hints: doubled hints on changing the file extension
BugIDEA-216746Inlay hints: Use editor font for editor
BugIDEA-216360Code vision selection background overrides editor margin
BugIDEA-216745Inlay hints: Select first item in the list when opening a settings page
BugIDEA-221337Joining lines performance is slow
PerformanceIDEA-219760Editor may start faster
UsabilityIDEA-216743Inlay hints: Add explanation text on root page of the settings
UsabilityIDEA-218340Escape required characters when copy-pasting text between different types of string literals
CosmeticsIDEA-216747Inlay hints: Increase space between checkboxes and "Black list..." label
TaskIDEA-217669Use same delay for popups shown on mouse hover in editor
ExceptionIDEA-221262IAE at org.jetbrains.plugins.github.pullrequest.comment.ui.EditorComponentInlaysManager
Editor. Code CompletionBugIDEA-221425Code completion broken and not configurable
BugIDEA-219161Empty bottom advertisement text in non-completion lookups
BugIDEA-220191How do you customize the CompletionPopup background color?
ExceptionIDEA-219655NSEE at kotlin.collections.MapsKt__MapWithDefaultKt.getOrImplicitDefaultNullable
Editor. Diff and MergeFeatureIDEA-216868Diff could tell if binary files are different
FeatureIDEA-218189Show scope background color in Diff window files popup
BugIDEA-215841Directory diff finds binary content differences in some big binary files, while they are the same
BugIDEA-220960Compare files doesn't respect Soft wrap option
BugIDEA-220681Wrong Differences ignored label
BugIDEA-218187Diff/Merge files drop-down has strange files sorting
UsabilityIDEA-220861Merge dialog: Actions buttons should be disabled if file is not selected
ExceptionIDEA-220582NPE at
Editor. Editing TextFeatureIDEA-125325Join lines in custom file type should handle end-of-line comments
BugIDEA-221610Need to click twice to unselect identifier that is being renamed
BugIDEA-216967Folded values of properties from resource bundles are not changed on property value changing in *.properties file
BugIDEA-215899Folded property value editing: if PasteFromHistory (Ctrl-Shift-V) is invoked in value editor, Esc closes editor instead of ChooseContentToPaste dialog
BugIDEA-218068Javadoc comments folding captures code on the same line
BugIDEA-221642Incorrect parameter popup highlighting range
BugIDEA-210020Search highlight color does not change when changing theme
BugIDEA-215896Folded property value editing: incorrect cursor after Expand invocation in case of long property value text
BugIDEA-218901Limit Description width in inspections popup
BugIDEA-217073Burmese language literals irreversibly break the editor
BugIDEA-217353Paste inside text block should escape opening/closing quotes
UsabilityIDEA-204308Multiline TODO popup interferes with editing the TODO.
UsabilityIDEA-215414Toggle Case action must preserve selection if changed text expands
UsabilityIDEA-216380When folding Javadoc comments do not show ellipsis if full content is shown when folded
CosmeticsIDEA-185041Tabs rendering for show whitespaces are too intrusive, and space rendering look too much like periods.
Editor. Error HighlightingBugIDEA-217862False code inspection on methode reference on protected class for inheritence in different package
Editor. Formatter and Code StylePerformanceIDEA-218532Freezes in CodeStyle.getSettings
CosmeticsIDEA-218180JavaScript language level is used in the Configure indents action name instead of JavaScript
Editor. Intention ActionsBugIDEA-219577Create File intention popup does not support speed search in the options popup
BugIDEA-218163CreateFileFix creates files in sources instead of resources locations in Gradle / Maven projects
BugIDEA-220487Create File Intention: in the target roots drop-down the inconsistent slashes are used (in case of missing directories)
TaskIDEA-217596Redesign tooltip for warnings/errors on scrollbar
Infrastructure. Packaging and InstallationTaskIDEA-220738Bundle Kotlin 1.3.50 with IntelliJ IDEA
TaskIDEA-219542Enable Bytecode Verification by default
Plugin Development (DevKit)FeatureIDEA-203877Help to write PersistentStateComponent correctly
FeatureIDEA-219724Devkit: support <projectListeners> (2019.3+)
FeatureIDEA-206060DevKit: deprecate Project Wizard
FeatureIDEA-219619plugin.xml: highlight EP/EP-attributes annotated with @ApiStatus.Experimental
FeatureIDEA-220700plugin.xml: suppress spellchecking for EP attributes marked with @NonNls
FeatureIDEA-211503Devkit: specifying ApiStatus.ScheduledForRemoval without Javadoc
BugIDEA-219140Devkit: support <applicationListeners> (2019.3+)
BugIDEA-217581Devkit plugin.xml I18n: take into account all ConfigurableEP/InspectionEP classes
BugIDEA-221095Devkit: resolve EPs when used via xinclude or <depends>
BugIDEA-217183DevKit: PluginXmlDomInspection should not request icon from implementation-detail plugins
TaskIDEA-216155@ScheduledForRemoval: inspection that warns if API marked with SFR must already be removed
TaskIDEA-221351Devkit: include 'com.intellij.modules.platform' dependency by default in plugin.xml templates
Plugin. MarkdownCosmeticsIDEA-221369Make grayscale antialiasing the default in Markdown preview
Plugin. Shell ScriptBugIDEA-221031Shell script removes '/' slash from execution command
BugIDEA-215936Shell Plugin :: Tab Size In Editor Doesn't Match Size Configured In Settings
BugIDEA-218250Cant define working directory for ShConfigurationType
BugIDEA-220421Java classes are suggested in completion popup
BugIDEA-219544shell script format problems with locale
BugIDEA-219427Shell Script command appended to current Terminal command line
Plugin. Task ManagementBugIDEA-207486[Task Management] the task dropdown in the toolbar is disabled for the newly added server in the fresh IDE installation
Plugin. TerminalFeatureIDEA-116253font zooming does not work in terminal tool window
BugIDEA-220774Terminal failed to start on Windows (blocked by antivirus)
BugIDEA-219379Terminal sessions are lost on every major update
BugIDEA-180204Terminal output garbled after specific file has been printed out
BugIDEA-2195992019.2 JBTerminal throws java.lang.Throwable: Directory index may not be queried for default project
ExceptionIDEA-163345"Could not set clipboard: cannot open system clipboard" (#171.584)
Plugin. YAMLFeatureIDEA-212876Made an option to disable (or change) key sequence paste feature
ServicesBugIDEA-220472Services View: for the Compound Run Configuration Debug is disabled
BugIDEA-220601Services: text in speed search popup is red even if the tree contains matched nodes
Services. SSHBugIDEA-220081SSHJ: Hash hosts in known_hosts file setting ignored
User InterfaceFeatureIDEA-203207Touch Bar: Options on the Touch Bar should be filtered when searching in popup
FeatureIDEA-101757Copy status message to clipboard
BugIDEA-218342IDEA crash on a dropdown filtering
BugIDEA-215943Expand button for "No proxy for" field insert spaces instead of commas
BugIDEA-219479New License Dialog: Show error message in bottom part
BugIDEA-218080"Open Project" dialog does not appear if opening a project via "Open Recent" main menu
BugIDEA-217907Error message in status bar is truncated
BugIDEA-218782'null' user account name when trying to sync settings on freshly installed IDEA
BugIDEA-204463Touch Bar: Items in "Add to Favourites" list disabled in IDEA UI are not disabled on the Touch Bar
BugIDEA-221233Smooth mouse wheel scrolling mishandles some burst scroll events on Windows
BugIDEA-220046Editor tabs: editor tabs icon jumps down on tabs layout changed
BugIDEA-221532"Recent Files" list flickers on hovering
BugIDEA-220057NPE in NotificationsManagerImpl.findWindowForBalloon
BugIDEA-221112Incorrect text painting in goto class
BugIDEA-218593Project window does not restore "maximize" state
BugIDEA-216347Tabs in color themes: ToolWindow.HeaderTab.underlinedTabForeground / underlinedTabInactiveForeground don't work
BugIDEA-221491Tab placement none doesn't work with table layout
BugIDEA-220663Empty frame when project is opened in current window
BugIDEA-221330Tabs painting artefacts after disabling tabs
BugIDEA-207914Validation message doesn't fit explanation text
BugIDEA-220729"Open" project link doesn't work on Welcome screen
BugIDEA-218687Select the only plugin on the right on search
BugIDEA-216341Tabs in color themes: ToolWindow.HeaderTab.hoverBackground is applied incorrectly to an inactive tool window tab
BugIDEA-221860'Exit from Fullscreen' is broken on mac
BugIDEA-221755Project opened from fullscreen is windowed
UsabilityIDEA-211035Tabs Placement: None should affect only tabs visibility
UsabilityIDEA-18213MacOSX: Use Cmd+Enter instead of Ctrl+Enter
UsabilityIDEA-119140"Find in path" dialog missing tabstop for "File mask(s)" checkbox
UsabilityIDEA-76396Make MouseWheel scrolling smooth
UsabilityIDEA-217044Better wording for "Autoscroll to source", "Autoscroll from source" and "Scroll to source"
UsabilityIDEA-116865Add the ability to bind "Jump to Editor" to a key other than escape
UsabilityIDEA-219185New License dialog: Wrong dialog size
UsabilityIDEA-55081Allow date format customization
UsabilityIDEA-104317Javadoc with images using the data: scheme are shown as broken images.
UsabilityIDEA-218869New error tooltip with action is hard to use for multi-line error
CosmeticsIDEA-221352"Multiple libraries contain the file" text doesn't fit the popup header
TaskIDEA-215788Remove group headers where they are not needed (in Preferences)
TaskIDEA-216355Debugger: do not underline tab if there is only one tab in a group
TaskIDEA-216075Convert New File action to the same popup design as New Class
ExceptionIDEA-198352"java.lang.Throwable: null topic; dialog=class" after invoking "Context help" ("Help" button, F1) in a dialog with no help available
ExceptionIDEA-216781Exception occurs on opening Spelling tab in Settings
User Interface. Action SystemBugIDEA-220573It takes a long time for context menu to appear when right-clicking on 1000 files in a directory
UsabilityIDEA-218224Request: always offer "show in explorer" when it's a file in the file system
User Interface. ControlsBugIDEA-218270Toolwindows in 'Window' mode are hardly accessible
BugIDEA-215218[Debugger tabs] all tabs are opened after IDE restart with Undocked view mode
CosmeticsIDEA-215252Git Login window — the width of Username and Password fields is not equal
CosmeticsIDEA-215220[Debugger tabs] add a tooltip to the icon under which all tabs options are shown
CosmeticsIDEA-214806"JRE" combobox is cut in Maven Runner Settings
User Interface. Find, Replace, UsagesBugIDEA-191582FindInPath & ReplaceInPath: Regexp: incorrect behavior in case of malformed replacement string
BugIDEA-172063find in path preview hides file extension if filter mask is set, even if several extensions are allowed
BugIDEA-166862Find/Replace: Do Refactor button disappears
BugIDEA-202674IntelliJ froze after trying to open result from find in path dialog
BugIDEA-214836IDE freezes in "Find in path" while scrolling through found files
BugIDEA-173424Find in Path results sorting in random order
UsabilityIDEA-56579Find Usages dialog could preserve option values
User Interface. FocusBugIDEA-221394Focus is lost when switching project using "Recent projects"
UsabilityIDEA-211276Refactoring preview "Do Refactor" cannot be handled from keyboard because it does not gain focus
User Interface. Keyboard InputBugIDEA-216141Typing Alt+Letter is broken on macOS in IDEA 2019.2 because of a mnemonic related issue
BugIDEA-220414"Jump Outside Current Bracket/Quote" does not work with Emacs Tabs
User Interface. Look and FeelBugIDEA-221356"Cannot set High contrast theme" error on attempt to set High contrast theme
UsabilityIDEA-219108Checkboxes for plugins are right next to scrollbar, leading to frequent operator error
User Interface. NavigationBugIDEA-220990Configuration 'Use "CamelHumps" words' does not appear in 'Find Action...' window
BugIDEA-217470Next enabled option will be selected if disabled one was called from keyboard
PerformanceIDEA-217855Go to Action: don't init all configurables on EDT
UsabilityIDEA-220792"Recent Files" popup no longer remembers it's dimensions
TaskIDEA-217686Not clear what In-place Descriptions menu item means
User Interface. Project ViewUsabilityIDEA-85947Need to rename "synchronize" context menu item
Version ControlFeatureIDEA-220779Add recent commit messages into completion list
FeatureIDEA-212693Support Issue Navigation from annotate/blame commit tooltips
FeatureIDEA-218460Browse Repository At Revision: support Annotate
FeatureIDEA-73223More completions in commit message editor. Not only for file names, but method/field names, etc.
FeatureIDEA-178283Add 'Copy as Patch to Clipboard' to the Shelf view
BugIDEA-215930Rewording commit by shortcut (F2) invokes edit changelist dialog instead reword dialog
BugIDEA-210224Synchronous execution on EDT: unshelveChangeList on Update Project
BugIDEA-218842Diff In Commit-dialog: In Unified View the first chunk is not in focus on dialog opening
BugIDEA-221637Unversioned files selected in "Local Changes" are not checked by default in commit dialog on "Commit Project" invocation
BugIDEA-216607Undo in the editor removes checkbox in the commit pane
BugIDEA-217856Find action: "Changelists: Enable changelist conflict tracking" cannot be enabled and does not exist in settings
BugIDEA-221627Non-modal commit: Checked unversioned files are unchecked on Ctrl + K
BugIDEA-218809"Paths Affected in Revision" window is not shown anymore if to close the underlying diff
BugIDEA-184345Regression - Git Branch Spacebar Functionality
BugIDEA-221535Non-modal commit: Commit button in not getting enabled when only unversioned files selected
PerformanceIDEA-218483ChangesViewManager may load it's state lazily
UsabilityIDEA-207787Silent Unshelve silently ignores a file if it doesn't match the base
UsabilityIDEA-216488Do not show "View 0 commits" after unsuccessful update with conflicts on rejected push attempt
UsabilityIDEA-218356could you please stop popping annoying "Adding file to VCS" messages
CosmeticsIDEA-221406Typo in "Project from Version Control"
TaskIDEA-217302Remove "VCS History Cache Settings" panel from "Version Control" -> "Background" settings
TaskIDEA-217255HierarchicalFilePathComparatorTest is in different package than testee
ExceptionIDEA-217482Synchronous execution on EDT on "Fix and Commit" on commit line separators
Version Control. GitFeatureIDEA-173936Smart checkout could use shelf instead of stash
FeatureIDEA-164356Let push a branch which is not current branch
FeatureIDEA-168476git interactive rebase: Add "drop" option
BugIDEA-170401Canceled Commit task reports that the file has been committed while it has not
BugIDEA-217872Changing the Update Info Filter in the Settings doesn't activate the "Apply" button
BugIDEA-220998Cherry-pick without dialog doesn't synchronize file system changes to the VFS
BugIDEA-210229Wrong baseline for branches statusbar widget
BugIDEA-220504Git | Pull is broken because missing some GitBundle properties
BugIDEA-217569Rename selected branch from Branch Popup do not affect repos which contain this branch as current
BugIDEA-1994983-way merge shows wrong hash of incoming commit during interactive rebase.
BugIDEA-217242Git hooks don't run unless you open "Commit Options" popup
PerformanceIDEA-220438Don't use reflection to read git config via ini4j
UsabilityIDEA-152791File with reverted staged changes is highlighted as changed (blue)
UsabilityIDEA-220048Add a setting to select Shelf or Stash as a preferable method to preserve local changes
UsabilityIDEA-81532Git: cannot force add a file which is on .gitignore list
UsabilityIDEA-149015Rename "Git | Revert" action to avoid confusion with `git revert` command
CosmeticsIDEA-221248Typo in the description of interactive rebase.
CosmeticsIDEA-221703Tag dialog: change tooltip text on Validate button
ExceptionIDEA-221695Throwable at org.jetbrains.git4idea.ssh.GitXmlRpcHandlerService.getXmlRcpPort
Version Control. Local HistoryUsabilityIDEA-73911Implement user-friendly method toString in class com.intellij.history.core.revisions.RecentChange
CosmeticsIDEA-195993Recent Changes dialog needs some spacing
CosmeticsIDEA-220623Recent Changes dialog design
Version Control. LogBugIDEA-209131If the project name contains an underscore '_', the underscore does not appear in the Log Paths combobox.
BugIDEA-219575memory leak
PerformanceIDEA-217010VcsLogManager leaks project
PerformanceIDEA-217125Git log component update is very slow
UsabilityIDEA-193806Display errors which affect displayed information in the Log
Version Control. MercurialBugIDEA-220350Push commits dialog (mercurial): should enter remote URL on every push
UsabilityIDEA-73341Mercurial: allow adding ignored files
Version Control. TFSCosmeticsIDEA-215448Add Items to TFS window - there is no "NO" option. Should be either both (text and button) No or Cancel
No subsystemFeatureWEB-39636Intention action to convert nested calls to a pipe expression and vice versa
BugWEB-40027Incorrect "variable initializer is redundant" message
BugWEB-40777Run anything: yarn is not shown in the list of available commands
BugWEB-38017Red code is generated when creating a new variable inside `for` content
PerformanceWEB-17638Joining Lines works extremely slow
Build toolsBugWEB-40782'Run Anything': List scripts from package.json when typing `npm` or `yarn` regardless what tool is set in preferences
CSSBugWEB-37978Webpack aliases not resolved in URLs in CSS properties
BugWEB-35236Import of css files with webpack aliases is not resolved in case of '@import url()'
BugWEB-40898CSS padding property hint auto is invalid
CoffeeScriptBugWEB-34310CoffeeScript: "Change signature" refactoring doesn't work
DebuggerBugWEB-38477Debugging with "js.debugger.use.node.options" fails if path to TEMP directory contains non-ASCII characters
BugWEB-40694Debugger doesn't stop on a breakpoint in Kotlin/JS project
BugWEB-13411Node.js: can't set value in debugger
BugWEB-41007Can't debug node.js - get error 'URI is not hierarchial'
BugWEB-36471WebStorm Debugger variable set value error.
File WatchersFeatureWEB-36668Allow enabling global file watchers for all new projects
BugWEB-40636Strange intention actions: just 'Yes' and 'No'
BugWEB-29424Race condition between saving file and file watcher execution
CosmeticsWEB-40053File Watchers: column header in Settings is not fully visible
JSONBugWEB-40927Editor is breaking JSON syntax when inserting new line after key-value pair
JavaScriptFeatureWEB-38784Support Promise.allSettled
FeatureWEB-2089Implement AMD declaration linking
FeatureWEB-32472Validate duplicate ES6 exports in JS
FeatureWEB-40240Suggest awaited items in code completion for promises
FeatureWEB-40404Extract single property from object as a shorthand property, not as spreadElements
BugWEB-30569ES6 classes: Generated code doesn't take comments at the end of the class into account
BugWEB-28204'Create variable' quick-fix shown when not applicable (in variable type annotation)
BugWEB-36802'Safe delete parameter' should check for usages inside function and show conflicts dialog
BugWEB-21935Wrong highlighting for 'del' word in gulpfile.js
BugWEB-36461Double `flip if-else` results in double parenthesis
BugWEB-40009JSDocs and Promise all not working
BugWEB-40192Quick fix: Joining variable declaration adds redundant indent for a comment
BugWEB-39875JS Intentions: JS: Converting arrow function to anonymous function breaks on IIFE
BugWEB-40659Intention "Extract increment" in for loop generates invalid code
BugWEB-40662Intention: Incorrect replacing const with let in for-of loop
BugWEB-40538Exception when file has several default exports
BugWEB-38545Invalid highlighting for JS Classes after including via require
BugWEB-40637Replace with indexer access produces malformed code in HTML context
BugWEB-40492Unicode code points are not supported in JS identifiers
BugWEB-40393'Create Directory/File' fixes don't work with relative paths in 2019.3
BugWEB-28080Extends ES5 classes with ES6 classes is not supported
BugWEB-38679Type mismatch inspection incorrectly matches JSDoc type expression with destructuring parameter
BugWEB-38677JSDoc: wrong type mismatch errors when using function type with IIFE
BugWEB-39441CommonJS: completion for exported symbols when using const {freeze} = Object; module.exports = freeze({})
BugWEB-40655Duplicate 'Simplify' items in Alt+Enter for conditional
BugWEB-38392False 'unused definition' when re-defining a property initialized in constructor
BugWEB-40194Quick fix: Joining variable declarations with export removes export
BugWEB-40285'Split into declaration and initialization and move to scope start' duplicates variable initialization in for-in loop
BugWEB-40100Merge 'simplify' intention and inspection
UsabilityWEB-40195Quick fix: Improve availability of 'Quote/Unquote property names' after lbrace and for commas
UsabilityWEB-40096Quick Fix: JS/TS: "Join Concatenated String Literals" duplicates the functionality of "Compute Constant Value "
TaskWEB-40821Enable type hints by default for function parameters
TaskWEB-40421Support having decorators after the 'export' keyword
JavaScript. FormatterBugWEB-13538Wrong indent for comments in chained function calls
BugWEB-38347Formatting unindents comments in braceless ifs
BugWEB-38291Reformat Code (Ctrl + Alt + L) deletes empty space between curly brace and 'from' keyword
BugWEB-28301Formatter: support Rearrange Code action inside script tag
BugWEB-40497TypeScript - when 'function declaration parameters' wraps the parameters it unneccesarily wraps lambda function passed as a argument
BugWEB-39888Formatter does not respect TypeScript code style settings for VueJS components using typescript in <script> tag.
JavaScript. FrameworksBugWEB-31785React: `props.<props_name>` not resolved unless there is explicit `propTypes` declaration
JavaScript. InspectionsFeatureWEB-40156Add inspection when using trailing commas in destructuring/ functions with rest parameters
FeatureWEB-40394Duplicate declaration inspection for export (specifiers/aliases)
BugWEB-32373False positive on redundant escape characters inspection in regular expression built from template string
BugWEB-39775"const variable without initializer" from assigning PHP to inline JS
BugWEB-39843Quick fix: JS : Converting a function and its member declarations to a class caused exception
BugWEB-40911False 'missing await' for async generators
BugWEB-27499'var to let/const' produces invalid result in 'for' loop
BugWEB-24660unresolved file name quickfix cannot create file inside not existed folder
BugWEB-29134"unused local-variable/constant" inspection shouldn't provide a quick-fix for required loop variable
TaskWEB-39873Intention actions "Merge Parallel For Loops" and "Merge Parallel For-In Loops" - either rethink, or remove
JavaScript. RefactoringFeatureWEB-38972Quick-fix: Convert const to let. remove readonly modifier
FeatureWEB-40033Add an intention action to add a template string argument
BugWEB-40919Extracting a generator method from a field assigned to a generator breaks code due to ASI not allowed
BugWEB-37033Typescript: in case of return type mismatch, quick fix should update the whole class hierarchy
BugWEB-39798'Change signature' should handle arrow functions in class hierarchy
BugWEB-40959Inappropriate suggestion to replace string with template string inside flow/typescript type declaration
BugWEB-39719Extract variable: opening/closing quote in selection breaks result
BugWEB-39368'Introduce variable' is available on invalid selection and breaks code
BugWEB-37162'Introduce local variable' produces red when invoked in 'export default' with decorators
BugWEB-31704'Extract method' for generators should extract generators when possible with updating usages to 'yield * newFunc()'
BugWEB-40910'Introduce parameter' shouldn't work with the yield expressions
BugWEB-40957Invalid result of 'Introduce variable' when react function returns parenthesized HTML
BugWEB-7439Extract JavaScript variable fails if using multiple declarations chained in a single 'var' statement
BugWEB-39717Extract variable, Template literal: expression in selection breaks result
BugWEB-38409'Introduce parameter' shouldn't suggest anonymous callback scope
BugWEB-25137WebStorm allows to extract variable with breaking the operator precedence
UsabilityWEB-39973Refactoring: JS(ES5): 'Superclass' and 'Field' shouldn't be available to choose from "refactor"
UsabilityWEB-17564Refactoring: Extract variable: empty line is added on switching between radiobuttons inside popup
UsabilityWEB-39729WebStorm does't detect labels when refactoring
CosmeticsWEB-39913Replace word "lvalue" in warning message about the variable usage on the left side
LintersBugWEB-39960Mark modified (*) keep showing after save with ESLint
Node.jsBugWEB-40907Rider: Scripts from package.json are not shown in 'Run anything' dialog
ExceptionWEB-40124Node.js Remote Interpreter: Vagrant: Throwable: Synchronous execution under ReadAction
Pug (ex-Jade)BugWEB-21974jade: unbuffered javascript code not correctly indented
SASSBugWEB-36975SCSS: Webstorm incorrectly reports "mismatched property value" error if function is called `l()`
TypeScriptFeatureWEB-40352TypeScript: provide quick fix to insert/remove type arguments for extends/implements case
FeatureWEB-40531Duplicate declaration for default exports.
FeatureWEB-40793Default type parameters should be omitted
FeatureWEB-36148TypeScript: new quick fix 'Add "jsx":"react" to tsconfig.json'
FeatureWEB-40032TypeScript: provide quick fix to insert/remove type arguments
FeatureWEB-40789Enable duplicate declaration for union/intersection types
FeatureWEB-40667Enable duplicate declaration for type parameters
FeatureWEB-40231TypeScript: quick fix to enable allowSyntheticDefaultImports/esModuleInterop
BugWEB-40454"Add braces to arrow function" should not prepend return if method is void
BugWEB-40908False positive symbol assignment
BugWEB-41003TypeScript: incorrect error message for incompatible members
BugWEB-40449@internal not suggested as JSDoc comment
BugWEB-38395False positive 'method will not be accessible' when changing visibility of class member in namespace
BugWEB-40935TypeScript: incorrect type inference when we pass optional parameter to a method
BugWEB-40928False positive type checking error with optional properties
BugWEB-40922TypeScript: incorrect smart cast to never
BugWEB-40436Field refactoring doesn't pick usage
BugWEB-35889Change signature throws exception when parameter is not described in JSDoc
BugWEB-40914TypeScript: Property optionality is not processed in some cases
BugWEB-37898Literals from switch-cases typed by an enum should have references to their source values
BugWEB-32227TypeScript: show error on initializing optional parameters
BugWEB-40864Overloads don't work after re-exporting
BugWEB-40660TypeScript. Fix failed if one of the parameters has extends/keyof word
BugWEB-34084Suggestions incomplete for React components when there is an Omit (Pick and Exclude) structure in the type hierarchy
BugWEB-39652Refactor inferred params
BugWEB-40966Higher-order type inference fails for mapped types
BugWEB-40897Incorrect "prototype" property in the static type of a enum
BugWEB-40657TypeScript. Insert type arguments completion handler
BugWEB-40903TypeScript: false positive type-checking error (and wrong navigation)
UsabilityWEB-40275Misleading error message: parent tsconfig.json not found
Unit TestsFeatureWEB-19963Cucumber.js: all step references are shown as undefined if feature is written using non-US language
BugWEB-40351Highlight failed line in the test for shorthanded properties
BugWEB-40585`Rerun failed tests` runs successful tests under failed group (describe)

  • No labels