Child pages
  • Scala Plugin Nightly

Versions Compared

Key

  • This line was added.
  • This line was removed.
  • Formatting was changed.

...

Tip

You can setup auto-update of Scala plugin Nightly builds in IntelliJ IDEA.
Simply select desired update channel from a drop-down menu at "Updates" tab in Scala plugin settings page.

Or if you cannot do it from plugin settings add "https://plugins.jetbrains.com/plugins/nightly/1347" to custom repositories in Settings -> Plugins -> Browse custom repositories

Build 2020.2.539

Download Scala plugin for IDEA

Expand
4 Fixed issues
4 Fixed issues
  • SCL-17795 do not render `null` containing class for members from anonymous classes
  • SCL-17765 scaladoc: macros should be resolved from outer type definitions scopes
  • SCL-17755 add link to code style settings from auto import settings
  • SCL-17626 quick doc: empty tooltip on variables defined inside patterns

Build 2020.1.1209

Download Scala plugin for IDEA

Expand
0 Fixed issues
0 Fixed issues

Build 2020.2.533

Download Scala plugin for IDEA

Expand
2 Fixed issues
2 Fixed issues
  • SCL-15307 Autocomplete: suggest companion object members inside a class / trait, auto-import them
  • SCL-17719 Automatic project compilation benchmarks

Build 2020.2.524

Download Scala plugin for IDEA

Expand
1 Fixed issues
1 Fixed issues
  • SCL-17772 Type mismatch hints: display folded errors correctly

Build 2020.2.514

Download Scala plugin for IDEA

Expand
10 Fixed issues
10 Fixed issues
  • SCL-9720 Documentation view unreadable when @define placeholders are used
  • SCL-10619 Auto-import of "static" methods
  • SCL-6593 Wrong warning highlight for scaladoc when using macro in parameter description
  • SCL-17756 scaladoc: support macro injection wrapped with braces
  • SCL-17757 scaladoc: remove annoying error when macro is not unresolved
  • SCL-17761 scaladoc: support escaping of $
  • SCL-17759 scaladoc: adjacent macro injections should be treated as separate macros
  • SCL-17765 scaladoc: macros should be resolved from outer type definitions scopes
  • SCL-17764 scaladoc: inherit doc with empty super comment should insert paragraph break anyway
  • SCL-17769 scaladoc: macro name should only support letters a-zA-Z and digits 0-9

Build 2020.2.501

Download Scala plugin for IDEA

Expand
2 Fixed issues
2 Fixed issues
  • SCL-17734 Non empty parameter clause
  • SCL-17720 "Can't unlock compiler for Project" exception

Build 2020.1.1208

Download Scala plugin for IDEA

Expand
0 Fixed issues
0 Fixed issues

Build 2020.1.1206

Download Scala plugin for IDEA

Expand
0 Fixed issues
0 Fixed issues

Build 2020.1.1204

Download Scala plugin for IDEA

Expand
2 Fixed issues
2 Fixed issues
  • SCL-17722 IDE stuck when editing file
  • SCL-17713 NoSuchElementException in ImplicitCollector

Build 2020.2.494

Download Scala plugin for IDEA

Expand
14 Fixed issues
14 Fixed issues
  • SCL-17724 IDE freeze due to infinite recursion
  • SCL-11023 IntelliJ ScalaDoc showing $<macro name>
  • SCL-17722 IDE stuck when editing file
  • SCL-10619 Auto-import of "static" methods
  • SCL-17631 auto-removed closing brace for nested `if` breaks code semantics
  • SCL-17726 scalafmt: support include diractive
  • SCL-17730 Support not only values an parameters as arguments to pass
  • SCL-17723 scalatest: fix test method generator for version 3.1.0
  • SCL-17741 Auto-import for vals and lazy vals
  • SCL-17713 NoSuchElementException in ImplicitCollector
  • SCL-17714 Exclude from completion/auto-import settings is not applied
  • SCL-17715 scaladoc: inherited macro values from libraries sources are not resolved
  • SCL-17638 Disable Scalafmt fallback to default settings
  • SCL-17576 test run configurations: regexps get multiplied when choosing some checkboxes on Logs tab

Build 2020.2.486

Download Scala plugin for IDEA

Expand
1 Fixed issues
1 Fixed issues
  • SCL-17721 Parser can't handle empty line after for condition

Build 2020.2.474

Download Scala plugin for IDEA

Expand
4 Fixed issues
4 Fixed issues
  • SCL-14299 Suggest import of string interpolators
  • SCL-17718 Show companion class / trait / object keywords as usages, provide navigation
  • SCL-16995 Please consider adding the "disable the auto-import popup" to the Scala auto-import settings
  • SCL-17697 Show companion for class / trait / object in the gutter

Build 2020.1.1201

Download Scala plugin for IDEA

Expand
0 Fixed issues
0 Fixed issues

Build 2020.2.463

Download Scala plugin for IDEA

Expand
5 Fixed issues
5 Fixed issues
  • SCL-16160 Support Given Instances
  • SCL-16162 Support Extension Methods
  • SCL-16161 Support Given Parameters
  • SCL-17407 Support Scala 3's "quiet" control syntax
  • SCL-17687 in presence of wildcard import of companion object completion suggests method in companion object twice

Build 2020.2.453

Download Scala plugin for IDEA

Expand
6 Fixed issues
6 Fixed issues
  • SCL-5693 ScalaDoc not recognising unordered lists.
  • SCL-11946 quick doc: links to a class with non-fully-qualified-names are not resolved
  • SCL-6599 Reformat code corrupts lists
  • SCL-17624 scaladoc: markup syntax opening/closing tags are sometimes incorrectly highlighted
  • SCL-15997 scaladoc comment should detect urls and inject references to them
  • SCL-17697 Show companion for class / trait / object in the gutter

Build 2020.1.1198

Download Scala plugin for IDEA

Expand
0 Fixed issues
0 Fixed issues

Build 2020.2.439

Download Scala plugin for IDEA

Expand
8 Fixed issues
8 Fixed issues
  • SCL-17340 InvalidPathException in case of semicolon in path when importing sbt project as bsp
  • SCL-17437 Can't compile with incrementalityType=IDEA a dotty project containing both java and scala files
  • SCL-17688 Completion for companion class is not wysiwyg
  • SCL-17620 Inspection: toString on Array
  • SCL-17686 import is auto-added differently depending on how it's triggered
  • SCL-17385 Show compiler-based highlighting progress in the status bar if compilation is too long
  • SCL-17697 Show companion for class / trait / object in the gutter
  • SCL-17330 use compiler messages to highlight java files in scala 3 project

Build 2020.2.425

Download Scala plugin for IDEA

Expand
0 Fixed issues
0 Fixed issues

Build 2020.2.407

Download Scala plugin for IDEA

Expand
2 Fixed issues
2 Fixed issues
  • SCL-17672 support NlsContexts annotations in "ExtractToBundle" inspections
  • SCL-17688 Completion for companion class is not wysiwyg

Build 2020.2.397

Download Scala plugin for IDEA

Expand
1 Fixed issues
1 Fixed issues
  • SCL-17672 support NlsContexts annotations in "ExtractToBundle" inspections

Build 2020.1.1193

Download Scala plugin for IDEA

Expand
0 Fixed issues
0 Fixed issues

Build 2020.2.390

Download Scala plugin for IDEA

Expand
3 Fixed issues
3 Fixed issues
  • SCL-17673 make ScalaConsoleRunConfiguration non final
  • SCL-17671 wrappers of class parameters should have access modifier
  • SCL-17674 import from companion object suggests irrelevant items

Build 2020.2.380

Download Scala plugin for IDEA

Expand
2 Fixed issues
2 Fixed issues
  • SCL-17550 Freezing on mac while navigating large project
  • SCL-17653 highlighting is not updated on change in for expression guard

Build 2020.2.372

Download Scala plugin for IDEA

Expand
0 Fixed issues
0 Fixed issues

Build 2020.2.365

Download Scala plugin for IDEA

Expand
2 Fixed issues
2 Fixed issues
  • SCL-17612 Automatically generate all case class fields when instantiating
  • SCL-17648 Wrong parse for infixed foldLeft

Build 2020.2.356

Download Scala plugin for IDEA

Expand
1 Fixed issues
1 Fixed issues
  • SCL-17612 Automatically generate all case class fields when instantiating

Build 2020.2.349

Download Scala plugin for IDEA

Expand
0 Fixed issues
0 Fixed issues

Build 2020.2.342

Download Scala plugin for IDEA

Expand
3 Fixed issues
3 Fixed issues
  • SCL-17637 changes in interpolated string prefix do not invalidate caches
  • SCL-17527 For comprehension highlighting error when using inline if
  • SCL-17632 Exception: "Cannot create com.intellij.psi.PsiDocumentManager because container is already disposed" when opening a project in same window

Build 2020.2.333

Download Scala plugin for IDEA

Expand
7 Fixed issues
7 Fixed issues
  • SCL-13357 "null" after Java class name in a completion
  • SCL-17518 Red Highlighting Error: Method overloading with implicit is highlighted in red, but still compiles and runs
  • SCL-7279 IntelliJ fails to recognize extractors on an & object
  • SCL-9437 syntax highlighting error in intellij 15
  • SCL-17459 Overridden signature that places implicits into context bounds highlights with 'overriding type does not conform...'
  • SCL-17570 False positive error in Scala code when assigning integer literal to java.lang.Long name
  • SCL-17525 red code when overriding java method with varargs parameter

Build 2020.1.1192

Download Scala plugin for IDEA

Expand
0 Fixed issues
0 Fixed issues

Build 2020.2.322

Download Scala plugin for IDEA

Expand
1 Fixed issues
1 Fixed issues
  • SCL-17618 Exception when decompiling a java class

Build 2020.2.307

Download Scala plugin for IDEA

Expand
2 Fixed issues
2 Fixed issues
  • SCL-17544 quick doc: links are not added in many different cases
  • SCL-17534 Scala codestyle ignore SPACE_BEFORE_IF_PARENTHESES property

Build 2020.2.298

Download Scala plugin for IDEA

Expand
8 Fixed issues
8 Fixed issues
  • SCL-17375 Enable in-editor Scaladoc rendering
  • SCL-17457 Indent insertion when typing '.' disobeys code style settings
  • SCL-17557 quick doc: wrong space position for access modifier with this
  • SCL-17546 quick navigate info: do not add `with Object` to class without base Object
  • SCL-17543 quick doc: escape type parameter bounds in extends/with list
  • SCL-17563 quick doc: higher-kinded types are not rendered properly
  • SCL-7725 When listing members of a class, generics syntax is bad escaped
  • SCL-8760 Wrong documentation is shown in editor

Build 2020.2.290

Download Scala plugin for IDEA

Expand
0 Fixed issues
0 Fixed issues

Build 2020.2.281

Download Scala plugin for IDEA

Expand
2 Fixed issues
2 Fixed issues
  • SCL-11011 Don't list excessive parentheses in auto-complete list
  • SCL-17519 Pass -P:semanticdb:sourceroot:$PROJECTDIR to the compiler if semanticdb-scalac is enabled

Build 2020.1.1187

Download Scala plugin for IDEA

Expand
0 Fixed issues
0 Fixed issues

Build 2020.2.273

Download Scala plugin for IDEA

Expand
3 Fixed issues
3 Fixed issues
  • SCL-17086 Lots of false "not found" errors involving package object
  • SCL-17540 Hotkey for "Show implicit hints" for Scala resets to pair of other hotkeys
  • SCL-17594 Inspection description for Scalastyle links to broken HTTPS page

Build 2020.1.1185

Download Scala plugin for IDEA

Expand
0 Fixed issues
0 Fixed issues

Build 2020.2.262

Download Scala plugin for IDEA

Expand
3 Fixed issues
3 Fixed issues
  • SCL-15306 Auto-import: suggest members of the companion object
  • SCL-16431 Unapplied method should not have function type
  • SCL-15610 The editor will not notify if there are missing or additional parameter list on scala method invocation

Build 2020.2.257

Download Scala plugin for IDEA

Expand
5 Fixed issues
5 Fixed issues
  • SCL-17522 Compiler-based highlighting: CustomTrafficLightRendererContributor error in 2020.2
  • SCL-17437 Can't compile with incrementalityType=IDEA a dotty project containing both java and scala files
  • SCL-17330 use compiler messages to highlight java files in scala 3 project
  • SCL-17385 Show compiler-based highlighting progress in the status bar if compilation is too long
  • SCL-17516 Implicit hints are not showing when compiler-based highlighting is enabled (for Scala 2)

Build 2020.1.1181

Download Scala plugin for IDEA

Expand
0 Fixed issues
0 Fixed issues

Build 2020.2.253

Download Scala plugin for IDEA

Expand
1 Fixed issues
1 Fixed issues
  • SCL-17572 importing sbt project as BSP creates bloop config even when .bsp server config exists

Build 2020.2.241

Download Scala plugin for IDEA

Expand
1 Fixed issues
1 Fixed issues
  • SCL-17562 Another "java.nio.file.InvalidPathException: Illegal char <:> " on BSP for windows when running the project

Build 2020.1.1178

Download Scala plugin for IDEA

Expand
2 Fixed issues
2 Fixed issues
  • SCL-17086 Lots of false "not found" errors involving package object
  • SCL-17550 Freezing on mac while navigating large project

Build 2020.2.229

Download Scala plugin for IDEA

Expand
1 Fixed issues
1 Fixed issues
  • SCL-17550 Freezing on mac while navigating large project

Build 2020.2.223

Download Scala plugin for IDEA

Expand
1 Fixed issues
1 Fixed issues
  • SCL-15307 Autocomplete: suggest companion object members inside a class / trait, auto-import them

Build 2020.2.213

Download Scala plugin for IDEA

Expand
0 Fixed issues
0 Fixed issues

Build 2020.2.208

Download Scala plugin for IDEA

Expand
2 Fixed issues
2 Fixed issues
  • SCL-17466 parameterless java method invocation inferred as Unit in parameter position
  • SCL-16875 Erroneous type mismatch: Required: Disposable, found: Unit

Build 2020.2.193

Download Scala plugin for IDEA

Expand
0 Fixed issues
0 Fixed issues

Build 2020.1.1174

Download Scala plugin for IDEA

Expand
0 Fixed issues
0 Fixed issues

Build 2020.2.188

Download Scala plugin for IDEA

Expand
0 Fixed issues
0 Fixed issues

Build 2020.2.187

Download Scala plugin for IDEA

Expand
1 Fixed issues
1 Fixed issues

Build 2020.2.185

Download Scala plugin for IDEA

Expand
11 Fixed issues
11 Fixed issues
  • SCL-9174 ScalaTestRunner: ignore test suites annotated with @DoNotDiscover when using 'All in package' test kind
  • SCL-17470 `AbstractTestRunConfiguration` does not implement `ConfigurationWithCommandLineShortener`
  • SCL-16070 make ScalaTest configuration UI look closer to JUnit
  • SCL-15487 scaladoc panel displays "Cannot fetch remote documentation: internal error" if scala class inherits java class
  • SCL-17386 Scala worksheet default settings do not persist
  • SCL-17526 custom scala macros support: add help link to blog
  • SCL-17510 built-in scalafmt plugin doesn't support the new `fileOverride` option
  • SCL-17478 Run configuration does not remember the testKind when loading the project, always resets to CLASS
  • SCL-17504 scala repl leads to java.lang.NoClassDefFoundError: org/jline/reader/Completer
  • SCL-17517 switch to dotty 0.24.0-RC1
  • SCL-17366 Scala REPL doesn't support java 9+

Build 2020.1.1173

Download Scala plugin for IDEA

Expand
2 Fixed issues
2 Fixed issues
  • SCL-17510 built-in scalafmt plugin doesn't support the new `fileOverride` option
  • SCL-17504 scala repl leads to java.lang.NoClassDefFoundError: org/jline/reader/Completer

Build 2020.1.1167

Download Scala plugin for IDEA

Expand
4 Fixed issues
4 Fixed issues
  • SCL-16070 make ScalaTest configuration UI look closer to JUnit
  • SCL-17470 `AbstractTestRunConfiguration` does not implement `ConfigurationWithCommandLineShortener`
  • SCL-17366 Scala REPL doesn't support java 9+
  • SCL-17504 scala repl leads to java.lang.NoClassDefFoundError: org/jline/reader/Completer

Build 2020.1.1165

Download Scala plugin for IDEA

Expand
0 Fixed issues
0 Fixed issues

Build 2020.2.159

Download Scala plugin for IDEA

Expand
0 Fixed issues
0 Fixed issues

Build 2020.2.156

Download Scala plugin for IDEA

Expand
0 Fixed issues
0 Fixed issues

Build 2020.1.1158

Download Scala plugin for IDEA

Expand
2 Fixed issues
2 Fixed issues
  • SCL-17386 Scala worksheet default settings do not persist
  • SCL-17478 Run configuration does not remember the testKind when loading the project, always resets to CLASS

Build 2020.2.153

Download Scala plugin for IDEA

Expand
4 Fixed issues
4 Fixed issues
  • SCL-17124 Can not open the Settings window
  • SCL-15553 No implicits found for parameter when explicit passing parameter
  • SCL-17482 commenting import via action (`Ctrl + /`) doesn't rehighlight the file
  • SCL-17463 don't use ApplicationInitializedListener EP, it is explicitly non-dynamic

Build 2020.1.1152

Download Scala plugin for IDEA

Expand
2 Fixed issues
2 Fixed issues
  • SCL-17438 inspection "comparing unrelated types" broken in Scala 2.13
  • SCL-17347 Debug Tooltip: Almost within reach but ultimately unreachable

Build 2020.2.148

Download Scala plugin for IDEA

Expand
3 Fixed issues
3 Fixed issues
  • SCL-17334 Missing expand implicit hints in dropdown menu
  • SCL-17438 inspection "comparing unrelated types" broken in Scala 2.13
  • SCL-17347 Debug Tooltip: Almost within reach but ultimately unreachable

Build 2020.2.141

Download Scala plugin for IDEA

Expand
0 Fixed issues
0 Fixed issues

Build 2020.1.1136

Download Scala plugin for IDEA

Expand
1 Fixed issues
1 Fixed issues
  • SCL-17340 InvalidPathException in case of semicolon in path when importing sbt project as bsp

Build 2020.2.138

Download Scala plugin for IDEA

Expand
3 Fixed issues
3 Fixed issues
  • SCL-17450 Type aliases and Scala 2 covariant opaque type red code
  • SCL-16284 Subtyping between higher-kinded abstract type members is not honored
  • SCL-17461 No res0 completion in Scala REPL for scala 2.13.2

Build 2020.2.129

Download Scala plugin for IDEA

Expand
1 Fixed issues
1 Fixed issues
  • SCL-17449 Illegal inheritance, self-type Child.type does not conform to Singleton

Build 2020.2.121

Download Scala plugin for IDEA

Expand
1 Fixed issues
1 Fixed issues

Build 2020.1.1132

Download Scala plugin for IDEA

Expand
1 Fixed issues
1 Fixed issues
  • SCL-17385 Show compiler-based highlighting progress in the status bar if compilation is too long

Build 2020.2.109

Download Scala plugin for IDEA

Expand
0 Fixed issues
0 Fixed issues

Build 2020.1.1128

Download Scala plugin for IDEA

Expand
1 Fixed issues
1 Fixed issues
  • SCL-17385 Show compiler-based highlighting progress in the status bar if compilation is too long

Build 2020.2.108

Download Scala plugin for IDEA

Expand
3 Fixed issues
3 Fixed issues

Build 2020.1.1125

Download Scala plugin for IDEA

Expand
0 Fixed issues
0 Fixed issues

Build 2020.1.1124

Download Scala plugin for IDEA

Expand
1 Fixed issues
1 Fixed issues
  • SCL-17410 Create jbr JDK on sbt-idea-plugin project import

Build 2020.1.1123

Download Scala plugin for IDEA

Expand
2 Fixed issues
2 Fixed issues

Build 2020.2.102

Download Scala plugin for IDEA

Expand
0 Fixed issues
0 Fixed issues

Build 2020.1.1116

Download Scala plugin for IDEA

Expand
0 Fixed issues
0 Fixed issues

Build 2020.1.1111

Download Scala plugin for IDEA

Expand
5 Fixed issues
5 Fixed issues
  • SCL-15307 Autocomplete: suggest companion object members inside a class / trait, auto-import them
  • SCL-17397 remove usage of deprecated `IdeaPluginDescriptorImpl.loadFromFile`
  • SCL-17393 do not inherit LexerState, it is going to be removed
  • SCL-17280 Extract dotty template project name and description to bundles
  • SCL-17326 Activate SafeDelete for parameters

Build 2020.1.1096

Download Scala plugin for IDEA

Expand
2 Fixed issues
2 Fixed issues
  • SCL-17343 Good code red: "Cannot resolve overloaded method"
  • SCL-17350 BSP project indexes .bloop/ directory

Build 2020.1.1089

Download Scala plugin for IDEA

Expand
0 Fixed issues
0 Fixed issues

Build 2020.1.1084

Download Scala plugin for IDEA

Expand
1 Fixed issues
1 Fixed issues
  • SCL-17305 IntellIJ Compile Server slows down I/O by using Nailgun with an inefficient SecurityManager implementation.

Build 2020.1.1081

Download Scala plugin for IDEA

Expand
4 Fixed issues
4 Fixed issues
  • SCL-17364 Unexpected highlighting error while using generic parameter of an implicit class.
  • SCL-17368 Highlighting error on implicit conversion with typed implicit parameter
  • SCL-17374 Type mismatch highlighting for Scalatags Option parameter
  • SCL-17198 Partially-applied `ArrowAssoc` shows as error

Build 2020.1.1076

Download Scala plugin for IDEA

Expand
0 Fixed issues
0 Fixed issues

Build 2020.1.1073

Download Scala plugin for IDEA

Expand
0 Fixed issues
0 Fixed issues

Build 2020.1.1067

Download Scala plugin for IDEA

Expand
2 Fixed issues
2 Fixed issues
  • SCL-17363 worksheet: sometimes prints redundant new lines in Plain mode if evaluating outside compile server
  • SCL-17326 Activate SafeDelete for parameters

Build 2020.1.1059

Download Scala plugin for IDEA

Expand
4 Fixed issues
4 Fixed issues
  • SCL-17086 Lots of false "not found" errors involving package object
  • SCL-17260 Error highlighting bug in for-comprehension with pattern matching for classes without withFilter method
  • SCL-16844 ProjectComponents should be removed
  • SCL-17300 Worksheet REPL fails in presence of sealed trait in the project

Build 2020.1.1049

Download Scala plugin for IDEA

Expand
0 Fixed issues
0 Fixed issues

Build 2020.1.1037

Download Scala plugin for IDEA

Expand
3 Fixed issues
3 Fixed issues
  • SCL-15580 do no add line comments with line indexes inside multiline string literals
  • SCL-16349 IDE breaks the alignment in Scala Worksheets by adding unnecessary empty new lines
  • SCL-11495 REPL Worksheet Blue arrow disappears in case of invalid code

Build 2020.1.1031

Download Scala plugin for IDEA

Expand
0 Fixed issues
0 Fixed issues

Build 2020.1.1027

Download Scala plugin for IDEA

Expand
2 Fixed issues
2 Fixed issues
  • SCL-17313 completion suggests methods from wrong identifier on manually deleting/inserting part of the method name
  • SCL-17326 Activate SafeDelete for parameters

Build 2020.1.1016

Download Scala plugin for IDEA

Expand
1 Fixed issues
1 Fixed issues
  • SCL-17232 Detect supported / unsupported Scala 3 versions

Build 2020.1.1011

Download Scala plugin for IDEA

Expand
1 Fixed issues
1 Fixed issues
  • SCL-17232 Detect supported / unsupported Scala 3 versions

Build 2020.1.1001

Download Scala plugin for IDEA

Expand
3 Fixed issues
3 Fixed issues
  • SCL-17232 Detect supported / unsupported Scala 3 versions
  • SCL-17136 Assertion error when showing folded preview with chain inside
  • SCL-17290 toString on String should be a warning

Build 2020.1.977

Download Scala plugin for IDEA

Expand
0 Fixed issues
0 Fixed issues

Build 2020.1.970

Download Scala plugin for IDEA

Expand
0 Fixed issues
0 Fixed issues

Build 2020.2.100

Download Scala plugin for IDEA

Expand
0 Fixed issues
0 Fixed issues

Build 2020.1.966

Download Scala plugin for IDEA

Expand
1 Fixed issues
1 Fixed issues
  • SCL-17193 Scala SDK settings: no label for "Scala version"

Build 2020.1.954

Download Scala plugin for IDEA

Expand
1 Fixed issues
1 Fixed issues

Build 2020.1.949

Download Scala plugin for IDEA

Expand
1 Fixed issues
1 Fixed issues
  • SCL-17225 Unnecessary line shown in sbt shell

Build 2020.1.944

Download Scala plugin for IDEA

Expand
1 Fixed issues
1 Fixed issues
  • SCL-17258 Find usages - Please change caller according to com.intellij.openapi.project.IndexNotReadyException documentation exception

Build 2020.1.937

Download Scala plugin for IDEA

Expand
3 Fixed issues
3 Fixed issues
  • SCL-17256 sometimes first request to compiler server fails
  • SCL-17233 Scala 3 scratch treated incorrectly
  • SCL-17114 exceptions thrown when doing undo and redo in editor

Build 2020.1.928

Download Scala plugin for IDEA

Expand
2 Fixed issues
2 Fixed issues
  • SCL-17228 BSP: "Project JDK is not defined" after import
  • SCL-16196 add template to create dotty project

Build 2019.3.721

Download Scala plugin for IDEA

Expand
0 Fixed issues
0 Fixed issues

Build 2020.1.921

Download Scala plugin for IDEA

Expand
0 Fixed issues
0 Fixed issues

Build 2020.1.917

Download Scala plugin for IDEA

Expand
1 Fixed issues
1 Fixed issues
  • SCL-16196 add template to create dotty project

Build 2020.1.912

Download Scala plugin for IDEA

Expand
7 Fixed issues
7 Fixed issues
  • SCL-17229 BSP: "No Scala SDK in module" after initial import
  • SCL-16149 Scala Scratch doesn't provide code completion for an exhaustive pattern-matching expression
  • SCL-16611 use TASTY produced by dotc for IDE features
  • SCL-16496 Two worksheets in same module can not be isolated
  • SCL-17238 apply / unapply live template doesn't detect type parameters
  • SCL-17202 localization: run configuration: outstanding
  • SCL-17201 localization: outstanding misc

Build 2020.1.901

Download Scala plugin for IDEA

Expand
3 Fixed issues
3 Fixed issues
  • SCL-16865 "No implicit" errors are not visible enough in case implicit hints turned off?
  • SCL-16611 use TASTY produced by dotc for IDE features
  • SCL-16892 step into method call with default implementation in trait doesn't work

Build 2020.1.879

Download Scala plugin for IDEA

Expand
1 Fixed issues
1 Fixed issues
  • SCL-16611 use TASTY produced by dotc for IDE features

Build 2020.1.870

Download Scala plugin for IDEA

Expand
7 Fixed issues
7 Fixed issues
  • SCL-11156 SAM highlighting errors
  • SCL-17170 type mismatch with SAM conversions
  • SCL-17227 BSP fails to run Scalatest
  • SCL-17095 Cannot import simple project with bsp
  • SCL-17051 Can't create a method out of the method call inside a Scala Worksheet
  • SCL-16596 wrong error on SAM inside Option
  • SCL-17208 java.lang.AssertionError AnsiEscapeDecoder.escapeText on importing scalatest project

Build 2020.1.859

Download Scala plugin for IDEA

Expand
3 Fixed issues
3 Fixed issues
  • SCL-17210 Viewing file causes continuous memory consumption crashing Intellij
  • SCL-16921 use bundles in compiler settings
  • SCL-17204 localization: annotator errors

Build 2020.1.857

Download Scala plugin for IDEA

Expand
4 Fixed issues
4 Fixed issues
  • SCL-17120 Failed to initialize sbt shell tool window when importing sbt project from external source
  • SCL-16496 Two worksheets in same module can not be isolated
  • SCL-16149 Scala Scratch doesn't provide code completion for an exhaustive pattern-matching expression
  • SCL-17209 Exception when opening project

Build 2020.1.843

Download Scala plugin for IDEA

Expand
7 Fixed issues
7 Fixed issues
  • SCL-16865 "No implicit" errors are not visible enough in case implicit hints turned off?
  • SCL-16583 Method chain hints: handle infix method "calls"
  • SCL-16738 Debug information overlap with Inlay hints
  • SCL-16721 Unsound code completion regarding class fields
  • SCL-17206 Don't show type mismatch for partially inferred types
  • SCL-17052 Creating a method out of the method call generates a method body with literal values as method's parameter types
  • SCL-16974 Create a constructor matching super class' constructor adds a public modifier in the arguments for Scala super classes

Build 2020.1.831

Download Scala plugin for IDEA

Expand
0 Fixed issues
0 Fixed issues

Build 2020.1.816

Download Scala plugin for IDEA

Expand
7 Fixed issues
7 Fixed issues
  • SCL-16919 declaration is never used inspection is triggered for overridable methods parameters
  • SCL-17012 never highlight case class parameters as unused
  • SCL-17174 Wrongly marked redundant block when block has only one expr but multiple statements
  • SCL-16981 declaration is never used shouldn't be invoked for dummy implicit in overloaded function
  • SCL-17036 Remove migrators
  • SCL-17188 Invalid bundle strings are not shown as invalid
  • SCL-17140 bad "The enclosing block is redundant" inspection result in interpolated string

Build 2020.1.808

Download Scala plugin for IDEA

Expand
3 Fixed issues
3 Fixed issues
  • SCL-15806 Build plugin for JDK 11
  • SCL-17076 "Introduce variable" refactoring works wrong if used inside string interpolator
  • SCL-17184 compiler-based highlighting: better highlighting of offsets in whitespaces

Build 2020.1.789

Download Scala plugin for IDEA

Expand
1 Fixed issues
1 Fixed issues

Build 2020.1.787

Download Scala plugin for IDEA

Expand
1 Fixed issues
1 Fixed issues
  • SCL-16246 scala.collection.Factory implicit is not found by the editor (but is ok in runtime)

Build 2020.1.782

Download Scala plugin for IDEA

Expand
1 Fixed issues
1 Fixed issues
  • SCL-17115 type annotation inspection should ignore test traits which self-type is TestCase

Build 2020.1.777

Download Scala plugin for IDEA

Expand
4 Fixed issues
4 Fixed issues
  • SCL-17094 incompatible with planned idea eap? - type mismatch in build.sbt and no sdk found for the module
  • SCL-16963 use bundles in File | Settings | Languages & Frameworks| Scala settings
  • SCL-16279 Scala plugin: incorrect characters are inserted when use block comment.
  • SCL-17058 Override ConfigurationFactory::getId method i to avoid problems with localizations

Build 2020.1.770

Download Scala plugin for IDEA

Expand
1 Fixed issues
1 Fixed issues
  • SCL-17094 incompatible with planned idea eap? - type mismatch in build.sbt and no sdk found for the module

Build 2020.1.759

Download Scala plugin for IDEA

Expand
0 Fixed issues
0 Fixed issues

Build 2020.1.752

Download Scala plugin for IDEA

Expand
11 Fixed issues
11 Fixed issues
  • SCL-15487 scaladoc panel displays "Cannot fetch remote documentation: internal error" if scala class inherits java class
  • SCL-16611 use TASTY produced by dotc for IDE features
  • SCL-17136 Assertion error when showing folded preview with chain inside
  • SCL-16844 ProjectComponents should be removed
  • SCL-17113 manually replacing imports with placeholder import marks import as unused
  • SCL-17140 bad "The enclosing block is redundant" inspection result in interpolated string
  • SCL-17078 Local import statement breaks the type mismatch highlighting mechanism
  • SCL-17085 Presentation compiler reports error for correct code
  • SCL-17148 No type mismatch when there's a tailing import statement in a block
  • SCL-17097 implement incremental highlighting for scala files
  • SCL-17089 Highlighting error on function usage with signature def fooAutoCloseable, V(r: => T)(f: T => V): V

Build 2020.1.724

Download Scala plugin for IDEA

Expand
1 Fixed issues
1 Fixed issues
  • SCL-15791 can't resolve symbol uTest when creating a new test

Build 2020.1.715

Download Scala plugin for IDEA

Expand
1 Fixed issues
1 Fixed issues
  • SCL-16435 live templates for a implicit class / implicit value class

Build 2020.1.713

Download Scala plugin for IDEA

Expand
3 Fixed issues
3 Fixed issues
  • SCL-14662 BSP: infer shared source directories
  • SCL-17105 external project import: shows "sbt project detected" when importing via BSP (or other system)
  • SCL-16907 do not show BSP icon in non-bsp project

Build 2020.1.706

Download Scala plugin for IDEA

Expand
0 Fixed issues
0 Fixed issues

Build 2020.1.700

Download Scala plugin for IDEA

Expand
0 Fixed issues
0 Fixed issues

Build 2020.1.688

Download Scala plugin for IDEA

Expand
0 Fixed issues
0 Fixed issues

Build 2020.1.679

Download Scala plugin for IDEA

Expand
3 Fixed issues
3 Fixed issues
  • SCL-16610 show bsp diagnostics in editor
  • SCL-17092 line comment inside if/else breaks indentation of else branch
  • SCL-17064 Localization: play module

Build 2020.1.660

Download Scala plugin for IDEA

Expand
2 Fixed issues
2 Fixed issues
  • SCL-17087 Cannot set breakpoint in Scala files
  • SCL-17072 Misleading breakpoints inside a Scala Worksheet

Build 2020.1.659

Download Scala plugin for IDEA

Expand
0 Fixed issues
0 Fixed issues

Build 2020.1.651

Download Scala plugin for IDEA

Expand
5 Fixed issues
5 Fixed issues
  • SCL-15512 wrong gutter `overrides type` for types
  • SCL-17028 Worksheet turns green when closing the project
  • SCL-17072 Misleading breakpoints inside a Scala Worksheet
  • SCL-17051 Can't create a method out of the method call inside a Scala Worksheet
  • SCL-6279 Method Override for Trait Using Self-Reference Not Recognized

Build 2020.1.645

Download Scala plugin for IDEA

Expand
1 Fixed issues
1 Fixed issues

Build 2020.1.634

Download Scala plugin for IDEA

Expand
2 Fixed issues
2 Fixed issues
  • SCL-16120 internal profiler column filter shouldn't be reset on changing mouse focus
  • SCL-17060 Localization: lang/editor/findUsages

Build 2020.1.604

Download Scala plugin for IDEA

Expand
5 Fixed issues
5 Fixed issues
  • SCL-17055 Suggest map.contains(error) for map.get(error).nonEmpty
  • SCL-17065 Localization: org.jetbrains.sbt
  • SCL-17063 Localization: bsp module
  • SCL-16722 Unify code folding settings layout with one of other languages
  • IDEA-229963 i18n keys inappropriate key usage

Build 2019.3.720

Download Scala plugin for IDEA

Expand
4 Fixed issues
4 Fixed issues
  • SCL-16431 Unapplied method should not have function type
  • SCL-16901 Annotator: don't show type mismatch for whole function literal when result type doesn't match
  • SCL-16904 Function literal: when possible, highlight parameter type(s) / count, not the type of the whole function literal
  • SCL-15544 Type ascription: highlight type, not expression

Build 2020.1.552

Download Scala plugin for IDEA

Expand
1 Fixed issues
1 Fixed issues
  • SCL-17057 Tests failing due to incomptaible JDK/sbt bersions

Build 2020.1.534

Download Scala plugin for IDEA

Expand
0 Fixed issues
0 Fixed issues

Build 2020.1.525

Download Scala plugin for IDEA

Expand
3 Fixed issues
3 Fixed issues
  • SCL-15408 can't resolve symbol ++:
  • SCL-16844 ProjectComponents should be removed
  • SCL-17039 exhaustive match is not suggested for Either of ADT

Build 2020.1.510

Download Scala plugin for IDEA

Expand
7 Fixed issues
7 Fixed issues
  • SCL-17006 BSP project refresh disabled after failed refresh
  • SCL-17001 BSP: option to disable automatic bloopInstall for sbt projects
  • SCL-17036 Remove migrators
  • SCL-16958 bsp-via-sbt import: does not upgrade sbt version automatically
  • SCL-16982 BSP sbt-over-bloop import: import with dependency sources
  • SCL-16285 Automatic sbt export with Bloop
  • SCL-16977 BSP "build on file save" does not work

Build 2020.1.502

Download Scala plugin for IDEA

Expand
0 Fixed issues
0 Fixed issues

Build 2020.1.490

Download Scala plugin for IDEA

Expand
1 Fixed issues
1 Fixed issues
  • SCL-17014 Java OOM when building scala plugin in recent intellij IDEA

Build 2020.1.463

Download Scala plugin for IDEA

Expand
2 Fixed issues
2 Fixed issues
  • SCL-16802 error on overloaded java static method call at constructor parameter position
  • SCL-13712 SBT compilation errors should strip ANSI color codes

Build 2020.1.449

Download Scala plugin for IDEA

Expand
1 Fixed issues
1 Fixed issues
  • SCL-16904 Function literal: when possible, highlight parameter type(s) / count, not the type of the whole function literal

Build 2020.1.434

Download Scala plugin for IDEA

Expand
10 Fixed issues
10 Fixed issues
  • SCL-16604 support jps compilation for dotty
  • SCL-16073 'Clear results in worksheet' works only after touching idea menu
  • SCL-16946 language injections: Property escape sequences are not supported in this regex dialect
  • SCL-16171 Support new Pattern Bindings with type ascriptions and case in for
  • SCL-14460 trait parameters support
  • SCL-16924 use bundles in code style settings
  • SCL-16481 IDE doesn't align the `else` clause in the method body in Scala Worksheets
  • SCL-16169 Support changed syntax of wildcard arguments in types
  • SCL-9271 In interactive mode add compilation error status somewhere
  • SCL-16168 Support Quotes and Splices

Build 2020.1.424

Download Scala plugin for IDEA

Expand
4 Fixed issues
4 Fixed issues
  • SCL-16901 Annotator: don't show type mismatch for whole function literal when result type doesn't match
  • SCL-16904 Function literal: when possible, highlight parameter type(s) / count, not the type of the whole function literal
  • SCL-15544 Type ascription: highlight type, not expression
  • SCL-16745 freeze in ScalaLibraryType.createNewLibrary

Build 2020.1.409

Download Scala plugin for IDEA

Expand
1 Fixed issues
1 Fixed issues
  • SCL-16962 generated forms contain dummy border at the top

Build 2020.1.393

Download Scala plugin for IDEA

Expand
0 Fixed issues
0 Fixed issues

Build 2020.1.389

Download Scala plugin for IDEA

Expand
4 Fixed issues
4 Fixed issues

Build 2020.1.376

Download Scala plugin for IDEA

Expand
11 Fixed issues
11 Fixed issues
  • SCL-16562 Scala 2.13 -Yimports option is not recognized
  • SCL-16965 Exception when trying to compile project with latest scala nightly plugin - 2020.1.344
  • SCL-15806 Build plugin for JDK 11
  • SCL-16691 IDE should autocomplete basic pattern-matching expressions
  • SCL-16921 use bundles in compiler settings
  • SCL-16908 Internal inspection: replace `getText.contains` with `textContains` for PsiElement
  • SCL-16953 Internal inspection: replace `getText == s` with `textMatches(s)` for PsiElement
  • SCL-16897 exception from ScalaUnusedSymbolInspection: Non-physical PsiElement...
  • SCL-16890 Scala 2.13 good code red regression for cats.data.NonEmptySet
  • SCL-16745 freeze in ScalaLibraryType.createNewLibrary
  • SCL-16930 add type annotation suppression doesn't work for package object

Build 2020.1.355

Download Scala plugin for IDEA

Expand
1 Fixed issues
1 Fixed issues
  • SCL-16965 Exception when trying to compile project with latest scala nightly plugin - 2020.1.344

Build 2020.1.353

Download Scala plugin for IDEA

Expand
4 Fixed issues
4 Fixed issues
  • SCL-16965 Exception when trying to compile project with latest scala nightly plugin - 2020.1.344
  • SCL-15806 Build plugin for JDK 11
  • SCL-16953 Internal inspection: replace `getText == s` with `textMatches(s)` for PsiElement
  • SCL-16930 add type annotation suppression doesn't work for package object

Build 2020.1.344

Download Scala plugin for IDEA

Expand
4 Fixed issues
4 Fixed issues
  • SCL-15806 Build plugin for JDK 11
  • SCL-16921 use bundles in compiler settings
  • SCL-16908 Internal inspection: replace `getText.contains` with `textContains` for PsiElement
  • SCL-16897 exception from ScalaUnusedSymbolInspection: Non-physical PsiElement...

Build 2020.1.320

Download Scala plugin for IDEA

Expand
0 Fixed issues
0 Fixed issues

Build 2020.1.316

Download Scala plugin for IDEA

Expand
0 Fixed issues
0 Fixed issues

Build 2020.1.313

Download Scala plugin for IDEA

Expand
1 Fixed issues
1 Fixed issues
  • SCL-16745 freeze in ScalaLibraryType.createNewLibrary

Build 2020.1.309

Download Scala plugin for IDEA

Expand
2 Fixed issues
2 Fixed issues
Wiki Markup

* [SCL-16916|https://youtrack.jetbrains.com/issue/SCL-16916] Cannot load file if ScalaDoc contains {@}
* [SCL-16691|https://youtrack.jetbrains.com/issue/SCL-16691] IDE should autocomplete basic pattern-matching expressions

Build 2020.1.303

Download Scala plugin for IDEA

Expand
4 Fixed issues
4 Fixed issues
  • SCL-15549 wrap if/else/ try/finally for/yield do/while bodies in {} on typing {
  • SCL-16745 freeze in ScalaLibraryType.createNewLibrary
  • SCL-16169 Support changed syntax of wildcard arguments in types
  • SCL-16873 Write-unsafe context when toggling type aware highlighting and power-save mode

Build 2019.3.716

Download Scala plugin for IDEA

Expand
5 Fixed issues
5 Fixed issues
  • SCL-16901 Annotator: don't show type mismatch for whole function literal when result type doesn't match
  • SCL-16898 Annotator: function literals: don't infer type when parameter type is not known
  • SCL-16903 Type mismatch hints: handle expressions before `}`
  • SCL-16899 Don't show type a mismatch error when there's a parser error
  • SCL-16893 Type mismatch hints: handle expressions before `else` keyword

Build 2020.1.281

Download Scala plugin for IDEA

Expand
8 Fixed issues
8 Fixed issues
  • SCL-16898 Annotator: function literals: don't infer type when parameter type is not known
  • SCL-16901 Annotator: don't show type mismatch for whole function literal when result type doesn't match
  • SCL-16171 Support new Pattern Bindings with type ascriptions and case in for
  • SCL-16899 Don't show type a mismatch error when there's a parser error
  • SCL-16903 Type mismatch hints: handle expressions before `}`
  • SCL-16893 Type mismatch hints: handle expressions before `else` keyword
  • SCL-16868 pasting into a comment inside a specs2 test deletes the comment
  • SCL-16839 Autocomplete in formatted string doesn't work at the end

Build 2020.1.260

Download Scala plugin for IDEA

Expand
6 Fixed issues
6 Fixed issues
  • SCL-16733 no-dialog import for BSP: New ... / Project from existing sources
  • SCL-16855 externalIconProvider for sbt
  • SCL-16858 BSP: fetching test classes should get them from all project-associated workspaces
  • SCL-16821 BSP: improved connection management
  • SCL-16820 Good code is red: Use trait to return Tuple option
  • SCL-16856 externalIconProvider for BSP

Build 2020.1.253

Download Scala plugin for IDEA

Expand
8 Fixed issues
8 Fixed issues
  • SCL-15697 Highlight redundant parameter in a final, private, or local method
  • SCL-16789 Good code red: case class unapply
  • SCL-16831 formatter moves else to the preceding line comment breaking code semantics
  • SCL-16870 incomplete declarations break parsing of subsequent code
  • SCL-16877 compiling evaluator doesn't always work if there are new classes defined
  • SCL-16099 overriding deprecated method inspection
  • SCL-16839 Autocomplete in formatted string doesn't work at the end
  • SCL-16820 Good code is red: Use trait to return Tuple option

Build 2020.1.232

Download Scala plugin for IDEA

Expand
2 Fixed issues
2 Fixed issues
  • SCL-15697 Highlight redundant parameter in a final, private, or local method
  • SCL-16745 freeze in ScalaLibraryType.createNewLibrary

Build 2020.1.224

Download Scala plugin for IDEA

Expand
0 Fixed issues
0 Fixed issues

Build 2020.1.213

Download Scala plugin for IDEA

Expand
0 Fixed issues
0 Fixed issues

Build 2020.1.210

Download Scala plugin for IDEA

Expand
2 Fixed issues
2 Fixed issues
  • SCL-16735 make sure PropertyFoldingBuilder works for scala via UAST
  • SCL-16849 Type mismatch hints: handle arguments in right-associative infix expressions

Build 2019.3.715

Download Scala plugin for IDEA

Expand
2 Fixed issues
2 Fixed issues
  • SCL-16819 Tooltips persist indefinitely
  • SCL-16849 Type mismatch hints: handle arguments in right-associative infix expressions

Build 2020.1.205

Download Scala plugin for IDEA

Expand
1 Fixed issues
1 Fixed issues

Build 2020.1.191

Download Scala plugin for IDEA

Expand
1 Fixed issues
1 Fixed issues

Build 2020.1.189

Download Scala plugin for IDEA

Expand
1 Fixed issues
1 Fixed issues
  • SCL-16817 Control cache behavior of cache macros with parameter

Build 2020.1.187

Download Scala plugin for IDEA

Expand
0 Fixed issues
0 Fixed issues

Build 2020.1.185

Download Scala plugin for IDEA

Expand
1 Fixed issues
1 Fixed issues
  • SCL-16439 BSP+Bloop: Start Bloop through Launcher

Build 2020.1.176

Download Scala plugin for IDEA

Expand
0 Fixed issues
0 Fixed issues

Build 2020.1.172

Download Scala plugin for IDEA

Expand
0 Fixed issues
0 Fixed issues

Build 2020.1.166

Download Scala plugin for IDEA

Expand
1 Fixed issues
1 Fixed issues
  • SCL-16435 live templates for a implicit class / implicit value class

Build 2020.1.162

Download Scala plugin for IDEA

Expand
2 Fixed issues
2 Fixed issues
  • SCL-16786 worksheet in plain mode hangs when editing in interactive mode and while indexing is in progress
  • SCL-16739 Quick fix: add type annotation to anonymous function parameter doesn't work when a caret is just after the parameter

Build 2020.1.150

Download Scala plugin for IDEA

Expand
0 Fixed issues
0 Fixed issues

Build 2020.1.149

Download Scala plugin for IDEA

Expand
2 Fixed issues
2 Fixed issues
  • SCL-16749 freeze in formatter due to language injections
  • SCL-16573 please get rid of AnotationHolderImpl custom implementations

Build 2020.1.145

Download Scala plugin for IDEA

Expand
1 Fixed issues
1 Fixed issues
  • SCL-16757 StackOverflowError in LUB calculation

Build 2019.3.711

Download Scala plugin for IDEA

Expand
1 Fixed issues
1 Fixed issues
  • SCL-16565 Debugging does not work with Play Framework

Build 2020.1.139

Download Scala plugin for IDEA

Expand
4 Fixed issues
4 Fixed issues
  • SCL-16562 Scala 2.13 -Yimports option is not recognized
  • SCL-16565 Debugging does not work with Play Framework
  • SCL-16251 Cannot resolve overloaded method 'Array'
  • SCL-16714 Incorrect resolve for eta expanded methods

Build 2019.3.710

Download Scala plugin for IDEA

Expand
0 Fixed issues
0 Fixed issues

Build 2020.1.115

Download Scala plugin for IDEA

Expand
102 Fixed issues
102 Fixed issues
  • SCL-15627 Good code red: Nothing inferred while pattern matching on a tuple
  • SCL-13959 Type hints for long method chains
  • SCL-15738 Debugger: support Step Into (F7) method selection
  • SCL-15782 Show type mismatch tooltip on Ctrl + F1
  • SCL-16586 Redesign of hint settings
  • SCL-13053 Trailing commas not recognized in Scala sources of the build
  • SCL-16482 deadlock in worksheet actions
  • SCL-16472 2019.3 EAP intellij asks for setting up scala SDK even though scala is provided via gradle
  • SCL-16698 jps compilation doesn't work for cross projects
  • SCL-14097 new in scala 2.13: more precise prototype for args of overloaded method
  • SCL-11580 Improve sbt project import
  • SCL-16431 Unapplied method should not have function type
  • SCL-16658 Scala failed to save settings and has been disabled
  • SCL-14055 Three equal actions for "Show Implicit hints" in Find Action list
  • SCL-16453 Auto-completion for `def` identifiers (as for `val`s and `var`s)
  • SCL-16516 Google App Engine build failing with 2019.3 EAP
  • SCL-16518 don't use PsiFileFactory.createFileFromText to build stubs
  • SCL-16339 Ctrl+Alt+W shortcut doesn't work in Scala Worksheets
  • SCL-16689 Find usages doesn't detect writes on var
  • SCL-16625 Type hints: an option to suppress hints that break formatting
  • SCL-16461 scala files from current project are shown twice in console links
  • SCL-13836 Good code red - @this Play2 Template Injection
  • SCL-16484 worksheet in PLAIN mode: runtime errors are not displayed
  • SCL-16130 Scala 2.13: Cannot resolve overloaded method "map" for scala.immutable.Map
  • SCL-16493 For scala 2.13.1 REPL worksheet compilation errors are shown in the right tab
  • SCL-16494 Implicit inlays move type chain hints
  • SCL-16331 support `Synthesize a PartialFunction from function literal`
  • SCL-16643 A simpler example for method chain hints
  • SCL-16651 exception opening inlay hints settings from welcome screen
  • SCL-16650 exception on moving class to another package
  • SCL-16702 choose jvm module for run configurations in cross projects
  • SCL-16149 Scala Scratch doesn't provide code completion for an exhaustive pattern-matching expression
  • SCL-16708 StackOverflowError typechecking F-bounded types in Scala
  • BDIDE-238 Auto-import doesn't work (Scala)
  • SCL-16572 regular context menu shown instead of hints settings
  • SCL-16571 settings of method chain hints are messed up
  • SCL-16570 exception in inlay hints settings on windows
  • SCL-16686 Exception NoSuchMethodError: utest.framework.Tree.children()Lscala/collection/Seq when running a test with scala 2.13
  • SCL-16043 worksheet in plain mode: false warning in scala 2.13
  • SCL-10222 Worksheet does not work when it was created in packages
  • SCL-15360 --addPluginSbtFile fails when temporary sbt file path contains spaces
  • SCL-16384 Highlight error in foldLeft using a tuple of numbers as an accumulator
  • SCL-16587 worksheet: run button appears too early when running outside compiler server
  • SCL-14475 bsp: support refresh by buildTarget/didChange notification
  • SCL-16458 enable case completion inside partial function definition
  • SCL-16601 Scala-js jvm files not compiled
  • SCL-16519 do not allocate intermediate collection in PsiBuilderExt.lookAhead
  • IDEA-228144 Some Scala EditorConfig settings are not working properly or are highlighted wrongly
  • SCL-16470 Type hints settings: use proper terms
  • BDIDE-272 Scala completion doesn't work
  • SCL-16580 method chain hints: don't show singleton types on first line even if aligned
  • SCL-16612 Add link to the settings when showing error that REPL mode is available only in compile server process
  • SCL-16293 Correct code is highlighted red
  • SCL-16290 Scala: Incorrect "Unnecessary partial function" when matching type parameters
  • SCL-16502 sbt shell toolwindow is green after stop
  • SCL-16116 Improve BSP import performance
  • SCL-16421 todo in scaladoc not being recognized
  • SCL-16425 "Package names doesn't correspond to directories structures" warning in Scala Worksheets
  • SCL-11103 Array rendering in worksheet. Regression.
  • SCL-15683 Don't show $ when fixing typos in names of objects
  • SCL-16622 Use a single, standard "Type mismatch hints" setting
  • SCL-16539 Don't put chained method hints to View menu
  • SCL-16537 Expression chain hints: don't show obvious types (when configured so)
  • SCL-9271 In interactive mode add compilation error status somewhere
  • SCL-16535 Don't show a chain hint when there's a type mismatch hint
  • SCL-16438 BSP sessions are closed just after creation
  • SCL-16394 BSP builds don't cancel when connection fails or is canceled
  • SCL-16113 Caching shouldn't be done in recursive calls
  • SCL-16323 Broken `Jump to Source`
  • SCL-16327 Inconsistent expected type for various function literals
  • SCL-16325 Run ScalaTest with coverage disabled
  • SCL-16540 add inspection for function literal with typed parameter without parentheses
  • SCL-16635 "___ | Configure..." context menu entry for parameter name hints
  • SCL-16528 debugger: method evaluation with default parameters works incorrectly for the scala >= 2.12.8
  • SCL-16525 IDEA reports Scala type mismatch in valid source code
  • SCL-16521 Nullpointer exception when assigning lambda to kotlin sam type
  • SCL-16547 Method chain hints: don't show a hint for non method calls
  • SCL-16499 No-dialog import for BSP
  • SCL-16492 Misleading type mismatch hint when using literal types
  • SCL-16495 Make `TypePresentationContext` explicit in our code
  • SCL-16003 type hints for chained expressions with argument block or partial function
  • SCL-16554 Method chain hints: don't omit types when hints are aligned
  • SCL-16556 Method chain hints: remove the "type is identical" setting
  • SCL-16304 no type mismatch error if non-boolean value is passed to `if `
  • SCL-16305 Resolve cannot decide between object in package of package object and imported object with the same name
  • SCL-16067 No context button to run a uTest when file name differs from class\object name
  • SCL-16637 Invalid spacing for HKT type parameter variance
  • SCL-16548 Method chain hints: don't show a type of the whole expression
  • SCL-16656 Context menu for change access modifier (scala) intention opens java settings
  • SCL-16657 Argument for @NotNull parameter 'value' of com/intellij/openapi/util/UserDataHolderBase.putUserDataIfAbsent must not be null thrown after restart
  • SCL-16463 Desugar for-comprehensions result is incorrect for map+foreach combination
  • SCL-16374 BSP: manual connection management
  • SCL-14993 worksheet splitter is too wide
  • SCL-14237 uTest runner hanging if an exception thrown with null in message
  • SCL-16474 make member private appears in scaladoc
  • SCL-16661 Method chain hints: handle "explicit" parameters
  • SCL-16471 Library extension details not updated when changing selection in libraries list
  • SCL-16577 Method Chain Inlay hints not shown in preview when they are turned off
  • SCL-16573 please get rid of AnotationHolderImpl custom implementations
  • SCL-16685 utest run configuration in cross platfrom project is created without module name, test hangs
  • SCL-16569 worksheet: periodic output flush for long evaluations does not work
  • SCL-16592 Method chain hints: don't show "package types"

Build 2020.1.113

Download Scala plugin for IDEA

Expand
0 Fixed issues
0 Fixed issues

Build 2019.3.708

Download Scala plugin for IDEA

Expand
1 Fixed issues
1 Fixed issues
  • SCL-16573 please get rid of AnotationHolderImpl custom implementations

Build 2019.3.705

Download Scala plugin for IDEA

Expand
2 Fixed issues
2 Fixed issues
  • SCL-15738 Debugger: support Step Into (F7) method selection
  • SCL-16540 add inspection for function literal with typed parameter without parentheses

Build 2020.1.111

Download Scala plugin for IDEA

Expand
97 Fixed issues
97 Fixed issues
  • SCL-15627 Good code red: Nothing inferred while pattern matching on a tuple
  • SCL-13959 Type hints for long method chains
  • SCL-15782 Show type mismatch tooltip on Ctrl + F1
  • SCL-16586 Redesign of hint settings
  • SCL-13053 Trailing commas not recognized in Scala sources of the build
  • SCL-16482 deadlock in worksheet actions
  • SCL-16472 2019.3 EAP intellij asks for setting up scala SDK even though scala is provided via gradle
  • SCL-16698 jps compilation doesn't work for cross projects
  • SCL-14097 new in scala 2.13: more precise prototype for args of overloaded method
  • SCL-11580 Improve sbt project import
  • SCL-16431 Unapplied method should not have function type
  • SCL-16658 Scala failed to save settings and has been disabled
  • SCL-14055 Three equal actions for "Show Implicit hints" in Find Action list
  • SCL-16453 Auto-completion for `def` identifiers (as for `val`s and `var`s)
  • SCL-16516 Google App Engine build failing with 2019.3 EAP
  • SCL-16518 don't use PsiFileFactory.createFileFromText to build stubs
  • SCL-16339 Ctrl+Alt+W shortcut doesn't work in Scala Worksheets
  • SCL-16689 Find usages doesn't detect writes on var
  • SCL-16625 Type hints: an option to suppress hints that break formatting
  • SCL-13836 Good code red - @this Play2 Template Injection
  • SCL-16484 worksheet in PLAIN mode: runtime errors are not displayed
  • SCL-16130 Scala 2.13: Cannot resolve overloaded method "map" for scala.immutable.Map
  • SCL-16493 For scala 2.13.1 REPL worksheet compilation errors are shown in the right tab
  • SCL-16494 Implicit inlays move type chain hints
  • SCL-16331 support `Synthesize a PartialFunction from function literal`
  • SCL-16643 A simpler example for method chain hints
  • SCL-16651 exception opening inlay hints settings from welcome screen
  • SCL-16461 scala files from current project are shown twice in console links
  • SCL-16650 exception on moving class to another package
  • SCL-16702 choose jvm module for run configurations in cross projects
  • SCL-16149 Scala Scratch doesn't provide code completion for an exhaustive pattern-matching expression
  • SCL-16708 StackOverflowError typechecking F-bounded types in Scala
  • BDIDE-238 Auto-import doesn't work (Scala)
  • SCL-16572 regular context menu shown instead of hints settings
  • SCL-16571 settings of method chain hints are messed up
  • SCL-16570 exception in inlay hints settings on windows
  • SCL-16686 Exception NoSuchMethodError: utest.framework.Tree.children()Lscala/collection/Seq when running a test with scala 2.13
  • SCL-16043 worksheet in plain mode: false warning in scala 2.13
  • SCL-15360 --addPluginSbtFile fails when temporary sbt file path contains spaces
  • SCL-16384 Highlight error in foldLeft using a tuple of numbers as an accumulator
  • SCL-16587 worksheet: run button appears too early when running outside compiler server
  • SCL-14475 bsp: support refresh by buildTarget/didChange notification
  • SCL-16458 enable case completion inside partial function definition
  • SCL-16601 Scala-js jvm files not compiled
  • SCL-16519 do not allocate intermediate collection in PsiBuilderExt.lookAhead
  • IDEA-228144 Some Scala EditorConfig settings are not working properly or are highlighted wrongly
  • SCL-16470 Type hints settings: use proper terms
  • BDIDE-272 Scala completion doesn't work
  • SCL-16580 method chain hints: don't show singleton types on first line even if aligned
  • SCL-16612 Add link to the settings when showing error that REPL mode is available only in compile server process
  • SCL-16293 Correct code is highlighted red
  • SCL-16290 Scala: Incorrect "Unnecessary partial function" when matching type parameters
  • SCL-16502 sbt shell toolwindow is green after stop
  • SCL-16116 Improve BSP import performance
  • SCL-16421 todo in scaladoc not being recognized
  • SCL-16425 "Package names doesn't correspond to directories structures" warning in Scala Worksheets
  • SCL-11103 Array rendering in worksheet. Regression.
  • SCL-16622 Use a single, standard "Type mismatch hints" setting
  • SCL-16539 Don't put chained method hints to View menu
  • SCL-16537 Expression chain hints: don't show obvious types (when configured so)
  • SCL-9271 In interactive mode add compilation error status somewhere
  • SCL-16535 Don't show a chain hint when there's a type mismatch hint
  • SCL-16438 BSP sessions are closed just after creation
  • SCL-16394 BSP builds don't cancel when connection fails or is canceled
  • SCL-16113 Caching shouldn't be done in recursive calls
  • SCL-16656 Context menu for change access modifier (scala) intention opens java settings
  • SCL-16323 Broken `Jump to Source`
  • SCL-16327 Inconsistent expected type for various function literals
  • SCL-16325 Run ScalaTest with coverage disabled
  • SCL-16635 "___ | Configure..." context menu entry for parameter name hints
  • SCL-16528 debugger: method evaluation with default parameters works incorrectly for the scala >= 2.12.8
  • SCL-16525 IDEA reports Scala type mismatch in valid source code
  • SCL-16521 Nullpointer exception when assigning lambda to kotlin sam type
  • SCL-16547 Method chain hints: don't show a hint for non method calls
  • SCL-16499 No-dialog import for BSP
  • SCL-16492 Misleading type mismatch hint when using literal types
  • SCL-16495 Make `TypePresentationContext` explicit in our code
  • SCL-16003 type hints for chained expressions with argument block or partial function
  • SCL-16554 Method chain hints: don't omit types when hints are aligned
  • SCL-16556 Method chain hints: remove the "type is identical" setting
  • SCL-16304 no type mismatch error if non-boolean value is passed to `if `
  • SCL-16305 Resolve cannot decide between object in package of package object and imported object with the same name
  • SCL-16067 No context button to run a uTest when file name differs from class\object name
  • SCL-16637 Invalid spacing for HKT type parameter variance
  • SCL-16548 Method chain hints: don't show a type of the whole expression
  • SCL-16657 Argument for @NotNull parameter 'value' of com/intellij/openapi/util/UserDataHolderBase.putUserDataIfAbsent must not be null thrown after restart
  • SCL-16463 Desugar for-comprehensions result is incorrect for map+foreach combination
  • SCL-16374 BSP: manual connection management
  • SCL-14993 worksheet splitter is too wide
  • SCL-14237 uTest runner hanging if an exception thrown with null in message
  • SCL-16474 make member private appears in scaladoc
  • SCL-16661 Method chain hints: handle "explicit" parameters
  • SCL-16471 Library extension details not updated when changing selection in libraries list
  • SCL-16577 Method Chain Inlay hints not shown in preview when they are turned off
  • SCL-16685 utest run configuration in cross platfrom project is created without module name, test hangs
  • SCL-16569 worksheet: periodic output flush for long evaluations does not work
  • SCL-16592 Method chain hints: don't show "package types"

Build 2019.3.699

Download Scala plugin for IDEA

Expand
1 Fixed issues
1 Fixed issues
  • SCL-15683 Don't show $ when fixing typos in names of objects

Build 2019.3.694

Download Scala plugin for IDEA

Expand
4 Fixed issues
4 Fixed issues
  • SCL-16689 Find usages doesn't detect writes on var
  • SCL-16625 Type hints: an option to suppress hints that break formatting
  • SCL-15360 --addPluginSbtFile fails when temporary sbt file path contains spaces
  • SCL-16463 Desugar for-comprehensions result is incorrect for map+foreach combination

Build 2019.3.688

Download Scala plugin for IDEA

Expand
1 Fixed issues
1 Fixed issues
  • SCL-16463 Desugar for-comprehensions result is incorrect for map+foreach combination

Build 2019.3.681

Download Scala plugin for IDEA

Expand
1 Fixed issues
1 Fixed issues
  • SCL-16661 Method chain hints: handle "explicit" parameters

Build 2019.3.678

Download Scala plugin for IDEA

Expand
1 Fixed issues
1 Fixed issues
  • SCL-16708 StackOverflowError typechecking F-bounded types in Scala

Build 2019.3.673

Download Scala plugin for IDEA

Expand
1 Fixed issues
1 Fixed issues
  • SCL-16625 Type hints: an option to suppress hints that break formatting

Build 2019.3.668

Download Scala plugin for IDEA

Expand
3 Fixed issues
3 Fixed issues
  • SCL-16708 StackOverflowError typechecking F-bounded types in Scala
  • SCL-16625 Type hints: an option to suppress hints that break formatting
  • SCL-16470 Type hints settings: use proper terms

Build 2019.3.663

Download Scala plugin for IDEA

Expand
5 Fixed issues
5 Fixed issues
  • SCL-16698 jps compilation doesn't work for cross projects
  • SCL-16702 choose jvm module for run configurations in cross projects
  • IDEA-228144 Some Scala EditorConfig settings are not working properly or are highlighted wrongly
  • SCL-16323 Broken `Jump to Source`
  • SCL-14237 uTest runner hanging if an exception thrown with null in message

Build 2020.1.108

Download Scala plugin for IDEA

Expand
0 Fixed issues
0 Fixed issues

Build 2019.3.646

Download Scala plugin for IDEA

Expand
0 Fixed issues
0 Fixed issues

Build 2019.3.644

Download Scala plugin for IDEA

Expand
4 Fixed issues
4 Fixed issues
  • SCL-16569 worksheet: periodic output flush for long evaluations does not work
  • SCL-16637 Invalid spacing for HKT type parameter variance
  • SCL-16612 Add link to the settings when showing error that REPL mode is available only in compile server process
  • SCL-16657 Argument for @NotNull parameter 'value' of com/intellij/openapi/util/UserDataHolderBase.putUserDataIfAbsent must not be null thrown after restart

Build 2020.1.105

Download Scala plugin for IDEA

Expand
29 Fixed issues
29 Fixed issues
  • SCL-15627 Good code red: Nothing inferred while pattern matching on a tuple
  • SCL-16472 2019.3 EAP intellij asks for setting up scala SDK even though scala is provided via gradle
  • SCL-15782 Show type mismatch tooltip on Ctrl + F1
  • SCL-16431 Unapplied method should not have function type
  • SCL-11580 Improve sbt project import
  • SCL-14097 new in scala 2.13: more precise prototype for args of overloaded method
  • SCL-14055 Three equal actions for "Show Implicit hints" in Find Action list
  • SCL-16331 support `Synthesize a PartialFunction from function literal`
  • SCL-16494 Implicit inlays move type chain hints
  • SCL-16149 Scala Scratch doesn't provide code completion for an exhaustive pattern-matching expression
  • BDIDE-238 Auto-import doesn't work (Scala)
  • SCL-16461 scala files from current project are shown twice in console links
  • SCL-16130 Scala 2.13: Cannot resolve overloaded method "map" for scala.immutable.Map
  • SCL-16116 Improve BSP import performance
  • SCL-16374 BSP: manual connection management
  • SCL-16499 No-dialog import for BSP
  • SCL-16492 Misleading type mismatch hint when using literal types
  • SCL-16495 Make `TypePresentationContext` explicit in our code
  • SCL-14475 bsp: support refresh by buildTarget/didChange notification
  • SCL-16384 Highlight error in foldLeft using a tuple of numbers as an accumulator
  • SCL-16438 BSP sessions are closed just after creation
  • SCL-16471 Library extension details not updated when changing selection in libraries list
  • SCL-16502 sbt shell toolwindow is green after stop
  • SCL-16305 Resolve cannot decide between object in package of package object and imported object with the same name
  • SCL-16327 Inconsistent expected type for various function literals
  • BDIDE-272 Scala completion doesn't work
  • SCL-16293 Correct code is highlighted red
  • SCL-16394 BSP builds don't cancel when connection fails or is canceled
  • SCL-16421 todo in scaladoc not being recognized

Build 2019.3.641

Download Scala plugin for IDEA

Expand
0 Fixed issues
0 Fixed issues

Build 2019.3.639

Download Scala plugin for IDEA

Expand
1 Fixed issues
1 Fixed issues
  • SCL-16651 exception opening inlay hints settings from welcome screen

Build 2019.3.629

Download Scala plugin for IDEA

Expand
1 Fixed issues
1 Fixed issues
  • SCL-16612 Add link to the settings when showing error that REPL mode is available only in compile server process

Build 2019.3.626

Download Scala plugin for IDEA

Expand
1 Fixed issues
1 Fixed issues
  • SCL-16612 Add link to the settings when showing error that REPL mode is available only in compile server process

Build 2019.3.623

Download Scala plugin for IDEA

Expand
0 Fixed issues
0 Fixed issues

Build 2019.3.617

Download Scala plugin for IDEA

Expand
0 Fixed issues
0 Fixed issues

Build 2019.3.605

Download Scala plugin for IDEA

Expand
0 Fixed issues
0 Fixed issues

Build 2019.3.603

Download Scala plugin for IDEA

Expand
0 Fixed issues
0 Fixed issues

Build 2019.3.598

Download Scala plugin for IDEA

Expand
3 Fixed issues
3 Fixed issues
  • SCL-16556 Method chain hints: remove the "type is identical" setting
  • SCL-16580 method chain hints: don't show singleton types on first line even if aligned
  • SCL-16592 Method chain hints: don't show "package types"

Build 2019.3.596

Download Scala plugin for IDEA

Expand
2 Fixed issues
2 Fixed issues
  • SCL-13053 Trailing commas not recognized in Scala sources of the build
  • SCL-16458 enable case completion inside partial function definition

Build 2019.3.585

Download Scala plugin for IDEA

Expand
4 Fixed issues
4 Fixed issues
  • SCL-16572 regular context menu shown instead of hints settings
  • SCL-16571 settings of method chain hints are messed up
  • SCL-16570 exception in inlay hints settings on windows
  • SCL-16577 Method Chain Inlay hints not shown in preview when they are turned off

Build 2019.3.573

Download Scala plugin for IDEA

Expand
3 Fixed issues
3 Fixed issues
  • SCL-16548 Method chain hints: don't show a type of the whole expression
  • SCL-16547 Method chain hints: don't show a hint for non method calls
  • SCL-16554 Method chain hints: don't omit types when hints are aligned

Build 2019.3.560

Download Scala plugin for IDEA

Expand
9 Fixed issues
9 Fixed issues
  • SCL-16482 deadlock in worksheet actions
  • SCL-16484 worksheet in PLAIN mode: runtime errors are not displayed
  • SCL-16043 worksheet in plain mode: false warning in scala 2.13
  • SCL-16453 Auto-completion for `def` identifiers (as for `val`s and `var`s)
  • SCL-11103 Array rendering in worksheet. Regression.
  • SCL-14993 worksheet splitter is too wide
  • SCL-9271 In interactive mode add compilation error status somewhere
  • SCL-16421 todo in scaladoc not being recognized
  • SCL-16325 Run ScalaTest with coverage disabled

Build 2019.3.549

Download Scala plugin for IDEA

Expand
4 Fixed issues
4 Fixed issues
  • SCL-16453 Auto-completion for `def` identifiers (as for `val`s and `var`s)
  • SCL-16539 Don't put chained method hints to View menu
  • SCL-16537 Expression chain hints: don't show obvious types (when configured so)
  • SCL-16535 Don't show a chain hint when there's a type mismatch hint

Build 2019.3.534

Download Scala plugin for IDEA

Expand
2 Fixed issues
2 Fixed issues
  • SCL-13959 Type hints for long method chains
  • SCL-16003 type hints for chained expressions with argument block or partial function

Build 2019.3.525

Download Scala plugin for IDEA

Expand
8 Fixed issues
8 Fixed issues
  • SCL-16472 2019.3 EAP intellij asks for setting up scala SDK even though scala is provided via gradle
  • SCL-16304 no type mismatch error if non-boolean value is passed to `if `
  • SCL-16525 IDEA reports Scala type mismatch in valid source code
  • SCL-16113 Caching shouldn't be done in recursive calls
  • SCL-16521 Nullpointer exception when assigning lambda to kotlin sam type
  • SCL-16290 Scala: Incorrect "Unnecessary partial function" when matching type parameters
  • SCL-16003 type hints for chained expressions with argument block or partial function
  • SCL-16474 make member private appears in scaladoc

Build 2019.3.512

Download Scala plugin for IDEA

Expand
3 Fixed issues
3 Fixed issues
  • SCL-16472 2019.3 EAP intellij asks for setting up scala SDK even though scala is provided via gradle
  • SCL-16518 don't use PsiFileFactory.createFileFromText to build stubs
  • SCL-16519 do not allocate intermediate collection in PsiBuilderExt.lookAhead

Build 2019.3.498

Download Scala plugin for IDEA

Expand
2 Fixed issues
2 Fixed issues
  • SCL-16149 Scala Scratch doesn't provide code completion for an exhaustive pattern-matching expression
  • SCL-16421 todo in scaladoc not being recognized

Build 2019.3.496

Download Scala plugin for IDEA

Expand
3 Fixed issues
3 Fixed issues
  • SCL-16421 todo in scaladoc not being recognized
  • SCL-16502 sbt shell toolwindow is green after stop
  • SCL-16305 Resolve cannot decide between object in package of package object and imported object with the same name

Build 2019.3.484

Download Scala plugin for IDEA

Expand
6 Fixed issues
6 Fixed issues
  • SCL-15627 Good code red: Nothing inferred while pattern matching on a tuple
  • SCL-14097 new in scala 2.13: more precise prototype for args of overloaded method
  • SCL-16331 support `Synthesize a PartialFunction from function literal`
  • SCL-16130 Scala 2.13: Cannot resolve overloaded method "map" for scala.immutable.Map
  • SCL-16327 Inconsistent expected type for various function literals
  • SCL-16293 Correct code is highlighted red

Build 2019.3.480

Download Scala plugin for IDEA

Expand
3 Fixed issues
3 Fixed issues
  • SCL-16494 Implicit inlays move type chain hints
  • SCL-16492 Misleading type mismatch hint when using literal types
  • SCL-16495 Make `TypePresentationContext` explicit in our code

Build 2019.3.466

Download Scala plugin for IDEA

Expand
2 Fixed issues
2 Fixed issues
  • SCL-16431 Unapplied method should not have function type
  • SCL-16461 scala files from current project are shown twice in console links

Build 2019.3.459

Download Scala plugin for IDEA

Expand
2 Fixed issues
2 Fixed issues
  • SCL-16461 scala files from current project are shown twice in console links
  • SCL-16384 Highlight error in foldLeft using a tuple of numbers as an accumulator

Build 2019.2.1157

Download Scala plugin for IDEA

Expand
0 Fixed issues
0 Fixed issues

Build 2019.3.449

Download Scala plugin for IDEA

Expand
1 Fixed issues
1 Fixed issues
  • SCL-15782 Show type mismatch tooltip on Ctrl + F1

Build 2019.3.443

Download Scala plugin for IDEA

Expand
4 Fixed issues
4 Fixed issues
  • SCL-15782 Show type mismatch tooltip on Ctrl + F1
  • BDIDE-238 Auto-import doesn't work (Scala)
  • SCL-14475 bsp: support refresh by buildTarget/didChange notification
  • BDIDE-272 Scala completion doesn't work

Build 2019.3.427

Download Scala plugin for IDEA

Expand
9 Fixed issues
9 Fixed issues
  • SCL-16448 Intellij IDEA project window is blocked after closing a project with running sbt shell
  • SCL-16374 BSP: manual connection management
  • SCL-16455 ObjectNotDisposedException when closing project imported via sbt shell
  • SCL-16450 useless sbt-shell-toolwindow-console tab in sbt shell
  • SCL-16451 Use named arguments shouldn't be shown for non-Scala classes
  • SCL-16444 Ad hoc configuration for type mismatch hints
  • SCL-16438 BSP sessions are closed just after creation
  • SCL-16394 BSP builds don't cancel when connection fails or is canceled
  • SCL-16116 Improve BSP import performance

Build 2019.3.410

Download Scala plugin for IDEA

Expand
1 Fixed issues
1 Fixed issues
  • SCL-15980 Aligning of type hints in expression chains conflicts with other inlays

Build 2019.3.405

Download Scala plugin for IDEA

Expand
3 Fixed issues
3 Fixed issues
  • SCL-15330 sbt shell toolwindow icon should indicate if it is running
  • SCL-12717 Group all -build modules under "build" module goup
  • SCL-16401 improve module names of imported sbt projects

Build 2019.3.373

Download Scala plugin for IDEA

Expand
3 Fixed issues
3 Fixed issues
  • SCL-16397 Convert counting loops properly
  • SCL-11367 Excessive code fir "for" loop convertation
  • SCL-16398 Support symbols completion in commit text

Build 2019.3.370

Download Scala plugin for IDEA

Expand
0 Fixed issues
0 Fixed issues

Build 2019.3.363

Download Scala plugin for IDEA

Expand
0 Fixed issues
0 Fixed issues

Build 2019.3.360

Download Scala plugin for IDEA

Expand
2 Fixed issues
2 Fixed issues
  • SCL-16349 IDE breaks the alignment in Scala Worksheets by adding unnecessary empty new lines
  • SCL-16367 Can't perform a refactoring by renaming a method in the base class/trait using Scala Worksheets

Build 2019.3.348

Download Scala plugin for IDEA

Expand
1 Fixed issues
1 Fixed issues
  • SCL-16081 IDE provides an incorrect type annotation for a public method

Build 2019.3.343

Download Scala plugin for IDEA

Expand
1 Fixed issues
1 Fixed issues
  • SCL-16362 Can't implement methods with Alt+Insert in Scala Worksheets

Build 2019.3.341

Download Scala plugin for IDEA

Expand
4 Fixed issues
4 Fixed issues
  • SCL-16342 NPE on extracting variable in a worksheet
  • SCL-15549 wrap if/else/ try/finally for/yield do/while bodies in {} on typing {
  • SCL-16351 Typehint on mouse hover doesn't work at end of identifier
  • SCL-16282 Triple quotes completion does not work with multicursor

Build 2019.3.333

Download Scala plugin for IDEA

Expand
2 Fixed issues
2 Fixed issues

Build 2019.3.326

Download Scala plugin for IDEA

Expand
0 Fixed issues
0 Fixed issues

Build 2019.3.321

Download Scala plugin for IDEA

Expand
1 Fixed issues
1 Fixed issues
  • SCL-16081 IDE provides an incorrect type annotation for a public method

Build 2019.3.319

Download Scala plugin for IDEA

Expand
4 Fixed issues
4 Fixed issues
  • SCL-16149 Scala Scratch doesn't provide code completion for an exhaustive pattern-matching expression
  • SCL-16334 freeze on opening project due to Play2SyntheticPackagesHolder
  • SCL-16317 extract variable on last line breaks code
  • SCL-16336 Import via Alt+Enter does not work in scratch files but does work in regular .scala files and worksheet

Build 2019.3.305

Download Scala plugin for IDEA

Expand
0 Fixed issues
0 Fixed issues

Build 2019.3.289

Download Scala plugin for IDEA

Expand
5 Fixed issues
5 Fixed issues
  • SCL-15025 support modifiers introduced in scala 3 in parser
  • SCL-16282 Triple quotes completion does not work with multicursor
  • SCL-16304 no type mismatch error if non-boolean value is passed to `if `
  • SCL-16273 Detect .scalafmt.conf in repo root if not found in project root.
  • SCL-16298 Nullpointer when applying extract method refactoring to scala scratch file

Build 2019.3.272

Download Scala plugin for IDEA

Expand
1 Fixed issues
1 Fixed issues
  • SCL-16194 Scala templates show false error mesages again

Build 2019.3.270

Download Scala plugin for IDEA

Expand
3 Fixed issues
3 Fixed issues
  • SCL-14447 ScalaTest does not find class, if class in package with reserved name
  • SCL-16282 Triple quotes completion does not work with multicursor
  • SCL-16240 When running ScalaTests with Use UI with sbt Test framework quits unexpectedly

Build 2019.3.264

Download Scala plugin for IDEA

Expand
1 Fixed issues
1 Fixed issues
  • SCL-16195 don't duplicate scala setters in completion

Build 2019.3.252

Download Scala plugin for IDEA

Expand
3 Fixed issues
3 Fixed issues
  • SCL-16244 Breakpoints do not work in lambda functions when the classes are reload dynamically
  • SCL-13793 Scala plugin does not support trailing comma syntax from scala 2.12
  • SCL-16149 Scala Scratch doesn't provide code completion for an exhaustive pattern-matching expression

Build 2019.3.236

Download Scala plugin for IDEA

Expand
8 Fixed issues
8 Fixed issues
  • SCL-16289 Unable to build scala project with 2019.3 / EAP due to missing android class
  • SCL-15481 Type mismatch: fine-grained diff
  • SCL-16277 Run worksheet fails
  • SCL-14447 ScalaTest does not find class, if class in package with reserved name
  • SCL-16286 formatter: ability to add spacing before colon in type argument context bound
  • SCL-16203 Import via Alt+Enter does not work in Worksheet but does work in regular .scala files
  • SCL-15989 Pasting when having multiline string selected does not insert delimiters
  • SCL-16053 language injection shouldn't take margin char from settings

Build 2019.2.1155

Download Scala plugin for IDEA

Expand
0 Fixed issues
0 Fixed issues

Build 2019.2.1154

Download Scala plugin for IDEA

Expand
0 Fixed issues
0 Fixed issues

Build 2019.3.217

Download Scala plugin for IDEA

Expand
0 Fixed issues
0 Fixed issues

Build 2019.3.210

Download Scala plugin for IDEA

Expand
1 Fixed issues
1 Fixed issues
  • SCL-15025 support modifiers introduced in scala 3 in parser

Build 2019.3.196

Download Scala plugin for IDEA

Expand
1 Fixed issues
1 Fixed issues
  • SCL-15025 support modifiers introduced in scala 3 in parser

Build 2019.3.193

Download Scala plugin for IDEA

Expand
1 Fixed issues
1 Fixed issues
  • SCL-15025 support modifiers introduced in scala 3 in parser

Build 2019.3.189

Download Scala plugin for IDEA

Expand
0 Fixed issues
0 Fixed issues

Build 2019.3.174

Download Scala plugin for IDEA

Expand
7 Fixed issues
7 Fixed issues
  • SCL-16146 SBT shell tool window is always empty
  • SCL-16208 scalac error: multiple scala-library.jar files at running hello world
  • SCL-16225 sbt process is created twice on running build process
  • SCL-15936 Highlighting error in IntelliJ IDE Community Edition 2019.2 with Java HashMap
  • SCL-16202 ScalaPsiManager.clearAllCaches requires EDT
  • SCL-16224 Opening quote sign doesn't come together with closing one in build.sbt
  • SCL-16230 BSP import on Windows fails

Build 2019.2.1153

Download Scala plugin for IDEA

Expand
0 Fixed issues
0 Fixed issues

Build 2019.2.1149

Download Scala plugin for IDEA

Expand
2 Fixed issues
2 Fixed issues
  • SCL-16146 SBT shell tool window is always empty
  • SCL-16225 sbt process is created twice on running build process

Build 2019.2.1144

Download Scala plugin for IDEA

Expand
0 Fixed issues
0 Fixed issues

Build 2019.2.1142

Download Scala plugin for IDEA

Expand
1 Fixed issues
1 Fixed issues
  • SCL-16202 ScalaPsiManager.clearAllCaches requires EDT

Build 2019.2.1138

Download Scala plugin for IDEA

Expand
1 Fixed issues
1 Fixed issues
  • SCL-16137 NullPointerException in ScalaCompilerReferenceIndexBuilder when compiling IDEA sources

Build 2019.2.1132

Download Scala plugin for IDEA

Expand
1 Fixed issues
1 Fixed issues
  • SCL-16197 Wrong Inspection on Redundant Conversion

Build 2019.2.1116

Download Scala plugin for IDEA

Expand
4 Fixed issues
4 Fixed issues
  • SCL-15745 Incorrect rendering of class name `<:<` in scala doc
  • SCL-16179 Support for switch expressions
  • SCL-16180 Top-level class in default package has no documentation
  • SCL-16187 Support removable breaks from switch

Build 2019.2.1107

Download Scala plugin for IDEA

Expand
2 Fixed issues
2 Fixed issues
  • SCL-15468 No indention for `else` in new line while typing
  • SCL-15751 Empty extension of classes, traits and objects

Build 2019.2.1082

Download Scala plugin for IDEA

Expand
0 Fixed issues
0 Fixed issues

Build 2019.2.1058

Download Scala plugin for IDEA

Expand
0 Fixed issues
0 Fixed issues

Build 2019.2.1051

Download Scala plugin for IDEA

Expand
0 Fixed issues
0 Fixed issues

Build 2019.2.1045

Download Scala plugin for IDEA

Expand
1 Fixed issues
1 Fixed issues
  • SCL-16044 Test run configurations loose stuff when firstly opening the project in another version of IDEA (remaining points)

Build 2019.2.1033

Download Scala plugin for IDEA

Expand
3 Fixed issues
3 Fixed issues
  • SCL-15082 BSP session does not clean up bsp processes when done
  • SCL-14857 bsp build toolwindow problem reports: lines off by one
  • SCL-14876 bsp: support multiple connections

Build 2019.2.1012

Download Scala plugin for IDEA

Expand
2 Fixed issues
2 Fixed issues
  • SCL-16110 Incorrect type inference when using Scala 2.13 (works ok if 2.12 is selected)
  • SCL-16016 Seq from variadic parameter does not conform to Seq in 2.13

Build 2019.2.1010

Download Scala plugin for IDEA

Expand
3 Fixed issues
3 Fixed issues
  • SCL-16014 scala scratch files use wrong language level
  • SCL-16093 NPE when extracting to method code that contains Kotlin object method call
  • SCL-15809 Problems with private copy method

Build 2019.2.994

Download Scala plugin for IDEA

Expand
2 Fixed issues
2 Fixed issues
  • SCL-15737 Explicit imports now shadow locally defined identifiers.
  • SCL-16057 Intellij IDEA incorrectly determines which class will be used

Build 2019.2.991

Download Scala plugin for IDEA

Expand
0 Fixed issues
0 Fixed issues

Build 2019.2.986

Download Scala plugin for IDEA

Expand
0 Fixed issues
0 Fixed issues

Build 2019.2.980

Download Scala plugin for IDEA

Expand
2 Fixed issues
2 Fixed issues
  • SCL-13083 Copy file from finder and paste it into project view just create scriptFile.scala
  • SCL-16041 Intention to change access modifier should only be shown on signature

Build 2019.2.976

Download Scala plugin for IDEA

Expand
5 Fixed issues
5 Fixed issues
  • SCL-16044 Test run configurations loose stuff when firstly opening the project in another version of IDEA (remaining points)
  • SCL-11696 REPL Worksheet Scala 2.12 NoSuchMethodError for Collections operators
  • SCL-16082 MatchError in TestConfigurationData.createFromExternal
  • SCL-15884 BSP modules are not created when tags are missing
  • SCL-15968 Generate a top-level project for all BSP modules (projects)

Build 2019.2.965

Download Scala plugin for IDEA

Expand
1 Fixed issues
1 Fixed issues
  • SCL-15067 BSP only imports Scala build targets

Build 2019.2.963

Download Scala plugin for IDEA

Expand
1 Fixed issues
1 Fixed issues
  • SCL-16076 setter signature is missing in compound types with var declarations

Build 2019.2.961

Download Scala plugin for IDEA

Expand
1 Fixed issues
1 Fixed issues
  • SCL-15067 BSP only imports Scala build targets

Build 2019.2.956

Download Scala plugin for IDEA

Expand
0 Fixed issues
0 Fixed issues

Build 2019.2.955

Download Scala plugin for IDEA

Expand
4 Fixed issues
4 Fixed issues
  • SCL-16031 ScalaTest template not honoured when creating new test run configurations via context menu
  • SCL-16060 don't show chained expression type hints if they are all equal
  • SCL-15905 False-positive of "reflective call" inspection on projections
  • SCL-11621 Improve Class + Object presentation in Project View

Build 2019.2.941

Download Scala plugin for IDEA

Expand
1 Fixed issues
1 Fixed issues
  • SCL-11621 Improve Class + Object presentation in Project View

Build 2019.2.936

Download Scala plugin for IDEA

Expand
2 Fixed issues
2 Fixed issues
  • SCL-15930 Ctrl+Click doesn't work for URLs in Scala source code
  • SCL-15951 Fotmatter exception in introduce variable (scalafmt)

Build 2019.2.935

Download Scala plugin for IDEA

Expand
6 Fixed issues
6 Fixed issues
  • SCL-16039 BSP: SerializationException: Cannot deserialize ScalaSdkData
  • SCL-15873 Assume batch semantics for BSP diagnostics
  • SCL-15986 stackOverflow in `ScalaPsiElement.getDeepSameElementInContext`
  • SCL-15881 BSP: respect resources directories
  • SCL-15894 BSP rebuild action
  • SCL-15968 Generate a top-level project for all BSP modules (projects)

Build 2019.2.923

Download Scala plugin for IDEA

Expand
5 Fixed issues
5 Fixed issues
  • SCL-13959 Type hints for long method chains
  • SCL-16026 Plugin upload fails with authorization error
  • SCL-16027 Also show type hint for last expression in expression chains
  • SCL-7232 intention to add/change access modifier
  • SCL-15983 expression chain type hints shouldn't show singleton types

Build 2019.2.886

Download Scala plugin for IDEA

Expand
6 Fixed issues
6 Fixed issues
  • SCL-15932 Trailing comma in an argument list is considered invalid
  • SCL-15961 introduce variable suggest chooser for a simple case clause branch
  • SCL-12260 Introduce variable suggest "unit" name for `int` variable if expected type is Unit
  • SCL-15842 Unable to normally extract a variable out of a pattern matching expression
  • SCL-12210 Introduce variable: don't add the tailing reference when expected type is Unit
  • SCL-15944 Duplicate code inspections matches purely on string even if the classes are not compatible

Build 2019.2.872

Download Scala plugin for IDEA

Expand
3 Fixed issues
3 Fixed issues
  • SCL-13959 Type hints for long method chains
  • SCL-15606 Run/Tests fail with ClassNotFoundException for BSP projects under bloop 1.3.0+
  • SCL-11621 Improve Class + Object presentation in Project View

Build 2019.2.849

Download Scala plugin for IDEA

Expand
1 Fixed issues
1 Fixed issues
  • SCL-15606 Run/Tests fail with ClassNotFoundException for BSP projects under bloop 1.3.0+

Build 2019.2.847

Download Scala plugin for IDEA

Expand
2 Fixed issues
2 Fixed issues
  • SCL-15957 wrong completion result in presence of `this` or `super` references
  • SCL-15951 Fotmatter exception in introduce variable (scalafmt)

Build 2019.2.837

Download Scala plugin for IDEA

Expand
5 Fixed issues
5 Fixed issues
  • SCL-15475 IDEA does not count @varargs Scala annotation, marking a function call as invalid in Java code
  • SCL-15930 Ctrl+Click doesn't work for URLs in Scala source code
  • SCL-15931 Code completion for method arguments provides an unsound suggestion regarding the argument type
  • SCL-15901 Akka-Http: false type mismatch highlighting
  • SCL-15926 Incorrect code completion suggestion while creating an instance of a class

Build 2019.2.829

Download Scala plugin for IDEA

Expand
0 Fixed issues
0 Fixed issues

Build 2019.2.824

Download Scala plugin for IDEA

Expand
6 Fixed issues
6 Fixed issues
  • SCL-15250 Use inlay type ascription to indicate type mismatch
  • SCL-13959 Type hints for long method chains
  • SCL-15911 wrong quickfix for unnecessary parentheses inspection
  • SCL-11382 Create method intention with named arguments doesn't work
  • SCL-15774 Scala console: evaluate text on Enter
  • SCL-15910 hide Scala REPL from context menu in non-scala files

Build 2019.2.808

Download Scala plugin for IDEA

Expand
0 Fixed issues
0 Fixed issues

Build 2019.2.801

Download Scala plugin for IDEA

Expand
2 Fixed issues
2 Fixed issues
  • SCL-15757 Scala plugin should not suggest to convert text in clipboard from Java to Scala if it is pasted inside a string literal
  • SCL-15869 convert java to scala dialog is not shown on copy pasting java class name

Build 2019.2.794

Download Scala plugin for IDEA

Expand
7 Fixed issues
7 Fixed issues
  • SCL-14838 Scala Console classpath shortener seems to cause issues with JDK11 and JPMS
  • SCL-15775 Rename Scala Console to Scala REPL
  • SCL-15907 paste one-line content to one-line multiline string literal adds stripmargin
  • SCL-15774 Scala console: evaluate text on Enter
  • SCL-15630 Auto-completion completes for the wrong type
  • SCL-15859 scala console: use appropriate scala language level
  • SCL-15858 scala console: display entered text right after `scala>` prompt

Build 2019.2.786

Download Scala plugin for IDEA

Expand
5 Fixed issues
5 Fixed issues
  • SCL-15871 find usages ignores child packages in case of private top level access modifier
  • SCL-15630 Auto-completion completes for the wrong type
  • SCL-15685 code duplication shows intersecting text ranges
  • SCL-15827 Suspicious forward reference in class should not be triggered for function values
  • SCL-15900 Type diff: prefix same-looking simple names

Build 2019.2.773

Download Scala plugin for IDEA

Expand
9 Fixed issues
9 Fixed issues
  • SCL-15871 find usages ignores child packages in case of private top level access modifier
  • SCL-15481 Type mismatch: fine-grained diff
  • SCL-15774 Scala console: evaluate text on Enter
  • SCL-11382 Create method intention with named arguments doesn't work
  • SCL-15858 scala console: display entered text right after `scala>` prompt
  • SCL-15812 Good code red & code completion fails : nested tuple method calls
  • SCL-15885 Repeating members in signatures generated by "extract method" refactoring
  • SCL-15880 Exception when trying to rename apply method
  • SCL-15614 Good code red - tuple member multiplication

Build 2019.2.737

Download Scala plugin for IDEA

Expand
2 Fixed issues
2 Fixed issues
  • SCL-15774 Scala console: evaluate text on Enter
  • SCL-15858 scala console: display entered text right after `scala>` prompt

Build 2019.2.734

Download Scala plugin for IDEA

Expand
6 Fixed issues
6 Fixed issues
  • SCL-9397 Code completion incorrect (cache invalidation problem?)
  • SCL-15775 Rename Scala Console to Scala REPL
  • SCL-15774 Scala console: evaluate text on Enter
  • SCL-15856 `case` completion item is added to completion list where it is not expected
  • SCL-15859 scala console: use appropriate scala language level
  • SCL-15858 scala console: display entered text right after `scala>` prompt

Build 2019.2.721

Download Scala plugin for IDEA

Expand
3 Fixed issues
3 Fixed issues
  • SCL-15685 code duplication shows intersecting text ranges
  • SCL-15856 `case` completion item is added to completion list where it is not expected
  • SCL-15607 Autocomplete doesn't work for Simulacrum code

Build 2019.2.706

Download Scala plugin for IDEA

Expand
2 Fixed issues
2 Fixed issues
  • SCL-15833 Incorrect code completion for string interpolation expression using a class field
  • SCL-15671 empty tooltip message in ScalaUnnecessaryParenthesesInspectionBase, RedundantBlockInspection

Build 2019.2.694

Download Scala plugin for IDEA

Expand
2 Fixed issues
2 Fixed issues
  • SCL-15847 TypeParameterInfoExtendsTest.testAllBounds fails since 2.11
  • SCL-15829 improve scala code style settings migration mechanism

Build 2019.2.682

Download Scala plugin for IDEA

Expand
1 Fixed issues
1 Fixed issues
  • SCL-15829 improve scala code style settings migration mechanism

Build 2019.2.680

Download Scala plugin for IDEA

Expand
1 Fixed issues
1 Fixed issues
  • SCL-15634 Use 2.13 as default scala version in tests

Build 2019.2.666

Download Scala plugin for IDEA

Expand
5 Fixed issues
5 Fixed issues
  • SCL-15756 Add support for `*` symbol used by kind-projector plugin.
  • SCL-15792 Highlight scala code in sbt files (worked before)
  • SCL-2101 Same named class formal parameter and class member are error highlighted
  • SCL-14074 Exhaustive match and completion for expected types in case clause doesn't appear in Worksheet
  • SCL-15634 Use 2.13 as default scala version in tests

Build 2019.2.628

Download Scala plugin for IDEA

Expand
14 Fixed issues
14 Fixed issues
  • SCL-15558 Trying to run ScalaTest compiled with 2.13.0-RC3 causes java.lang.NoSuchMethodError in "ScalaTest-dispatcher"
  • SCL-15792 Highlight scala code in sbt files (worked before)
  • SCL-15686 Backspace to delete triple quotes breaks the code
  • SCL-13130 Type mismatch not highlighted for callback functions
  • SCL-15680 Calls to functions from method parameters are not type checked
  • SCL-15799 java.lang.IllegalArgumentException during inspection
  • SCL-15747 insert margins when pasting multiline content to one-line multiline string literal
  • SCL-15671 empty tooltip message in ScalaUnnecessaryParenthesesInspectionBase, RedundantBlockInspection
  • SCL-15670 ScalaUnnecessaryParenthesesInspectionBase, RedundantBlockInspection registers INFORMATION level problem in batch mode
  • SCL-15602 Missing error highlighting
  • SCL-15633 macro defs must have explicitly specified return types
  • SCL-15635 Disallow repeated param except in method signature
  • SCL-12580 Bad code green: Function call without arguments shows no errors
  • SCL-14609 Language Injection: enable by default

Build 2019.2.613

Download Scala plugin for IDEA

Expand
7 Fixed issues
7 Fixed issues
  • SCL-15756 Add support for `*` symbol used by kind-projector plugin.
  • SCL-15481 Type mismatch: fine-grained diff
  • SCL-15795 error highlighting in for-comprehensions works wrong when editing code
  • SCL-15671 empty tooltip message in ScalaUnnecessaryParenthesesInspectionBase, RedundantBlockInspection
  • SCL-15648 Incorrect warning that (Integer) cannot be used for a format specifier %d
  • SCL-14726 Bad code green: Semicolon in for
  • SCL-15729 NullPointerException in decompiler

Build 2019.2.580

Download Scala plugin for IDEA

Expand
7 Fixed issues
7 Fixed issues
  • SCL-15780 sort available versions with respect to milestones and RC
  • SCL-15481 Type mismatch: fine-grained diff
  • SCL-15779 Setup scala sdk notification problems
  • SCL-15781 Reformatting Scala code on regex pattern match wrongly inserts space
  • SCL-15795 error highlighting in for-comprehensions works wrong when editing code
  • SCL-15783 Method / constructor invocation: highlight comma on excessive argument(s)
  • SCL-15228 No Scala SDK in module & Project JDK is not defined is displayed twice

Build 2019.2.566

Download Scala plugin for IDEA

Expand
6 Fixed issues
6 Fixed issues
  • SCL-15481 Type mismatch: fine-grained diff
  • SCL-15774 Scala console: evaluate text on Enter
  • SCL-15760 NoClassDefFoundError when trying to run Scala console with Scala 2.13
  • SCL-15432 nonempty text is not covered by block in #Scala #formatter
  • SCL-15773 Method / constructor invocation: highlight "space" before a closing paren on missing argument(s)
  • SCL-15783 Method / constructor invocation: highlight comma on excessive argument(s)

Build 2019.2.551

Download Scala plugin for IDEA

Expand
4 Fixed issues
4 Fixed issues
  • SCL-15481 Type mismatch: fine-grained diff
  • SCL-15776 serialization exception for Play2ProjectData
  • SCL-15753 Play: Find Usages of Members seems broken and throws exception
  • SCL-14976 Use upper case numeric literal suffixes

Build 2019.2.533

Download Scala plugin for IDEA

Expand
5 Fixed issues
5 Fixed issues
  • SCL-15481 Type mismatch: fine-grained diff
  • SCL-15686 Backspace to delete triple quotes breaks the code
  • SCL-15754 Don't highlight a term before a dot as a "type mismatch"
  • SCL-15758 external system deserialization breaks with java.util.Optional
  • SCL-15746 one line comment in pattern matching breaks formatting

Build 2019.2.516

Download Scala plugin for IDEA

Expand
12 Fixed issues
12 Fixed issues
  • SCL-10908 Support FlatSpec for selective test launch
  • SCL-15481 Type mismatch: fine-grained diff
  • SCL-15438 Copying and pasting code within the Scala editor shouldn't guess that code might be Java
  • SCL-15404 debugger doesn't work in partial functions, defined with pattern matching syntax when you mute/unmute breakpoints
  • SCL-15686 Backspace to delete triple quotes breaks the code
  • SCL-15754 Don't highlight a term before a dot as a "type mismatch"
  • SCL-15724 Regression: `Convert to expression in parentheses` refactoring is not available in Nightly
  • SCL-15549 wrap if/else/ try/finally for/yield do/while bodies in {} on typing {
  • SCL-13358 "Convert to argument in parentheses" refactoring works incorrectly
  • SCL-15739 Freezing UI due to presentation compiler
  • SCL-15743 Fix UI for Editor | General | Smart Keys | Scala
  • SCL-15312 FlatSpec tests specifically with a certain style aren't picked up by the right menu anymore

Build 2019.2.499

Download Scala plugin for IDEA

Expand
0 Fixed issues
0 Fixed issues

Build 2019.2.491

Download Scala plugin for IDEA

Expand
0 Fixed issues
0 Fixed issues

Build 2019.2.489

Download Scala plugin for IDEA

Expand
1 Fixed issues
1 Fixed issues
  • SCL-15549 wrap if/else/ try/finally for/yield do/while bodies in {} on typing {

Build 2019.2.483

Download Scala plugin for IDEA

Expand
7 Fixed issues
7 Fixed issues
  • SCL-13169 Refactor | Extract variable leads to broken code if the default name is already used
  • SCL-15724 Regression: `Convert to expression in parentheses` refactoring is not available in Nightly
  • SCL-13358 "Convert to argument in parentheses" refactoring works incorrectly
  • SCL-15678 BSP: build toolwindow does not report task progress (2019.2)
  • SCL-15643 sbt 1.3.0 shell output is messy
  • SCL-15711 `make conversion explicit` action throws scala.MatchError
  • SCL-8405 Extract local variable conflicts with method names if method was imported

Build 2019.2.474

Download Scala plugin for IDEA

Expand
5 Fixed issues
5 Fixed issues
  • SCL-15620 Do not show error "implicit parameters may not be call-by-name" for Scala 2.13
  • SCL-15676 StackOverflowError in cats project
  • SCL-15671 empty tooltip message in ScalaUnnecessaryParenthesesInspectionBase, RedundantBlockInspection
  • SCL-15670 ScalaUnnecessaryParenthesesInspectionBase, RedundantBlockInspection registers INFORMATION level problem in batch mode
  • SCL-15672 Java methods do not recognize Scala methods' throws annotation

Build 2019.2.459

Download Scala plugin for IDEA

Expand
2 Fixed issues
2 Fixed issues
  • SCL-15653 Function used, but not applied (executed)
  • SCL-15632 inspection + quick fix for deprecated symbol literals

Build 2019.2.441

Download Scala plugin for IDEA

Expand
2 Fixed issues
2 Fixed issues
  • SCL-14339 "definition type is obvious" specification
  • SCL-15481 Type mismatch: fine-grained diff

Build 2019.2.426

Download Scala plugin for IDEA

Expand
1 Fixed issues
1 Fixed issues

Build 2019.1.1059

Download Scala plugin for IDEA

Expand
3 Fixed issues
3 Fixed issues
  • SCL-15481 Type mismatch: fine-grained diff
  • SCL-15652 Highlight unused / redundant things as "unused", not as "error or warning"
  • SCL-15545 Unnecessary parentheses: highlight only parentheses

Build 2019.2.411

Download Scala plugin for IDEA

Expand
5 Fixed issues
5 Fixed issues
  • SCL-10058 Pipe added to multiline string when pasting even when stripMargin / pipes are not used
  • SCL-15652 Highlight unused / redundant things as "unused", not as "error or warning"
  • SCL-15549 wrap if/else/ try/finally for/yield do/while bodies in {} on typing {
  • SCL-15545 Unnecessary parentheses: highlight only parentheses
  • SCL-15656 autocomplete multiline string when typing in an empty file

Build 2019.1.1052

Download Scala plugin for IDEA

Expand
3 Fixed issues
3 Fixed issues
  • SCL-14339 "definition type is obvious" specification
  • SCL-15652 Highlight unused / redundant things as "unused", not as "error or warning"
  • SCL-15545 Unnecessary parentheses: highlight only parentheses

Build 2019.2.401

Download Scala plugin for IDEA

Expand
2 Fixed issues
2 Fixed issues
  • SCL-15652 Highlight unused / redundant things as "unused", not as "error or warning"
  • SCL-15545 Unnecessary parentheses: highlight only parentheses

Build 2019.2.394

Download Scala plugin for IDEA

Expand
5 Fixed issues
5 Fixed issues
  • SCL-15250 Use inlay type ascription to indicate type mismatch
  • SCL-15502 Inspection: `override` modifier required
  • SCL-14339 "definition type is obvious" specification
  • SCL-15629 Type hints: unified presentation, folding, navigation, tooltips, and brace matching
  • SCL-14726 Bad code green: Semicolon in for

Build 2019.1.1048

Download Scala plugin for IDEA

Expand
2 Fixed issues
2 Fixed issues
  • SCL-14339 "definition type is obvious" specification
  • SCL-15522 Assertion error: Every search scope must be associated with a project: NOT: EMPTY during ReferencesSearch

Build 2019.2.383

Download Scala plugin for IDEA

Expand
8 Fixed issues
8 Fixed issues
  • SCL-9397 Code completion incorrect (cache invalidation problem?)
  • SCL-5444 reformat always add indentation to @example content
  • SCL-14339 "definition type is obvious" specification
  • SCL-15277 bsp build reports 'failed' despite successful compilation of all modules
  • SCL-15521 completion suggests elements from the wrong scope
  • SCL-15624 scala plugin 2019.2.6 "Memory leak detected" with 2019.2 EAP (192.5118.30)
  • SCL-15581 NPE in ScalaPsiUtil#getStubOrPsiSibling
  • SCL-15629 Type hints: unified presentation, folding, navigation, tooltips, and brace matching

Build 2019.1.1039

Download Scala plugin for IDEA

Expand
3 Fixed issues
3 Fixed issues
  • SCL-15250 Use inlay type ascription to indicate type mismatch
  • SCL-14339 "definition type is obvious" specification
  • SCL-15629 Type hints: unified presentation, folding, navigation, tooltips, and brace matching

Build 2019.1.1032

Download Scala plugin for IDEA

Expand
3 Fixed issues
3 Fixed issues
  • SCL-15250 Use inlay type ascription to indicate type mismatch
  • SCL-14339 "definition type is obvious" specification
  • SCL-15629 Type hints: unified presentation, folding, navigation, tooltips, and brace matching

Build 2019.2.363

Download Scala plugin for IDEA

Expand
4 Fixed issues
4 Fixed issues
  • SCL-15250 Use inlay type ascription to indicate type mismatch
  • SCL-14339 "definition type is obvious" specification
  • SCL-15629 Type hints: unified presentation, folding, navigation, tooltips, and brace matching
  • SCL-14976 Use upper case numeric literal suffixes

Build 2019.2.346

Download Scala plugin for IDEA

Expand
5 Fixed issues
5 Fixed issues
  • SCL-15250 Use inlay type ascription to indicate type mismatch
  • SCL-15594 Don't highlight arguments when there are multiple inapplicable overloaded methods
  • SCL-15593 Make possible to use inaly hints in annotator
  • SCL-15571 Type mismatch errors: widen literal types when the value is of no importance
  • SCL-15592 Method / constructor invocation: highlight only a single kind of error

Build 2019.1.1027

Download Scala plugin for IDEA

Expand
5 Fixed issues
5 Fixed issues
  • SCL-15250 Use inlay type ascription to indicate type mismatch
  • SCL-15594 Don't highlight arguments when there are multiple inapplicable overloaded methods
  • SCL-15593 Make possible to use inaly hints in annotator
  • SCL-15571 Type mismatch errors: widen literal types when the value is of no importance
  • SCL-15592 Method / constructor invocation: highlight only a single kind of error

Build 2019.2.337

Download Scala plugin for IDEA

Expand
0 Fixed issues
0 Fixed issues

Build 2019.2.335

Download Scala plugin for IDEA

Expand
0 Fixed issues
0 Fixed issues

Build 2019.2.323

Download Scala plugin for IDEA

Expand
2 Fixed issues
2 Fixed issues
  • SCL-15549 wrap if/else/ try/finally for/yield do/while bodies in {} on typing {
  • SCL-14550 Suggest Implicit Hints on Implicit Conversions / Implicit Arguments / Expression Type

Build 2019.2.310

Download Scala plugin for IDEA

Expand
0 Fixed issues
0 Fixed issues

Build 2019.1.1011

Download Scala plugin for IDEA

Expand
0 Fixed issues
0 Fixed issues

Build 2019.2.294

Download Scala plugin for IDEA

Expand
5 Fixed issues
5 Fixed issues
  • SCL-15560 IntelliJ doesn't show `Run` or `Debug` options on Right click menu for some Scala Test files.
  • SCL-15558 Trying to run ScalaTest compiled with 2.13.0-RC3 causes java.lang.NoSuchMethodError in "ScalaTest-dispatcher"
  • SCL-15570 fix ScalaRenameAliasedTest.testRenameDefAliased for 2019.2
  • SCL-15469 multiline interpolated string: enter after injected variable does not insert margin char
  • SCL-15568 exception with recursive raw types

Build 2019.2.273

Download Scala plugin for IDEA

Expand
3 Fixed issues
3 Fixed issues
  • SCL-15498 JavaDoc comment background color has no effect on whitespaces
  • SCL-15563 do not use deprecated `ProjectOpenProcessorBase` constructor
  • SCL-15278 Unwrap single-expression definition body on deleting `{`

Build 2019.1.1005

Download Scala plugin for IDEA

Expand
0 Fixed issues
0 Fixed issues

Build 2019.1.1001

Download Scala plugin for IDEA

Expand
0 Fixed issues
0 Fixed issues

Build 2019.1.999

Download Scala plugin for IDEA

Expand
0 Fixed issues
0 Fixed issues

Build 2019.1.992

Download Scala plugin for IDEA

Expand
0 Fixed issues
0 Fixed issues

Build 2019.2.234

Download Scala plugin for IDEA

Expand
6 Fixed issues
6 Fixed issues
  • SCL-15501 multi-line string: spaces are not added after margin char on enter on first line
  • SCL-15500 multi-line strings: enter action does not insert margin in worksheet mode
  • SCL-9365 String formatter canot handle stripMargin strings that also begin with | characters
  • SCL-15509 `Balance Header` quickfix in ScalaDocUnbalancedHeaderInspection does not work
  • SCL-15436 wrong indent for margin char in interpolated multiline string with empty line
  • SCL-6739 Settings / Scala / Language injection for interpolated strings: Language ID values are not sorted

Build 2019.2.227

Download Scala plugin for IDEA

Expand
0 Fixed issues
0 Fixed issues

Build 2019.1.990

Download Scala plugin for IDEA

Expand
1 Fixed issues
1 Fixed issues
  • SCL-15480 Type mismatch tooltip: vertically align the types

Build 2019.1.987

Download Scala plugin for IDEA

Expand
7 Fixed issues
7 Fixed issues
  • SCL-15502 Inspection: `override` modifier required
  • SCL-15501 multi-line string: spaces are not added after margin char on enter on first line
  • SCL-15500 multi-line strings: enter action does not insert margin in worksheet mode
  • SCL-9365 String formatter canot handle stripMargin strings that also begin with | characters
  • SCL-15509 `Balance Header` quickfix in ScalaDocUnbalancedHeaderInspection does not work
  • SCL-15436 wrong indent for margin char in interpolated multiline string with empty line
  • SCL-6739 Settings / Scala / Language injection for interpolated strings: Language ID values are not sorted

Build 2019.2.190

Download Scala plugin for IDEA

Expand
0 Fixed issues
0 Fixed issues

Build 2019.1.981

Download Scala plugin for IDEA

Expand
2 Fixed issues
2 Fixed issues
  • SCL-15490 some minor typos in the UI Scala plugin description
  • SCL-15520 ui freeze on library change events due to ScalaJsDebuggerSettingsPatcher

Build 2019.1.978

Download Scala plugin for IDEA

Expand
6 Fixed issues
6 Fixed issues
  • SCL-15497 Spelling correction is really bay!
  • SCL-15478 Disable the "suspicious shadowing" inspection by default
  • SCL-15494 message of deprecated class is not shown for constructor invocation
  • SCL-15496 apply call to deprecated case class not shown as deprecated
  • SCL-15495 deprecated object not shown as deprecated in unapply/apply/update
  • SCL-10047 Some of Scala/Scaladoc inspections have no description

Build 2019.1.973

Download Scala plugin for IDEA

Expand
2 Fixed issues
2 Fixed issues
  • SCL-15480 Type mismatch tooltip: vertically align the types
  • SCL-15483 Unify type mismatch messages

Build 2019.2.172

Download Scala plugin for IDEA

Expand
82 Fixed issues
82 Fixed issues
  • SCL-12438 Possibility to specify two scalastyle config files
  • SCL-11532 Apply template generates wrong code
  • SCL-2510 Unnested package support
  • SCL-15200 Wrap method body in {} on typing {
  • SCL-15116 Code duplication in markdown code snippet
  • SCL-15201 Impossible to create scala worksheet
  • SCL-12650 Unapply template is polluted by default values
  • SCL-15399 completion of extension methods not in scope is VERY slow
  • SCL-15394 ??? is positioned incorrectly when typing { + Enter
  • SCL-14585 extract to variable: multi-line """string""" value aligned with leading '|' character is extracted incorrectly
  • SCL-15237 When trying to save Scalafmt configuration for new projects, IntelliJ IDEA 2019.1 freezes while trying to load the Editor |Code Style | Scala page
  • SCL-10790 Create New Scala Class should offer Case Class option
  • SCL-15230 enter inside package statement should create extra package statement
  • SCL-15351 Calls on expressions that are not callable are not highlighted
  • SCL-7116 Good code red: method is allegedly already defined
  • SCL-15234 var could be val inspection is broken
  • SCL-15379 Empty intention string for "Make declared type more specific"
  • SCL-15386 Overriding indicator only finds one implementation
  • SCL-15120 BSP: Map source roots directly to content roots
  • SCL-15329 exception on creating new IDEA project
  • SCL-15345 PlayWS request builders are red
  • SCL-15326 "indent first parameter" setting should be applied even if there is no parameters yet
  • SCL-15357 Unable to run apps for classes with inner classes
  • SCL-8595 Highlighting error with equals and operator precedence
  • SCL-15264 Scala Templates show false error messages
  • SCL-15364 Scala Plugin Refator->Rename is not working
  • SCL-15229 Slow right clicks in Scala code
  • SCL-2101 Same named class formal parameter and class member are error highlighted
  • SCL-15398 missing "Unspecified value parameters" error highlighting for Java classes
  • SCL-14979 Formatter: Wrong indention for block in lambda block
  • SCL-15294 Add tests for JavaAccessorEmptyParenCallInspection
  • SCL-3137 Classes with the same name but from different packages are not distinguished in the method signature.
  • SCL-15293 Add test for ApparentResultTypeRefinementInspection
  • SCL-15292 Add tests for UnitMethodInspection s
  • SCL-15291 Add tests for AccessorLikeMethodInspections
  • SCL-15297 Add tests for ParameterlessOverrideInspection
  • SCL-15296 Add tests for ParameterlessAccessInspection
  • SCL-15396 wrap method body on {+ Enter typing breaks code when dealing with anonymous classes
  • SCL-15242 Sort result of auto import by some metric that considers context
  • SCL-15395 convert to """string""" action should restore caret position inside the string
  • SCL-15279 decompiler doesn't add "abstract override" modifiers
  • SCL-14340 overriding java method with an argument that is existentially typed not working
  • SCL-15278 Unwrap single-expression definition body on deleting `{`
  • SCL-15335 overridden member marker for vals is shown, but navigation is not working
  • SCL-15295 Add tests for EmptyParenOverrideInspection
  • SCL-15095 Auto-complete ScalaDoc after a Space
  • SCL-15358 Cannot handle equally typed signatures which differ only in call-by-name/call-by-value
  • SCL-15373 Unknown error when using formatter with scalafmt and specific rules.
  • SCL-15450 Don't show 'Anonymous function convertible to a method value' inspection on functions with empty param list
  • SCL-14726 Bad code green: Semicolon in for
  • SCL-15311 import expressions with wildcard are parsed differently in play2 templates
  • SCL-15271 String interpolation in multiline strings
  • SCL-15353 Support "Adjust code style settings" feature
  • SCL-15253 "No tail recursion annotation" inspection should not be shown if last call is inside try/catch/finally
  • SCL-15414 string conversion adds redundant quote if string is both interpolated and formatted
  • SCL-15417 Expression with Unit return type in argument of map
  • SCL-15313 Implicit hitns: wrong presentation for context bounds of class type params
  • SCL-15236 Duplicated in overriding member
  • SCL-10890 invalid apply function template if class has tuple parameters
  • SCL-14824 Access-Modifier for Class in method not reported as error
  • SCL-15145 Worksheets should be ignored in code duplication detection
  • SCL-15437 inspection highlights remaining method body if inspected expression is the only one in the body
  • SCL-15280 no spacing before multiline string placed on single line
  • SCL-11133 False Negative: wrongly infers code block after try
  • SCL-15282 Inspection / refactorings: don't use procedure syntax for declarations
  • SCL-15381 Cannot resolve equally typed signatures which differ only in call-by-name/call-by-value
  • SCL-15288 highlight unresolved references in scaladoc as a warning
  • SCL-15383 Prioritize 'Import' quickfix over other quickfixes
  • SCL-13358 "Convert to argument in parentheses" refactoring works incorrectly
  • SCL-15321 wrong indentation resulting from Method call arguments -> align when multiline
  • SCL-15325 "No tail recursion annotation" inspection shouldn't be shown
  • SCL-15420 "convert to string concatenation" action should wrap result with brackets
  • SCL-15348 existential declarations should resolve in any order
  • SCL-15444 JFlex.jar generates broken `_ScalaCoreLexer.java`
  • SCL-15445 Type of block expression with a tailing statement should be Unit
  • SCL-8633 Functions with similar plain and by-name parameters in signatures are underlined red
  • SCL-5789 Same-named class members from different namespaces treated as duplicates
  • SCL-15406 Rename adds comment /*EndMarker/?
  • SCL-15308 Good code red: multiline context bounds
  • SCL-15448 2019.1 Wrong syntax highlight in sql block
  • SCL-15266 method signature inspections: Method with mutator-like name is parameterless inspection doesn't work
  • SCL-15265 Empty description for several method signature inspections

Build 2019.1.969

Download Scala plugin for IDEA

Expand
1 Fixed issues
1 Fixed issues
  • SCL-14340 overriding java method with an argument that is existentially typed not working

Build 2019.1.962

Download Scala plugin for IDEA

Expand
1 Fixed issues
1 Fixed issues
  • SCL-11709 Language injection: handle margin character in multiline strings

Build 2019.1.957

Download Scala plugin for IDEA

Expand
1 Fixed issues
1 Fixed issues
  • SCL-15399 completion of extension methods not in scope is VERY slow

Build 2019.1.954

Download Scala plugin for IDEA

Expand
8 Fixed issues
8 Fixed issues
  • SCL-15399 completion of extension methods not in scope is VERY slow
  • SCL-15394 ??? is positioned incorrectly when typing { + Enter
  • SCL-13358 "Convert to argument in parentheses" refactoring works incorrectly
  • SCL-15095 Auto-complete ScalaDoc after a Space
  • SCL-15278 Unwrap single-expression definition body on deleting `{`
  • SCL-15396 wrap method body on {+ Enter typing breaks code when dealing with anonymous classes
  • SCL-15406 Rename adds comment /*EndMarker/?
  • SCL-15448 2019.1 Wrong syntax highlight in sql block

Build 2019.1.945

Download Scala plugin for IDEA

Expand
9 Fixed issues
9 Fixed issues
  • SCL-15394 ??? is positioned incorrectly when typing { + Enter
  • SCL-15278 Unwrap single-expression definition body on deleting `{`
  • SCL-15445 Type of block expression with a tailing statement should be Unit
  • SCL-11133 False Negative: wrongly infers code block after try
  • SCL-15396 wrap method body on {+ Enter typing breaks code when dealing with anonymous classes
  • SCL-15448 2019.1 Wrong syntax highlight in sql block
  • SCL-15406 Rename adds comment /*EndMarker/?
  • SCL-15417 Expression with Unit return type in argument of map
  • SCL-15450 Don't show 'Anonymous function convertible to a method value' inspection on functions with empty param list

Build 2019.1.926

Download Scala plugin for IDEA

Expand
1 Fixed issues
1 Fixed issues
  • SCL-15437 inspection highlights remaining method body if inspected expression is the only one in the body

Build 2019.1.912

Download Scala plugin for IDEA

Expand
6 Fixed issues
6 Fixed issues
  • SCL-15200 Wrap method body in {} on typing {
  • SCL-14979 Formatter: Wrong indention for block in lambda block
  • SCL-15420 "convert to string concatenation" action should wrap result with brackets
  • SCL-15444 JFlex.jar generates broken `_ScalaCoreLexer.java`
  • SCL-15280 no spacing before multiline string placed on single line
  • SCL-15271 String interpolation in multiline strings

Build 2019.1.900

Download Scala plugin for IDEA

Expand
1 Fixed issues
1 Fixed issues

Build 2019.1.895

Download Scala plugin for IDEA

Expand
5 Fixed issues
5 Fixed issues
  • SCL-15351 Calls on expressions that are not callable are not highlighted
  • SCL-15420 "convert to string concatenation" action should wrap result with brackets
  • SCL-15381 Cannot resolve equally typed signatures which differ only in call-by-name/call-by-value
  • SCL-15414 string conversion adds redundant quote if string is both interpolated and formatted
  • SCL-15398 missing "Unspecified value parameters" error highlighting for Java classes

Build 2019.2.166

Download Scala plugin for IDEA

Expand
27 Fixed issues
27 Fixed issues
  • SCL-2510 Unnested package support
  • SCL-15200 Wrap method body in {} on typing {
  • SCL-15116 Code duplication in markdown code snippet
  • SCL-15234 var could be val inspection is broken
  • SCL-15237 When trying to save Scalafmt configuration for new projects, IntelliJ IDEA 2019.1 freezes while trying to load the Editor |Code Style | Scala page
  • SCL-15230 enter inside package statement should create extra package statement
  • SCL-15201 Impossible to create scala worksheet
  • SCL-15264 Scala Templates show false error messages
  • SCL-15145 Worksheets should be ignored in code duplication detection
  • SCL-15293 Add test for ApparentResultTypeRefinementInspection
  • SCL-15292 Add tests for UnitMethodInspection s
  • SCL-15291 Add tests for AccessorLikeMethodInspections
  • SCL-15297 Add tests for ParameterlessOverrideInspection
  • SCL-15296 Add tests for ParameterlessAccessInspection
  • SCL-15295 Add tests for EmptyParenOverrideInspection
  • SCL-15294 Add tests for JavaAccessorEmptyParenCallInspection
  • SCL-15279 decompiler doesn't add "abstract override" modifiers
  • SCL-15278 Unwrap single-expression definition body on deleting `{`
  • SCL-15236 Duplicated in overriding member
  • SCL-14824 Access-Modifier for Class in method not reported as error
  • SCL-15253 "No tail recursion annotation" inspection should not be shown if last call is inside try/catch/finally
  • SCL-15311 import expressions with wildcard are parsed differently in play2 templates
  • SCL-15282 Inspection / refactorings: don't use procedure syntax for declarations
  • SCL-15288 highlight unresolved references in scaladoc as a warning
  • SCL-15242 Sort result of auto import by some metric that considers context
  • SCL-15266 method signature inspections: Method with mutator-like name is parameterless inspection doesn't work
  • SCL-15265 Empty description for several method signature inspections

Build 2019.1.888

Download Scala plugin for IDEA

Expand
3 Fixed issues
3 Fixed issues
  • SCL-14585 extract to variable: multi-line """string""" value aligned with leading '|' character is extracted incorrectly
  • SCL-15373 Unknown error when using formatter with scalafmt and specific rules.
  • SCL-15395 convert to """string""" action should restore caret position inside the string

Build 2019.1.877

Download Scala plugin for IDEA

Expand
4 Fixed issues
4 Fixed issues
  • SCL-8595 Highlighting error with equals and operator precedence
  • SCL-15353 Support "Adjust code style settings" feature
  • SCL-14340 overriding java method with an argument that is existentially typed not working
  • SCL-15381 Cannot resolve equally typed signatures which differ only in call-by-name/call-by-value

Build 2019.1.871

Download Scala plugin for IDEA

Expand
0 Fixed issues
0 Fixed issues

Build 2019.1.867

Download Scala plugin for IDEA

Expand
1 Fixed issues
1 Fixed issues
  • SCL-15386 Overriding indicator only finds one implementation

Build 2019.1.864

Download Scala plugin for IDEA

Expand
4 Fixed issues
4 Fixed issues
  • SCL-12438 Possibility to specify two scalastyle config files
  • SCL-15379 Empty intention string for "Make declared type more specific"
  • SCL-15360 --addPluginSbtFile fails when temporary sbt file path contains spaces
  • SCL-15383 Prioritize 'Import' quickfix over other quickfixes

Build 2019.1.856

Download Scala plugin for IDEA

Expand
6 Fixed issues
6 Fixed issues
  • SCL-7116 Good code red: method is allegedly already defined
  • SCL-2101 Same named class formal parameter and class member are error highlighted
  • SCL-3137 Classes with the same name but from different packages are not distinguished in the method signature.
  • SCL-15358 Cannot handle equally typed signatures which differ only in call-by-name/call-by-value
  • SCL-8633 Functions with similar plain and by-name parameters in signatures are underlined red
  • SCL-5789 Same-named class members from different namespaces treated as duplicates

Build 2019.1.851

Download Scala plugin for IDEA

Expand
1 Fixed issues
1 Fixed issues
  • SCL-15357 Unable to run apps for classes with inner classes

Build 2019.1.845

Download Scala plugin for IDEA

Expand
0 Fixed issues
0 Fixed issues

Build 2019.1.839

Download Scala plugin for IDEA

Expand
3 Fixed issues
3 Fixed issues
  • SCL-15345 PlayWS request builders are red
  • SCL-15348 existential declarations should resolve in any order
  • SCL-14340 overriding java method with an argument that is existentially typed not working

Build 2019.1.832

Download Scala plugin for IDEA

Expand
2 Fixed issues
2 Fixed issues
  • SCL-15326 "indent first parameter" setting should be applied even if there is no parameters yet
  • SCL-15321 wrong indentation resulting from Method call arguments -> align when multiline

Build 2019.1.830

Download Scala plugin for IDEA

Expand
1 Fixed issues
1 Fixed issues
  • SCL-15335 overridden member marker for vals is shown, but navigation is not working

Build 2019.1.826

Download Scala plugin for IDEA

Expand
0 Fixed issues
0 Fixed issues

Build 2019.1.820

Download Scala plugin for IDEA

Expand
1 Fixed issues
1 Fixed issues
  • SCL-15329 exception on creating new IDEA project

Build 2019.1.813

Download Scala plugin for IDEA

Expand
3 Fixed issues
3 Fixed issues
  • SCL-15229 Slow right clicks in Scala code
  • SCL-15308 Good code red: multiline context bounds
  • SCL-15313 Implicit hitns: wrong presentation for context bounds of class type params

Build 2019.1.803

Download Scala plugin for IDEA

Expand
0 Fixed issues
0 Fixed issues

Build 2019.1.787

Download Scala plugin for IDEA

Expand
2 Fixed issues
2 Fixed issues
  • SCL-15264 Scala Templates show false error messages
  • SCL-15311 import expressions with wildcard are parsed differently in play2 templates

Build 2019.1.782

Download Scala plugin for IDEA

Expand
1 Fixed issues
1 Fixed issues
  • SCL-15278 Unwrap single-expression definition body on deleting `{`

Build 2019.1.780

Download Scala plugin for IDEA

Expand
2 Fixed issues
2 Fixed issues
  • SCL-15288 highlight unresolved references in scaladoc as a warning
  • SCL-15294 Add tests for JavaAccessorEmptyParenCallInspection

Build 2019.1.775

Download Scala plugin for IDEA

Expand
12 Fixed issues
12 Fixed issues
  • SCL-15279 decompiler doesn't add "abstract override" modifiers
  • SCL-15253 "No tail recursion annotation" inspection should not be shown if last call is inside try/catch/finally
  • SCL-15242 Sort result of auto import by some metric that considers context
  • SCL-15293 Add test for ApparentResultTypeRefinementInspection
  • SCL-15292 Add tests for UnitMethodInspection s
  • SCL-15291 Add tests for AccessorLikeMethodInspections
  • SCL-15297 Add tests for ParameterlessOverrideInspection
  • SCL-15296 Add tests for ParameterlessAccessInspection
  • SCL-15282 Inspection / refactorings: don't use procedure syntax for declarations
  • SCL-14824 Access-Modifier for Class in method not reported as error
  • SCL-15266 method signature inspections: Method with mutator-like name is parameterless inspection doesn't work
  • SCL-15265 Empty description for several method signature inspections

Build 2019.1.772

Download Scala plugin for IDEA

Expand
2 Fixed issues
2 Fixed issues
  • SCL-15200 Wrap method body in {} on typing {
  • SCL-15278 Unwrap single-expression definition body on deleting `{`

Build 2019.1.765

Download Scala plugin for IDEA

Expand
0 Fixed issues
0 Fixed issues

Build 2019.1.763

Download Scala plugin for IDEA

Expand
8 Fixed issues
8 Fixed issues
  • SCL-2510 Unnested package support
  • SCL-15237 When trying to save Scalafmt configuration for new projects, IntelliJ IDEA 2019.1 freezes while trying to load the Editor |Code Style | Scala page
  • SCL-15201 Impossible to create scala worksheet
  • SCL-15234 var could be val inspection is broken
  • SCL-15235 Overriding-marker missing when overridden by indirect self-type trait
  • SCL-15242 Sort result of auto import by some metric that considers context
  • SCL-15236 Duplicated in overriding member
  • SCL-15230 enter inside package statement should create extra package statement

Build 2019.1.751

Download Scala plugin for IDEA

Expand
1 Fixed issues
1 Fixed issues
  • SCL-15201 Impossible to create scala worksheet

Build 2019.1.744

Download Scala plugin for IDEA

Expand
1 Fixed issues
1 Fixed issues
  • SCL-15201 Impossible to create scala worksheet

Build 2019.1.727

Download Scala plugin for IDEA

Expand
2 Fixed issues
2 Fixed issues
  • SCL-15198 when creating new project scala version set to null though it was indicated
  • SCL-15201 Impossible to create scala worksheet

Build 2019.1.703

Download Scala plugin for IDEA

Expand
2 Fixed issues
2 Fixed issues
  • SCL-15177 navigation to package object from stacktraces in console is broken again
  • SCL-15181 don't use navigation element to check accessibility

Build 2019.1.702

Download Scala plugin for IDEA

Expand
4 Fixed issues
4 Fixed issues
  • SCL-3559 Settings > Code Style
  • SCL-2601 Formatter: infix method call formatted with unwanted ' ' before argument list
  • SCL-15193 Method implement does not transport scoped access modifiers
  • SCL-15188 Indenting multi-line evaluation in for comprehension broken

Build 2019.1.682

Download Scala plugin for IDEA

Expand
0 Fixed issues
0 Fixed issues

Build 2019.1.675

Download Scala plugin for IDEA

Expand
14 Fixed issues
14 Fixed issues
  • SCL-12760 Scala chained method call formatting incorrect
  • SCL-9650 Incorrect indent after newline in definitions
  • SCL-15130 Not clear that bytecode indexing switching on is applied only after restart of idea
  • SCL-15147 wrong indent after pressing enter before dot in method call chain
  • SCL-9302 Rich class for self typed trait not found by the highlighter
  • SCL-15113 Refreshing sbt project causes sbt-shell to be launched w/o ideaPort setting
  • SCL-15129 for maven project it is suggested to turn on bytecode idexing for find usages though it's useless
  • SCL-15172 avoid building java method hierarchy in favor of reusing our own
  • SCL-15114 Find Usages via bytecode fails for catsKernelStdGroupForInt
  • SCL-14995 Rename ScConstructor into ScConstructorInvocation
  • SCL-15167 Monocle support fails for type parameters with variance
  • SCL-15148 Download links are not posted in release notes on confluence
  • SCL-15099 Maven module doesn't support classifier for compilerPlugin
  • SCL-15133 Find usages for apply - not working for particular case

Build 2019.1.638

Download Scala plugin for IDEA

Expand
1 Fixed issues
1 Fixed issues
  • SCL-15161 Good code red: kind projector `<:<` witness

Build 2019.1.626

Download Scala plugin for IDEA

Expand
3 Fixed issues
3 Fixed issues
  • SCL-15142 don't generate PsiMethodWrappers for scala default arguments
  • SCL-15149 refactor ScFunction
  • SCL-14956 Take .flags into account in ScalacTestDataHighlightingTest

Build 2019.1.619

Download Scala plugin for IDEA

Expand
2 Fixed issues
2 Fixed issues
  • SCL-13695 "Download the plugin" link -> misconfigured DNS error
  • SCL-15148 Download links are not posted in release notes on confluence

Build 2019.1.602

Download Scala plugin for IDEA

Expand
4 Fixed issues
4 Fixed issues
  • SCL-4167 Class parameters indentation improvement
  • SCL-12760 Scala chained method call formatting incorrect
  • SCL-3673 Code Style / Method declaration parameters / Align when multiline shouldn't affect class declarations
  • SCL-15126 Newline indentation alignment regression on Nightly

Build 2019.1.567

Download Scala plugin for IDEA

Expand
21 Fixed issues
21 Fixed issues
  • SCL-4167 Class parameters indentation improvement
  • SCL-14916 Please add trailing comma support for Scala in Code Style settings
  • SCL-4269 Don't move a same-line comment down on code reformat
  • SCL-15096 PicoPluginExtensionInitializationException at project open
  • SCL-14951 SBT import fails for cats project, IntelliJ goes crazy
  • SCL-13293 SBT Shell messages are separated by empty line
  • SCL-3673 Code Style / Method declaration parameters / Align when multiline shouldn't affect class declarations
  • SCL-15057 Good code red: regression: implicit conversion search no longer takes HKT kindedness into account for ambiguous method error
  • SCL-15085 Extremely unhelpful error message trying to run test
  • SCL-12427 Scala Reformat code fails when else if has comment in between
  • SCL-15091 'no.tailrec.annotation.title' is not found
  • SCL-7886 Codestyle formatting - braces keep on getting added
  • SCL-14807 Default alignment of `*` in documentation comments
  • SCL-14553 Update bsp support to 2.0
  • SCL-14957 scalafmt: dynamically choose library version to use based on version field of configuration file
  • SCL-15087 Allow unlimited heap size for sbt
  • SCL-15069 We need a project icon
  • SCL-15081 caching annotations are not IDEA incremental compiler friendly
  • SCL-15066 Bytecode find usages fails to correctly detect compiler mode on project import
  • SCL-15013 Implement Code Duplication
  • SCL-15090 Closing bracket in method call is indented if trailing comma is present and first argument starts from new line

Build 2019.1.458

Expand
3 Fixed issues
3 Fixed issues
  • SCL-13293 SBT Shell messages are separated by empty line
  • SCL-14807 Default alignment of `*` in documentation comments
  • SCL-14957 scalafmt: dynamically choose library version to use based on version field of configuration file

Build 2019.1.443

Expand
0 Fixed issues
0 Fixed issues

Build 2019.1.435

Expand
0 Fixed issues
0 Fixed issues

Build 2019.1.425

Expand
1 Fixed issues
1 Fixed issues
  • SCL-15033 Generate code: Throwable: AWT events are not allowed inside write action:

Build 2019.1.412

Expand
0 Fixed issues
0 Fixed issues

Build 2019.1.405

Expand
2 Fixed issues
2 Fixed issues
  • SCL-5444 reformat always add indentation to @example content
  • SCL-15021 Good code red: trait companion methods not recognized in Java as static interface methods

Build 2019.1.400

Expand
2 Fixed issues
2 Fixed issues
  • SCL-15004 @define scala doc tags are red
  • SCL-14998 IntelliJ 2018.3, Scala Plugin: "Find Usages" on members of private classes does not work

Build 2019.1.391

Expand
0 Fixed issues
0 Fixed issues

Build 2019.1.388

Expand
2 Fixed issues
2 Fixed issues
  • SCL-14848 Implement/Override methods intention action does not play nice with kind-projector
  • SCL-15019 Render type lambdas using kind-projector syntax if it is available

Build 2019.1.385

Expand
2 Fixed issues
2 Fixed issues
  • SCL-15011 Good code red with alias for FUnit and reduce
  • SCL-15008 Erroneous extra implicit parameter, when using context bounds on apply method

Build 2019.1.378

Expand
0 Fixed issues
0 Fixed issues

Build 2019.1.371

Expand
0 Fixed issues
0 Fixed issues

Build 2019.1.358

Expand
6 Fixed issues
6 Fixed issues
  • SCL-14952 IDEA freezes after file copy and ctrl-space
  • SCL-14993 worksheet splitter is too wide
  • SCL-14986 don't create stubs for local elements
  • SCL-14990 move PsiElement.accept(PsiElementVisitor) to base classes
  • SCL-14982 MatchError in TypeDefinitionMembers$.privateProcessDeclarations
  • SCL-14983 fix warning about ScalaImportOptimizer progress indicator

Build 2019.1.333

Expand
1 Fixed issues
1 Fixed issues

Build 2019.1.324

Expand
0 Fixed issues
0 Fixed issues

Build 2019.1.319

Expand
2 Fixed issues
2 Fixed issues
  • SCL-14965 Exception when pasting code (emanating from scala plugin)
  • SCL-14968 Remove bundled HOCON support

Build 2019.1.301

Expand
4 Fixed issues
4 Fixed issues
  • SCL-14940 implicit instance not found
  • SCL-14949 Resources not copying in Scala/Maven project
  • SCL-14936 Implicit resolution don't work for implicit classes with higher kind type parameter
  • SCL-14950 go to definition doesn't work for constructor references in 2019.1

Build 2019.1.273

Expand
3 Fixed issues
3 Fixed issues
  • SCL-13750 Syntax highlight error for http4s implicit syntax
  • SCL-14956 Take .flags into account in ScalacTestDataHighlightingTest
  • SCL-14927 Good code red: monix.execution.Callback

Build 2019.1.263

Expand
3 Fixed issues
3 Fixed issues
  • SCL-14266 Type alias wildcard import from package object - good code sometimes red
  • SCL-12626 Broken imports in generated Udash project
  • SCL-14927 Good code red: monix.execution.Callback

Build 2019.1.256

Expand
4 Fixed issues
4 Fixed issues
  • SCL-13947 Scalafmt doesn't reformatting after code_template expansion
  • SCL-14856 exhaustive match generated code in method definition is shifted
  • SCL-14108 Scalafmt For config. file the plugin should open "specify path" dialog at project root directory
  • SCL-14556 Scala plugin doesn't report scalafmt error

Build 2019.1.246

Expand
1 Fixed issues
1 Fixed issues

Build 2019.1.225

Expand
0 Fixed issues
0 Fixed issues

Build 2019.1.219

Expand
1 Fixed issues
1 Fixed issues
  • SCL-14884 Worksheets: output panel is not showing in 2019.1

Build 2019.1.202

Expand
10 Fixed issues
10 Fixed issues
  • SCL-14707 Value overrides nothing when extending trait hierarchy from jar
  • SCL-14862 IntelliJ Scala compiler gets it wrong while Scala Scala compiler manages to do the thing
  • SCL-14888 Test run configuration should allow to specify JRE other than module default
  • SCL-14913 Vararg classparameters have invalid type when accessed from Java code
  • SCL-14897 Weird self type annotation and ThisTypeSubstitution interaction
  • SCL-14894 Good code red - inner class of a generic class
  • SCL-14892 Override/implement action & caching inconsistencies
  • SCL-14891 Good code red with fs2 streams
  • SCL-14881 Unexpected 'Illegal inheritence from sealed class' error when using a scala sealed class for Java generic constraint.
  • SCL-14922 Good code red: "trait inherited multiple times"

Build 2019.1.200

Expand
9 Fixed issues
9 Fixed issues
  • SCL-14862 IntelliJ Scala compiler gets it wrong while Scala Scala compiler manages to do the thing
  • SCL-14913 Vararg classparameters have invalid type when accessed from Java code
  • SCL-14897 Weird self type annotation and ThisTypeSubstitution interaction
  • SCL-14894 Good code red - inner class of a generic class
  • SCL-14886 Good code red: cannot resolve symbol due to change of type member
  • SCL-14892 Override/implement action & caching inconsistencies
  • SCL-14891 Good code red with fs2 streams
  • SCL-14881 Unexpected 'Illegal inheritence from sealed class' error when using a scala sealed class for Java generic constraint.
  • SCL-14888 Test run configuration should allow to specify JRE other than module default

Build 2019.1.166

Expand
0 Fixed issues
0 Fixed issues

Build 2018.3.779

Expand
0 Fixed issues
0 Fixed issues

Build 2019.1.151

Expand
1 Fixed issues
1 Fixed issues
  • SCL-14857 bsp build toolwindow problem reports: lines off by one

Build 2019.1.133

Expand
0 Fixed issues
0 Fixed issues

Build 2019.1.127

Expand
3 Fixed issues
3 Fixed issues
  • SCL-9167 Support View -> Show Bytecode action for Scala
  • SCL-14879 Extensions are only loaded on second SBT refresh
  • SCL-14874 process handler of ScalaCompileServer should be blocking

Build 2019.1.112

Expand
1 Fixed issues
1 Fixed issues
  • SCL-14716 Make Scala plugin project buildable without SBT

Build 2019.1.102

Expand
1 Fixed issues
1 Fixed issues
  • SCL-14804 Navigate to Class / Symbol: support symbolic method names

Build 2018.3.775

Expand
1 Fixed issues
1 Fixed issues
  • SCL-14862 IntelliJ Scala compiler gets it wrong while Scala Scala compiler manages to do the thing

Build 2019.1.91

Expand
0 Fixed issues
0 Fixed issues

Build 2019.1.83

Expand
0 Fixed issues
0 Fixed issues

Build 2018.3.771

Expand
1 Fixed issues
1 Fixed issues

Build 2019.1.75

Expand
1 Fixed issues
1 Fixed issues

Build 2018.3.769

Expand
2 Fixed issues
2 Fixed issues
  • SCL-14848 Implement/Override methods intention action does not play nice with kind-projector
  • SCL-14859 Do not trigger anonymous function simplification inspection inside polymorphic KP lambdas

Build 2019.1.51

Expand
1 Fixed issues
1 Fixed issues
  • SCL-10175 Collection inspection: filtered option

Build 2019.1.22

Expand
0 Fixed issues
0 Fixed issues

Build 2018.3.762

Expand
0 Fixed issues
0 Fixed issues

Build 2018.3.760

Expand
0 Fixed issues
0 Fixed issues

Build 2019.1.10

Expand
1 Fixed issues
1 Fixed issues
  • SCL-14664 refactor or reimplement for statements desugaring

Build 2018.3.754

Expand
1 Fixed issues
1 Fixed issues
  • SCL-14664 refactor or reimplement for statements desugaring

Build 2019.1.4

Expand
31 Fixed issues
31 Fixed issues
  • SCL-13978 Good code red: concrete protected type member with a stable identifier
  • SCL-8684 Unwrapping multiple types in the same for-comprehension doesn't show a compile error
  • SCL-11192 Idea mark red shapeless dependent type code that is correct
  • SCL-4943 Good code is red: inferred type for class projected from singleton type doesn't conforms to appropriate existential type
  • SCL-13103 Valid path-dependent types usage results in red code
  • SCL-14803 Color schemes: support `=>`
  • SCL-14779 Good code red: for comprehension without yield with multiple clauses
  • SCL-14664 refactor or reimplement for statements desugaring
  • SCL-5638 for-comprehension type hints and error highlighting
  • SCL-14680 Presentation compiler fails to resolve implicits
  • SCL-14584 for comprehension desugar changes 'yield' block incorrectly
  • SCL-14586 higher-kinded types: generic parameter "variance" track is lost
  • SCL-6498 Bad code is green: guard type in for statement is not type-checked
  • SCL-14184 For comprehension infers to Nothing
  • SCL-14782 mapN is unresolved for Validated with different error types
  • SCL-14618 Incorrect type inference for nested classes and `for`-comprehension
  • SCL-4652 Good code red: higher-kinded type imperfectly applied?
  • SCL-13797 Good code red with type member
  • SCL-14700 Good code red using Id type and withFilter
  • SCL-14801 Better-monadic-for withFilter-less desugaring is broken
  • SCL-7017 Wrong syntax red highlighting for value.type
  • SCL-13607 Using path dependent type application for refined type parameters has false red error highlight.
  • SCL-9901 Bad code in green: Option in for comprehension with yield
  • SCL-14734 For-comprehensions: highlight `<-` and `if` in the same way as method calls
  • SCL-9178 False highlight error of protected type ("Cannot resolve symbol")
  • SCL-14771 Support of implicit0 in for
  • SCL-14468 good code red (default parameters, some shapeless tags involved)
  • SCL-14774 Exception when accessing worksheet settings
  • SCL-14401 For comprehensions do not enforce a single monadic context
  • SCL-14660 Implicit search fails to find implicits with path dependent return types
  • SCL-11285 Good code red: Type mismatch for dependent type

Build 2018.3.750

Expand
1 Fixed issues
1 Fixed issues
  • SCL-14664 refactor or reimplement for statements desugaring

Build 2018.3.742

Expand
3 Fixed issues
3 Fixed issues
  • SCL-14803 Color schemes: support `=>`
  • SCL-14771 Support of implicit0 in for
  • SCL-14801 Better-monadic-for withFilter-less desugaring is broken

Build 2018.3.725

Expand
1 Fixed issues
1 Fixed issues
  • SCL-14664 refactor or reimplement for statements desugaring

Build 2018.3.724

Expand
11 Fixed issues
11 Fixed issues
  • SCL-13978 Good code red: concrete protected type member with a stable identifier
  • SCL-4943 Good code is red: inferred type for class projected from singleton type doesn't conforms to appropriate existential type
  • SCL-13103 Valid path-dependent types usage results in red code
  • SCL-14680 Presentation compiler fails to resolve implicits
  • SCL-13797 Good code red with type member
  • SCL-9178 False highlight error of protected type ("Cannot resolve symbol")
  • SCL-7017 Wrong syntax red highlighting for value.type
  • SCL-14468 good code red (default parameters, some shapeless tags involved)
  • SCL-4652 Good code red: higher-kinded type imperfectly applied?
  • SCL-13607 Using path dependent type application for refined type parameters has false red error highlight.
  • SCL-11285 Good code red: Type mismatch for dependent type

Build 2018.3.718

Expand
4 Fixed issues
4 Fixed issues
  • SCL-11192 Idea mark red shapeless dependent type code that is correct
  • SCL-14782 mapN is unresolved for Validated with different error types
  • SCL-14660 Implicit search fails to find implicits with path dependent return types
  • SCL-14586 higher-kinded types: generic parameter "variance" track is lost

Build 2018.3.699

Expand
2 Fixed issues
2 Fixed issues
  • SCL-14779 Good code red: for comprehension without yield with multiple clauses
  • SCL-14774 Exception when accessing worksheet settings

Build 2018.3.688

Expand
11 Fixed issues
11 Fixed issues
  • SCL-8684 Unwrapping multiple types in the same for-comprehension doesn't show a compile error
  • SCL-14664 refactor or reimplement for statements desugaring
  • SCL-5638 for-comprehension type hints and error highlighting
  • SCL-14184 For comprehension infers to Nothing
  • SCL-14584 for comprehension desugar changes 'yield' block incorrectly
  • SCL-9901 Bad code in green: Option in for comprehension with yield
  • SCL-14618 Incorrect type inference for nested classes and `for`-comprehension
  • SCL-6498 Bad code is green: guard type in for statement is not type-checked
  • SCL-14774 Exception when accessing worksheet settings
  • SCL-14401 For comprehensions do not enforce a single monadic context
  • SCL-14734 For-comprehensions: highlight `<-` and `if` in the same way as method calls

Build 2018.3.673

Expand
0 Fixed issues
0 Fixed issues

Build 2018.3.668

Expand
1 Fixed issues
1 Fixed issues
  • SCL-14700 Good code red using Id type and withFilter

Build 2018.3.660

Expand
0 Fixed issues
0 Fixed issues

Build 2018.3.654

Expand
1 Fixed issues
1 Fixed issues
  • SCL-14759 Kind projector in context bound breaks context bound highlighting

Build 2018.3.652

Expand
1 Fixed issues
1 Fixed issues
  • SCL-9167 Support View -> Show Bytecode action for Scala

Build 2018.3.649

Expand
1 Fixed issues
1 Fixed issues

Build 2018.3.644

Expand
1 Fixed issues
1 Fixed issues
  • SCL-10876 Consider adding support for new kind-projector syntax for polymorphic lambdas

Build 2018.3.641

Expand
2 Fixed issues
2 Fixed issues
  • SCL-14247 Support addPluginSbtFile injection for sbt 0.13
  • SCL-14745 Typecheck error with parameterized bounds.

Build 2018.3.619

Expand
1 Fixed issues
1 Fixed issues
  • SCL-14630 private variable rename refactor is broken

Build 2018.3.610

Expand
2 Fixed issues
2 Fixed issues
  • SCL-14486 Usages of covariant higher-kinded type parameter highlighted as error
  • SCL-14533 Good code red when using implicit from a parameter with type refinement

Build 2018.3.597

Expand
2 Fixed issues
2 Fixed issues
  • SCL-14716 Make Scala plugin project buildable without SBT
  • SCL-14659 Gradle: support "using qualified names" option

Build 2018.3.589

Expand
1 Fixed issues
1 Fixed issues
  • SCL-14616 InteliJ Scala plugin cannot infer proper type of variable created by apply method and make false error highlighting

Build 2018.3.578

Expand
0 Fixed issues
0 Fixed issues

Build 2018.3.571

Expand
4 Fixed issues
4 Fixed issues
  • SCL-14457 2018.3.2 SbtSettings API has weird setters that end with _$eq
  • SCL-14667 Exhaustive match broken
  • SCL-14692 Scala plugin: IDE frozen after a VCS refresh
  • SCL-14645 Simulacrum injector generates invalid code for type constructors with more than 1 argument

Build 2018.3.563

Expand
0 Fixed issues
0 Fixed issues

Build 2018.3.551

Expand
3 Fixed issues
3 Fixed issues

Build 2018.3.549

Expand
2 Fixed issues
2 Fixed issues
  • SCL-14663 wrong expected type for constructor argument
  • SCL-14666 sbt-structure-extractor artifacts bundled twice

Build 2018.3.541

Expand
3 Fixed issues
3 Fixed issues
  • SCL-14591 coursier.ResolutionException on SBT shell startup when coursier is used globally on EAP
  • SCL-14588 Redesign library extension loading
  • SCL-14577 Suggest exhaustive match when using map/filter/flatMap/... with curly braces

Build 2018.3.530

Expand
6 Fixed issues
6 Fixed issues
  • SCL-11912 Scala plugin wrongly highlighting syntax error on higher kinded type
  • SCL-14179 False error detection
  • SCL-13042 Good code red in function argument type inference
  • SCL-14661 BSP source directories not respected
  • SCL-9053 Incorrect type error involving singleton type
  • SCL-9738 Good code red: type inference when adding to a Map

Build 2018.3.519

Expand
2 Fixed issues
2 Fixed issues
  • SCL-14635 sbt project import fails with URI scheme is not "file"
  • SCL-14648 Cannot import a scala project that depends on ProjectRef with git

Build 2018.3.510

Expand
0 Fixed issues
0 Fixed issues

Build 2018.3.504

Expand
4 Fixed issues
4 Fixed issues
  • SCL-14442 Future of Some recover to None red highlighting
  • SCL-14549 Generated method implementations have signatures with full qualified type names when using scalafmt formatter
  • SCL-14406 Regression from 2018.1 -> 2018.2: Scala Syntax Highlighting false alarm with Slick DBIOAction and Effect
  • SCL-14633 Implementing abstract method in a non-trait class generates invalid code

Build 2018.3.489

Expand
1 Fixed issues
1 Fixed issues
  • SCL-13089 Good-code-red implicit conversion with higher-kinds type mismatch NotInferedT

Build 2018.3.477

Expand
0 Fixed issues
0 Fixed issues

Build 2018.3.475

Expand
0 Fixed issues
0 Fixed issues

Build 2018.3.473

Expand
3 Fixed issues
3 Fixed issues
  • SCL-14567 disable "Resolving external annotaitons" for sbt projects
  • SCL-13133 False warning var could be val
  • SCL-14599 Invalid return type resolution of scala class in java

Build 2018.3.463

Expand
4 Fixed issues
4 Fixed issues
  • SCL-14563 Scala plugin typer generalizes literal types to Any
  • SCL-14597 Override 'getCompilableFileExtensions' in InitialScalaBuilder and return proper extensions list
  • SCL-14545 Project view: display package object next to the corresponding package
  • SCL-14595 Literal type inference is lost in different scopes (Good code red)

Build 2018.3.453

Expand
2 Fixed issues
2 Fixed issues
  • SCL-14552 exception in worksheet for scala 2.13
  • SCL-14550 Suggest Implicit Hints on Implicit Conversions / Implicit Arguments / Expression Type

Build 2018.3.444

Expand
5 Fixed issues
5 Fixed issues
  • SCL-14545 Project view: display package object next to the corresponding package
  • SCL-14550 Suggest Implicit Hints on Implicit Conversions / Implicit Arguments / Expression Type
  • SCL-14570 Scala reports type issue where there is not
  • SCL-14568 rename for local variables takes very long
  • SCL-14336 support sbt commands in Run anything window

Build 2018.3.428

Expand
3 Fixed issues
3 Fixed issues
  • SCL-14565 Type info doesn't work on method definitions
  • SCL-14545 Project view: display package object next to the corresponding package
  • SCL-14550 Suggest Implicit Hints on Implicit Conversions / Implicit Arguments / Expression Type

Build 2018.3.407

Expand
3 Fixed issues
3 Fixed issues
  • SCL-14567 disable "Resolving external annotaitons" for sbt projects
  • SCL-14555 exception about wrong kind of a reference in scala doc
  • SCL-14568 rename for local variables takes very long

Build 2018.3.401

Expand
1 Fixed issues
1 Fixed issues
  • SCL-14550 Suggest Implicit Hints on Implicit Conversions / Implicit Arguments / Expression Type

Build 2018.3.358

Expand
3 Fixed issues
3 Fixed issues
  • SCL-14541 Implicit hints are displayed as plain text in the recent builds of IDEA 2018.3
  • SCL-14544 broken `case Data.DataCase` completion when case class is defined inside a (companion) object
  • SCL-14545 Project view: display package object next to the corresponding package

Build 2018.3.349

Expand
4 Fixed issues
4 Fixed issues
  • SCL-14538 Good Code Red. Incorrect type inference for HKT, as usual.
  • SCL-14535 Scala implicit conversion with view bound not found in some cases (breaks most scalajs-react code)
  • SCL-14336 support sbt commands in Run anything window
  • SCL-14536 compile server cannot be started in debug IDEA

Build 2018.3.327

Expand
1 Fixed issues
1 Fixed issues
  • SCL-11987 Using SBT shell for build and import, logs intellij communication to default sbt history

Build 2018.3.322

Expand
0 Fixed issues
0 Fixed issues

Build 2018.3.313

Expand
3 Fixed issues
3 Fixed issues
  • SCL-14523 Worksheet doesn't work in REPL mode: IncorrectOperationException in attempt to run a simple expression
  • SCL-14320 worksheet repl mode doesn't work for scala 2.13
  • SCL-14423 Exception in attempt to run tests in akka-stream-extensions project

Build 2018.3.301

Expand
3 Fixed issues
3 Fixed issues
  • SCL-13027 Good code red: overloaded method selected based on return type used in infix notation
  • SCL-14478 Class completion doesn't work on line before a method call with parameter
  • SCL-14518 show type info renders upper bound wrong

Build 2018.3.295

Expand
0 Fixed issues
0 Fixed issues

Build 2018.3.290

Expand
0 Fixed issues
0 Fixed issues

Build 2018.3.281

Expand
4 Fixed issues
4 Fixed issues
  • SCL-13650 Can't evaluate a function call in debug mode, scala 2.13
  • SCL-14509 scala_compiler.xml changes without a good reason
  • SCL-14355 "Implement methods" doesn't replicate Infix Type notation
  • SCL-14510 Cannot complete class name of a class declared in a package object

Build 2018.3.270

Expand
5 Fixed issues
5 Fixed issues
  • SCL-13032 Wrong result of "Add type annotation to value definition"
  • SCL-14414 Exception after opening ticket2251.scala file
  • SCL-14445 NPE while (re)formatting Scala code
  • SCL-14478 Class completion doesn't work on line before a method call with parameter
  • SCL-14503 Wrong highlighting - Float Infinity is considered as a Double instead of a Float

Build 2018.3.255

Expand
1 Fixed issues
1 Fixed issues
  • SCL-14498 Good code yellow: wrong inspection for inner class actors

Build 2018.3.253

Expand
0 Fixed issues
0 Fixed issues

Build 2018.3.245

Expand
0 Fixed issues
0 Fixed issues

Build 2018.3.235

Expand
0 Fixed issues
0 Fixed issues

Build 2018.3.227

Expand
0 Fixed issues
0 Fixed issues

Build 2018.3.223

Expand
0 Fixed issues
0 Fixed issues

Build 2018.3.195

Expand
0 Fixed issues
0 Fixed issues

Build 2018.3.185

Expand
0 Fixed issues
0 Fixed issues

Build 2018.3.176

Expand
0 Fixed issues
0 Fixed issues

Build 2018.3.163

Expand
0 Fixed issues
0 Fixed issues

Build 2018.3.157

Expand
0 Fixed issues
0 Fixed issues

Build 2018.3.153

Expand
0 Fixed issues
0 Fixed issues

Build 2018.3.147

Expand
0 Fixed issues
0 Fixed issues

Build 2018.3.134

Expand
0 Fixed issues
0 Fixed issues

Build 2018.3.126

Expand
0 Fixed issues
0 Fixed issues

Build 2018.3.120

Expand
0 Fixed issues
0 Fixed issues

Build 2018.3.110

Expand
0 Fixed issues
0 Fixed issues

Build 2018.3.106

Expand
1 Fixed issues
1 Fixed issues
  • SCL-14415 Can't start SBT shell in IDEA: "Not a valid key: idea-shell"

Build 2018.3.102

Expand
0 Fixed issues
0 Fixed issues

Build 2018.3.100

Expand
3 Fixed issues
3 Fixed issues
  • SCL-11748 "SBT Task" run configurations should be able to run/debug in shell
  • SCL-14341 Can't open worksheet settings in 2018.3
  • SCL-14399 Copy worksheet don't copy the whole line

Build 2018.3.97

Expand
2 Fixed issues
2 Fixed issues
  • SCL-14397 NPE when opening Scala code style settings without an open project
  • SCL-14375 debugger doesn't work in SAM lambdas

Build 2018.3.92

Expand
1 Fixed issues
1 Fixed issues
  • SCL-14342 sbt plugin resolution happens once per project

Build 2018.3.84

Expand
0 Fixed issues
0 Fixed issues

Build 2018.3.81

Expand
0 Fixed issues
0 Fixed issues

Build 2018.3.79

Expand
25 Fixed issues
25 Fixed issues
Wiki Markup

* [SCL-9347|https://youtrack.jetbrains.com/issue/SCL-9347] Good code red using class with generics using `forSome` keyword
* [SCL-12503|https://youtrack.jetbrains.com/issue/SCL-12503] Good code red for Dynamic object at type position (Cannot resolve symbol ...)
* [SCL-14152|https://youtrack.jetbrains.com/issue/SCL-14152] Scala plugin considers vararg case class field as an incorrect override for Seq[T] method 
* [SCL-9468|https://youtrack.jetbrains.com/issue/SCL-9468] Type mismatch, type inference fails with path dependent type and type projection
* [SCL-7891|https://youtrack.jetbrains.com/issue/SCL-7891] Error in highlighting when extending generic types
* [SCL-12251|https://youtrack.jetbrains.com/issue/SCL-12251] Implicit resolution incorrect (incorrectly assuming ambiguity?)
* [SCL-10156|https://youtrack.jetbrains.com/issue/SCL-10156] Implemented method not found
* [SCL-6573|https://youtrack.jetbrains.com/issue/SCL-6573] Trashy error message on mixin type
* [SCL-10399|https://youtrack.jetbrains.com/issue/SCL-10399] Incorrect F[_] type sometimes inferred leading to spurious error highlighting
* [SCL-11261|https://youtrack.jetbrains.com/issue/SCL-11261] Good code red: type parameter with upper and lower bound
* [SCL-13017|https://youtrack.jetbrains.com/issue/SCL-13017] False error: Expression of type Int doesn't conform to expected type Seq[Int]
* [SCL-13654|https://youtrack.jetbrains.com/issue/SCL-13654] Error inspection can't find implicit conversion for method apply call with curly brackets
* [SCL-12136|https://youtrack.jetbrains.com/issue/SCL-12136] Errors reported in Scala code when there are none
* [SCL-13747|https://youtrack.jetbrains.com/issue/SCL-13747] Syntax highlighting error in scratch file (inherited method)
* [SCL-10029|https://youtrack.jetbrains.com/issue/SCL-10029] Type constraints on class methods are highlighted incorrectly
* [SCL-9701|https://youtrack.jetbrains.com/issue/SCL-9701] IDEA incorrectly deduces vararg closure parameter type
* [SCL-12977|https://youtrack.jetbrains.com/issue/SCL-12977] Good code red: Extractors extending classes with type parameters
* [SCL-10845|https://youtrack.jetbrains.com/issue/SCL-10845] Wrongly reports error for method overloaded by implicit class
* [SCL-11597|https://youtrack.jetbrains.com/issue/SCL-11597] Good code red: Custom extractor returning Option[tuple] highlighted incorrectly
* [SCL-13015|https://youtrack.jetbrains.com/issue/SCL-13015] False error: Expression of type Seq[Int] => Unit doesn't conform to expected type Int => Unit
* [SCL-13114|https://youtrack.jetbrains.com/issue/SCL-13114] False error: Expression of type X.type doesn't conform to expected type ({   val v : List[T] }) forSome {type T}
* [SCL-10354|https://youtrack.jetbrains.com/issue/SCL-10354] val.type not recognized in type parameters
* [SCL-13018|https://youtrack.jetbrains.com/issue/SCL-13018] Cannot parse repeated parameter of a function type
* [SCL-12120|https://youtrack.jetbrains.com/issue/SCL-12120] Wrong highlighting with Scala 2.12.2/2.11.11's new feature: "Allow custom `apply` and `unapply` methods in case class companions"
* [SCL-13205|https://youtrack.jetbrains.com/issue/SCL-13205] use scala "import hidden" implicit function , IDEA can't understand

Build 2018.3.75

Expand
4 Fixed issues
4 Fixed issues
  • SCL-14375 debugger doesn't work in SAM lambdas
  • SCL-14380 ScTemplateBodyImpl.exprs doesn't find all expressions
  • SCL-14379 type annotations: apply method is "stable" only for objects
  • SCL-14194 Evaluate expression with compilation does not work inside lambda

Build 2018.3.63

Expand
0 Fixed issues
0 Fixed issues

Build 2018.3.34

Expand
0 Fixed issues
0 Fixed issues

Build 2018.3.29

Expand
0 Fixed issues
0 Fixed issues

Build 2018.3.23

Expand
1 Fixed issues
1 Fixed issues

Build 2018.3.16

Expand
3 Fixed issues
3 Fixed issues
  • SCL-14258 AOT completion pollutes results in evaluate expression dialog
  • SCL-14209 Exhaustive match postfix completion
  • SCL-14328 Do not force AOT completion for function literal parameters

Build 2018.2.804

Expand
1 Fixed issues
1 Fixed issues

Build 2018.2.802

Expand
1 Fixed issues
1 Fixed issues
  • SCL-14328 Do not force AOT completion for function literal parameters

Build 2018.2.800

Expand
1 Fixed issues
1 Fixed issues

Build 2018.3.8

Expand
28 Fixed issues
28 Fixed issues
  • SCL-9913 Ability to select scala class file from project view and decompile to java code
  • SCL-14307 Scala plugin delete the whole Scala file when I want to "remove unuse element".
  • SCL-14283 Apply methodTemplate doesn't generate Type
  • SCL-14255 sbt project-specific settings saved as defaults, causes import errors
  • SCL-14216 exhaustive match: imports
  • SCL-14075 sealed template definition is inherited from Java
  • SCL-14298 exception from akka props inspection
  • SCL-14270 convert to a method reference: wrong suggestion if method takes implicit type class instance
  • SCL-14264 False "no implicits found" hint
  • SCL-14267 Hundreds of threads being spawned when building Scala plugin project with SBT from IDEA
  • SCL-14305 implicit search bug
  • SCL-14302 semantic highlighting: variable pattern
  • SCL-14082 resolving subpackage should respect scope
  • SCL-14273 Method parameters, incorrect inspection
  • SCL-14143 ScNewTemplateDefinition might not be inheritor
  • SCL-14313 witness selectDynamic regression
  • SCL-14281 exhaustive match: disable Java inheritors
  • SCL-14129 Support rewrite rules for scalafmt
  • SCL-14319 strange navigation info for types from Witness.selectDynamic
  • SCL-14278 Scalastyle-consistent formatting of imports is not consistent with Scalastyle
  • SCL-14279 wrong inspection description for parameterless access inspection
  • SCL-14277 Scala local hints issue
  • SCL-14317 semantic highlighting: class parameter reference is highlighted
  • SCL-13879 Display a content of .scalafmt.conf file
  • SCL-14090 Merge multiple gutter icons happens for overriding members, but doesn't for overrided
  • SCL-14032 variance checking error
  • SCL-14293 wrong "method overrides nothing" message for dependent parameter types
  • SCL-13420 Red code for shapeless Witness on negative literals

Build 2018.2.792

Expand
5 Fixed issues
5 Fixed issues
  • SCL-14305 implicit search bug
  • SCL-14317 semantic highlighting: class parameter reference is highlighted
  • SCL-14143 ScNewTemplateDefinition might not be inheritor
  • SCL-14319 strange navigation info for types from Witness.selectDynamic
  • SCL-14313 witness selectDynamic regression

Build 2018.2.784

Expand
3 Fixed issues
3 Fixed issues
  • SCL-14255 sbt project-specific settings saved as defaults, causes import errors
  • SCL-14075 sealed template definition is inherited from Java
  • SCL-14281 exhaustive match: disable Java inheritors

Build 2018.2.769

Expand
8 Fixed issues
8 Fixed issues
  • SCL-9913 Ability to select scala class file from project view and decompile to java code
  • SCL-14307 Scala plugin delete the whole Scala file when I want to "remove unuse element".
  • SCL-14278 Scalastyle-consistent formatting of imports is not consistent with Scalastyle
  • SCL-14293 wrong "method overrides nothing" message for dependent parameter types
  • SCL-13420 Red code for shapeless Witness on negative literals
  • SCL-14264 False "no implicits found" hint
  • SCL-14302 semantic highlighting: variable pattern
  • SCL-14082 resolving subpackage should respect scope

Build 2018.2.752

Expand
2 Fixed issues
2 Fixed issues
  • SCL-9913 Ability to select scala class file from project view and decompile to java code
  • SCL-14283 Apply methodTemplate doesn't generate Type

Build 2018.2.738

Expand
1 Fixed issues
1 Fixed issues

Build 2018.2.716

Expand
0 Fixed issues
0 Fixed issues

Build 2018.2.714

Expand
1 Fixed issues
1 Fixed issues

Build 2018.2.711

Expand
1 Fixed issues
1 Fixed issues
  • SCL-14256 type inference of polymorphic arguments should happen before adapting to expected type

Build 2018.2.709

Expand
1 Fixed issues
1 Fixed issues
  • SCL-13998 Move BSP support code from `scala/` to `/`

Build 2018.2.703

Expand
3 Fixed issues
3 Fixed issues
  • SCL-14212 Exhaustive match: explicit case class companion module
  • SCL-14211 Exhaustive match completion: infix expression case
  • SCL-14242 sbt import doesn't work if .jvmopts file contains comments

Build 2018.2.695

Expand
23 Fixed issues
23 Fixed issues
  • SCL-12430 Not a valid key: idea-shell
  • SCL-13225 sbt shell input not focused when expected
  • SCL-9913 Ability to select scala class file from project view and decompile to java code
  • SCL-12708 Incorrect highlighting of vararg methods passed as parameters to h/o functions expecting functions taking varargs
  • SCL-14202 Fatal error initializing plugin org.intellij.scala
  • SCL-14152 Scala plugin considers vararg case class field as an incorrect override for SeqT method
  • SCL-14196 Regression: Akka HTTP MediaTypes literals that a dot in the name don't appear in code completion and have highlighting error
  • SCL-12392 SBT Shell usability feedback
  • SCL-14144 highlighting missing in library files
  • SCL-13954 Type hints: omit when type is obvious, not when type is stable
  • SCL-14224 False warnings about missed implicits in scalatest code
  • SCL-14187 implicit hints are not disposed on the last offset of the file
  • SCL-14181 expected type for arguments should check implicits before expected type of an invocation
  • SCL-14206 Wrong types generated for implementation of a Java interface
  • SCL-14223 Wrong inspection message in `JavaAccessorEmptyParenCallInspection`
  • SCL-14208 Missing gutter icon for overriden vals
  • SCL-13579 Return type of toString is obvious
  • SCL-14008 Good code red: calling overloaded method with named parameters when implicit conversion is required
  • SCL-13747 Syntax highlighting error in scratch file (inherited method)
  • SCL-14199 NPE in `org.jetbrains.plugins.scala.project.migration.ImportedLibrariesService`
  • SCL-14198 REPL Worksheet doesn't resolve resN values
  • SCL-14238 wrong highlighting of argument in block
  • SCL-14110 Method result type hint: use ": Unit =", not just ": Unit" for procedural syntax

Build 2018.2.687

Expand
1 Fixed issues
1 Fixed issues
  • SCL-14223 Wrong inspection message in `JavaAccessorEmptyParenCallInspection`

Build 2018.2.678

Expand
3 Fixed issues
3 Fixed issues

Build 2018.2.661

Expand
1 Fixed issues
1 Fixed issues
  • SCL-14110 Method result type hint: use ": Unit =", not just ": Unit" for procedural syntax

Build 2018.2.656

Expand
1 Fixed issues
1 Fixed issues
  • SCL-14144 highlighting missing in library files

Build 2018.2.653

Expand
4 Fixed issues
4 Fixed issues
  • SCL-14196 Regression: Akka HTTP MediaTypes literals that a dot in the name don't appear in code completion and have highlighting error
  • SCL-14187 implicit hints are not disposed on the last offset of the file
  • SCL-13747 Syntax highlighting error in scratch file (inherited method)
  • SCL-14008 Good code red: calling overloaded method with named parameters when implicit conversion is required

Build 2018.2.646

Expand
2 Fixed issues
2 Fixed issues
  • SCL-14202 Fatal error initializing plugin org.intellij.scala
  • SCL-14199 NPE in `org.jetbrains.plugins.scala.project.migration.ImportedLibrariesService`

Build 2018.2.636

Expand
4 Fixed issues
4 Fixed issues
  • SCL-12430 Not a valid key: idea-shell
  • SCL-13579 Return type of toString is obvious
  • SCL-13954 Type hints: omit when type is obvious, not when type is stable
  • SCL-14110 Method result type hint: use ": Unit =", not just ": Unit" for procedural syntax

Build 2018.2.630

Expand
4 Fixed issues
4 Fixed issues
  • SCL-14178 IDE hangs with Scala plug-in
  • SCL-14185 existential types are not shown in infix notation
  • SCL-14180 wrong "not found implicit" error
  • SCL-14182 scala plugin paste bug V2018.2.9

Build 2018.2.612

Expand
1 Fixed issues
1 Fixed issues
  • SCL-14159 Cannot find implicit for ActorContext

Build 2018.2.610

Expand
8 Fixed issues
8 Fixed issues
  • SCL-13431 Cannot properly highlight instantiations made through type alias
  • SCL-6041 Good code is red, new parameterized type alias definition
  • SCL-14024 SBT Shell should pick up jvm options from .jvmopts
  • SCL-14168 separated build/import options in sbt shell are not respected for projects using previous "build and import" setting
  • SCL-13575 Type annotation settings: "Type is obvious" -> "Type is stable"
  • SCL-14173 hydra downloader throws npe
  • SCL-14172 Scala parameter/type hints do not work
  • SCL-14166 Editor implicitly assigns type Any to predefined Double constants

Build 2018.2.588

Expand
1 Fixed issues
1 Fixed issues
  • SCL-13919 scala plugin shows incorrect deprecation warnings

Build 2018.2.581

Expand
2 Fixed issues
2 Fixed issues
  • SCL-14147 IDEA hangs on create_class quickfix
  • SCL-14133 Scalafmt fails in case of comment in a worksheet

Build 2018.2.578

Expand
2 Fixed issues
2 Fixed issues
  • SCL-14137 Exhaustive match generate nothing for sealed class and its decendants
  • SCL-13635 plugin dependency jar packaging

Build 2018.2.561

Expand
3 Fixed issues
3 Fixed issues
  • SCL-14137 Exhaustive match generate nothing for sealed class and its decendants
  • SCL-14051 No "Implicits" context menu for Implicit arg. of Implicit conversion
  • SCL-14130 Specific context menu doesn't appear for Implicit arg. inline hint if arg. belongs to Implicit conversion

Build 2018.2.548

Expand
0 Fixed issues
0 Fixed issues

Build 2018.2.546

Expand
0 Fixed issues
0 Fixed issues

Build 2018.2.545

Expand
12 Fixed issues
12 Fixed issues
  • SCL-13950 IDEA fails to import sbt 1.2 projects
  • SCL-13945 Project requires reimport after its closing
  • SCL-14114 Scalafmt: IDEA generates incorrect code for create_test action
  • SCL-14089 Error highlighting: No implicits found with explicit class parameter
  • SCL-13956 separate build/import options for sbt shell
  • SCL-14113 scalafmt: broken indent after generated "toString()" method
  • SCL-13977 Expression in parantheses show implicit conversion twice
  • SCL-14117 Scalafmt: Failed to format UnfoldPullerAsync.scala
  • SCL-14115</