Child pages
  • IntelliJ IDEA 2019.2 EAP (192.4205.1 build) Release Notes

Versions Compared

Key

  • This line was added.
  • This line was removed.
  • Formatting was changed.
No subsystemFeatureIDEA-210929Provide ability to copy a TBX link to a settings
FeatureIDEA-207379Redesign several indices to be able use prebuilt values
FeatureIDEA-93154Intention action: wrap collections/map with Collections.unmodifiable* variant
FeatureIDEA-192898I want to provide searchable options from plugin to allow searching plugin settings in the settings dialogue.
FeatureIDEA-210961Implement action for Slow Startup Profiling
FeatureIDEA-83668soutp live template: take arrays into consideration
FeatureIDEA-111333Provide Sublime Text keymap
BugIDEA-208771Memory leak of GlobalInspectionContextImpl
BugIDEA-203356Junit tests should not be marked as ignored when assertion in @AfterClass fails
BugIDEA-211771can we please get rid of "No IDEA annotations attached to JDK" notification bar and simply always load our external annotations, regardless of whether they are attached or not? or add them automatically to the JDK during project opening if they're missing? (edited)
BugIDEA-2061325 modules of the IntelliJ Community are missing in the master branch source tree
BugIDEA-204173"Settings | Scopes" - "Expand" action doesn't work for ill-formatted strings
BugIDEA-202296EditorConfig-related actions in the status bar: on the first attempt only one action is shown
BugIDEA-207848IDE crashes on startup
BugIDEA-202565Creating live template containing annotation with value generates code with syntax error
BugIDEA-149084Spring Boot: completion in .yml files: incorrect results on inserting property if one with same prefix exists
BugIDEA-202994DiffUserDataKeys.GO_TO_SOURCE_DISABLE property is ignored in OpenInEditorAction
BugIDEA-203161SOE at ThreeComponentsSplitter.visibleDividersCount() on attempt to open Run tool window in certain Gradle-based projects
BugIDEA-144233Drag'n'Drop to move files within Project Tree View?
BugIDEA-207782Memory leak in gradle import process
BugIDEA-208060Deadlock on Rider startup
BugIDEA-209987IDEA is deadlocked at startup before showing splashscreen
BugIDEA-205756contract can be simplified
BugIDEA-205603Recent Location popup is not redraw after resize
BugIDEA-204321Rider EAP not keeping terminal configuration
BugIDEA-204455Breadcrumbs: breadcrumbs still shown after turning them off
BugIDEA-204674The logs' arhive file name is too generic
BugIDEA-209684Hide "RunAnything" popup on any other popup appearing
BugIDEA-211786IDE freeze after user tries to start CPU usage profiling with tracing (windows)
BugIDEA-205654Extra lines in recent location snippet
BugIDEA-201003Huge freeze while "navigate to test data"
BugIDEA-206726Test icon doesn't appear after test completion
BugIDEA-204163Don't suggest `P` and `B` live templates in all Kotlin contexts
BugIDEA-190880Copyright profiles UI needs more space
BugIDEA-203310Memory leak detected VirtualFilePointerManagerImpl, ConsoleViewImpl
BugIDEA-207034Can't resize toolwindow dragging its title bar
BugIDEA-204044move clashes with resize in custom decorated mode
BugIDEA-206149Fix com.intellij.ui.stripe.Updater#findPreviousIndex
BugIDEA-207155File structure: Rename warning appeared under the File structure dialog
BugIDEA-205818Switching between Look and feel spoils Recent locations popup
BugIDEA-168781Mnemonics for run actions is broken in case of '_' and '&' in configuration name
BugIDEA-158131Optimize Imports runs on too many files
BugIDEA-97887Good code red: Extending inner types of parameterised classes in external jars
BugIDEA-201667Soft-Wrap works incorrectly with Inlays
BugIDEA-206802"Columns List" context item not working
BugIDEA-214499NodeJsInterpreterManager must not always instantiate default project unconditionally because it's bad for performance
BugIDEA-204505Plugin Settings: Custom plugin icons are not scaled on HiDPI Linux
BugIDEA-145069EditorConfig plugin doesn't handle indent_size option correctly
BugIDEA-211665ShelveedChangesViewManager leaks contents
BugIDEA-210734project load progress is broken
BugIDEA-204946File templates: File Template Variables aren't parsed in includes
BugIDEA-205817It's possible to open several Recent Locations popups simultaneously
BugIDEA-199283[Run Anything] a list of maven goals, which appears after mouse clicking on "load more", differs from the list invoked using keyboard
BugIDEA-211678I can't attach CPU profiler (JDK 11)
BugIDEA-206341[Dump Threads in Run tool window] add java11 support
BugIDEA-206487Error:java: java.lang.IllegalArgumentException: Not supported: org.jetbrains.jps.javac.InputFileObject[...]
BugIDEA-206285Suggestions bubble can make it impossible to mouse click at the beginning of line
BugIDEA-211072Associate With File Type: search doesn't work properly in the Register New File Type Association dialog
BugIDEA-205610Already disposed exception if close project with opened Recent location popup
BugIDEA-205847Comments from coffescript files shown as text in snippets
BugIDEA-209470Persistent profiler may prevent startup in case update is installed in a new folder and previous is disabled
BugIDEA-207318mac.touchbar exception in 2019.1 EAP
BugIDEA-210616Persistent Profiler can't be enabled if YK binaries were already copied
BugIDEA-131162Call Hierarchy Tree Creates Infinite Nesting on Recursive Functions
BugIDEA-206180Custom font size is not preserved on Linux
BugIDEA-205350Fold region at beginning of file causes issues
BugIDEA-203108fix for RUBY-19897 fails with JFX10
BugIDEA-210940Borderless UI: Welcome screen is cut (shorter then should be) and can not be resized
BugIDEA-181157Cannot compile Groovy if Groovy is global library
BugIDEA-214500NpmManager must not always instantiate default project unconditionally because it's bad for performance
BugIDEA-209816BuildOutputInstantReaderImpl.getCurrentLine() does not work when reading over 50 lines
BugIDEA-136762Fonts in ProjectView under Darcula in Linux looks bad after sequental LaF changes
BugIDEA-208045Exception from `RootModelImpl` on (Cargo) project update.
BugIDEA-211668wrong slashe on "Save LOB" on windows
BugIDEA-205658Empty lines at the end of file are shown as empty snippet
BugIDEA-210937Remove -agentlib:yjpagent64 on import of settings
BugIDEA-206403unused declaration inspection: constructor used in code outside analysis scope should be marked as used
BugIDEA-206008Test with Coverage doesn't report number of passed tests in tooltip
BugIDEA-208982All completion items have the same (wrong) color
BugIDEA-211042Borderless UI: Can't move window by clicking near the minimize icon
BugIDEA-202979intellij idea 2018.3 does not finish scanning files to index
BugIDEA-188752Undo action leads to Editor color schemes deletion
BugIDEA-209729Module name is not shown in goto class without flex plugin
BugIDEA-201532The BlockInlay loses the background of the editor's selection
BugIDEA-205663Recent Locations is not available in Find Action
BugIDEA-211564A very long indexing of Ultimate project with strange `findLeafElementAt` call from `JavaFunctionExpressionIndex`
BugIDEA-210786Allow to provide snapshot folder (via -Dsnapshots.path)
PerformanceIDEA-212605Pycham Educational 2019.1 (in linux, using snap) hangs on pressing alt+enter when editing a .py file
PerformanceIDEA-209136ShowAutoImportPass#importUnambiguousImports is invoked synchronously on EDT
PerformanceIDEA-208908Out of memory because of 16M byte arrays caused by debugging
PerformanceIDEA-212712Tab action lasts too long
PerformanceIDEA-209529PsiViewerDialog causes memory leak
UsabilityIDEA-78518Method Inheritance Hierarchy should allow to narrow by search scope
UsabilityIDEA-206611Editor | General | SoftWraps| Soft-wrap file types: it is unclear how to specify types there
UsabilityIDEA-205653There is no ability to clear Recent Location history from popup
UsabilityIDEA-212566Memory and CPU snapshot have the same name
UsabilityIDEA-204836Nested class/method navigation breadcrumb trail off by one
UsabilityIDEA-205681Recent location list size should be configurable in Settings
UsabilityIDEA-211876"Profile slow startup" should notify user that snapshot is ready after restart
UsabilityIDEA-211517Group all profiling related actions under Diagnostic menu
UsabilityIDEA-161842Key Mapping: Ctrl-Y not assigned to "Redo" is problematic
UsabilityIDEA-211516Attach CPU profiling should start the profiling right away
UsabilityIDEA-201429Remove .editorconfig from the list of file templates
UsabilityIDEA-205605Long code samples shows scroll bars
CosmeticsIDEA-204514Some spaces between file names in logs would be really nice
CosmeticsIDEA-205841Right border is not redraw if resize Recent location popup
CosmeticsIDEA-212707Windows Modern UI: Consider making the name of the solution bold
CosmeticsIDEA-206591Rename Mac OS X to macOS
CosmeticsIDEA-203127Rename "Settings Summary" to "Collect Troubleshooting Information"
CosmeticsIDEA-212694Rename "Postpone" to "Not Now" in Restart IDE dialog
CosmeticsIDEA-201465Improve display for long string in Ctrl+hover tooltips
TaskIDEA-207119Unify start-up time measurement
TaskIDEA-205647Shortcut for Recent location
TaskIDEA-185056Remove pin icon from quick navigate tooltip
TaskIDEA-205600[Bundled JRE 11] Get rid of MimetypesFileTypeMap usage because it is moved to private package since JDK 11
TaskIDEA-203680Invalidate external projects imported data on 'Invalidate Caches' action
TaskIDEA-207393Update bundled trove library to prevent unnecessary rehashing
TaskIDEA-206446Explicitly be aware that IBM JDK doesn't support `report-cdata-event`
TaskIDEA-207966Defaults RL locations number to 25
TaskIDEA-205758Hide 'Show parameter name hints on completion' in Code Completion settings
ExceptionIDEA-207299com.intellij.openapi.extensions.impl.PicoPluginExtensionInitializationException (ShowDiagramBase)
ExceptionIDEA-211880Exception when user tries to start cpu profiling after profiling slow startup
ExceptionIDEA-206482RuntimeException: java.lang.reflect.InvocationTargetException
ExceptionIDEA-196008Throwable at com.intellij.openapi.roots.impl.libraries.LibraryImpl.<init>
ExceptionIDEA-205608Editor is already disposed exception if navigate on recent location sample with quick search result
ExceptionIDEA-199921com.intellij.util.Alarm - Assertion failed: Already disposed
ExceptionIDEA-206776in Linux on project closing Throwable occurs at com.intellij.openapi.wm.impl.GlobalMenuLinux.access$800
AndroidBugIDEA-205671Instant Run button has disappeared from the UI in 2018.3+
BugIDEA-204346ANDROID: AE: Write-unsafe context!
BugIDEA-208010Clean Project action is shown but does nothing in non-Android projects
BugIDEA-191821Error when try to build NOT gradle android project with library android with "Enable manifest merging"
BugIDEA-208605Profiling Android applications doesn't work
BugIDEA-208185IntentionHintComponent is registered as child of project causing a memory leak
BugIDEA-193964Gradle test runner outputs to console and instead creating test result toolwindow
ExceptionIDEA-206890SOE on Logcat toolwindow opening in any android project
Build. AntBugIDEA-202538Starting already built project takes a lot of time
UsabilityIDEA-212072Ant: Hide Ant tool window when no Ant files added
Build. GradleFeatureIDEA-188855Support package prefixes
FeatureIDEA-208727Show tasks colors in Gradle tool window
FeatureIDEA-207271Gradle Groovy syntax cannot resolve symbol 'exclude'
FeatureIDEA-201866[Gradle] An ability to configure default encoding by build script
BugIDEA-202246Incorrect warning in build.gradle
BugIDEA-210131IDEA 2019.1 can't import/sync the Gradle project which 2018.3 could
BugIDEA-208906Unexpected Gradle project evaluation failure during Gradle import.
BugIDEA-202168temp\ijtestinitXY.gradle -> ijTestIncludes contains unescaped strings for test with custom names
BugIDEA-182742Running several JUnit tests in a Gradle project creates a JUnit run configuration which uses platform test runner
BugIDEA-202918Optimize Imports functionality deletes org.gradle.util.GradleVersion import
BugIDEA-209409Cannot resolve symbol on dynamically created tasks
BugIDEA-203517Gradle test runner unable to find test task with type extended from `org.gradle.api.tasks.testing.Test`
BugIDEA-207396Test suite shown as terminated when test class inherits from abstract test class
BugIDEA-210487Project will be rebuilt (with gradle delegation), if the project was built by running a configuration then click "build" button again
BugIDEA-206362Cannot resolve extension in Gradle
BugIDEA-206305Gradle editor cannot resolve basic gradle keywords in 2019.1 IDE version
BugIDEA-204971Usage of internal Gradle `DefaultConvention` should be replaced by public API usages
BugIDEA-187917Gradle import creates additional content roots for providedRuntime/providedCompile dependencies in a Spring Boot War project
BugIDEA-202844IntelliJ 2018.3 stopped supporting Gradle Java module configuration with src and resource folder in the same folder
BugIDEA-169795Run Tests uses incorrect task when delegated to Gradle
BugIDEA-193640"Attach Gradle project" file chooser filters out .gradle.kts files
BugIDEA-207556Run Configuration classpath doesn't include dependent modules output roots if such folders were not exist before the delegated build
BugIDEA-208411Odd option when use "Run tests using: Choose per test" option
BugIDEA-204199NullPointerException while importing a pretty complex Gradle project
BugIDEA-175569"Two modules in the project cannot share the same content root" error
BugIDEA-202179Platform run configurations created for @Test methods in abstract classes when "Gradle test runner" is selected
BugIDEA-204476Bogus ambiguous call to constructor in gradle files
BugIDEA-205456Gradle: last test in suite is shown as ignored
BugIDEA-205337Gradle sync fail: source folder out of content
BugIDEA-178036Inconsistent "Reload changed classes" behavior when build actions delegated to Gradle
BugIDEA-201331IntelliJ doesn't respect annotation definition order when importing a project from Gradle
BugIDEA-205919Wrong test run configuration producing for package
BugIDEA-212028"Could not determine Java version using executable" error after opening a project
BugIDEA-203967JUnit parameterized java tests Gradle test runner support
BugIDEA-1984142018.3 Can't import Gradle project with source out of content root error with Gradle version 4.7 or newer and 'Separate modules per source set' disabled
BugIDEA-208977Gradle: "Store generated project files externally" option is not enabled when project open action is used for new project importing
BugIDEA-210372IntelliJ 2019.1 attempts Gradle sync even though project haven't opted in for this (project with multiple build systems)
BugIDEA-209560Ambiguous method call between two methods accepting Closure and Action
BugIDEA-211609Build view keep pending task after sync failed
BugIDEA-163187HotSwap is not triggered when build action is delegated to gradle
BugIDEA-202466Gradle project structure broken in Gradle tool window
BugIDEA-207327Second linked Gradle project is missing from linked projects list in Gradle settings
BugIDEA-204753Gradle: multi-module project creation is broken
BugIDEA-207719Can't run all tests in module (Gradle project)
BugIDEA-208041AssertionError from ReprocessContentRootDataActivity
BugIDEA-202975Import Gradle project with Gradle 5.0 fails when IDE is running under 11 JDK
BugIDEA-204086Source directories not marked as such in 2018.3 with Gradle 4.7+ and "Separate modules per source set" disabled
BugIDEA-176428Authenticated custom gradle wrapper download returns 401 unauthorized on project import
BugIDEA-203058Intellij gradle plugin issue with gradle 5, groovy and spock projects
BugIDEA-206037Gradle import fails witch error: Could not find or load main class java.base.java.lang=ALL-UNNAMED
BugIDEA-204633DataNode serialization bug, affecting MPP project data serialization
BugIDEA-198301New Gradle project uses most recent JDK among installed in IDE when "Use Project JDK" option is specified in import wizard
BugIDEA-181187Inter sourcesets dependencies not recognized by Idea when using gradle composite build
BugIDEA-209441Double borders around test tree
BugIDEA-178417Delegating IDE run actions to gradle causes CreateProcess error 206 on windows (filename too long)
BugIDEA-204313Recursion in build.gradle of kotlin-native project
BugIDEA-202181Gradle run configurations for abstract classes with test methods are created with incorrect module
BugIDEA-206742Gradle Delegate run/debug reloads many classes on first hotswap
BugIDEA-206555"Unused symbol": Gradle annotation "TaskAction" does not mark the method as used
BugIDEA-203429Unable to start Gradle 5.0 daemon process in IntelliJ
BugIDEA-203446Import Gradle project fails: project leakage in control model
BugIDEA-205334Adding new module to Gradle project doesn't show root project in the list
BugIDEA-205449Spring Initializr + 191 IDEA : gradle project failed on import from custom Initializr Service
BugIDEA-203656Up-to-date build script can be wrongly treated as changed
BugIDEA-208705Do not save build scripts while editing
BugIDEA-206492Running gradle tests via project context menu is broken
BugIDEA-202243Gradle/Kotlin/JUnit: Cannot run tests with `names with spaces and sym'bols`
PerformanceIDEA-199623High CPU load by "DisconnectableInputStream source reader" threads when debugging gradle task
PerformanceIDEA-204736IntelliJ freezes permanently while indexing
UsabilityIDEA-212133Gradle scripts in the editor: don't show long editor tabs, if they don't add useful information
UsabilityIDEA-189463Setting "Delegate Build Actions to Gradle" should override project output directory
UsabilityIDEA-176794Provide the option to set "Delegate IDE build/run actions to gradle" setting per gradle project
UsabilityIDEA-191523Gradle: do not show Import dialog when creating/opening projects
UsabilityIDEA-212059Gradle: improve editor tabs naming for Gradle files
UsabilityIDEA-173354"Delegate IDE build/run actions to gradle" affects all projects
UsabilityIDEA-208995Run Anything: no completion of gradle command prefix
UsabilityIDEA-209462Build tool window: new tabs should be opened on the right
CosmeticsIDEA-208914Wrong postion of warning balloon `No tasks available`
CosmeticsIDEA-208918Remove class name from title of task choosing popup of method
CosmeticsIDEA-197431Link to "Open the debugger session tab" is displaced
CosmeticsIDEA-208915Remove line above the hint inside task choosing popup
TaskIDEA-209544Replace “Run Maven Task” dialog with 'Run Anything'
TaskIDEA-207607Replace “Run Gradle Task” dialog with 'Run Anything'
TaskIDEA-203887Upgrade built-in Gradle to 4.10.3
TaskIDEA-209450Import gradle conventions for DSL resolve
TaskIDEA-203139Update gradle icon for run configuration and for projects nodes in gradle tool window
TaskIDEA-207606Run Gradle tasks: add classes completion to Run Anything dialog
Configuration ProblemIDEA-192580Support for packagePrefix in Gradle projects
ExceptionIDEA-203399Groovy: IAE "Unneeded kind: METHOD" at KindsResolverProcessor.execute(), analysis fails to complete
ExceptionIDEA-200709java.lang.NoClassDefFoundError: org/jetbrains/plugins/groovy/codeInspection/BaseInspection
Build. JPS (Compiling Project)BugIDEA-200052@NotNull exception thrown for parameter marked @Nullable
BugIDEA-203194Not able to run Java scratch on Java11
BugIDEA-205069"Build" process hanging, had to hard-quit app
BugIDEA-184859Remove dependency from JPS on IntelliJ IDEA installation
BugIDEA-209714VerifyError: Expecting a stackmap frame (JDK12 Preview mode + notnull annotated methods)
BugIDEA-207236FileSystemLoopException on building project located on google drive file stream
BugIDEA-211172Incorrect nullability checks generated for type-use annotations on arrays
BugIDEA-203603Show descriptive error message if project is configured to use JDK but 'IntelliJ Platform Plugin SDK' is used instead
BugIDEA-206390Error:java: class X is public, should be declared in a file named X.java
BugIDEA-202775Build fails if the paths contain symlinks
BugIDEA-203838Interface field usages aren't recompiled after pushing it down and changing return type
BugIDEA-203265AccessDeniedException when copying resources that are read-only
BugIDEA-203645Hang on project open
BugIDEA-212329Annotation processor is not invoked with java 9 modules
BugIDEA-201089XMLInputFactoryImpl exception on any attempt to build project with IBM JDK
PerformanceIDEA-205572Optimization proposal: avoid @NotNull runtime check for a string literal returned from a method
UsabilityIDEA-206946Building Java Scratch file builds everything while "Use classpath of module" is set to <no module>
UsabilityIDEA-204623Intellij sould be bundle with ECJ 4.10. There should be an option to only pass the command line typed by the user. Maybe also add an option to choose the JRE used by ECJ ?
CosmeticsIDEA-174920Don't write "Rebuild" in status bar when not whole project is being recompiled
ExceptionIDEA-206314ClassCastExpection during incremental compilation
Build. MavenFeatureIDEA-206109Use Build Tool window to report Maven build process
FeatureIDEA-143475Drop Maven 2.2.1 from IDEA distribution
FeatureIDEA-25247Maven: Update Indices when application starts up/on a regular basis
BugIDEA-188234Web project built with maven with two dependencies with the same artifactId and version (but different groupId) loses one of the artifacts
BugIDEA-200272Maven extension breaks dependency resolution
BugIDEA-207493Maven: Build tool window: no navigation to errors in *.kt files
BugIDEA-207490Maven: Build tool window: no navigable links to errors are shown in the right tab (console)
BugIDEA-200543HotSwap is not triggered when build action is delegated to maven
BugIDEA-202846Can not download source code for jar after updtaing 2018.3
BugIDEA-202286Refreshing Maven always resets Java Compiler to "Javac"
BugIDEA-201282maven 3.6.0: NoSuchMethodError: DefaultArtifactResolver.setLoggerFactory
UsabilityIDEA-212060Maven: include pom.xml into the editor tab/recent files to make them recognizable and searchable
CosmeticsIDEA-129410Maven: settings cosmetics
CosmeticsIDEA-125728Maven: ExecuteMavenGoal: confusing title of 'Select maven project file' dialog
CosmeticsIDEA-133126hide view "Maven Projects" for not maven project
TaskIDEA-183383Update Bundled Maven Version
ExceptionIDEA-205363ClassNotFoundException: org.apache.commons.cli.ParseException PluginClassLoader
Code Analysis. DependenciesBugIDEA-203520"Analyze This Dependency" action doesn't process usages of classes from other modules and libraries exported by the dependency
BugIDEA-203484Empty node is shown instead of JDK name in 'Analyze Dependencies' results
Code Analysis. DuplicatesFeatureIDEA-214460Do not detect duplicates inside ruby test files.
FeatureIDEA-181304Highlight duplicated branches in 'switch-case' statement
FeatureIDEA-214455Skip initialization methods during duplicates analysis in ruby files.
BugIDEA-206673Inspection `Duplicated code fragment` does not analyze content folders.
BugIDEA-214457Distinguish methods calls in ruby files.
BugIDEA-209663Relayout duplicates configurable
CosmeticsIDEA-207219Change "Hide duplicates fix" for "Duplicated code fragment" inspection
Code Analysis. InspectionFeatureIDEA-33733"Field can be local" quickfix should not create redundant variable
FeatureIDEA-93333Chained method calls inspection shall ignore methods which return the same type of enclosing class
BugIDEA-205936Inspections View: Group by Module doesn't work for groovy files
BugIDEA-209420Unable to export Inspection Results as HTML
BugIDEA-203067InspectionElement should be public/otherwise usable, or GotoInspectionModel should not be public
BugIDEA-208728Fix settings link on inspection toolwindow.
BugIDEA-203922Ctrl+Alt+Up in inspection results moves to the next result, rather than previous
BugIDEA-206216Fix all for warning in the top level file doesn't work when caret is located inside injection
BugIDEA-181614Inspection profile changes every time project is opened
BugIDEA-204111Run inspection by name produces empty view
BugIDEA-208127Batch inspection result preview not scrolled to warning in injected code
BugIDEA-86833web.xml inspection for assignable to javax.servlet.Servlet is wrong
BugIDEA-208033Go to next highlighted error is broken
BugIDEA-210730The same spelling error is underlined twice
BugIDEA-210888Offline inspection result file contains incorrect path to project if run command has `..` segments in path to project
BugIDEA-207410Can't choose Constant conditions and exceptions in settings
BugIDEA-204984Inspect Code hangs for single java file
BugIDEA-204414Exporting inspections results as HTML doesn't produce output
BugIDEA-183685Incorrect parameter type - ParamConverterProvider
BugIDEA-203538Cannot export results of single inspection run to XML
PerformanceIDEA-207013Uast: Evaluator hangs uninterruptible analysing some loops
PerformanceIDEA-204287LocalInspectionTool.isValidID should precompile regular expression
UsabilityIDEA-204371Remember "Group by severity" setting in inspection results
UsabilityIDEA-204733Troubles massively apply fix to all found warnings
UsabilityIDEA-30715"Split into multiple declarations" / "Split into separate declarations" confusion
CosmeticsIDEA-206994Show more context in Inspection results preview
CosmeticsIDEA-207817Typo in rule description for "Excessive range check" inspection
ExceptionIDEA-206047Invalid cached value assertion during offline inspections
ExceptionIDEA-203498com.intellij.analysis.AnalysisScope$2.visitFileEx(AnalysisScope.java:248): Read access is allowed from event dispatch thread or inside read-action only
Code Analysis. Language InjectionBugIDEA-153979Injected fragment editor: inserting new lines makes references unresolved
BugIDEA-211437Language Injection: close the injected fragment editor on un-injecting
BugIDEA-212451Multihost language injection: injected fragment editing causes exceptions and corrupted code
BugIDEA-201839Injected Brace Matcher Works Pretty Fun
BugIDEA-211592Language Injection: no comment is inserted on injecting into java constant
BugIDEA-202431Postgres SQL injected language formater
PerformanceIDEA-207632PostgreSQL fragment editing slow and unusable
UsabilityIDEA-211593Language Injection: 'do you want to insert annotation?' prompting message is misleading in case of missing annotations
ExceptionIDEA-211432REWA at com.intellij.psi.impl.source.tree.injected.changesHandler.AbstractMarkerBasedInjectedFileChangesHand ler.getReportException
Code Analysis. Structural SearchFeatureIDEA-182437Search Structurally dialog should have an inline preview
FeatureIDEA-203929Check lambdas/method references type using `getFunctionalInterfaceType()` in structural search
FeatureIDEA-210188Add type filters for JS structural search
FeatureIDEA-206520Add JavaScript/TypeScript existing templates
BugIDEA-206795File type not correctly detected from editor selection
BugIDEA-202958try-finally without catch blocks pattern finds try-catch-finally statements
BugIDEA-210460SSR: Double-clicking a group node in the Existing Templates dialog closes the dialog
BugIDEA-202914mess after selection
BugIDEA-209897Search for for loop pattern with expression list statement fails
BugIDEA-210464SSR: Exporting/importing a template should not include search scope
BugIDEA-208475Problems finding for loop statements
BugIDEA-210782Structural search in JavaScript: can't find arrow function
BugIDEA-210612Scopes dialog requires 2 OK/Cancel clicks before it goes away
BugIDEA-193965Structural Search And Replace: rerun button works incorrectly
BugIDEA-209956Expressions enclosed in parentheses are replaced twice during Structural Replacement
BugIDEA-209438new String[0] pattern incorrectly matches new String[0][] expression
BugIDEA-203274Syntax highlighting does not change when changing file type
BugIDEA-211084debugger pattern finds all identifiers in JS
BugIDEA-205240Editing a count filter put wrong value in max count editor if min count is not default
PerformanceIDEA-206479Slow structural search for pattern ArrayUtil.toObjectArray($var$, $class$.class)
UsabilityIDEA-168054Make structural search/replace templates available globally
UsabilityIDEA-203074Cutting and pasting a placeholder in the template editor looses all placeholder filters
ExceptionIDEA-202169IOOBE at com.intellij.structuralsearch.plugin.ui.filters.FilterPanel$2$1.getRowRendererComponent(FilterPanel. java:77)
ExceptionIDEA-197743«Perform code analysis» before Commit fails with NPE
Core. Diagrams (UML)BugIDEA-60296Modules UML diagram: listen to module and library rename
BugIDEA-124475Save diagram: ignores changed filename and drops layout
BugIDEA-207533Move UML diagram colors to color theme, then use editor color theme
BugIDEA-141306UML: new enum constant creating for enum via UML diagram creates uncompilable code if enum contains some members other than constants
BugIDEA-201919Fonts in UML diagrams are no longer vectorial but rasterized (to poor resolution)
BugIDEA-127395On diagram export to file this file doesn't appear in project until synchronization is invoked
BugIDEA-207912Diagrams background is white on Darcula
BugIDEA-204874UML diagram: context menu does not work on macOS
BugIDEA-209065UML: classes added to diagram via AddClassToDiagram action (<Space>) or by drag'n'drop appear incorrectly in the navigation popup
BugIDEA-208229Export diagram to image file: progress cancelling doesn't work
BugIDEA-210642Exporting ER diagram to png freezes idea
BugIDEA-206436Memory hogging in Diagrams + Structure tool window + Zoom In/Out
BugIDEA-208180Unknown and unwanted artifacts in UML diagram
BugIDEA-184834Uml Class diagram adds two entries to every diagram that can not be delete
BugIDEA-186132No default .uml extension for new class diagrams
BugIDEA-124631Opening *.uml file does nothing
UsabilityIDEA-182068Java Class Diagrams window steals focus from editor
UsabilityIDEA-47864UML: Create New Method dialog: provide possibility to set static and final modifiers
ExceptionIDEA-151955'deleteFile() not supported' when trying to delete diagram from Navigation bar
ExceptionIDEA-206582IndexNotReadyException on calling UML diagram during indexing
ExceptionIDEA-173305IAE at com.intellij.diagram.presentation.SimpleElement.<init>
ExceptionIDEA-90136IDE at com.intellij.diagram.presentation.SimpleElement.<init>
ExceptionIDEA-202308IndexNotReadyException on opening project if UML diagram is opened in the active editor
ExceptionIDEA-172311NPE at com.intellij.diagram.util.DiagramUtils.setBestPopupSizeForGraph
ExceptionIDEA-72445Exception when reverting changes with diagram opened
Core. File SystemFeatureIDEA-198080fsnotifier fails to start from Flatpak image
BugIDEA-211677Deadlock/freeze on quitting IntelliJ IDEA
BugIDEA-188926`VirtualFileManager.refreshWithoutFileWatcher` can take an extremely long time on a Windows FileSystem with a large number of mapped network drives
BugIDEA-212025VFS refresh blocks UI while reading file system under read action
PerformanceIDEA-208128VirtualFilePointer.getUrl() accesses disk
PerformanceIDEA-211046RefreshWorker/VFS massive memory usage
PerformanceIDEA-208259JdkTable / VirtualFilePointerContainerImpl initialization / VirtualFilePointerContainerImpl.getUrls() do disk access
PerformanceIDEA-180274Offload watch root setting from EDT
PerformanceIDEA-202236UI freeze on VFS operations (I/O in PersistentFS.processEvents)
ExceptionIDEA-207039Import Database Schema + H2 datasource: select or unselect table or column may invoke exception InvalidPathException: UNC path is missing sharename
ExceptionIDEA-208539java.lang.Throwable: Synchronous execution on EDT: fsnotifier
Core. HTMLCosmeticsIDEA-201570Questionable folding and preview of "&nbsp;" in HTML (Velocity)
Core. IDE SettingsFeatureIDEA-108609Cannot remap cursor keys for navigation outside the editor (popups, etc.)
FeatureIDEA-207917Provide a way to disable proxy detection logic on early startup
FeatureIDEA-107709StringUtils within a File Template
BugIDEA-206460Cannot not start IDE after 2018.3.4 update
BugIDEA-191923Importing config of old IDE version including custom plugin URL causes incompatible plugin suggestion from this URL
BugIDEA-100538Editor: Fall back fonts are not applied on Mac OS
BugIDEA-201018Unable to submit IDE errors anonymously after enabling 2FA
BugIDEA-205643IDE cannot restart after disabling/enabling plugin — hangs indefinitely
BugIDEA-207196@NotNull method com/intellij/openapi/projectRoots/impl/JavaSdkImpl.suggestSdkName must not return null
BugIDEA-209415“Start Failed” on closing the import-settings dialog
BugIDEA-210223doesn't save re-added file type configuration
BugIDEA-191085Failed to sync IDE settings. Invalid credentials
BugIDEA-188964Error loading kotlin-language facet
BugIDEA-205967Wrong previous version directory in import setting dialog (2019.1 suggests 2018.1)
BugIDEA-207107PhpStorm 2019.1 EAP build 191.4738.10, The file auto save is invalid.
BugIDEA-207297Settings sync doesn't work, NPE in CloudConfigManager
BugIDEA-209785No separator for File templates group when invoke new from Project view
BugIDEA-202843WARN - ge.ExternalProjectsDataStorage java.lang.NullPointerException
BugIDEA-207936IDEA is 'saving application' indefinitely
BugIDEA-198533Template group disappeared when you drag all templates to another group
BugIDEA-206472Reformat Code does not work for JSON
BugIDEA-206792[jdk11] MaxJavaStackTraceDepth=-1 is outside the allowed range
BugIDEA-179784Idea fails to load a project when running on Java 9
PerformanceIDEA-2026612018.3 slowness
UsabilityIDEA-195932Allow "Check connection" even if no proxy is selected
UsabilityIDEA-206954"Configure soft wraps" action should apply search highlight to the "Soft wraps" group in the editor settings
UsabilityIDEA-202502"Use console font" / "Use color scheme font instead of the default" checkboxes can't be set by clicking on their text
UsabilityIDEA-206444"Edit variables" for live template shows empty expression lists for templates with no context
CosmeticsIDEA-203663Preferences | Editor | General | Gutter Icons: sort plugin groups alphabetically
Core. Image ViewerBugIDEA-203942SVGLoader incorrectly interprets svg document size
Core. IndicesPerformanceIDEA-202748Hang during UnindexedFilesUpdater working
PerformanceIDEA-2022212 minute freeze on index query after deleting a large directory
PerformanceIDEA-208533OutOfMemory when indexing a 2Gb project, "Out of memory" window stuck forever
PerformanceIDEA-205778Upgrade to IntelliJ 2018.3.3 (from 2018.2.x) causes high cpu/memory usage in idle state
UsabilityIDEA-207075Better diagnosis for FileBasedIndexImpl - scheduleIndexRebuild, reason: File type change
Core. JSONBugIDEA-212680Replace with allowed value simply erase a current value instead of proposing available ones.
BugIDEA-209825No effect when use $ref in propertyNames in json schema
Core. Navigation and SearchFeatureIDEA-205404When navigating from Java stacktrace try to find the relevant position within line
BugIDEA-178367Weird 'choose implementation' popup
BugIDEA-202922Navigate | File results are not sorted by proximity
BugIDEA-164838Open three new same windows when do "Open In New Editor Window"
BugIDEA-211449IDEA is unable to find lambda implementations when invoked on library class source
BugIDEA-207132Recent locations popup shows 1 less snippets as in settings
BugIDEA-205772Javadoc: multi-resolve method references without signature to all overloads
BugIDEA-206342Hierarchy scope has disappeared
UsabilityIDEA-207052There should be a way to customize GoToDeclaration behavior
CosmeticsIDEA-207272Recent locations: icon is not shown for decompiled classes
TaskIDEA-209480Remove stub hierarchy
Core. Platform APIFeatureIDEA-200287UCallableReferenceExpression should provide access to referenceNameElement
FeatureIDEA-198928Make UAST provide a priory list of PsiElement types which could be used to get required UElement
FeatureIDEA-207347Please allow the UndoRedoAction to use the JB UndoManager for a JTextComponent
FeatureIDEA-211175Provide an annotation which may be used to mark public elements which must not be used from external plugins
FeatureIDEA-209082Allow IDEs to customize which builds can be used as possible updates
FeatureIDEA-209154Allow plugins to contribute additional details into description template used by 'Submit a bug report' action
FeatureIDEA-177378make the registry entries extendible by plugins
FeatureIDEA-208103ExecUtil.sudoCommand could show a prompt on macOS 10.10+
BugIDEA-202707If PersistentStateComponent::loadState failed with exception it won't be called next time
BugIDEA-205876Completion on a LightClass that is an interface does not include static methods
BugIDEA-210479A race condition in module structure loading
BugIDEA-208630Fix "Bean extension class should not have constructor with parameters" EPs
BugIDEA-203169Handle ProcessCanceledException during extension point listeners
BugIDEA-181010unable to use BouncyCastleProvider in plugin due com.intellij.util.lang.UrlClassLoader is not providing ProtectionDomain
BugIDEA-196796UAST: UMethod should provide access to the return-type reference expression
BugIDEA-209724Smart pointer creation during project disposal leads to "Element from alien project" assertion
BugIDEA-203089Optional dependency load order is not respected
BugIDEA-211580AvailableSince annotations stopped being included after Kotlin dependency on IntelliJ changed from kotlin.build.custom.deps:intellij-core to kotlin.build:intellij-core
BugIDEA-210378Incorrect API for PsiModificationTrackerImpl#forLanguages?
UsabilityIDEA-207106Log plugin that use registerFileType instead of FileTypeFactory
TaskIDEA-203954Make sure that `PsiReferenceProvider`s add references to elements they were asked about
TaskIDEA-204389Tons of "Kotlin: 'psi: PsiElement?' is deprecated. ambiguous psi element, use `sourcePsi` or `javaPsi`" compiler warnings
ExceptionIDEA-203514java.lang.AssertionError: Smart pointer list mismatch: size=1, ref.key=SMART_POINTERS 2145812205, manager.key=SMART_POINTERS 2145812205; has another pointer list with size 36
Core. Plugin ManagementFeatureIDEA-206274If there there are two dependencies on the same plugin in plugin.xml and one of them is optional the other is treated as optional as well
FeatureIDEA-211218Possibility to mark a plugin as internal
BugIDEA-205032Updating plugins in an offline environment no longer works with new marketplace and custom plugin repository
BugIDEA-171225Plugin manager should select ony one (latest compatible) version in custom plugin repository and use it
BugIDEA-202957New Plugins dialog: 503 server error causes two error dialogs - one after settings dialog is closed
BugIDEA-197563Plugins sync says "not installed" for installed plugins
BugIDEA-205249Required plugin isn't isn't added when click 'Enable' in 'Preferences | Plugins'
BugIDEA-210955Plugin deduplication on load should compare id, not name
PerformanceIDEA-205534Typing lags in plugins search UI
UsabilityIDEA-212701Place plugin home page above the plugin descripton
UsabilityIDEA-212691Filter out invalid plugins when the problem is fixed
UsabilityIDEA-200867Show plugin versions in the installed plugins list
UsabilityIDEA-202747Provide a link to plugin homepage along the vendor link
UsabilityIDEA-212690Do not show checkboxes for plugins that are not loaded
CosmeticsIDEA-212695Replace "Enable plugins" with “Enable required plugins”
CosmeticsIDEA-207802Plugins page: do not show (0) if no updates available
Core. Project SettingsBugIDEA-107676Project Templates: attempt to apply the project template created from one of static web template project fails with velocity exceptions
BugIDEA-208237IDEA forgets unloaded modules.
BugIDEA-203651Kotlin MPP (Common and JS) test source roots are not detected as source roots
BugIDEA-210208Inspection profile file is deleted by IDEA
BugIDEA-185499Do not create all facet editors on project settings open
BugIDEA-139332Creating template from project error: Error parsing file template
BugIDEA-208386If both .idea/workspace.xml and .idea/misc.xml are modified, reload doesn't happen correctly
BugIDEA-208450Memory leak in RootModelImpl.myDisposable
BugIDEA-210798Dependencies scope dropdown is switching on mouse over
BugIDEA-206879Scopes: can't exclude folder, only the files inside it
PerformanceIDEA-207895Opening Project Structure dialog is slow for projects with many modules
UsabilityIDEA-41940Provide better diagnostics when the user selects a JRE directory as JSDK home
CosmeticsIDEA-202743Library that contains only a single folder is shown as "libs and one more file" in Project Structure
TaskIDEA-209554Support pom maven artefacts
ExceptionIDEA-202726AccessDeniedException on project name change if .name file is read-only
ExceptionIDEA-212645Exception on new project opening
ExceptionIDEA-205597REWA at com.intellij.openapi.application.impl.ApplicationImpl.assertIsDispatchThread
Core. Quick DocumentationFeatureIDEA-175215Better quick JavaDoc for enums
BugIDEA-202665Quick documentation resolves method to any compatible method
BugIDEA-205229QuickDoc popup appears at wrong position when cursor is in "Find" field
BugIDEA-201393QuickDoc popup hides after selecting "Show Toolbar" option if QucikDoc is shown on mouse move
BugIDEA-205497QuickDoc popup appears on another monitor if invoked from "Brief Info" popup
BugIDEA-205190Misplaced Mouse Cursor
BugIDEA-203264Restoring quick doc popup size changes its content
BugIDEA-203713QuickDoc shown on mouse move changes position or disappears after clicking on link it contains
BugIDEA-201449Documentation tab name is not updated on following links in documentation
BugIDEA-203728Quick doc opened for an item from Project View changes position if one clicks on a hyperlink it contains
BugIDEA-209629Too small default size of quick doc popup (causing text clipping by scrollpane)
BugIDEA-203588JDK11 Javadoc links use wrong anchor format
BugIDEA-204179Wrong scrolling position after hyperlink navigation in quick doc popup
BugIDEA-212079QuickDocumentation is unable to load SVG from the jar file
BugIDEA-201280QuickDoc popup appears at the cursor position after closing the documentation tab in Tool Window
BugIDEA-201079QuickDoc popup is not focused on the second "Ctrl+Q" if it was opened from autocomplete or Project View
BugIDEA-210890Quick documentation for lookup items doesn't work if the file is empty
BugIDEA-201819QuickDoc popup is shown under the element in Diagram area even if there is not enough space for it
BugIDEA-189815Quick doc popup shown on mouse hover closes when clicking on a reference to a different class inside
BugIDEA-208812Inappropriate quick doc for array length
BugIDEA-201023QuickDoc popup becomes small after resizing and clicking the link inside the popup
BugIDEA-211038Ctrl-Shift-Arrow does not resize quick documentation popup but closes it
BugIDEA-210310Quick Documentation pop-up closes when moving between items in File View
BugIDEA-210273Table columns missing in Javadoc Quick Documentation view for Java 12
BugIDEA-202789Too many "Element information is not available during index update" notifications
BugIDEA-201036Autocomplete list moves up when opening/closing QuickDoc Tool Window
BugIDEA-198297Quick Documentation popup is sometimes placed off screen
UsabilityIDEA-208365Always autosize quickdoc popup when it's displayed on hover
UsabilityIDEA-208364Don't show quick info tooltip on Ctrl-hover if a quickdoc popup is currently visible
UsabilityIDEA-200674Adjust popup size according to the font size
CosmeticsIDEA-211247JavaDoc generated from HTML eats angle brackets in the link title
Core. RefactoringsFeatureIDEA-124496Scope Setting for Rename Refactoring
UsabilityIDEA-212081Names of Copy and Move actions in the context menu should reflect what's going to be copied or moved
UsabilityIDEA-206481Improve new file "Register New File Type Association"
CosmeticsIDEA-206172Refactor of directory name that begins with a dot to another name that begins with a dot PREVIEW-s a new name with TWO dots.
Core. RegExpBugIDEA-208559Invalid 'redundant character escape' in JS regex
Core. Run | Debug. ConfigurationsFeatureIDEA-114577Confirm deletion of run/debug configurations
BugIDEA-210262[Environment variables] when pasting several variables with semicolon at the line end - the last entry is removed
BugIDEA-157989"Stop" button does not work when the IDE is launched as a background task
BugIDEA-204416Running debug tomcat run configuration always launches "Before launch" gulp tasks in debug mode
BugIDEA-206657Compound Run Configuration triggers "Run" but not "Debug"
BugIDEA-206761Run configuration adds one more underscore
BugIDEA-96960Run Configurations popup: inconsistent position for run config folders
BugIDEA-208525Changes to my Environment Variables in Configurations aren't saving
BugIDEA-202004Run Configuration. Red class name "Class 'Main' is in the default package"
BugIDEA-195693Context help shows 404 page when invoked for a run configuration which don't have special help page
BugIDEA-194910Add macro support for VM options field (e.g. expand $ModuleFileDir$ properly)
BugIDEA-185342Shorten command line is missing on scratch run configuration even though prompted
UsabilityIDEA-207069Environment Variables "Open Folder"
UsabilityIDEA-204335Need an ability to disable run configuration delete confirmation dialog
UsabilityIDEA-206392Do not allow empty parameters in Run configuration > Spring Boot > Application
UsabilityIDEA-206173Environment Variables: can no longer paste from clipboard
UsabilityIDEA-206952Environment Variables doesn't allow to paste Name or Value separately for variable
UsabilityIDEA-201215JVM launcher cannot process @argfiles produced by IDEA
CosmeticsIDEA-200261[Run anything] Completion popup hides and shows after each key press (i.e. flickers)
ExceptionIDEA-205510Throwable at com.intellij.execution.impl.RunManagerImpl.addConfiguration$intellij_platform_lang_impl
Core. Run | Debug. External ToolsCosmeticsIDEA-184889External Tool named with an underscore does not display properly from project context menu
Core. XMLBugIDEA-183886XML highliting and redefined schemas
BugIDEA-202642XmlLikeFileType.isCaseSensitive has wrong name
BugIDEA-208504First xi:include tag in *Plugin.xml file is highlighted as error
BugIDEA-212646XML attribute value is marked as error if DTD's attribute type is enumeration containing DTD keyword as value
BugIDEA-206686Where is "Collapse empty tag" > "fix all in file" option?
BugIDEA-205629Argument rangeInElement exception when deleting xml tag in Android Studio 3.3
BugIDEA-210207XML schema issue - element X is not allowed here (Web.xml)
BugIDEA-206666IdeaPluginRegistrationIndex isn't file-based
BugIDEA-207657Quick fix to escaping "&" breaks inside injected languages inside XML
BugIDEA-210622Good code is red: No-namespace element incorrectly reported as "not allowed here" in XML file with XML Schema
BugIDEA-212344catalog.xsd in IntelliJ platform-impl.jar is outdated
CosmeticsIDEA-204273Outdated version of the Xerces library in org.jetbrains.intellij.build.CommunityLibraryLicenses
ExceptionIDEA-212704Invoking Find by XPath throws ClassCastException
Editor. Code CompletionFeatureIDEA-203280Groovy Script for PHP Storm Live Templates give suggested box?
FeatureIDEA-199722Can I make the live template appear at the top of the code completion list?
BugIDEA-205485Goto Declaration doesn't work in completion autopopup with automatic quick doc popup
BugIDEA-186754Code completion list is blinking after typing non-ASCII text
BugIDEA-214469Live Templates suggestions disappear on non-alphanumeric character input
BugIDEA-209206Completion: avoid showing loading... for multiple entries in the fully resized completion list
BugIDEA-204126[Live templates] autocompletion is not shown for some live templates (e.g. sout, psvm)
BugIDEA-207334Edit Postfix template dialog: custom template box is missing
BugIDEA-200049backspace doesn't work in completion popup
BugIDEA-148060Completion doesn't work after switching window
BugIDEA-208424Word completion doesn't work in language-specific elements in small IDEs
BugIDEA-199925Dash breaks autocompletion for live template name
UsabilityIDEA-211557Code completion dropdown stays open after Shift+Enter (Start New Line)
UsabilityIDEA-209123Enable F2 and Shift+F2 shortcuts while code completion is active
UsabilityIDEA-210660Make "Jump outside closing bracket/quote with Tab" default behaviour
UsabilityIDEA-209784Basic/Smart completion does not offer package private methods when runtime object type is from another package
ExceptionIDEA-194554AE at com.intellij.codeInsight.documentation.DocumentationManager.assertSameProject
Editor. Color SchemesFeatureIDEA-212390Ability to drag-n-Drop editor color scheme
BugIDEA-207403Darcula color scheme: "Custom Keyword 4" default color looks like an error
TaskIDEA-206064Display a warning of Rider color schemes incompatibility instead of failing, fall back to some other color scheme
Editor. Diff and MergeFeatureIDEA-48213Compare two files action does not allow to select which file will be left and which one will be right (swap diff)
FeatureIDEA-197789Allow adding file contents to the Blank DIff Window
BugIDEA-207667Weird synchronised scrolling in diff view with soft wrapped lines
BugIDEA-203659Shift+Tab in Diff editor changes line indentation style
BugIDEA-210607'Apply changes' in diff view does't work
BugIDEA-210783Couldn't select items in 'Diff Between' window (Deployment/Remote Host Access) with UP/DOWN arrow keyboard keys
BugIDEA-111268Tab width not respected when viewing code changes inline
BugIDEA-212625Incorrect highlighting in diff view when last document line is soft wrapped
UsabilityIDEA-123813Preserve diff pane widths when switching between files
UsabilityIDEA-155010Suggest to unlock 'Disable editing' button in 'Commit Changes' dialog when I'm trying to type in diff view
UsabilityIDEA-207839Accept left/right shortcuts are reversed
UsabilityIDEA-182230VCS "visual merge" window: don't ask "Are you sure" if there was no changes
CosmeticsIDEA-206495Partial commits: Excess "Uncheck all" checkbox on Diff dialog
CosmeticsIDEA-211780Escape characters in action name of "Diff \\& Merge"
ExceptionIDEA-207311Error: can't show diff on EAP
Editor. Editing TextFeatureIDEA-168176Move Caret Backward/Forward a Paragraph With Selection
FeatureIDEA-204140Should be able to unwrap rule based switch expression
FeatureIDEA-204702Support after-line-end inlays in editor
FeatureIDEA-205621Switch statement unwrapper
FeatureIDEA-36496Move statement up/down handles catch blocks improperly
FeatureIDEA-70189Java Smart Complete Statement: Complete ternary operator if necessary
FeatureIDEA-144788Code folding - Class description doxygen/javadoc comments: leave first line visible
FeatureIDEA-207307No horizontal scroll in editor when the width of block inlay is more than editor width
FeatureIDEA-106702Folding comments block
FeatureIDEA-211180Jump outside closing bracket with Tab should jump after the semicolon
BugIDEA-197682Shadow action is created with the wrong lifetime spec (Disposable)
BugIDEA-208508Wrong size of quick navigation popup hides part of the popup text
BugIDEA-203335Parameter info appears when not required
BugIDEA-205802Repaint issues for soft-wrap marks in a diff pane
BugIDEA-201210Expanding selection within method's generic type parameter expands to beginning of file
BugIDEA-197843'Move Statement Up/Down' for switch-case-blocks does only detect the statement when the caret is exactly on the statement
BugIDEA-205622Scope popup closes diff fragment popup
BugIDEA-205774Moving Up/Down doesn't work properly for Enum constants in case of missing ';'
BugIDEA-207542TODO highlighting affects following lines
BugIDEA-214565Different indents for Python in commentStart() macro
BugIDEA-205130Parameters info shows the actual proper method signature as disabled
BugIDEA-199639While typing TODO comment with Korean text, color scheme to the last letter is disappeared
BugIDEA-205365Git diff view in commit dialog does not allow copying text to clipboard (CTRL+C) if this shortcut is assigned to "Copy as Plain Text" action.
BugIDEA-201750Move Up/Down and Scroll works wrong with a cloned caret
BugIDEA-210470Fira Code breaks fixed-width alignment on "[[" - double opening bracket
BugIDEA-204898Exception in buildFoldRegions can block loading of editor
BugIDEA-201183Live Template Context in Java type declarations
BugIDEA-211085Current line number colour incorrectly calculated
BugIDEA-196178Join Lines on selected text also joins not selected text
BugIDEA-202915Highlighting of deleted ranges in diff window is blinking sometimes
BugIDEA-203120Adding Inlay leads to code lens invalidity
BugIDEA-175878Multicursor first cursor incorrect indent on tab press in injected fragment
BugIDEA-205739Editor: Action is applied for the wrong line if invoked from menu
BugIDEA-202245Editor ignores EditorMouseEvent consuming
BugIDEA-138431Editor: Ctrl+Left / Right (arrow) does not skip over indent whitespace to prev/next token
BugIDEA-202906Parameter hints find wrong overload
BugIDEA-203015Wrong caret position after up/down movements in presence of both inline and block inlays
BugIDEA-192879"Move statement" skips position outside code block in Java
BugIDEA-204769Editor: selecting "Copy" action from menu copies whole line instead
BugIDEA-204058Enter doesn't work in line comment if an invalid todo pattern is configured
BugIDEA-208973Identifier highlighting is lost after moving line
BugIDEA-207212Editor scrolls unexpectedly on pasting collapsed method
BugIDEA-204703Text selection significantly slows down when cursor is outside the text editor
BugIDEA-207951Ide freeze on showing parameter info
BugIDEA-205336after new file is added, "last edit location" doesn't work
BugIDEA-136779In editor, alt+drag should clear the old caret.
BugIDEA-208537folding toggles are not shown for added fold regions
BugIDEA-201725Rich text copy / paste on high DPI screens should scale down fonts
BugIDEA-207805Selection in editor is not reset on mouse right click outside selection
BugIDEA-167224Unwrap lambda should add braces if necessary
BugIDEA-203902Text drag'n'drop in editor is not canceled by Esc key
BugIDEA-205635Moving up/down enum entry declaration with empty line after declaration produces red code
BugIDEA-208782Fallback font Italic version doesn't work on Mac
BugIDEA-205776Moving Up/Down dowsn't work for Enum constant with body
BugIDEA-208853Changing scratch language causes IntelliJ to lose scratches
BugIDEA-203201Cursor jumps back and sometimes random extra spaces are inserted
BugIDEA-195293Strange behavior when join lines with "builder.append('...')"
BugIDEA-201502Weird soft wraps behavior when working with XML content
BugIDEA-210104Move Caret to Matching Brace moves to wrong position
BugIDEA-204900Smart Enter fails to add function body if staying at annotation
PerformanceIDEA-206039IntelliJ froze for 148 seconds after tabbing alt-tabbing away and back to IntelliJ with large buffer.txt file
PerformanceIDEA-211201Typing with multiple carets is slow in XML files
PerformanceIDEA-210051Memory leak in DocumentImpl
UsabilityIDEA-208930Pressing Tab in a selection doesn't prefix first line with a tabulator
UsabilityIDEA-209051Inspection popup is overlapped by quick doc
UsabilityIDEA-185682Parameter info hides the code being editing at the top of a file
UsabilityIDEA-198213Double clicking on the { or } (curly brace) should select class body
UsabilityIDEA-211756"Delete to word end" is extremely inconvenient on whitespaces
UsabilityIDEA-200630too eager commenting out
UsabilityIDEA-203855Cloned carets visually off
UsabilityIDEA-89608Should be able to set editor view options like soft wraps for certain file types
UsabilityIDEA-204308Multiline TODO popup interferes with editing the TODO.
CosmeticsIDEA-200296confusing gutter folding hints for "closure" folding
TaskIDEA-205639Gutter current line number highlighting doesn't respect conversion function
TaskIDEA-209242Increase default number of items stored by default in clipboard history
Editor. Error HighlightingBugIDEA-198053Library source does not match the bytecode for VirtualFilePointerTracker
BugIDEA-204791Duplicate highlights in maven
BugIDEA-202625IDEA doesn't see library after it is copied into 'lib' folder
PerformanceIDEA-20704523 lines with open dots cause of hang of IDEA
Editor. Formatter and Code StyleBugIDEA-204185Code Generation settings are not being saved
BugIDEA-206778Export codestyle settings to JSON: export fails when non-default values are provided for java | wrapping and braces | braces placement options
BugIDEA-203464There is not same code style in 2018.2 and 2018.3 which I have the same codestyle.xml
BugIDEA-204458Java Formatter : close-brace in enum does not create new line
BugIDEA-211444Code Style Settings: incorrect variants in drop-down for WrapOnTyping option
BugIDEA-195707"'case' on new line" setting name is misleading; behavior should be changed and a new setting added with the old behavior
BugIDEA-147601Javadoc Code formatting does not indent HTML tags properly
BugIDEA-212466"Expected to be final" identifier is not always painted as such in Java editor
BugIDEA-203775NPE on opening unified diff view when Upsource Integration plugin is enabled
BugIDEA-206769Export codestyles settings to JSON: space_within_* attributes of java settings are not exported
BugIDEA-206789Export codestyle settings to JSON: java | wrapping and braces | visual guides option is not exported
BugIDEA-189934Replace lambda with method references messes up indentation
PerformanceIDEA-204975UI freeze when formatting a 200KB one-line XML file
CosmeticsIDEA-207230Tab width in Definition window differs from tab width in editor
Editor. Intention ActionsBugIDEA-155352Unwrap Statement produces broken code
BugIDEA-202205Wrong gutter action add to intention popup when we have disabled gutter action
Frameworks. DroolsBugIDEA-97068drools mvel syntax not working for Objects created in then clause
BugIDEA-152064Single quotes are listed as errors within drools rules
PerformanceIDEA-203046Intellij lags when editing drl (Drools rules) files.
Frameworks. GWTBugIDEA-211438GWT: IDE doesn't respect Java language level for GWT client code under default 'client' package
BugIDEA-206271GWT Debug broken with latest IDEA version(s)
BugIDEA-194048IDEA GWT hosted mode run issue
UsabilityIDEA-208047GWT: quickfixes which show popups work strangely when invoked from batch inspection results
ExceptionIDEA-208056GWT: invoking New | "GWT UiRenderer and ui.xml File" always produce an exception
Frameworks. HibernateBugIDEA-185976Hibernate plugin doesn't work with Kotlin "Entities"
Frameworks. SpringFeatureIDEA-199770Spring MVC and Kotlin: provide the "RelatedViews" gutter navigation icons for the request mapping methods
FeatureIDEA-199860Spring + Kotlin: Select In... | Spring Beans doesn't work for kotlin classes
FeatureIDEA-190488Recognize MethodInvokingFactoryBean when resolving bean type
FeatureIDEA-203238Spring Cloud Stream: binder name completion in application configuration files
FeatureIDEA-205930Spring MVC + Kotlin: reference to constant is not supported as @PathVariable value
FeatureIDEA-201453Spring Cloud Stream: support 'spring.binders' files
FeatureIDEA-199838Spring MVC and Kotlin: provide intentions to create the missing @PathVariable-annotated parameters
FeatureIDEA-201452Spring Cloud Stream: provide navigation between bound producers and consumers
BugIDEA-208628"Copy Configuration" does not work properly when called from "Run Dashboard"
BugIDEA-201454Spring Cloud Stream: false positive 'Cannot find channel' warning when referring to binding dedicated error channel
BugIDEA-208889Spring Boot: endpoints data is not available sometimes with 'Failed to check application ready state: File exists' error message
BugIDEA-122239Spring: support Spring io.Resource for ReloadableResourceBundleMessageSource#basename
BugIDEA-208629"Run Dashboard" disappears when clicking "Show Configurations" button
BugIDEA-200131Spring MVC and kotlin: model attributes rename doesn't work for Freemarker views
BugIDEA-212065Spring Initializr wizard does not import Gradle KTS project
BugIDEA-168170Spring: "Duplicate bean name" does not respect imports
BugIDEA-149459Spring Boot: fix highlighting of Map "key" part when using RelaxedNames
BugIDEA-161820Spring MVC: if custom @RequestMapping meta-annotations defines #value the mapping is not recognized
BugIDEA-174066Spring MVC @PathVariable inspection doesn't locate pathvariable when @RequestMapping contains constant
BugIDEA-204724Spring Boot: Endpoints: wrong path
BugIDEA-204415Cannot resolve @PathVariable for Spring MVC project (chops off last character)
BugIDEA-204374Cache manager auto-configuration is not detected properly
BugIDEA-207544Spring Boot plugin breaks IDE
BugIDEA-194994Update resources does not work for Spring boot with devtools and enabled 'Delegate IDE build/run actions to gradle'
BugIDEA-164845Spring Boot: config key provider "handle-as" should unwrap collection types
BugIDEA-204797Spring Boot: Run Dashboard doesn't show url for MVC application, Endpoints tab displays 'failed to check application ready state' when using 32-bit jre
BugIDEA-206247Spring Java Configuration and @Qualifier for Optional<Foo> Argument with bean of type Foo autowire error
BugIDEA-203834Spring Cloud Stream: dedicated error channel referenced by 'binding.group.errors' is not resolved
BugIDEA-205789WebTestClient
BugIDEA-209327Renaming parameter in @GetMapping in Kotlin file rename method parameter but doesn't change @GetMapping value
BugIDEA-202986Spring MVC not support resolution of views written as not-inlined strings
BugIDEA-205828[Kotlin] SpEL inspection - Cannot resolve variable 'bar'
BugIDEA-208064Spring: ResourceBundleMessageSource#basename value is not resolved
BugIDEA-208886Spring Boot: Health and Mappings endpoint tabs are empty for SB 2.2.0.M1 by default
BugIDEA-205634Error on running Spring Boot run configuration on OpenJ9 JDK on Windows
BugIDEA-203473Spring Boot + Kotlin: find usages doesn't work for keys defined in application.properties referenced from @Value annotation
BugIDEA-206141@ConfigurationProperties doesn't make properties shown in application.properties
BugIDEA-212290False 'method may be static' warning for Spring Boot @Bean methods
PerformanceIDEA-205027UI is frozen for 25s after opening a project in a new window and immediately switching to the previous IDEA window
PerformanceIDEA-212432IDE freeze when selecting text with double click
PerformanceIDEA-203949SpringDiagramElementManager builds Spring Model on UI thread
UsabilityIDEA-211211Spring Boot: move edit default path action to context menu in Run Dashboard
CosmeticsIDEA-206783Inspection to move field injection to constructor injection should not add @Autowired in case of single constructor
ExceptionIDEA-201893PIEAE at com.intellij.psi.PsiInvalidElementAccessException.createByNode
ExceptionIDEA-146621YML config file: PIEAE at com.intellij.extapi.psi.ASTDelegatePsiElement.getManager
ExceptionIDEA-210704Spring Initializr: can't import a created gradle based project
ExceptionIDEA-207792java.lang.Throwable: It's prohibited to access index during event dispatching
ExceptionIDEA-206000Throwable at com.intellij.util.CachedValueStabilityChecker.complain
ExceptionIDEA-205670CCE at com.intellij.openapi.vfs.newvfs.persistent.PersistentFSImpl.getFileId
Frameworks. StrutsExceptionIDEA-206588Plugin exception [Plugin: StrutsAssistant] at com.intellij.util.ExtensionInstantiator.instantiateWithPicoContainerOnlyIfNeeded
GroovyFeatureIDEA-201921Add "Access to unresolved expression" to the analyze process
FeatureIDEA-202693Support Java lambda syntax
FeatureIDEA-202738Don't break code with backslash in literals
FeatureIDEA-205861Spock Interaction DSL triggers lots of spurious warnings
FeatureIDEA-201929Intention for mass fixing of @CompileStatic errors
FeatureIDEA-212594Bold braces for closure and lambda expressions
FeatureIDEA-188430Support nested code blocks
BugIDEA-137126Type inference: wrong completion variants are shown
BugIDEA-205783No navigation to setter in ++/-- expressions
BugIDEA-152478Good code red in Groovy: method is highlighted as unresolved when invoked on variable of raw type declared via def
BugIDEA-208781Error in parsing closure argument on a new line in an application statement
BugIDEA-203569Starting 'Groovy Console' always fails with "not available while IDEA is updating indices" error
BugIDEA-206710IDEA debugger shows warning about skipped breakpoint in ResetAgent. Looks like it's NPE
BugIDEA-203767Groovy CompileDynamic annotation is not recognised
BugIDEA-206659Broken resolve in OCHighlightingTest.groovy
BugIDEA-114247Spock data table test with double pipe (||) confused with boolean values
BugIDEA-208346Highlight illegal single argument lambda
BugIDEA-206932Good code red: collection to array assignment in @CompileStatic
BugIDEA-137307Groovy: Inspection of Java style setter invocation should not be applied to Spock mock invocations
BugIDEA-176655False Positive: String type not inferred in Stream.of..map closure (Groovy)
BugIDEA-205436NormalCompletionTest is red
BugIDEA-206945Invalid Ambiguous method call compilation error
BugIDEA-211117Groovy @Field fields do not resolve properly inside methods when groovy file is outside the project
BugIDEA-203683Convert to CompileStatic doesn't convert GString to String
BugIDEA-206717Convert to @CompileStatic adds second @CompileDynamic
BugIDEA-208383Groovy - provide @SuppressWarnings annotation for "Access to inaccessible element" inspection.
BugIDEA-205853`instanceof` type is not inferred
BugIDEA-205811Cannot assign empty list literal to set
BugIDEA-208834Wrong type of prefix increment/decrement
BugIDEA-194192Refactor Groovy type inference for "call" method invocations and constructors
BugIDEA-207049Wrong highlighting on method overloads and unknown type
BugIDEA-208831Wrong type of unary postfix increment
BugIDEA-206430Regression on Navigate to Class in Groovy
BugIDEA-210733Don't include JAR files from JDK configuration to classpath of Groovy run configuration
BugIDEA-207549Make closure call explicit produces invalid code
BugIDEA-209923Groovy - good code red - dynamic field access
BugIDEA-206716Static type is not inferred
BugIDEA-207933List type is not inferred on result type
BugIDEA-202956Groovydoc reports illegal character for space and coma
BugIDEA-185987Missing parameter when extracting method in Groovy
BugIDEA-201294ArrayIndexOutOfBoundsException when using groovy.transform.Immutable annotation in Groovy classes
BugIDEA-203850; not recognized as statement
BugIDEA-207974Bad code green: throws clause on annotation method
BugIDEA-202386Incomplete type for getClass()
BugIDEA-207921Cannot build groovy project using Groovy-Eclipse compiler
BugIDEA-87240"Pointless arithmetic expression" warning should be suppressed in Spock tests
BugIDEA-210375Groovy lambda support conflicts a lot with closures with the last param having default values
BugIDEA-201672False-positive warning: assigning null to non-primitive member is always fine
BugIDEA-193623Reassigned Parameter is leaking scope in Groovy
BugIDEA-205771Bad code green: type argument list is not allowed in import references
BugIDEA-206907Wrong groovy undefined variable highlighting
BugIDEA-128454Groovy's @TypeChecked with asImmutable() method called on collect()/collectEntries() result marks good code red.
BugIDEA-186753Groovy: Wrong type inference inside closure
BugIDEA-207367Unexpected formatting of code with a dot on a newline
BugIDEA-207309Ambiguous calls are highlighted as warnings in @CompileStatic
BugIDEA-206718Type inference: broken case
BugIDEA-207005False positive "Cannot resolve symbol" in "and:" separated part of "where:" block of Spock specification
BugIDEA-206662@CompileStatic: anonymous classes should not be excluded from compile-static scope
BugIDEA-206425void argument causes ambiguous method call highlighting
BugIDEA-210007Unresolved classes are highlighted with red in scripts
BugIDEA-139952Spock where block data table inspection issues
UsabilityIDEA-208325"Refactor | Convert to Java" should not be available for Gradle build files
UsabilityIDEA-179444Show parameter name hints corrupts the layout
ExceptionIDEA-209853Groovy Code Analysis Fatal Error
ExceptionIDEA-204054SOE in Groovy
ExceptionIDEA-209237Throwable: Non-physical PsiElement. Physical element is required to be able to anchor the problem in the source tree: PsiElement(identifier); file: DummyHolder
Groovy. GrailsFeatureIDEA-206469Grails `GrailsAutoConfiguration` should be recognised as a Spring Configuration
BugIDEA-206635Grails view doesn't always refresh
BugIDEA-166966New gsp file missing in menu for Grails project
BugIDEA-208739Grails: New Project wizard: not able to create new project
PerformanceIDEA-202875Performance issue with code editor on a Grails project
InfrastructureBugIDEA-211491Uast-based `RefJavaManager` doesn't property handle Kotlin's `KtPropertyAccessor`
BugIDEA-209632If a custom appStarter fails to load plugins the original exception is swallowed
TaskIDEA-200277Get rid of access to package-private members in platform modules from java support modules
TaskIDEA-206894Extract UrlClassLoader and its dependencies to a separate module
Infrastructure. Build ScriptsBugIDEA-203509Cannot debug tests in nested classes
BugIDEA-209655Executable flag for custom Linux/Mac executable files under 'lib' directory is not set in portable zip distribution
TaskIDEA-197426pom.xml generated for modules from IntelliJ IDEA project should honor exclusion of transitive dependencies
TaskIDEA-210033Deprecate optional modules in plugin layouts
TaskIDEA-209751Add ability to bundle plugin only into EAP builds
Configuration ProblemIDEA-199738Upgrade internal Ant to version 1.10.3 or newer (support JUnit5 Jupiter engine)
Infrastructure. Packaging and InstallationFeatureIDEA-194151Publish modules required to build IntelliJ IDEA from sources as Maven artifacts
FeatureIDEA-164251Include com.intellij.testFramework.vcs into some binary distribution
FeatureIDEA-194148Publish 'intellij.platform.testFramework' module as a Maven artifact
BugIDEA-212759Linux, tar.gz installation: IDEA fails to start: `Cannot find VM options file.`, `Error: Could not find or load main class com.intellij.idea.Main.`
BugIDEA-203550Windows Installer: 'Uninstall old versions' shows only several installations from only one disk with a weird gap
BugIDEA-2059072018.3.x silent installation leaves javaw.exe process hanging
BugIDEA-208430[jbr 11] Uninstall doesn't work after patching IDEA
BugIDEA-204606Disable Uninstall feedback options activated by default when uninstaller running from installer(when you install update with installer).
BugIDEA-202935Regression: cannot install IntelliJ IDEA in silent mode if intermediate directory is missing
BugIDEA-210993IDEA with JBR 11 starts with error via idea.bat
BugIDEA-206868Patch update doesn't work on macOS (2019.1 EAP)
BugIDEA-204957Projects opened with cli have names ending in ./. opening other projects causes hang and then indexes root file system and or sometimes the parent directory filesystem.
BugIDEA-141900Installer: Uninstall old version has weird word wrapping
BugIDEA-203213JPS from IntelliJ IDEA 183 branch fails to compile project because of missing class org.apache.maven.model.InputLocationTracker
BugIDEA-209778Silent install. Unable to install in the 'Program Files' folder
BugIDEA-158855Windows installer starts uninstaller even when clicking back
BugIDEA-206790[jre11.win.zip artifact]: There is 32bit launcher in archive
UsabilityIDEA-207608[jbr11 windows installers] It is better to remove checkboxes related to win32 system from Setup dialog
UsabilityIDEA-197129Kotlin compiler binaries miss executable permissions
UsabilityIDEA-202806There are too few rows in Uninstall Old Versions tab
CosmeticsIDEA-204535Header text in Rider Installer is heavily misaligned
CosmeticsIDEA-208125[Setup dialog]: Replace '...install JRE x86...' with '...instal JBR x86...'
TaskIDEA-211824Bundle Kotlin 1.3.31 with IntelliJ IDEA
TaskIDEA-206416Bundle Kotlin 1.3.21 with IntelliJ IDEA
TaskIDEA-202441Bundle Kotlin 1.3.20 with IntelliJ IDEA
TaskIDEA-203997Bundle Kotlin 1.3.11 with IntelliJ IDEA
TaskIDEA-210116We wan't to add custom uninstall step.
TaskIDEA-209378Bundle Kotlin 1.3.30 with IntelliJ IDEA
JavaFeatureIDEA-214531Show Expression Type should also show known boolean values, strings etc
FeatureIDEA-204569Highlight `break` for switch expressions
BugIDEA-205584Choose package dialog: should not apply changes on closing with Cancel
BugIDEA-204005Expected types should be aware of switch expressions
BugIDEA-203841Type hierarchy not complete when using test-jars
BugIDEA-205583Choose package dialog: a new package specified with several parent packages is shown on the top level and without parent packages
BugIDEA-204012"Surround with if" action and friends suggests to be applied for switch rule
BugIDEA-193315Deleting import statement after semicolon produces PSI/text inconsistency
BugIDEA-205947Join lines works incorrectly if next line string literal is followed by the method call
UsabilityIDEA-211627Provide separate gutter icon configuration options for external annotations and inferred annotations
UsabilityIDEA-208309Add 'main' template as an alias to 'psvm'
UsabilityIDEA-209397New Package: on creating inside the existing packages structure don't display the full package name as the new package name
ExceptionIDEA-205578IOOBE on editing the JavaDoc
Java. Code CompletionFeatureIDEA-206386Stream.toUnmodifiableList autocompletion
FeatureIDEA-204010'.switch' template should be available on switch expressions
FeatureIDEA-194568Show "will be casted to" class name in the method call completion list
FeatureIDEA-204244Configure magic constants for java.util.Spliterators.spliterator(..., int characteristics)
BugIDEA-203898Smart completion sometimes has "no suggestions/results" within throw statement
BugIDEA-211080Completion suggests already used methods in builder()
BugIDEA-202340Java 12 switch: completion inserts `default:` even if switch uses switch rule format
BugIDEA-195106Broken return type completion for method declarations
BugIDEA-209519IntelliJ should prefer class in same package over unused JDK classes in auto-complete
BugIDEA-209104Important methods missing from code completion suggestions.
BugIDEA-207858Completion: `default:` should be indented correctly
BugIDEA-203056Autocomplete doesn't show interface public methods on its private-package implementation
BugIDEA-203204Import-class popup suggests java.util.List as the last item
BugIDEA-208607Smart completion doesn't suggest Collectors.counting
BugIDEA-211405Auto completion freezes on every other letter
BugIDEA-202314Strike deprecated annotation options in completion dialog
BugIDEA-198368Raw generics are inserted in some cases
BugIDEA-202262Wrong cursor position, when IDEA autocompletes List.of(), Set.of() and other Java 9 factory methods for Collections
BugIDEA-203901Code completion can't consider consecutive digits as word separators
BugIDEA-204074Completion case constant add unnecessary '->'
BugIDEA-209230No `new` keyword completion inside negation
BugIDEA-210869Content assist does not always work for classes beginning with underscore(_)
BugIDEA-197130"After" text snippet of `.reqnonnull` Java postfix completion still shows `.reqnonnull` after inserted call.
BugIDEA-201609Inconsistent autosuggestion results
UsabilityIDEA-199341Do not use exact declaration information unless explicit Ctrl+Space is pressed
UsabilityIDEA-205205Import static class in java should complete with a period
UsabilityIDEA-201783Smart completion does not suggest sub-classes
UsabilityIDEA-209258When auto-completing a method in {@link}, don't insert all parameter types by default
ExceptionIDEA-204680ClassCastException during editing of SE
ExceptionIDEA-204037ClassCastException: com.intellij.psi.impl.source.tree.java.PsiLiteralExpressionImpl cannot be cast to com.intellij.psi.PsiReferenceExpression
Java. Code CoverageFeatureIDEA-196509Not possible to remove custom coverage suite from suite selection dialog
BugIDEA-161415Cannot "show tests covering line" if test class name contains _ or $
BugIDEA-90722File name too long IOException on CodeCoverage *.tr file
BugIDEA-206286Run/Debug configuration - JUnit - Code coverage - when include a class for exclusion and save the item is added to include dialog box
CosmeticsIDEA-200520What is the meaning of a checkbox with "include/exclude" title?
ExceptionIDEA-207251Coverage fails with exception on UrlClassLoader
Java. Code FormattingBugIDEA-205110Reformatting JavaDoc with generics Map adds extra spaces every time, may freeze IDE
BugIDEA-204482Java Code Formatting of enum uses blank Lines In declarations instead of blank lines before '}'
Java. Code GenerationBugIDEA-201670Generating setter for final field
BugIDEA-203737Introduced method has wrong context
UsabilityIDEA-210108Create new test window misses interface methods
UsabilityIDEA-209475When creating tests for methods that are in Object, it creates methods with postfix `1`
UsabilityIDEA-210629Extra empty line in generated 'equals'
Java. DebuggerFeatureIDEA-124595Feature to "Step Out" of the current block when debugging
FeatureIDEA-202293Support synchronized statement in evaluator
FeatureIDEA-210619Show value renderer icon right on evaluating popup
FeatureIDEA-173619Debug mode / Mouse gesture "Run to mouse pointer"
FeatureIDEA-189549Better display for Maps in debugger
BugIDEA-202291NPE in compiling evaluator
BugIDEA-209695SmartStepInto in readonly source: unable to choose the step target with Enter
BugIDEA-210838[Color Scheme] Debugger - Recursive calls highlighting is not applied
BugIDEA-204672Unable to attach to OpenJ jdk
BugIDEA-208648Evaluate window debugger doesn't seem to validate returned types
BugIDEA-203825Deadlock in debugger
BugIDEA-202129.attach_pid files in the working dir
BugIDEA-210122Unable to debug tests in forked mode with shmem transport
BugIDEA-198140'Smart step into' works unexpectedly on 'super' method call
BugIDEA-203144sa-jdwp: All object arrays contain only null values
BugIDEA-208435Smart step into method in anonymous class does not work
BugIDEA-205230"View as" popup item is inactive on the first click but becomes active on the next clicks
BugIDEA-206175Watch variables: blue screen lag
BugIDEA-207528Unable to do smart step into the second filter method
BugIDEA-207315Run to cursor highlighting appears in diff
BugIDEA-206160Instrumentation in java.lang.Thread does not work when running as Debug mode in Intellij Idea
BugIDEA-204693Argument boxing does not happen if type is not available
BugIDEA-203021IllegalStateException from objectMirror
BugIDEA-203543Launching rubocop as external tool fails
BugIDEA-204462Debugger does not propose to evaluate File.toString with disabled toString renderer
BugIDEA-195596"Add to watches" does nothing if invoked from Quick Evaluate popup
BugIDEA-203014Target Jdk version does not match message
BugIDEA-204691Unable to cast primitive value to Object
BugIDEA-208000"Target JRE version does not match project JDK version" message is shown for the same JDK/JRE = 1.8.0_121
BugIDEA-209139[Smart Step Into] unable to step into all methods which are repeating and located in one line
BugIDEA-211586'Step Out Of Code Block' doesn't step out of proxy method
BugIDEA-203322"Hold alt and click to evaluate expression not working" (this is a tip of the day)
BugIDEA-148867'Smart step into' doesn't work for stepping into dynamic proxy method invocations
BugIDEA-203275Cast in evaluator does not fail when is should
BugIDEA-205407Parameter is not resolved in breakpoint condition after adding @NotNull to parameter
BugIDEA-211062'Ctrl+C' from 'Evaluate' window copyes 'Collecting data..' instead of actual value
BugIDEA-207793Wrong smart step order with repeating methods
BugIDEA-209068Unable to quickly attach to a process started with suspend=y
BugIDEA-211761Smart step into fail if source code does not match the bytecode
BugIDEA-207569Can't use Debug: Error occurred during initialization of VM
BugIDEA-206755Hovering over line numbers in editor during debug make lines highlighted as if they're active in debugger
BugIDEA-208136Can't run Tomcat run configuration in 2019.1 EAP (build 5849.21): Could not find agent library ... Can't load AMD 64-bit .dll on a IA 32-bit platform
BugIDEA-208941"Show Method Return Values" feature malfunction
BugIDEA-198992OOM in CaptureStorage
BugIDEA-174922Smart step into doesn't work for Java 8 method references passed as parameters
BugIDEA-207694There should remain the possibility to invoke 'normal' stepInto action
PerformanceIDEA-209305Delay between breakpoint triggering and UI responding (highlighting corresponding place in editor)
PerformanceIDEA-204448Debug startup slowly with `debugger-agent.jar`
UsabilityIDEA-205901Debugger: Clicking into empty area below stack frames makes IntelliJ navigate to bottom-most item
UsabilityIDEA-204643Debugger buttons could be much more reactive
UsabilityIDEA-204807"Add to Watches" action shouldn't create duplicates
UsabilityIDEA-209391Unable to run application in debug mode
UsabilityIDEA-208790Add an option to disable run to cursor gesture
UsabilityIDEA-210164No visual feedback on toggling a breakpoints in diff-view
UsabilityIDEA-205987Preselect main thread on pause
UsabilityIDEA-211392Auto-show quick documentation prevents closing Breakpoints dialog
UsabilityIDEA-207231Don't change sort order when selecting a different goroutine in debugger
UsabilityIDEA-172140Suspend only current thread during evaluation of breakpoint's condition
CosmeticsIDEA-202684Map Entry's value displayed not good
Java. Debugger. Memory ViewBugIDEA-209121Running tests in debugger broken on non Linux/Mac/Windows
BugIDEA-210969Do not initialize memory agent proxy if remote debugging is used
BugIDEA-208333Memory Agent causes strange exceptions in program when running in debug mode
ExceptionIDEA-209163[Memory Agent] Exception on "Show Referring Objects" action, at com.intellij.debugger.memory.agent.MemoryAgentReferringObjectsProvider.getReferringObjects
Java. Debugger. StreamsBugIDEA-199022Stream Trace cannot access private class or method
Java. DecompilerFeatureIDEA-174243Decompiler Switch-Enum Sugaring Doesn't Support Obfuscated Code
BugIDEA-204272Decompiler loses generic info on varargs params
BugIDEA-208443Java decompiler not correctly decompiling string concatenation with recent Java
BugIDEA-204223Decompiler doesn't add mandatory narrowing cast on integer type
BugIDEA-204310Decompiler adds redundant imports for lambdas
BugIDEA-177029Cannot open Structure view (Ctrl+F12) for a large decompiled class
BugIDEA-197665Decompiler decompiles references to static fields inside class inforrectly
Java. Error HighlightingFeatureIDEA-169551IntelliJ could detect missing 'return' in lambda expression
BugIDEA-204596Remove RSL from 12_Preview
BugIDEA-209920No compile-time declaration for the method reference is found
BugIDEA-207296Good code red: exception never thrown in the corresponding try block
BugIDEA-129147JPA Intellisense incorrectly marking field as red
BugIDEA-210771Error message should be exposed for the new 'case' label in Java 12 in case of wrong constant usage
BugIDEA-203732Enum.valueOf method with generics is not highlighted as an error
BugIDEA-212406False positive for ambiguous call to unqualified static method on interface
BugIDEA-202897Error highlighted in a different place from javac
BugIDEA-192201Bad code is green: inner class object creation
BugIDEA-204208Bad code green: usage of 'continue' outside of switch expression
BugIDEA-206295Classes cannot be resolved on specific import statement constellation
BugIDEA-211203False positive in validation: There is no default constructor available
BugIDEA-203812bad code green: switch expression does not have any case clauses
BugIDEA-204006Create local from usage: update to switch expressions
BugIDEA-204125Java: False-Positive on Generics
BugIDEA-204204Bad code green: ambiguous reference either label or variable
BugIDEA-205883Incompatible types error is not reported when type has intersection bound
BugIDEA-208030False positive Variable might not have been initialized
BugIDEA-202621Switch expression: switch labeled block can't complete normally
BugIDEA-212188IDEA have not warning for using private constructor
BugIDEA-204188Good code red: switch expression as part of ternary operator with type conversions
BugIDEA-205657actual and formal generic arguments differ in length
BugIDEA-205390Javadoc method references aren't resolved when there are no parameter types
PerformanceIDEA-202848UAST is very slow on large string switch
PerformanceIDEA-210550Class inheritor search is slow for library classes used in many modules due to expensive scope checks
PerformanceIDEA-210047Very high memory usage
PerformanceIDEA-206649Auto-import on the fly freezes UI for 14 seconds
UsabilityIDEA-203776Confusing error message when switch expression is used as a body of void lambda
UsabilityIDEA-206347Import marked as unused in statement that does not compile
Java. GUI DesignerBugIDEA-208765Recompile action (Ctrl-Shift-F9) on form file shall recompile its bound class
Java. InspectionsFeatureIDEA-203449Switch statement without default branch: provide a quick-fix
FeatureIDEA-203387Add limited multiplication support to DFA
FeatureIDEA-187211Suggest using StandardCharsets.XYZ instead of "XYZ" where possible
FeatureIDEA-205213Inspect Code, Declaration access can be weaker: have optional "entry points" which should keep visibility as is (as for "Unused Code")
FeatureIDEA-193675Define default loggers in *public method without logging* inspection
FeatureIDEA-209351Support more AssertJ matchers in hardcoded contracts
FeatureIDEA-209951Inspection to detect when collection is accidentally passed as vararg and will be wrapped into one-element array
FeatureIDEA-206230Pointless bitwise inspection: report `i & ~i` and `i | ~i`
FeatureIDEA-203985"Fallthrough in 'switch' statement" inspection needs update for switch expressions
FeatureIDEA-207247Improve the inspection "Multiple occurrences of the same expression"
FeatureIDEA-208467Inspection to detect probably missing break-statement
FeatureIDEA-205727DFA: wire Map.keySet/values/entrySet().size() to Map.size()
FeatureIDEA-205151Misc improvements for Mismatched array read/write inspection
FeatureIDEA-207469Support parameter range at call site
FeatureIDEA-208005Extend the "iteration over 'keySet()' may be replaced with 'entrySet()' iteration" inspection to recognize put() calls
FeatureIDEA-208855Support bitwise xor in Java DFA
FeatureIDEA-96216Missing "Condition always false"
FeatureIDEA-195323Notify if array creation can be replaced with Enum#values()
FeatureIDEA-210209Suggest replacing Charset.forName("UTF-8") with StandardCharsets.UTF_8
FeatureIDEA-200879Intermediate Stream::collect could be reported when result of expression is Collection::size
FeatureIDEA-206567Warn about double bitwise complement (~) operation
FeatureIDEA-205949StringBuilder can be replaced with String inspection should recognize implicit toString() call
FeatureIDEA-209161Inspection to use Math::min / Math::max instead of handwritten code where possible
FeatureIDEA-205154Cast conflicts with instanceof: take into account assertion methods
FeatureIDEA-136622Inspection request: integer fraction multiplication i *= 3/2
FeatureIDEA-203579Update "Unnecessary 'return' statement" for enhanced switch statements
FeatureIDEA-203459"'default' not last case in 'switch' statement" inspection needs update for switch expressions
FeatureIDEA-200820Map.keySet(key).forEach(key -> map.get(key)) can be simplified
FeatureIDEA-205744Simplify Optional chains
FeatureIDEA-181751Loop statement that does not loop: allow to ignore for-each loops
FeatureIDEA-203974"Local variable used and declared in different 'switch' branches" inspection needs update for switch expressions
FeatureIDEA-208196Convert to enhanced switch: an option to omit warning if we cannot generate switch expression
FeatureIDEA-197185ReturnOfNull java inspection should have an option to ignore lambdas
FeatureIDEA-205057DFA: support remainder tracking
FeatureIDEA-204773Enable non-null parameter inference for non-stable source methods
FeatureIDEA-171758Support Guava collections in 'Suspicious collections method calls'
FeatureIDEA-202623Redundant switch labeled rule block
FeatureIDEA-205726DFA: Inline Collection/Map.clear() method
FeatureIDEA-205785Java inspection, which detects unused value of Optional.get() method
FeatureIDEA-203717"Nested 'switch' statement" inspection could use update for new switch
FeatureIDEA-205846Suggestion to use String.repeat where appropriate when using JDK 11
FeatureIDEA-176351Improve non-null inspection with static flow analysis (isPresent() and similar)
FeatureIDEA-204787Deprecated usage inspection should (optionally) skip occurrences in documentation.
FeatureIDEA-207874Inspection to replace Map.keySet().contains(K) with Map.containsKey(K)
FeatureIDEA-205560Integer multiplication cast to long: use dataflow to check for overflow possibility
FeatureIDEA-202753Map.entrySet can be simplified analysis could identify more cases.
FeatureIDEA-204701Redundant collection operation: suggest emptyIterator()
FeatureIDEA-194715Recognize assertTrue(Arrays.equals(a1, a2))
FeatureIDEA-204698Report meaningless operations on empty collections
FeatureIDEA-204461DFA: Make final getter stable if it gets a final field
FeatureIDEA-160792'Iteration over keySet() may be replaced with entrySet() iteration' should be smarter
FeatureIDEA-205676Inspection for simplifiable StringBuilder.append(CharSequence, int, int)
FeatureIDEA-203016On nullability violation show which ternary branch is nullable
FeatureIDEA-205555Warn about useless 'if' like "if (x == y) return x; else return y"
FeatureIDEA-204827When calculating `a - b`, take into account relations between `a` and `b`.
FeatureIDEA-188305Algebraic conversions in conditions DFA
FeatureIDEA-205011DFA: limited support for shift-left
FeatureIDEA-204734Track Optional content similarly to boxed numbers
FeatureIDEA-193906Java intention: Switch - Add default case with IllegalStateException
FeatureIDEA-207273Improve method return type inference from sources
FeatureIDEA-202825Track stream size in stream inliner
FeatureIDEA-185394Manual array population should be detected and replaced with Arrays.fill
FeatureIDEA-203878Auto(un)boxing inspection needs update for switch expressions
FeatureIDEA-206497Replace with stream: support intermediate map operations in counting loops
FeatureIDEA-206224Improve support of bitwise operation in DFA
FeatureIDEA-206024Add a quick-fix for "Integer multiplication or shift explicitly cast to long" inspection
FeatureIDEA-203316Turn on by default "Number of placeholders does not match number of arguments in logging call"
FeatureIDEA-208215Do not warn on cast to compatible interface when it has a matching instanceof check
FeatureIDEA-203462Update "Unnecessary 'default' for enum 'switch' statement" inspection for switch expressions
FeatureIDEA-203071Switch expressions: provide fix to generate missed branches for enum switches
FeatureIDEA-90060Class without logger Inspection enhancements
FeatureIDEA-206568Shift by inappropriate constant: use dataflow
FeatureIDEA-192251Infer purity of constructors from sources
FeatureIDEA-200455Suggest to replace (a, b) -> a + b lambdas with Integer::sum, Long::sum, Double::sum
FeatureIDEA-207267Suggest convert `int x = Integer.valueOf(str);` to `int x = Integer.parseInt(str);`
BugIDEA-210027Variable in dataflow remains local when used inside array initializer
BugIDEA-203085Switch expressions: support "Make method call chain to call sequence" intention
BugIDEA-198040False positive "'equals()' between objects of inconvertible types" for Class types
BugIDEA-209685"Deprecated API Usage" inspection suggests to replace method call but does nothing
BugIDEA-203928@DefaultQualifier from CheckerFramework not correctly supported
BugIDEA-203069Enum 'switch' statement that misses case should support enhanced switch statements
BugIDEA-203845com.intellij.util.IncorrectOperationException: Incorrect statement 'else
BugIDEA-207191Inspection "Method can be void" false positive in Kotlin/JAVA interop
BugIDEA-206052Don't report class as unsed when it has a used function because of an annotation
BugIDEA-207456Replace loop with stream: allow possible side-effects in joining prefix
BugIDEA-204250"replace with forEach" replaces "continue" to "return" in inner for
BugIDEA-204584Broken link in Java | Abstraction issues | 'public' method with 'boolean' parameter
BugIDEA-206397Iteration over keySet fix produce wrong code with wildcard ? extends
BugIDEA-204985Auto-replacing deprecated method with a suggested equivalent doesn't check type compatibility and breaks compilation
BugIDEA-204641Exception throwing analysis doesn't account for runtime exceptions in functions
BugIDEA-205523Unable to suppress "Redundant directive" inspection warning
BugIDEA-200488'Java | Class structure | Field can be local' inspection show warning even if annotation added to 'Additional Special Annotations'
BugIDEA-196932Inspection "Java | J2ME issues | Synthetic accessor call" can be improved
BugIDEA-211702Incorrect inspection "Can be replaced with single expression in functional style" when types differ
BugIDEA-172237SLF4J formatting inspection does not handle escaping backslash
BugIDEA-211140Package-level container annotation affects nullability of the elements in the same package but another artifact
BugIDEA-210123BoxedLong.equals(BoxedInteger) is incorrectly reported as 'always true' when their unboxed value is the same
BugIDEA-204671MagicConstant: hardcode constants for Toolkit.getMenuShortcutKeyMaskEx
BugIDEA-203946Update "Text label in 'switch' statement" inspection for switch expressions
BugIDEA-203979Java | Probable bugs | 'equals()' between objects of inconvertible types false negative with anonymous class
BugIDEA-210560"Excessive range check" inspection should not warn if expression contains a side effect
BugIDEA-204393Cannot unwrap break-with value if the value is a switch expression
BugIDEA-205851"Compute constant value" suggests to make not equivalent replacement
BugIDEA-210087Checker Framework's Nullable doesn't work with data flow analysis
BugIDEA-207019The "logging calls not guarded by log condition" should be updated for introduced in Java8 message suppliers
BugIDEA-208497Magic constant inspection shows warning for xor
BugIDEA-211120"Result of method call ignored" false positive in AssertJ tests
BugIDEA-177299Rework of inspection "'default' branch is unnecessary"
BugIDEA-211699"Return of null" inspection in lambda of Function<A, @Nullable B>
BugIDEA-205308'Replace with max()' produces uncompilable source
BugIDEA-203692Remove unused variable should be aware of Java 12 switch
BugIDEA-208270Action "Replace with old-style switch" is available on empty switch and does nothing
BugIDEA-203225Switch statement has too few branches: update for Java 12
BugIDEA-208211Unused declaration exclude option doesn't work
BugIDEA-204917"Loop can be collapsed with Stream API" creates uncompilable results in some cases
BugIDEA-209563"Qualify with outer class" available, but does nothing
BugIDEA-204014"I/O resource opened and not safely closed" should be updated to support switch expressions
BugIDEA-212718Type parameter 'T' extends 'final' class 'X' doesn't work for non-final enum
BugIDEA-202706InstanceVariableUninitializedUseInspection breaks on switch expression
BugIDEA-205008"Implicit numeric conversion" inspection doesn't report implicit conversions in compound assignment operators
BugIDEA-210298Result of method call ignored false-positive on Validate.nonNull check from commons-lang3
BugIDEA-203793Inspection for Unnecessary nullability check ignores String::equals called on literal
BugIDEA-212561'Find cause' cannot find problem in looking simple case
BugIDEA-203227Switch statement has too many branches: update for Java 12
BugIDEA-209944Inspection removing redundant casts causes compiler error
BugIDEA-203798Inspection "Default method not implemented" has too big range when implemented anonymously
BugIDEA-205112Declaration access can be weaker false positive with inner class constructor
BugIDEA-186140False positive "Pointless bitwise expression" inspection
BugIDEA-211701"Introduce holder class" loses comment
BugIDEA-203705"Equals called on enum value" doesn't suggest a quick-fix inside switch expression
BugIDEA-203531Use of obsolete date time API doesn't warn on new expressions
BugIDEA-211843Stringbuilder append false positive with start/end
BugIDEA-204430Red code after conversion to 'enhanced switch statement' when when 'default' has only 'return'
BugIDEA-207441False-positive "variable is always null" on linked-list like data structure
BugIDEA-172232Field dereference inside try block makes qualifier notnull outside
BugIDEA-206459Assignment to for loop parameter: ignore if parameter is not updated in loop update statement
BugIDEA-204944"'clone()' defined in non-Cloneable class 'null'" on anonymous class
BugIDEA-194091ParameterizedParametersStaticCollection reports valid data methods
BugIDEA-205309'Replace with findFirst()' produces uncompilable source
BugIDEA-208296Java 12: Replace with old-style switch produces erroneous code for exhaustive enum
BugIDEA-207197Don't warn about "return of null" in Map.compute(), computeIfPresent(), computeIfAbsent() lambdas
BugIDEA-206221"object allocation in loop" for a lambda which seems not to allocate anything
BugIDEA-203719"Result of object allocation ignored" inspection false positive in new switch
BugIDEA-203625Inspection 'assertEquals() between objects of inconvertible types' doesn't show warning when comparing collection of inconvertable type
BugIDEA-209686Type migration error message needs to escape <>
BugIDEA-204431'Unnecessary return statement' false positive in enhanced switch statement
BugIDEA-204804Unused import: don't warn if reference in import itself is unresolved
BugIDEA-206640Replace var with explicit type not working with for loop
BugIDEA-203424@noinspection doesn't work for some inspections
BugIDEA-204135Replacing if with switch suggested but not possible
BugIDEA-212632IDEA thinks that fields cannot be updated in AutoCloseable close() method
BugIDEA-207637"Flip equals" does nothing on unqualified equals
BugIDEA-202754"NullableProblems"-inspection gives incorrect warning on a getter that returns other field
BugIDEA-207178Incorrect simplification of optional suggested by inspection
BugIDEA-203289Javadoc <code>/{@code ...} inspection: might yield invalid/corrupted syntax
BugIDEA-205952Invalid Java Refactoring Suggestion - stream-foreach() call throwing exception
BugIDEA-207312Inspection / Java / Declaration redundancy: gets confused by Lombok's @Getter annotation
BugIDEA-204071Auto-unboxing fix produces red code
BugIDEA-206272"Fallthrough in 'switch' statement" false positive
BugIDEA-212412"Declaration can have final modifier" inspection reports values which may be uninitialized with final modifier.
BugIDEA-209231"Replace with 'try' with resources" does nothing
BugIDEA-203708"Unnecessary boxing" false-negative with Java 12 switch expressions
BugIDEA-204193"'break' statement" inspection should not highlight usage of 'value break'
BugIDEA-204986False Positive: "Class with only private constructor should be declared final" does not detect subclass on same level
BugIDEA-203698Value of ++ or -- is used: false-negative on switch expression
BugIDEA-203421"Unused declaration" inspection false positive on fields of inner classes
BugIDEA-204013"Redundant local variable" should be switch break-aware
BugIDEA-210534Replace explicit type with var not working for instantiated interfaces
BugIDEA-146649"Redundant type cast" warning expected
BugIDEA-209576'Class.getConstructor().newInstance()' call' generates inaccessible catch clauses
BugIDEA-199670Javadoc is inaccessible from here for a reference in the same directory
BugIDEA-202709False negative "Conditional expression with identical branches" inspection on switch expression
BugIDEA-205482"Use removal by object" fix may change semantics for List<Integer>
BugIDEA-204138Exception in "statement with empty body" inspection with switch expression
BugIDEA-204977"Method returns the same value" false-positive for void method with anonymous class inside
BugIDEA-208913Recognize @AutoValue as immutable classes, and let Nullability analysis rely on that
BugIDEA-205854"Compute constant value" can be shown and not shown in similar cases
BugIDEA-203510Entry points are not shown in inspection results toolwindow
BugIDEA-209226"Unqualified static access" incorrectly reports inside enum case
BugIDEA-205881Remove redundant cast leads to incompilable code
BugIDEA-210253'Suspicious package-private access' inspection incorrectly reports access to protected members from anonymous classes
BugIDEA-203447Switch statement without default branch: support Java 12
BugIDEA-204081`@VisibleForTesting` still treated as `@TestOnly` even if used to relax visibility of production method to call it from tests
BugIDEA-203343Replace with lambda suggestion can produce bad code
BugIDEA-205122Unwrap switch fails with exception
BugIDEA-174522No deannotate intention action for library classes annotated as deprecated via external annotations
BugIDEA-136742unused library inspection: false positive for libraries containing super classes/interfaces.
BugIDEA-205090Checking Optionals with Optional#isEmpty() still triggers {'Optional.get()' without 'isPresent()'} hint
BugIDEA-209486Transform body to single exit point generates red code
BugIDEA-203701Result of assignment is used: false-negative in Java 12
BugIDEA-203086Switch expressions: support "Replace conditional with if" intention
BugIDEA-204808CloneReturnsClassTypeInspection fails in anonymous class
BugIDEA-203454SwitchStatementDensityInspection: update for Java 12
BugIDEA-212215False positive casting is redundant creates compilation issue
BugIDEA-203703"Throwable not thrown" false-positive with Java 12 switch
BugIDEA-204187Code becomes red after applying conversion to old style switch
BugIDEA-207976Inspection turns a loop into an incorrect collect operation
BugIDEA-208770Inspection `OptionalGetWithoutIsPresent` doesn't recognize check in stream
BugIDEA-208859Good code yellow: FileReader and FileWriter constructors with Charset argument
BugIDEA-203697Class.getClass() false-negative on Java 12 switch expression
BugIDEA-189840False positive: 'Number of placeholders does not match number of arguments in logging call' if error(String, Trowable) is invoked
BugIDEA-203693"Move assignment to field declaration" produces erroneous code when assignment is inside Java 12 switch
BugIDEA-203450Ambiguous method call bug
BugIDEA-210306Suppress "Unused declaration" for arguments named "ignore.."
BugIDEA-202645Good code is yellow: @NonNls-annotated property in annotation triggers the "hard coded string literal" warning if the string literal is concatenated
BugIDEA-131480"Deprecated API usage" inspection warns in cases javac doesn't
BugIDEA-204207'Replace with 'old-style' switch statement' removes switch block body, when value break used.
BugIDEA-203709'equals()' called on BigDecimal false-negative on switch expression
BugIDEA-205376Warning about non-atomic operation on volatile field doesn't work for anonymous instance but works for lambda
BugIDEA-204867Scope of variable is too broad inspection doesn't keep var keyword.
BugIDEA-205137`Replace Switch with If` produce exceptions
BugIDEA-205529Conversion from the new to the old 'switch' doesn't split the list of the case constants
BugIDEA-203984"Remove unreachable branches" quickfix breaks code on switch expression
BugIDEA-203119Unwrap switch statement: support rule-cases and multiple expression cases
BugIDEA-196997'Number of placeholders ... in logging call' does not support Log4j 2's ParameterizedMessage
BugIDEA-205073Remove redundant suppress warning doesn't work for javadoc tags with unrelated descriptions
BugIDEA-209362Excessive range check inspection fix sometimes deletes third operand of polyadic
BugIDEA-210216'Suspicious package-private access' inspection incorrectly reports access to protected members from anonymous Kotlin classes
BugIDEA-204165[BUG][Inspection][IC-183.4588.61] false report of 'Optional.get()' without 'isPresent()' check
BugIDEA-207552Wrong inspection "Actual method parameter is the same constant"
BugIDEA-206763Iteration over keySet quickfix does not take into consideration that the variable name "entry" is already used by a lambda value
BugIDEA-212417Remove redundant casts intention does not handle single varargs parameters correctly
BugIDEA-204762"Integer division in floating point context" inspection false negative
BugIDEA-211709where is fix all intention for override?
BugIDEA-205525Do not warn "The declared exception X is never thrown" on native methods
BugIDEA-211147False positive for RedundantOperationOnEmptyContainer in case of static initializers for enum-like class
BugIDEA-206767Inspection "Externalizable class without 'public' no-arg constructor" doesn't work if Externalizable class is public
BugIDEA-206615Suppression for inspection 'Static field used before initialization' shows as redundant
BugIDEA-204868Loop can be replaced with Arrays.setAll ignores starting index
PerformanceIDEA-203363DuplicateBranchesInSwitchInspection is slow on a file with many switch cases
UsabilityIDEA-208192Replace with Java 12-style switch: support assignment
UsabilityIDEA-209618NotNull annotated method might result in null inspection disappears with pure Contract annotation set.
UsabilityIDEA-145390Public methods in anonymous inner classes shall be treated as private methods
UsabilityIDEA-196735Logging inspections could know about log4j 2 logger class out of the box
UsabilityIDEA-202808Method invoked with reflection is marked as unreachable if its caller method is added to custom entry point
UsabilityIDEA-205223Iteration over keySet() may be replaced with entrySet(): keep key variable when it's reused
UsabilityIDEA-210563"Java" > "Performance" > "StringBuilder can be replaced with String" inspection bug
UsabilityIDEA-207586'Replace with <>' inspection false positive when the generic type is annotated
CosmeticsIDEA-199315To reformulate the error about the inability to override the method from java.lang.Object
CosmeticsIDEA-205019Conversion StringBuilder -> String can be slightly improved
CosmeticsIDEA-206417Typo: Gaurd
ExceptionIDEA-207640Replace StringBuilder with String throws exception when there are comments inside
ExceptionIDEA-204106Auto-unboxing with switch expressions produces exceptions
ExceptionIDEA-205962AIOOBE in duplicate branches in switch inspection
ExceptionIDEA-204717Can't convert enhanced 'switch' to 'if' if a branch's body contains an end-of-line comment
ExceptionIDEA-206891NPE in data flow inspection
Java. Intention ActionsFeatureIDEA-199264Introduce useful standard interface type for lambda expression
FeatureIDEA-206609IDEA should know to open brackets in java code
FeatureIDEA-196755Intention to replace singleton collection with a normal one
FeatureIDEA-208199Merge convert to decimal/octal/hex/binary to submenu
FeatureIDEA-190886Create missing 'switch' branches should provide default branch
FeatureIDEA-201192Make encapsulate field available on the field declaration as an action
FeatureIDEA-203895Intention to split switch branch with multiple values into separate branches
FeatureIDEA-207204Action to annotate method/parameter as NonNls
FeatureIDEA-209056Action to transform method with multiple returns into the method with single exit point
FeatureIDEA-202622Java 12: Switch Expressions: Convert switch labeled rule expression to a block
FeatureIDEA-207785Flip method call on call without qualifier
FeatureIDEA-203533Various improvements in "Make call chain into call sequence"
FeatureIDEA-207519Ability to edit external range annotation
FeatureIDEA-205362Intention to convert (collection.isEmpty() || collection.size() > 1) to collection.size() != 1
BugIDEA-173780Insert declaration should resolve name conflicts
BugIDEA-175740"Expand lambda body" on invalid code produces stub/AST inconsistency
BugIDEA-203897"Import class" popup behaves weirdly in case of package local class
BugIDEA-208108String postfix increment intention
BugIDEA-209597Flip comparison intention produces PSI/text mismatch
BugIDEA-205607"Replace with old style 'switch' statement" intention produces unreachable code
BugIDEA-205835"invert if" inserts zillion of comments
BugIDEA-211687"Flip method call" with casts leads to PSI/text inconsistency
BugIDEA-206725"Insert default branch" produces uncompilable code
BugIDEA-205710`Change parameter type` / `Create method` quick-fixes malfunction and incorrect handling of the `void` type
BugIDEA-209600"Replace assert with if statement" changes semantics in then-branch of if-statement
BugIDEA-211698'Replace 'for each' loop with indexed 'for' loop' breaks code when not immediately inside a code block
BugIDEA-208457Add exceptions to existing catch suggests wrong option
BugIDEA-212402Inspection Use Objects.requireNonNull detected, but the fix not work for ParametersAreNonnullByDefault
BugIDEA-203741I cannot prevent IntelliJ from adding annotatations
BugIDEA-206882Invert if produces non-equivalent code for nested if statament
BugIDEA-212551Make method call chain into call sequence intention modifies references to variables named 'x'
BugIDEA-209568"Push conditional expression inside branch" generates bad-code-green
BugIDEA-209931Change method return type autosuggestion doesn't work when method return type is subtype of base return type of interface.
BugIDEA-177220Deletion of an annotation without a class member results in stub-AST mismatch
BugIDEA-208885"Wrap with unmodifiable map" produces uncompilable code on assignment LHS
UsabilityIDEA-211430'Replace switch with if' action generates redundant fully qualified variable type
UsabilityIDEA-209300Split into 2 if's doesn't work when I'm staying on the last symbol of &&
CosmeticsIDEA-202990Intellij suggests adding new parameter as '21th' parameter to method
ExceptionIDEA-211695"Convert to Basic Latin" fails on incomplete javadoc
Java. JavaFXBugIDEA-150665*.fxml "unsaved" asterisk stays visible after saving
Java. Properties FilesBugIDEA-207834Properties are not detected when defined as string constant as annotation parameter(s)
Java. RefactoringsFeatureIDEA-202383Convert old-style switch statements into the enhanced switch
FeatureIDEA-202384Convert new-style switch expressions and enhanced switch statements into the old-style switch statements
FeatureIDEA-180007Inline method with returns should work when inlining point is the only expression in a loop or lambda body
FeatureIDEA-178890"Inline" Foo.class.getName(), Foo.class.isInstance(bar)
FeatureIDEA-158665Support Inline Method refactoring when return statement interrupts the execution flow
FeatureIDEA-199273Create local variable should not suggest Object type when it is a ternary with null in one of the branches
FeatureIDEA-161607Allow to introduce variable in the head of try-with-resources block
FeatureIDEA-179176LVTI: Introduce local variable: suggest to use var
FeatureIDEA-37432"Inline Method refactoring is not supported when return statement interrupts the execution flow" is wrong
FeatureIDEA-211005Automatically fix "Not a statement" problem in inline method
FeatureIDEA-202629Java 12 Switch expression: Highlight duplicate values and branches
FeatureIDEA-211549Inline method: support negation at the call site
FeatureIDEA-211473Inline method: process some boolean methods with multiple exits specially
BugIDEA-205330Can't "Move" class files, only via drag and drop
BugIDEA-203891Extract Method preview: wrong diff, wrong line endings, wrong encoding
BugIDEA-202731Exception refactor removes try-with-resources block
BugIDEA-203444Pull members up suggests to reuse pulled method making it static which breaks the code
BugIDEA-210056Refactoring "Rename field" should not change it's fully-qualified name to thort name inside property-files
BugIDEA-202544'extract method' fails silently, exception is logged to idea.log
BugIDEA-203752Multiple files copy-paste between projects fails with 'paste is not available while idea is updating indices' warning
BugIDEA-207987Create local variable suggested but fails with exception
BugIDEA-205931Move Class member refactoring has issues with target class field
BugIDEA-179064Two different modal windows for the same calls for Refactor → Extract Parameter
BugIDEA-212110Extract as separate 'map' step doesn't work when "use 'var'" option is on
BugIDEA-181367Refactoring rename a base class cause also rename another derived class.
BugIDEA-39241Inline method produces multiple volatile field accesses
BugIDEA-209743Extracted variable from case label expression should be 'final'
BugIDEA-200562"Move class" dialog: autocompletion for class name in "Make inner class of" field doesn't contain classes from default package
BugIDEA-181195Duplicate code isn't detected when extracting a method
BugIDEA-214508Nullable field extracted in a non-Nullable variable
BugIDEA-203452Extract variable refactoring suggests illegal name
BugIDEA-153052Vararg argument is lost when changing signature
BugIDEA-205981parameter reordering removes annotation from the method's return type
BugIDEA-209745Extracting variable from enhanced switch expression creates red code
BugIDEA-208734'Convert anonymous to Inner' produces uncompilable source when generic of outer class is used
BugIDEA-194264Extract method with duplicates produces red code
BugIDEA-204546Inlining action should warn during inline variables if their value is not effectively final
BugIDEA-62340Bug in change signature quick fix
BugIDEA-211139Can't extract variables from enum class
BugIDEA-204134When merging identical branches of 'switch' statement keep the default branch the last
BugIDEA-206523Introduce variable doesn't work for switch statement
BugIDEA-209792Support auto-unboxing in reordering safety determination when extracting the variable
BugIDEA-211141"Extract method" from default method results in uncompilable code
BugIDEA-204121Introduce variable/method selects unexpected type on switch expression
PerformanceIDEA-207167Extract Method freezes UI while enumerating all inheritors to check for conflicts
UsabilityIDEA-176975Change Signature doesn't change variables
UsabilityIDEA-154832IDEA add unnecessary cast to double on method inline
UsabilityIDEA-206499ui bloopers
UsabilityIDEA-212160"Inline Variable" should not show confirmation dialog when there's a single occurrence
UsabilityIDEA-126385Usability request. Enable 'Go to source' action for items in 'Cannot undo' dialog
ExceptionIDEA-199784Extract method fails when inner class is used in lambda being extracted
Java. Tests. CucumberFeatureIDEA-201317Update Cucumber Formatter Plugin to Support ConcurrentEvents in Cucumber 4.x
BugIDEA-205590Executing Cucumber step for which WebElement in POP hasn't been found results in doubling step listing in "Run:" window
BugIDEA-142407Generating Cucumber step definiton using JVM Cucumber plugin does not properly escape parentheses in generated regex
BugIDEA-203395Cucumber incorrect popup for test results
BugIDEA-171766Cucumber-java plugin does not support java8 step definitions with dynamic regexp
BugIDEA-142408Show difference link is not always shown
BugIDEA-202964Cucumber step definitions are being marked as valid regardless of the casing
BugIDEA-205598191 IDEA could not find Cucumber step definitions
BugIDEA-203743Test result tree is not showing fail when cucumber step contains a single quote
BugIDEA-205969Broken Layout in Dialog "Create new step definition file" on UHD 4k screen
BugIDEA-171313Cucumber: Regex not abiding by anchors ^ or $
BugIDEA-208899Scenario.write output is missing
BugIDEA-203555Cucumber sentences does not evaluate {n} regular expressions
BugIDEA-189140Syntax highlighting of step variables in Cucumber features does not work together with doc string
PerformanceIDEA-187983Long code analysis - Cucumber with java8
UsabilityIDEA-206258Cucumber Autocomplete doesn't give me the ability to autocomplete capture groups that use the or operator
TaskIDEA-202545Java8 step definition in languages other than English
Java. Tests. JUnitFeatureIDEA-202111JUnit5 suggest, make reference and validate @EnumSource values from enum constants
FeatureIDEA-205843Click to see difference for JUnit doesn't support anonymous FeatureMatchers (too sensitive to whitespace)
FeatureIDEA-172385Ship 'junit-jupiter-params.jar' with IDEA
BugIDEA-202575JUnit5: FileSource test/container opens file in "bin" folder (if available) on "Jump to Source" or "Show Source"
BugIDEA-204168Test class selection by name is broken
BugIDEA-199945Idea 2018 and Junit 5 duplicates test executions when running tests from the IDE
BugIDEA-203036JUnit tests launched in fork mode doesn't list all the tests, teamcity messages leaked in the console.
BugIDEA-202594Counter of total tests shows less then it should when test fails
BugIDEA-206892Incorrect JUnit tree generated for repeated parameterized tests
BugIDEA-203609IDE won't run JUnit tests classes with same name
BugIDEA-203414Test configuration with invalid class shows as passing
BugIDEA-202869Run Configuration with Test Kind 'TAGS' has unsolvable Error
BugIDEA-178882Fork doesn't work properly when run tests from package with mix of Junit4 and Junit5 tests
BugIDEA-210882Running only tests selected in JUnit console is broken
BugIDEA-205937Can't run whole project JUnit tests in Gradle project with multiple modules because of NumberFormatException
BugIDEA-205512IntelliJ is only running the first package when you select multiple packages to run test
BugIDEA-123039StackOverflowError when exporting large junit results
PerformanceIDEA-203173JUnit 5 Platform Integration calls TestEngine.discover twice
UsabilityIDEA-208396Go to test don't detect all tests
UsabilityIDEA-211928Test kinds "UniqueId" and "Tags" missing in Run Configuration when including a test framework which implements JUnit 5 TestEngine without Jupiter
UsabilityIDEA-206042Display name of failed test in JUnit diff window
UsabilityIDEA-205284JUnit5: using @ParameterizedTest and @Test in the same class shows erroneous hint for public access class/methods
CosmeticsIDEA-204016Add some default stacktrace folds for Jigsaw modules
Java. Tests. TestNGBugIDEA-208083Testng testName reported wrong in the Run Window
BugIDEA-206449TestNG: test name is not displayed if it is identical to the suite name
Java. i18nBugIDEA-179376Almost all items from refactoring menu is unavailable for Resource Bundle in Project Tree
BugIDEA-179972Subgroups properties names changes when you select group node
BugIDEA-205800Properties keys are not collected into PropertyKeyIndex from Properties language injections
BugIDEA-179977The properties keys names should be in full format in Resource Bundle Editor when "Group by Prefixes" button is not pressed
ExceptionIDEA-180097NPE on deleting Resource Bundle
JavaX. AppServersBugIDEA-203047Rerun for JavaEE server run configuration does not lead to `Update` action
JavaX. AppServers. GlassFishBugIDEA-207655IDEA deploys External Source war files into Glassfish with the name option including the .war extension
BugIDEA-203330Unable to launch Glassfish 2 - IntelliJ messes up the domain.xml file
JavaX. AppServers. JBossFeatureIDEA-196515WildFly: Allow to configure connection timeout to management API
BugIDEA-212457Error running admin process: NoSuchMethodError on deploy to JBoss AS 7.x from 2019.1.2
BugIDEA-204571NPE thrown when selecting JBoss Server configuration or trying to create local configuration
BugIDEA-204303Open browser run configuration doesn't launch the browser and causes IntelliJ to constantly poll application (JBoss Server)
BugIDEA-209839Unable to run Wilfly 8 inside Intellij 2019.1
BugIDEA-208360Wildfly 16.0.0.Final Support Missing
BugIDEA-205586HTTP Management port configuration not found
JavaX. AppServers. JettyBugIDEA-202832Regression: Local Jetty run configuration JVM parameters are placed at wrong location in the final command line executed by IntelliJ
BugIDEA-204046Jetty 8.x.x regression -> configuration
JavaX. AppServers. ResinBugIDEA-205900Can not run resin server
JavaX. AppServers. TomcatFeatureIDEA-205443Tomcat: Option to select application context when deploying artifacts
BugIDEA-206243Tomcat startup script fails to run for copied run configurations
BugIDEA-205955Could not start Tomcat under latest EAP; spaces in username a problem?
JavaX. AppServers. WebSphereBugIDEA-207683Liberty (WLP) Deployment - Problems with server.xml generation when deploying
JavaX. EJB3BugIDEA-151644false error detection on ManagedExecutorService injection
JavaX. JPAFeatureIDEA-198647JPA Entity gutters are not available for Kotlin
BugIDEA-185331XML with default value and self closed tag causes warning
BugIDEA-205905JPA: ER diagram. In tooltips Entity names are displayed as "null"
BugIDEA-205585Persistence view: all entity elements are displayed as "unnamed"
BugIDEA-201107Java11. JPA/Hibernate console doesn't work
BugIDEA-180142JPA: JavaEE 8: add Download for JPA 2.2
BugIDEA-190769JPA. java.lang.IllegalArgumentException at calling quick-fix for the absent "other side attribute" at many-to-many relationships
BugIDEA-206212Java, KT: JPA. JoinColumn, "name" parameter: Completion, resolve of the column name doesn't work
BugIDEA-202607SpringData QueryLanguage Injector doesn't properly handle kotlin const vals in annotations
BugIDEA-203135Do not report error on classes/META-INF/persistence.xml, classes/META-INF/orm.xml
BugIDEA-131228JPA: Update hbm2ddl.auto in JPA persistence template Hibernate
JavaX. JSFBugIDEA-188937JSF 2.3 won't load <f:websocket>
BugIDEA-124803Code highlighting for ui:repeat varStatus not working. Parameter not recognized.
BugIDEA-204871JSF not automatically enabled and Cannot Manually add
UsabilityIDEA-201728Libraries under java enterprise for JSF default to 1.2 when we are at 2.1
JavaX. JSPBugIDEA-212393JSP code highlighting constantly breaking (showing good code as bad)
BugIDEA-203679JSP tags removed inside "application/ld+json" scripts when formatting JSP file
BugIDEA-211504JSP Validation: when compilation level 11 is set, jasper validation shows errors as if jdk 1.6 is used
BugIDEA-209555Jasper validation bug in 2019.1 RC
TaskIDEA-206443Rewrite JSP validation to run inside external build process and download required JARs instead of bundling them
JavaX. JavaEEBugIDEA-207971CDI: Unsatisfied dependency Injecting Conversation
BugIDEA-204655Unable to Add Framework Support for JSON Binding
BugIDEA-207516CDI: @Alternative stereotype not detected
ExceptionIDEA-206715java.lang.Throwable: Template not found on creating batch application
JavaX. Web ServicesBugIDEA-164683JAX-RS: IDEA shows "cannot resolve param" for valid @PathParam annotations
BugIDEA-176843@OnMessage inspection false positive on String/boolean pair
BugIDEA-154093JAX-RS: @PathParam is not resolved to the parameter in @Path when @Path has a static final String
Plugin Development (DevKit)FeatureIDEA-208632DevKit: Component/Action not registered - skip for deprecated classes
FeatureIDEA-211630IDEA UI Guidelines: "Action" text capitalization
FeatureIDEA-202010Highlight services/components with identical interface and implementation classes as redundant in plugin.xml
FeatureIDEA-206060DevKit: deprecate Project Wizard
FeatureIDEA-211486Devkit EP declaration: suggest to change declaration via 'qualifiedName' to 'name' in main plugin.xml
FeatureIDEA-201007Devkit: show warning if a plugin code uses API which wasn't available in old versions of the platform
FeatureIDEA-212463Devkit: resolve "keymap" in plugin.xml
FeatureIDEA-212745Devkit: <depends> checking
FeatureIDEA-207289plugin.xml: highlight duplicate <depends>
FeatureIDEA-199936Code insight for Registry keys defined via EP com.intellij.registryKey
BugIDEA-190992DevKit: provide "os" attribute for all EPs
BugIDEA-211126Bundled plugins: highlight vendor "email" and "url"
BugIDEA-209681Devkit: do not require description for Intention not registered in plugin.xml
BugIDEA-206150Something wrong in ExtensionOrderConverter#isBeforeOrAfterKeyword(java.lang.String, boolean)
BugIDEA-140250Rename class refactoring handles usages in xml incorrectly if inner class is renamed
BugIDEA-211131Bundled plugins: highlight generic <idea-plugin> "url" values
BugIDEA-202417Quick-fix to register PsiReferenceProvider via psi.referenceProvider generates red code
BugIDEA-202885DevKit: constant assertion when using xi:include with <depends> in plugin descriptors
BugIDEA-211136Bundled plugins: highlight <change-notes> and <version>
BugIDEA-187409AutoCompletion popup disappears if variant contain dash symbol "-"
BugIDEA-208354Devkit: subtags of 'intentionAction' tag in plugin.xml are highlighted as errors
BugIDEA-208819Devkit: false positive from UsePrimitiveTypesInspection
BugIDEA-209587Missing recent API inspection: clarify the message if return type of a method was changed
BugIDEA-209589Missing recent API inspection must not emit warnings in tests sources
BugIDEA-186526Plugin.xml validity inspection troubles in InspectionGadgets.xml
BugIDEA-208625Devkit: extension point property "className" should have PsiClass code insight
BugIDEA-182359Good code red: plugin.xml
BugIDEA-209536plugin.xml validity inspection doesn't highlight plugin actions which refer to platform action class
BugIDEA-211225Bundled plugins: highlight <idea-version>
BugIDEA-208482Devkit: some references to action classes are incorrectly highlighted with "has no default constructor" error
BugIDEA-210414False positive inspection, my plugin.xml not contains template text.
BugIDEA-210304Unnecessary "Element should be registered" error is shown for common filetype extension classes registered for a specific filetype
BugIDEA-205189theme.json: no spellchecking for color hex values
BugIDEA-197440Navigation to testdata hangs uninterruptible
BugIDEA-202635Devkit: fix all gutter icon sizes, make configurable
BugIDEA-209078Devkit plugin.xml: allow multiple components with same interface-class across types
BugIDEA-204436Plugin Icon search path is wrong for ZIP plugin distributions
PerformanceIDEA-211555Freeze on completion in XML file
UsabilityIDEA-204886Navigate to test data action shows multiple blinking modal progresses
UsabilityIDEA-204988Plugin DevKit: Group inspections in settings
UsabilityIDEA-210145Unnecessary "Element should be registered" error is shown for common language extension classes registered for a specific language
UsabilityIDEA-206928plugin.xml: plugin name in Tab title shouldn't only work for plugin projects
TaskIDEA-208472Devkit: allow user to specify modules which are included into single plugin for component registration check
ExceptionIDEA-201432Got 'Control-flow exceptions (like ProcessCanceledException) should never be logged' when opening project
Plugin. FreeMarkerBugIDEA-203729Freemarker: incorrect representation of wildcard type in the variable tooltip
BugIDEA-205704Freemarker editor doesn't resolve variables anymore when using <#stop "" /> statement in some cases
BugIDEA-202655FreeMarker plugin: built-in 'first' is not applicable to 'Sequence'
BugIDEA-210630Inspections are not executed on FreeMarker/Velocity files even with "data language" selected
BugIDEA-201000FreeMarker FTL // Support Code block folding
BugIDEA-203096Problem with formatting FreeMarker macros
ExceptionIDEA-204842nonempty text is not covered by block in #<FreeMarker>
Plugin. OSGiFeatureIDEA-200767Eclipse Concierge: cannot find the Concierge framework bundle
FeatureIDEA-209670Osmorc: Upgrade Bndlib to 4.2 or later
BugIDEA-210589Osmorc Run Configuration does not deploy non-auto-start bundles and fragments
ExceptionIDEA-210719Throwable at org.osmorc.run.OsgiRunConfiguration.getModules
Plugin. Settings RepositoryFeatureIDEA-174290Settings Repository plugin leaks sensitive information in the commit message
BugIDEA-182954Font size setting synchronization (via account) fail
BugIDEA-206186When starting up new 2019.1 IDEA it resets settings if JetBrains Account is used.
BugIDEA-200123Keymaps are not synced over Cloud Settings
BugIDEA-181296Incompatible plugin with new IDEA version shown as `installed in another IDE`
BugIDEA-204195settings sync says "Switch Structure" plugin is missing but it isn't
BugIDEA-205426Unable to push settings to shared repository - Unknown macro $PROJECT_FILE$ in storage file spec
Plugin. Task ManagementBugIDEA-173186Commit message lost after cancelling commit dialog with Add commit message from Task server enabled
BugIDEA-205214Task Server password/token is lost after closing IDE
BugIDEA-202675"Open Task" dialog with empty "Create changelist" field
BugIDEA-205965Pivotal Tracker implementation uses the deprecated and shutdowned API
BugIDEA-203337Duplicate shortcuts in "Open Task" window
BugIDEA-205194When I open a task with "create branch" option checked IDE tires to create a branch twice in a row
BugIDEA-203220After phpStorm upgrade when opening task it doesn't strip "[" when generates branch name causing not valid branch name error
UsabilityIDEA-203090Context List displays only the 10 most recent contexts
Plugin. TerminalFeatureIDEA-119667Feature request: shortcut for switching between terminal tabs
BugIDEA-202809Terminal tabs can't be reordered
BugIDEA-201228IllegalStateException when split Terminal tab
BugIDEA-208829Start SSH Session: if connection fails, the not-editable Terminal tab is opened
BugIDEA-204243In 2018.3 terminal doesn't save commands to the history (zsh).
BugIDEA-200854Regression: "Close session" and "Select Next/Previous Tab" no longer works in terminal since latest build
BugIDEA-201459Terminal doesn't source ".bash_profile" anymore in PyCharm
BugIDEA-204725Terminal with bash: 'cat' process ignores SIGPIPE
BugIDEA-155571terminal history not retained between openings op terminal pane
BugIDEA-205239Cmd+W in a Terminal tab moved to the Editor closes the wrong window
BugIDEA-203500Can't Open Local Terminal
BugIDEA-208328CTRL-C in terminal does not work in IDEA JDK 11 but works fine on IDEA JDK 8 (Mac)
BugIDEA-204683No login shell if "Python Terminal" plugin enabled
BugIDEA-202881Failed to start cmd.exe
BugIDEA-210461Sometimes Escape should not switch from the Terminal tool window to the editor
BugIDEA-202821Blank terminal
BugIDEA-202523Opening Embedded Terminal starts with: "cp: overwrite '/home/<username>/.WebStorm2018.3/config/terminal/history/history-'? " since updating to WebStorm 2018.3
BugIDEA-214512Re-ordering terminal tabs shows unexpected confirmation dialog to terminate running process
BugIDEA-208008Terminal window is scrolled to bottom and has no cursor on initial opening until enter is pressed
BugIDEA-203647Terminal settings (Environment Variables) forgotten after app restart
BugIDEA-165632The terminal is called twice.
UsabilityIDEA-205457Terminal trap DEBUG overrides my trap
UsabilityIDEA-132932Console font change doesn't take effect immediately
UsabilityIDEA-153536Support native OSX shortcuts in the terminal
UsabilityIDEA-204510too easy to accidentally close terminal window
UsabilityIDEA-116221Escape doesn't move focus back to the Editor from Terminal tool window
UsabilityIDEA-205690Terminal without running processes shows confirmation dialog on attempt to close it
UsabilityIDEA-206189Fall back shell path for terminal settings
ExceptionIDEA-203045Start ssh session is broken in 183.3795.24
Plugin. ThymeleafFeatureIDEA-129851Thymeleaf: rename doesn't work for included fragments
BugIDEA-211477Thymeleaf support has problems with special characters in litteral substitutions
BugIDEA-129852Thymeleaf: th:include: same-file fragment can be referenced with no keyword specifying
BugIDEA-202955Kotlin + Thymeleaf th:each problem
BugIDEA-145647Thymeleaf: support navigation to included / replaced fragment
BugIDEA-130667Thymeleaf: incorrect completion in th:include attribute value
BugIDEA-152595Thymeleaf: no navigation/completion/rename is provided for the included/replaces template w/o specified fragments (Complete-template fragments)
BugIDEA-209040Good code is red: accessing thymeleaf dictionary value with a parameter another dictionary value
BugIDEA-205379Thymeleaf: navigation to the parametrized fragment doesn't work
BugIDEA-152588Thymeleaf: completion should be available for the included/replaced fragments
BugIDEA-214484Thymeleaf. <template fragment param name> expected, got '@{'
BugIDEA-145628Thymeleaf: data-th-* syntax should not require xmlns declaration
BugIDEA-163350Darcula color scheme not looking very nice in Thymleaf templates
BugIDEA-214486Thymeleaf. Cannot resolve parameter's name.
PerformanceIDEA-202588Thymeleaf plugin stuck endlessly in syntax analysis
ExceptionIDEA-129849Thymeleaf: exception on attempt to rename the included file
Plugin. VelocityBugIDEA-203769Incorrect behavior for wildcard types in velocity templates
Services. Clouds. CloudBeesFeatureIDEA-150904Drop CloudBees support
Services. DockerFeatureIDEA-172715Docker: Provide possibility to debug code within a docker container
FeatureIDEA-176734Docker: Make it possible to open/edit container files via our Editor
BugIDEA-202524Docker: Auto-expose the unknown port if added in runtime at PortBinding tab
BugIDEA-201807Docker: Start/stop for a service node should work for compose files from one folder
BugIDEA-211945Docker. Files Chooser: java.lang.AssertionError at refreshing content with some expanded folders
BugIDEA-212161Docker. Files Chooser. Open in the Editor: change the "Failed to make writable" to another description
BugIDEA-207875DockerDebug. DockerRunConfig rename changes "launch" target in the remoteRunConfig to the first in the list.
BugIDEA-203879Creating runConfigs for multiple docker-compose files results in wrong commands being generated
BugIDEA-208312Error in typehint in cap_add block in docker-compose
BugIDEA-207868DockerDebug. Compose. "Custom Command" field changes are not saved.
BugIDEA-208100Docker. java.lang.AssertionError: Without manager but not disposed: Log at deleting container with the opened Log
BugIDEA-202973Docker: RunConfiguration: "..." instead of the error about the wrong path to the Dockerfile
BugIDEA-201749DockerCompose: after "restart" only the Log from the previous container is shown
BugIDEA-209993DockerDebug. The debug port in the "custom command" field is not changed after changing it in the remote configuration.
PerformanceIDEA-208129DockerDebug. Docker works slow after many "docker debug" runnings
UsabilityIDEA-212607Docker. Files Chooser tab. Provide possibility to "Collapse All"
UsabilityIDEA-207869DockerDebug. Compose. Auto-create a compose run configuration if it doesn't exist until remote debug
CosmeticsIDEA-212178Docker. Files Chooser. Refresh. Display another progress icon="spinner" and in another place
CosmeticsIDEA-212171Docker. Files Chooser. Remove "lock" from all the files, display it before the path
CosmeticsIDEA-212173Docker. Files Chooser. Files tab. Make a more indent after the path in the bar and the tree
CosmeticsIDEA-212174Docker. Files Chooser. Files tab. Icon to view files is not correct
Meta IssueIDEA-195017Docker: Simplify the access to container file system
Services. KubernetesFeatureIDEA-194758Helm: Validate requirements.yaml fields
BugIDEA-207703java.lang.LinkageError at attempt to load CRD as external spec
BugIDEA-207960Kubernetes: External resources. Multiple CRD schemas in one file: only the first schema is applied
BugIDEA-207953Kubernetes. External resources. CRD. Make it possible to add a schema with "version" key, not only "versions"
BugIDEA-210412Kubernetes: Custom Resource Definition support: reading cert-manager CRD yml fails with 'MismatchedInputException: Cannot deserialize instance of `com.intellij.kubernetes.model.CRDResource` out of VALUE_NULL token'
BugIDEA-204167Helm. com.intellij.util.IncorrectOperationException at attempt to rename the chart name in a read-only file
UsabilityIDEA-202462Noisy Kubernetes menu
CosmeticsIDEA-205741Kubernetes. Settings. Too big distance between fields.
ExceptionIDEA-207122Kubernetes. java.lang.Throwable: Incorrect CachedValue use: same CV with different captured context: at "ctl+click" on a key
User InterfaceFeatureIDEA-207424Please add uidesigner color constants to themes
BugIDEA-203350Help | Submit a Bug Report does not work for AppCode / CLion / DataGrip
BugIDEA-131794Tree selection changes on double-click expansion
BugIDEA-184388Exception on pressing "context menu button" if there is no context menu in the current UI component
BugIDEA-206344Recent Locations popup: after exiting presentation mode, popup may keep the enlarged font for snippets
BugIDEA-197444Run Anything. Shortcut cannot be changed or disabled
BugIDEA-204534KDE global menu
BugIDEA-158850Bookmarks navigation list shows two dots instead of bookmark mnemonic
BugIDEA-206484"Switch Boot Runtime" dialog: Some local JDKs are shown as "Undefined[Local]" in drop-down list
BugIDEA-201104Linux native menu: popups are not closed when native menu is opened
BugIDEA-207598Show smart step into popup above the line
BugIDEA-207998Recent projects "Create new project group" dialog is hidden
BugIDEA-203496java.lang.IllegalStateException: component cannot be null
BugIDEA-97714Add "Associate With File Type" to the editor tab context menu and menu
BugIDEA-202634ParameterInfo is now wedged in completion settings area
BugIDEA-208339No gap in log search field
BugIDEA-210827DarculaButtonUI.isSquare(Component) uses wrong instanceof test
BugIDEA-202749Missing mnemonics for labels
BugIDEA-118112Additional keybindings
BugIDEA-199367IDE hangs when searching in Hebrew+English
BugIDEA-207737support native custom decoration
BugIDEA-210978Freeze on "Mark object" (F11) in "Inspect object" (Alt-Click) popup
BugIDEA-208847Memory leak in InternalDecorator
BugIDEA-196876Fix group by popup in TODO tool window
BugIDEA-210873Bad description text wrapping in "IDE Fatal Errors" dialog
BugIDEA-168007Non-retina triangle icons in context menu
BugIDEA-166195icons doing the same action: intended?
BugIDEA-210887Notifications settings group list elements are centered
BugIDEA-205976Structure View shows content of the previously opened editor tab
BugIDEA-204130Find usages -> Export to Text background does not match font colour
BugIDEA-207957IDEA is not switched to full screen on Windows
BugIDEA-211968Recent projects menu/list contains paths with non-native slashes instead of project names
BugIDEA-205631The window with the addition of the note does not stretch vertically
BugIDEA-201284Linux Native Menu Bar: main menu is not available if the detached editor has focus
BugIDEA-211279Column resizing doesn't work in TODO table
BugIDEA-186740Scrollbar overlaps piece of text in an overflow hint
BugIDEA-204678Editor tab is minimized to OS title bar when detaching it with a mouse
BugIDEA-202305Update JavaScriptDebugger and JavaScriptLanguage icons
BugIDEA-206619Message from file-level notification is shown on top of Alt-Enter menu
BugIDEA-202939Can't exit search from Mac Touch Bar when no Touch Bar menu configurations
BugIDEA-127973Ctrl+Click doesn't work for multiple selection in Changes | Log, File History
BugIDEA-204015IllegalArgumentException because event getcomponent is null (from TrayIcon)
BugIDEA-208808Services Tool Window is shown in projects without services
BugIDEA-212346Scrollbar does not reflect the size of the content in Version Control tab while resizing it
BugIDEA-203219Touch Bar buttons for "Find/Replace in Path" dialog do not correspond to dialog buttons
BugIDEA-204645Help | Submit a Bug Report causes YouTrack to complain about template
BugIDEA-208645Text disappears in "IDE Fatal Errors" dialog box
BugIDEA-204831On IDEA restart 2 projects are opened while when IDEA was closed only one project was opened
BugIDEA-207394Icon animation stops in TestTree for one project if tests were started in parallel in two projects
BugIDEA-206700Validation in tables: bugs
BugIDEA-206775Remove Run Anything icon for IntelliJ IDEA
BugIDEA-203502Preview in "Find Usages" toolwindow turns green when disabled
BugIDEA-212553New Tabs UI: IDE no longer shows tips when no editor tabs are open
BugIDEA-199508New Search Field: replace clean icon with close one
BugIDEA-211513Project Structure -> Artifacts: Type ComboBox is too narrow
BugIDEA-211955"Open Recent" shows full path for consequently opened projects
BugIDEA-204789project frame opens out of screen
BugIDEA-208560QuickDefinition popup is enlarged each time it is opened for markdown file
BugIDEA-210678Background image resets after exit when using custom theme plugin
BugIDEA-203319"Run/Debug Configurations" dialog is opened without toolbar if invoked from Touch Bar while "Search Everywhere" was opened
BugIDEA-201103Linux native menu: some submenu are empty
PerformanceIDEA-208611Memory leak in IdeGlassPaneImpl
PerformanceIDEA-208610Memory leak in MouseDragHelper
PerformanceIDEA-205737parameter info tooltip slows down typing in editor
PerformanceIDEA-20434130s hang inside DeferredIconImpl
UsabilityIDEA-207735"Show file at revision" invoked from git log-based history does not show hash in editor tab title when "Show directory for non-unique file names" is enabled
UsabilityIDEA-179591'Couldn't checkout. Rollback changes to not let branches diverge' message extends past screen on Mac OS X
UsabilityIDEA-204151New Search Everywhere doesn't have an option to filter out run/debug configurations
UsabilityIDEA-167451file chooser dialog: can't definitely say which icons are grayed and which are wnot
UsabilityIDEA-195255Dialog Non-Project Files Protection: make OK primary button
UsabilityIDEA-211874Tabs: tabs UI wastes space on left border of a tab
UsabilityIDEA-203577Update tool window modes menu
UsabilityIDEA-209229When project is opened via launcher script Welcome screen is shown for a second
UsabilityIDEA-203571Disabled icons on status bar should support LAF changes
UsabilityIDEA-168223Open recent menu doesn't display project group if any
UsabilityIDEA-212381If a line has a navigation icon with a keyboard shortcut, the shortcut should work anywhere in the line
UsabilityIDEA-212332Next/previous error navigation should immediately show error tooltip
UsabilityIDEA-206408"Switch Boot Runtime" dialog takes a long time to show up
UsabilityIDEA-206969Consistent names of actions in View menu
UsabilityIDEA-209167"Submit Feedback" action from Android plugin overrides the platform action
UsabilityIDEA-210028AspectJ: unable to set ajc compiler path
UsabilityIDEA-210746Rename "Move Right" and "Move Down" actions to "Split and Move Right" and "Split and Move Down"
UsabilityIDEA-211957Feedback for "Show intention actions" with no intentions
UsabilityIDEA-208922Run Anything: no highlighting of matched text
UsabilityIDEA-211210Duplicated Mnemonic For Edit > Column Selection Mode and Macros actions
CosmeticsIDEA-209075Capitalize options in "Find in Path" dialog
CosmeticsIDEA-212776Don't show powered by for intentions provided by bundled plugins
CosmeticsIDEA-199007Incorrect progress dialog border rendering
CosmeticsIDEA-206478Partial commits: 'Uncheck All' checkbox misaligned with dependent checkboxes
CosmeticsIDEA-205502Main appearance font is not used in several toolwindows and notifications on macOS
CosmeticsIDEA-203829Analyze actions shows "Include test sources" option even if there are no tests in the project
CosmeticsIDEA-205826Annotation name is cropped on hiDPI monitor 175% scale
CosmeticsIDEA-203937Vertical aligned windows can't be resized entirely anymore
CosmeticsIDEA-85566Git branches with underscores don't render properly in branch menu
CosmeticsIDEA-211558Wrong indent in drop-down menu
CosmeticsIDEA-184165Startup splash screen progress bar is not centered
CosmeticsIDEA-211770Remove Edit icon from Run Configurations combobox
CosmeticsIDEA-197467Modernize Maven Run/Debug Configuration icon
CosmeticsIDEA-200555Icons in the Apply Patch dialog are not updated
CosmeticsIDEA-204690Mojave: low contrast menu selection background
TaskIDEA-202744Implement browse button inside combo boxes
TaskIDEA-209398do not create zillion of "swingworker" threads
TaskIDEA-210932Borderless UI: ERROR - llij.ide.plugins.PluginManager - null cannot be cast to non-null type java.awt.Color
TaskIDEA-205679Rework validation in tables
ExceptionIDEA-211366NPE when trying to open a project from Welcome Screen
ExceptionIDEA-208223CCE at com.intellij.ui.speedSearch.FilteringListModel.remove
ExceptionIDEA-203132NullPointerException occurs on entering Presentation mode
ExceptionIDEA-205460"Throwable: Project is already disposed" in Structure View on Close project
ExceptionIDEA-208621Bookmark dialog's move up/down actions do not work (throw exceptions)
ExceptionIDEA-212642IllegalArgumentException: Width and height cannot be <= 0
ExceptionIDEA-203612NullPointerException occurs on opening a second/new project in the same window
User Interface. AccessibilityBugIDEA-204449[a11y] instant rename refactor popup items are not selectable
BugIDEA-205209[a11y] instant rename popup ignores default enter
BugIDEA-203712[a11y] completion popup closes immediately in break point settings
User Interface. Action SystemExceptionIDEA-203236Throwable occurs when accessing "Run Anything" via shortcut
User Interface. Console ViewBugIDEA-203105Colours messed up in npm output
BugIDEA-86669Console: support ASCII backspace symbol in console view
PerformanceIDEA-205448Intellij hangs on "Save Test Results"
PerformanceIDEA-205347Asynchonous highlighting of a lot of console content leads to Out Of Memory
User Interface. ControlsFeatureIDEA-208143Find and Find-in-path to select word under the caret automatically.
BugIDEA-207235On Linux it's impossible to switch tabs in Debug Tool Window (e.g. from Threads to Frames), in Project View if the first line is selected
BugIDEA-208437Context help tooltips aren't shown in inspection settings
BugIDEA-209201[JDK 11] Empty autocomplete popup in run configuration after backspacing some part of filename
BugIDEA-206829JBLabel renders "..." in copyable mode regardless if autowrap is enabled.
BugIDEA-207083Implement validation of checkboxes
BugIDEA-204972Cannot assign context-dependent shortcut key if that shortcut is left alone for a different context
BugIDEA-200457ComponentValidator doesn't work with EditorTextField
BugIDEA-208708JVM crashes when creating vcs diff window
BugIDEA-204186IDEA lost mnemonic for 'File-eXit'
CosmeticsIDEA-202283Plugins UI: Top border of "Back to Plugins" button is cut
ExceptionIDEA-198778Exception on a click to the hidden toolwindow toolbar item
User Interface. Find, Replace, UsagesFeatureIDEA-210362Recently Edited and Recently Viewed scopes in Scope Chooser
BugIDEA-176926All Places scope does not include scratch files and consoles
BugIDEA-203491"Search Everywhere" is missing files
BugIDEA-204277Pinned "Find in Path" dialog is not closed when opening a project in the same window
BugIDEA-203111Undo doesn't work correctly after "replace all"
BugIDEA-168548find usages in file (ctrl-f7) skips some usages
BugIDEA-196030Find in Path | Open in Find Window does not work for current file scope with a scratch file
BugIDEA-194819Add reactive API/event listeners for usage inclusion/exclusion in UsageView
BugIDEA-193236Open In Find Window does a Replace All
BugIDEA-203563Can't change "Find in Path" scope during indexing
BugIDEA-202717Pinned "Find in Path" window closes on clicking on a result
BugIDEA-208622Find Usages for a class doesn't report instances created via method references (ClassName::new)
UsabilityIDEA-170894"Rerun Search" should not open new tab
UsabilityIDEA-202987Ability to customize a shortcut for search history
UsabilityIDEA-204169Add "Open results in a new tab" in the Find ToolWindow
UsabilityIDEA-108477Preview for in-place regexp replace doesn't preview line breaks
User Interface. FocusBugIDEA-207611Keymap switch leads to typeahead
BugIDEA-203154Focus lost when some tab is closed in Version control toolwindow
BugIDEA-189984Can't type in detached editor tab on Mac
BugIDEA-193333Paste after invoking navigation popup goes to editor sometimes
BugIDEA-86505File Structure: renaming from the popup is broken
BugIDEA-209224Can't use "Injected Language" feature because popup doesn't appear
BugIDEA-198612can't tab out a pane once breakpoint is hit
ExceptionIDEA-189622Some keystrokes cause 'Typeahead timeout exceeded" exception
ExceptionIDEA-207600"Typeahead timeout is exceeded" exception occurs after using shortcut when context menu is opened
User Interface. Keyboard InputBugIDEA-209426Cannot type characters that require AltGr
BugIDEA-203999Double CMD doesn't show tool windows
BugIDEA-208572Customized keymap for Up/Down/Left/Right is not applied to main menu
BugIDEA-206348Can no longer use "AltGr" to invoke Alt-Enter for Intention action under JDK11
UsabilityIDEA-206757[Sublime keymap]: "Ctrl+Shift+Backspace" should be mapped to "delete to line start" action
User Interface. Look and FeelBugIDEA-209654Buttons have yellow shadow in Darcula theme if IDEA is launched with clean settings
BugIDEA-206617Cannot open Settings when a theme is applied
BugIDEA-199525Mojave: selected item in context menu is highlighted with a different color than in the main menu
BugIDEA-207779Items in popup have two-tones highlighting when selected
BugIDEA-159315Black text on dark background in 'Rename File' dialog box. (Dracula theme)
BugIDEA-204746No border between 'Shelf' toolwindow content area and toolbar
BugIDEA-203934Icons become of a Darcula theme after restarting IDEA with "High Contrast" theme set
BugIDEA-202248Color Scheme reverts to Darcula from *custom* light color theme after restart if IDE theme is Darcula
BugIDEA-200158High Contrast Theme: Menu bar and popup menu items are not highlighted when selected after restarting IDEA with "High Contrast" theme set
BugIDEA-210915Scrollbar transparency in color scheme loses after changes
BugIDEA-201938High Contrast Theme: UML diagram window is still grey for contrast scheme
CosmeticsIDEA-204282Tree in "File and Code Templates" has grey background when "High Contrast" theme is applied
CosmeticsIDEA-211553Combobox popups have no border in Darcula theme
TaskIDEA-203153Support old color key names
User Interface. MacrosBugIDEA-204339Some IDEA macro invalid in other IDE's context.
User Interface. NavigationFeatureIDEA-202496Extension point to alter "No {0} found" text in Search everywhere contributor
FeatureIDEA-115029Feature request: recent files dialog should use up/down/left/right key mappings
BugIDEA-206631Show definition should be available in dumb mode for files
BugIDEA-207963Can't find some recent files in Search Everywhere top
BugIDEA-207202Quick action list trigger doesn't redraw on the first few mouse clicks
BugIDEA-209286Recent Locations: Only first selected location is opened if several locations are selected in popup
BugIDEA-210716Run anything shows no suggestions on first run
BugIDEA-206205Recent Locations popup: new-created file doesn't appear in popup
BugIDEA-154117Cannot bind Alt+S to an action
BugIDEA-207903Search Everywhere: Selection disappears when "more" item activated
BugIDEA-206176Recent locations popup: long string editing leads to location shown as empty
BugIDEA-208969Search Everywhere: Use addInputEvent method for correct collecting statistics
BugIDEA-206340Recent Locations popup: after checkbox is checked by mouse popup loses keyboard focus
BugIDEA-208222Search Everywhere: Items duplicated in Files and Symbols sections
BugIDEA-205760Navigation bar. Pressing Enter on a package selects a package in a Project View tree
BugIDEA-205837Recent files popup navigates to the last location after open from Find Action
BugIDEA-207077Header does not resize on popup resize, title and checkbox may overlap
BugIDEA-199673[Run config in the new SE] run config in a folder could not be found
BugIDEA-209047Group separators are eliminated in `Related Symbol` popup on speed search filtering
PerformanceIDEA-202231Compute breadcrumb information outside of EDT
UsabilityIDEA-204424Confusing representation of items without a group in go to related symbol popup
UsabilityIDEA-208718Implement the ability to move right/left on Navigation bar using additional shortcuts
UsabilityIDEA-207554Cmd+E/Ctrl+E doesn't work for iterating recent files after Recent/Recent edited files union
UsabilityIDEA-199661Results in "Search Everywhere" are delayed
UsabilityIDEA-204149Disable Search Everywhere from automatically inserting last query
UsabilityIDEA-207546Goto file: match spaces with file separators
TaskIDEA-209217Fixed size RL popup
ExceptionIDEA-206238IAE at com.intellij.util.containers.ContainerUtil.$$$reportNull$$$0
ExceptionIDEA-208332CCE at com.intellij.ide.actions.Switcher$SwitcherPanel$SwitcherSpeedSearch.propertyChange
User Interface. Project ViewFeatureIDEA-123918Allow to use additional keymaps for up/down in project window
BugIDEA-204446Structure sidebar flashing content with frontend (html related) files
BugIDEA-209330Pinned mode in 'project tree' always closes by switching windows.
BugIDEA-204918File nesting doesn't work with .java files
BugIDEA-190056Class members are highlighted as erroneous when they aren't
BugIDEA-204481Folders from "Scratches and Consoles" node do not disappear from the tree after deleting
BugIDEA-203616Update in Resource Bundle makes the file explorer to close the Resource Bundle folder
BugIDEA-206431[Autoscroll from source] in Unpinned/Undock modes doesn't work when using mouse
BugIDEA-176384Scroll from source not working anymore
ExceptionIDEA-203552CancellationException at org.jetbrains.concurrency.AsyncPromise.cancel
ExceptionIDEA-204840StringIndexOutOfBoundsException on Enum file opening when "Structure.Show Inherited" enabled
Version ControlFeatureIDEA-177606Use more relaxed heuristics to mark cherry-picked commits
FeatureIDEA-203130Allow to apply shelved changes without removing them from shelf by dragging corresponding changelist to 'Local Changes' tab while holding Ctrl
FeatureIDEA-210641Add VCS status and scope information to file quick documentation
FeatureIDEA-207325File sorting in Version Control: Local Changes differs from sorting in project view
FeatureIDEA-52058Prompt to add files to version control that got copied into a project externally.
FeatureIDEA-202946Show History for selection should work for the caret position
BugIDEA-203802Unshelve Silently restores several changelists in one
BugIDEA-209461191.6183.55 hangs on Synchronizing files due to git integration
BugIDEA-179602Workspace should not be restored is a branch is not checked out
BugIDEA-203012Files which were not added under VCS at once, do not appear at the list of files proposed ti add to VCS on project reload
BugIDEA-209722Annotate action behave wrong if other annotations added
BugIDEA-211694External files from ignored folders are suggested to be added to git
BugIDEA-206072IDEA shows half of project with an olive color
BugIDEA-210743Subversion: incorrect working copy is detected if the project is located below the repository root and <Project> VCS mapping is used
BugIDEA-198792"new changelist" disappears if a file is selected
BugIDEA-205331Cancelling pre-commit code analysis leaves all local changes in stash/shelve
BugIDEA-170942Scope background color is not shown for files that do not have VirtualFile
BugIDEA-209149File Status colors COPIED and RENAMED always appear in editor color scheme
BugIDEA-205302'Clean Unshelved Changelist' - Option button has no default option
BugIDEA-207822Local Changes: multiselection is lost on refresh
BugIDEA-204764File history missing part before rename/modified conflict.
BugIDEA-115100Maven project import sets Subversion VCS for submodules, if there is a folder or file called .svn in parent folders
BugIDEA-201084'Group By' button doesn't work in Apply Patch dialog
BugIDEA-207700Branches Popup: add tooltips for incoming/outgoing markers
BugIDEA-204713Deadlock after switching git branches (with kotlin)
BugIDEA-148109A file ignored via .gitignore is shown as modified in 'Local Changes'
BugIDEA-87811No line status markers for files modified without checkout
BugIDEA-207102Annoying "Shelf" behavior changes
PerformanceIDEA-205332Pre-commit code analysis stashes all roots in the multi-repo project
PerformanceIDEA-201408ChangesViewManager's tree builds itself in EDT causing performance problems
PerformanceIDEA-203998Do not use RemoteRevisionsCache for Git
PerformanceIDEA-208067Project leak via EditorImpl -> InlayModelImpl -> AnnotateRevisionAction$MyVcsVirtualFile
UsabilityIDEA-192682Can't drag&drop several files from 'Shelf' tool window to the 'Local Change" tool window
UsabilityIDEA-201491Default key binding for VCS/Git/Branches conflicts with MacOS binding
UsabilityIDEA-167403Shelf: focus disappears after removing one of the shelved lists
UsabilityIDEA-195646'Local Changes' tree shows module names instead of directory names if 'Group by: directory' is selected
UsabilityIDEA-128954Push dialog: enter invoked on the repository node should move it to edit mode
UsabilityIDEA-170151Make "Set Active Changelist" button enabled if file (or several files) inside changelist is selected
UsabilityIDEA-211599Add an ability to skip "Calculating whether something should be added to this commit"
UsabilityIDEA-204377Shortcut for Silent Shelve conflicts with Mac OS X system shortcut
UsabilityIDEA-203413Silent Shelf should shelve in the background
UsabilityIDEA-166965Changelist name displayed in dropdown is cropped
UsabilityIDEA-212285Local Changes Toolbar is hard to find in toolbars customization settings
UsabilityIDEA-204999Preview diff is too wide if file path is long
UsabilityIDEA-205644Can't abort whole patch apply process in case of multiple path apply conflicts
CosmeticsIDEA-207270Shelf viewer: missing space after moved files
CosmeticsIDEA-203839Change 'Unshelve changes' dialog button rename
TaskIDEA-204767Unbundle CVS plugin
TaskIDEA-204766Unbundle TFS plugin
ExceptionIDEA-214504"Project opening should be done in a transaction" on checkout project from git
ExceptionIDEA-180971java.lang.RuntimeException: java.lang.Exception: Cannot get ChangeListManager component state
ExceptionIDEA-205978Already disposed on exit from offline inspections
Version Control. GitFeatureIDEA-139940Force push could be made a bit safer with --force-with-lease option
FeatureIDEA-140714Add ignored folders to excluded folders of project from .gitignore for git-enabled projects.
FeatureIDEA-208154Show notification explaining the reason of Rejected force push
FeatureIDEA-119995Git: provide possibility to abort merge process
FeatureIDEA-116425Ignored files and folders should indicate that they are ignored
FeatureIDEA-125239gitignore right click?
FeatureIDEA-193870Set GIT_OPTIONAL_LOCKS for IDE operations
BugIDEA-76760When a file is added to git and immediately deleted, IDEA update fails with no visible reason
BugIDEA-201193Git Fetch is fetching only the current remote
BugIDEA-210221Synchronous execution on EDT: git unstash
BugIDEA-208453Memory leak in GitXmlRpcHandlerService
BugIDEA-210358Incoming/outgoing commits are checked on project opening before any manual git remote operation is done
BugIDEA-203005Project update over SSH fails if there are many repositories
BugIDEA-204694IO changes: Outgoing commits are not shown when local and remote branch names do not match
BugIDEA-170013Git Native SSH with passphrase fails with Permission denied
BugIDEA-171517Ignore empty remote section in git config
BugIDEA-204480Git: all remote operations fail with "execvp: No such file or directory" error
BugIDEA-198143On Linux, remote git operations over SSH hang if IDEA started via terminal (has tty assigned)
BugIDEA-205777IO Commits: commits status is not saved after refresh time is over
BugIDEA-205297java.lang.NullPointerException at git4idea.checkin.GitCheckinHandlerFactory$MyCheckinHandler.getSelectedRoots(GitCheckinHandlerFactory .java:368)
BugIDEA-200096New parallel multi-root fetch not working with store credential helper
BugIDEA-169020Exception from the VcsLogRefresher, if a Git root is unregistered in the Settings
BugIDEA-202874Indexing is suspended during the cherry-pick process
BugIDEA-202796Git Remote operations do not work with Native SSH
PerformanceIDEA-201588GitUtil.isGitRoot is expensive on windows and called too many times
UsabilityIDEA-212324Hide "Branch deleted" popup when clicking "Delete tracked branch"
UsabilityIDEA-208506Don't show commit dialog for Cherry-Pick by default
UsabilityIDEA-122038Abort cherry pick & view cherry-pick status should be available from UI
UsabilityIDEA-174119Git -> Add option should execute git add for all selected files
UsabilityIDEA-187448Partial commit | "Uncheck all" button
UsabilityIDEA-155587Git action "Checkout with Rebase" has counter-intuitive name
UsabilityIDEA-206134Unknown host question is asked N times for a single host
UsabilityIDEA-201596Don't add unrelated entries to automatically created .gitignore file
UsabilityIDEA-204470'Update checks failed' warning on Branches popup
CosmeticsIDEA-96602Small problem with hint on git pull dialog window when choose strategy
CosmeticsIDEA-203057Unify wordings in 'GitHub Pull Requests'
ExceptionIDEA-208359Synchronous execution on EDT: git in merge
ExceptionIDEA-207962Synchronous execution on EDT: /usr/bin/git version exception (2019.2 master branch)
ExceptionIDEA-202533IllegalArgumentException occurs on attempt to fetch changes from remote git repository if repository is not set
Version Control. GitHubFeatureIDEA-202764Add Open on GitHub option to annotations in diff dialog of older revisions
BugIDEA-206881GitHub pull requests: unfriendly error message on failed search validation
BugIDEA-209158GitHub Pull Requests: middle pane is not getting update on Refresh
BugIDEA-203744"Checked Out Branch pull/xxx" popup displayed even when no branch is checkout
BugIDEA-198120Cannot create github token when one with the name already exists
BugIDEA-206841GitHub pull requests: reviewers list is not sorted
BugIDEA-200881GitHub: Cannot view a PR on GitHub Enterprise 2.12 or older
UsabilityIDEA-196905If no github account is configured attempt to push/pull to repository with 2-step authentication always fails: token is not accepted/generated
UsabilityIDEA-203790It is not possible to refresh the list of pull requests if there are no pull requests yet
CosmeticsIDEA-205384Github: correct displayed error message on incorrect credentials providing
Version Control. Local HistoryBugIDEA-203490Copy/paste is not working in the left pane of the Local History window
UsabilityIDEA-75181show absolute time in local history
ExceptionIDEA-203259It's possible to call 'Show History for Selection' for project tree items: IllegalArgumentException is thrown
Version Control. LogFeatureIDEA-130845Log: add action to go-to-parent and go-to-child
FeatureIDEA-116312Ability to customise columns in the VCS log
BugIDEA-191688Resume indexing operation infinite pop-up dialog
BugIDEA-204247VCS Log repository root filter doesn't show tagged commits
BugIDEA-167341Intellij 2016.3.x builds run out of memory
BugIDEA-206766Bug in Log filtering by branch
PerformanceIDEA-178090High memory consumption of git indexing for projects with huge merge commits
UsabilityIDEA-207711Show columns settings should be preserved for additional Log tab
UsabilityIDEA-130970Git Log: search for filter string both in hashes and in strings
UsabilityIDEA-202408Strange window flickers on the screen when I navigate through git log (Windows 10)
UsabilityIDEA-207672`Log Indexing for "SAT" Stopped` message is confusing
UsabilityIDEA-160441Better name for Log tabs & tooltips
ExceptionIDEA-202461java.lang.Throwable: Skipping invalid VCS root: VcsRoot{vcs=svn, path=null}
ExceptionIDEA-209317Git double-dot: VcsException: fatal: bad revision when branch name is incorrect
Version Control. MercurialBugIDEA-203079Add project files to Mercurial
BugIDEA-195145Lots of WARN in idea.log from HgStatusCommand about 'No such file or directory'
BugIDEA-130035Mercurial - move refactoring bugs
BugIDEA-209262VCS refresh is taking a very long time with Mercurial
TaskIDEA-205988Please get rid of dependency on javax.activation
TaskIDEA-203152Update incoming / outgoingChangesOn icons for HG
Version Control. PerforceBugIDEA-150303Default p4 path doesn't work when running IDEA from JetBrains Toolbox on MacOS
BugIDEA-208851Perforce plugin cannot figure out a symlink is not "modified without checkout" when the target is reverted.
Version Control. SubversionBugIDEA-150369If path to client is just svn, default /user/bin/svn is used despite the PATH settings
BugIDEA-202942SVN Commit dialog hangs for a long time before showing up (since 2018.3)
BugIDEA-206423Subversion: impossible to merge file conflict using idea
BugIDEA-207234Freeze in "Hightlight Integrated" for branches with 1 commit difference
PerformanceIDEA-207024100% CPU usage when working with a changelists of ~100 files
CosmeticsIDEA-207786Duplicate in Settings -> Keymap (Subversion)
Version Control. TFSBugIDEA-206233TFS checkin not possible "Validation must be performed before checking in"
BugIDEA-206607TFS: Axis2 configuration error/ClassCastException on workspace creation
BugIDEA-206226Investigate duplicate condition in org.jetbrains.tfsIntegration.tests.ChangeHelper#getModificationChange
Web. ColdFusionBugIDEA-206225CFML: investigate duplicate conditions in CfmlQuoteHandler
BugIDEA-205139CFML: Improper closing tag auto completion with <cfset> and <cfif>
BugIDEA-205201ColdFusion: conflict in order of closing tags by type handler HTML with CFML
BugIDEA-205092CFML: Inspection Error When Writing SQL Variables with Pound Signs
Web. Flash and FlexFeatureIDEA-209027Feature Request: Run/Debug AIR Mobile config for iOS Simulator allow configuring Simulator device
BugIDEA-127053Adobe Air debug on Android device seems to always uninstall first
BugIDEA-207927Error when generating configuration for maven project using flexmojos and flex modules
BugIDEA-204397Adobe AIR support: IntelliJ IDEA cannot detect iPhone XS Max
No subsystemFeatureWEB-11807Feature: Folder templates for new projects
FeatureWEB-37865TypeScript: no override/implement completion for fields
FeatureWEB-29230HSLA (color) support in JS strings
FeatureWEB-36390Support path aliases defined in jsconfig.json
FeatureWEB-38231Incorporate NodeJS and Live Edit Tools to the default IDEA installation
FeatureWEB-34725Angular: provide navigation and content assist for selectors in [ngClass]
FeatureWEB-37472TypeScript 3.4: support improved type inference for unions/intersections
FeatureWEB-36697Add support for SVG properties to W3C CSS validator
FeatureWEB-37151Use proper syntax highlighting for destructured functions
FeatureWEB-37807Redesign new Vue project wizard to support npx and displaying progress in terminal
FeatureWEB-13732Add "Range" http header for video.
FeatureWEB-38278ES6: completion for default import bindings according to the exported name
FeatureWEB-38284Parameter info and parameter hints for tagged templates
BugWEB-37006Via quick-fix for failed tests possible to run several identical debug session, put several breakpoints on the same place
BugWEB-37365Autocompletion using Typescript definitions does not work at destructuring.
BugWEB-38807Please add "unsuspended" to the dictionary
BugWEB-36034##teamcity log messages when run mocha tests
BugWEB-36066[angular] IDEA navigates to wrong component declaraction
BugWEB-36757Quick Documentation: link to the external doc page is hidden after the click
BugWEB-38466WSL: prettier only works with javascript files
BugWEB-32850How to apply code style base on Prettier on this project, after saying "no" initially
BugWEB-38612"Do not show hints for current method" does not work for Javascript
BugWEB-36646Please add "parallelize" to the default dictionary
BugWEB-34111Copy paste error with js template literal with a template literal inside
BugWEB-35729So called "Smart Paste" escapes valid code blocks making them invalid in Javascript.
BugWEB-38796Intentions have doubled Before/After preview
BugWEB-36306Welcome frame missing Create New Project action link
BugWEB-37999Invalid highlighting on editing template string injection with nested injections
BugWEB-37751Poor documentation formatting for 'ary' function in lodash
BugWEB-38850A second space character is added after typing a space while entering a `return` keyword
BugWEB-38315'Convert to async' should also be proposed on class method names
BugWEB-36639New project template is only visible after the IDE restart
BugWEB-38068Code Highlight for HTML stops working
BugWEB-36877JavaScript projects: IDE frequently freezes when typing in the editor
BugWEB-37871js: confusing warning message "Binary operation argument types are not compatible"
BugWEB-37667JSX tag is not closed on typing /
BugWEB-38260Not able to unselect inserted variable name after live template expansion
BugWEB-35931Auto-inserted brace breaks the code in JS object with braceless lambdas
BugWEB-32905Can't analyse webpack.config.js: coding assistance will ignore module resolution rules in this file.
BugWEB-38172AngularJS can not setup development environment for plugin
BugWEB-36109Angular template: template reference variable incorrectly reported as unused
BugWEB-35513NodeJS: Importing a new project takes hours (when node_modules is already occupied)
BugWEB-37837Using Implement Members on an interface instance
BugWEB-38087ESLint Language server execution timeout on Windows WSL
BugWEB-38043convert to async function deletes nested functions in conversion process
BugWEB-37754Meaningless text in quickdoc for document.createElement() invoked from a TS file
BugWEB-37921'Convert to field holding arrow function' incorrectly processes string-named properties
BugWEB-36280<noscript> Content gets incorrectly highlighted
BugWEB-37818Custom file template with double extension
BugWEB-38546Show package's version when create project via npx
BugWEB-36065Sometimes editor shows Angular 2+ attributes as not allowed. This is the message. "Attribute (click) is not allowed here less... (Ctrl+F1) Inspection info: This inspection highlights unknown HTML tag attributes as invalid, and lets mark such attributes as Custom to avoid highlighting them as invalid. "
BugWEB-38828Can't choose value in 'package' field in run configurations on OSX via arrow keys
BugWEB-36333Go To menu from within Angular component template could be more functional
BugWEB-37226Can't run Vue.js plugin project (outdated config)
BugWEB-36051JSX: no parser recovery on an opening "<"
BugWEB-38470Unicode property escapes are available when language level is set to ECMAScript5.1
BugWEB-37062image tag incorrectly marked as deprecated in an SVG context
BugWEB-37044Invalid Inspection Warning - JavaScript - Constructor Returns Primitive Value
BugWEB-38249Autocomplete "import" places end in the wrong place
PerformanceWEB-35491Webstorm process uses up to 500% CPU
UsabilityWEB-38585Implement method/property intention action should have an option to implement in all classes
UsabilityWEB-37387'Ternary to if' and 'Split declaration/initializer' should be available on 'const' and turn them to 'let'
UsabilityWEB-38205Angular: allow running `ng new` with `--defaults=false`
UsabilityWEB-36796Save as project template: use notification instead of modal dialog
UsabilityWEB-37649Angular: not possible to overtype auto-inserted pair braces in interpolation
UsabilityWEB-37758Don't show path for local declarations in completion popup
UsabilityWEB-38832Can't choose task (gulp, grunt, npm) via arrow keys when field is empty (fresh RC)
UsabilityWEB-38309Update bundled plugins description
UsabilityWEB-34956Console Display has unwanted links on the right
UsabilityWEB-36592Quick Documentation tooltip shown on mouse move doesn't include a link to external docs
CosmeticsWEB-37438'Change color' alt+enter menu item is misaligned
CosmeticsWEB-38636Please add "Angeles" to the dictionary
Build toolsFeatureWEB-36867Use interactive console for npm scripts run tool window
BugWEB-38986Don't debug npm before launch tasks
UsabilityWEB-38759Add the possibility to disable system notifications from grunt task
UsabilityWEB-27442Can't switch between npm and gulp tasks in Run Gulp/Grunt/npm Task window without mouse
CSSFeatureWEB-30704@apply is deprecated and only supported by PostCSS, use more lenient parsing
FeatureWEB-28203CSS Modules: import class with hyphen as camelCase
FeatureWEB-96Allow browser selection for CSS validation
FeatureWEB-36035Extract CSS variable refactoring
FeatureWEB-21378color preview for css custom properties
FeatureWEB-24368Support postcss-simple-vars
FeatureWEB-36260In stylesheet linked to Angular template, provide completion for classes/IDs defined in html
FeatureWEB-30004Stylelint: allow linting CSS/PostCSS files with custom extensions
FeatureWEB-37256Instant image preview of encoded SVG data
BugWEB-36018Typescript TSX: value of "class" attribute is not recognizing as css class in 2018.3
BugWEB-38273Problem with justify-self and justify-items warnings in media queries
BugWEB-37524Hyphen css class renaming doesn't work
BugWEB-37014Typo in allowed property values for css overflow property
BugWEB-37249CSS inspection for 'appearance' property
BugWEB-37292CSS: Extract variable: do not allow to invoke refactoring over the var() function
BugWEB-38487CSS: Unsafe replacement with shorthand when a variable is used
BugWEB-36942Sort CSS properties (aka Rearrange) in SCSS files doesn't work inside media queries
BugWEB-35011Sort CSS properties: correctly move the end of line comment together with the property
BugWEB-37312CSS: 'Browser compatibility (properties)' inspection: "no MDN compatibility data" is shown for the properties with the appropriate data available
BugWEB-27632Bad scope for CSS resolution in Angular Templates
BugWEB-37332css attribute place-items has no supported values
UsabilityWEB-37979'Show CSS color preview as background' option is available when it is not applicable (e.g. in Community Edition)
TaskWEB-37622Support "Motion Path Module Level 1" CSS spec
TaskWEB-37628Support 'CSS Overscroll Behavior Module' CSS spec
ExceptionWEB-34320Locate duplicates doesn't work for css
ExceptionWEB-37372Extracting ruleset in JS strings produces the exception
CoffeeScriptBugWEB-36577Cannot insert new lines in multiline string in coffeesript
BugWEB-35376coffeescript JSX React.Fragment shorthand
BugWEB-33882CoffeeScript: JSX: "Remove attribute" intention breaks tag if an attribute contains an expression
BugWEB-38126Support splat arguments in invocation without parenthesis
BugWEB-34962Bad CoffeeScript syntax highlighting
BugWEB-35373coffeescript JSX props spread
DartFeatureWEB-23646Include non-imported Dart classes in code completion list and auto-insert import
FeatureWEB-23645Show package info in Dart code completion.
FeatureWEB-11590Support AngularDart
FeatureWEB-35830Dart code folding does not support optional `new`
FeatureWEB-36421Feature: allow to limit the scope of the Dart Analyzer with the current package
BugWEB-38346Auto insertion of /// unexpected by the Dart Plugin
BugWEB-36326Dart "assert" support
BugWEB-38651dart problems view issue suggestions don't handle angle brackets
BugWEB-36853Dart web debugging: breakpoints that are set before debug session starting are not resolved when using SDK 2.1
BugWEB-37752Dart Plugin shows only one line in quick definition look up for initialized variables (ctrl+shift+I)
BugWEB-35995Failed to load templates during new Dart project creation
BugWEB-17258Dart SDK is not configured after updating Dart
BugWEB-36954Dart plugin incorrectly prevents editing excluded files
UsabilityWEB-14771Custom code folding regions do not work in Dart code in some cases.
UsabilityWEB-37176when launching a Dart web app, delay launching until wevdev is ready and serving the app
TaskWEB-36102Support new Dart syntax: Set literals
TaskWEB-37677Support new Dart syntax: spread collections, control flow collections
DebuggerFeatureWEB-37309Console message filtering
FeatureWEB-38040JavaFx availability check before webconsole usage
FeatureWEB-35737npm script debugging not supported without $NODE_DEBUG_OPTION argument
FeatureWEB-27977Debugger console: use special colors for `console.info()` and `console.warn()` messages
FeatureWEB-26400Javascript Debug: Rerun to current URL
FeatureWEB-12349Debugger console: support string substitutions/output styling
BugWEB-36266Nullpointer Electron / Node.js Debugging
BugWEB-37804Debugging with "js.debugger.use.node.options" fails if path to TEMP directory contains spaces
BugWEB-36526When evaluate in console an object with many properties, some of them can't be shown due to a limit
BugWEB-38564'Smart step into' suggests only first call of the same name in a line
BugWEB-36714Debugger not attached, exits with -1073741510 when using `js.debugger.use.node.options` + `nodejs.console.use.terminal`
BugWEB-36056'Run to cursor' doesn't work in node.js debug
BugWEB-37444Console input icon doesn't change its size while changing font size
BugWEB-27620Node.js: Don't display variables that went out of scope while debugging
BugWEB-34213javascript debug insists on using Chrome Canary, rather than my release Chrome 68
BugWEB-37397Syntax error in Debug when try to "evaluate" arrow function expresion
BugWEB-37352Fonts in js debug console should be the same as in editor
BugWEB-37144Breakpoint already exist error after disabling suspend for existing breakpoint
BugWEB-36185Node.js: debugger is not attached if 'Allow taking heap snapshots' is ON unless 'js.debugger.use.node.options' is disabled
BugWEB-36095WinpException when stop Node.js run/debug configuration on Windows
BugWEB-36457Electron: render process debugging hangs after reloading app
BugWEB-36230Node.js debugger breaks on the first line when using Node.js 7.x
BugWEB-35630node debug connector isn't listening to debug port
BugWEB-37354Can't evaluate objects created in console
BugWEB-34907Electron: main process debugging: Debugger Never Attaches
BugWEB-38228Electron App does not start up corretly in DebugMode
BugWEB-36660Debugger: empty library file is opened
BugWEB-36666'Collecting data' for all variables after input in console
BugWEB-36953Throwable when rerunning tests
BugWEB-34557Debugging doesn't work for Vue+typescript when using @vue/cli 3.0.0
BugWEB-36132Regression: Debugger doesn't attach to forked process
BugWEB-37018ReferenceError when trying to evaluate expression
BugWEB-35467Step into nodejs core modules opens virtual file
BugWEB-38041Console input cleared on arrow down key press
BugWEB-36168Debugger does not respect breakpoints inside Meteor packages
BugWEB-37440Async stacktrace not shown in console
BugWEB-36462Background is blinking in debugger console
BugWEB-38097%NODE_DEBUG_OPTION% in NPM Script not working anymore
BugWEB-37880Workers are duplicated in Frames view when debugging in node 11.10.0
BugWEB-37070Disabled/muted/removed breakpoints still hit in Webpack applications after recompile
PerformanceWEB-38675Debugger: memory leak when re-building the application
PerformanceWEB-20253IDEA hangs when debugging TypeScript
PerformanceWEB-35886Out of memory after debugging my Angular app for awhile
UsabilityWEB-36448Better presentation for stack trace in debugger console
UsabilityWEB-36785Show warning when specifying hostname in the "Host" field of "Attach to Node.js/Chrome" remote debug configuration
CosmeticsWEB-37515Icons in console are not aligned
CosmeticsWEB-37645Use new UI for smart step into in JS debugger
CosmeticsWEB-37357Remove extra line in Filters popup
CosmeticsWEB-37349Move icons on the top line of output
TaskWEB-37145Debugger console: groups
TaskWEB-33598Customize URL for react-native
ExceptionWEB-36460ObjectNotDisposedException when create @angular/cli project
ExceptionWEB-36540BufferOverflowException when drag console outside IDE
ExceptionWEB-37223TypeCastException when call console.group()
ExceptionWEB-37246NoClassDefFoundError when debug via JavaScript run configuration
ExceptionWEB-36682UnsupportedOperationException when call 'Pause output'
ExceptionWEB-36972Assertion when debugging with temporary breakpoint
ExceptionWEB-37538RuntimeExceptionWithAttachments when debug npm script with interactive console
File WatchersBugWEB-38929'File watcher problems' inspection doesn't work for Less and other compilers that produce ANSI-escaped output
HTMLFeatureWEB-36403Show SVG elements only inside svg tag in HTML files
FeatureWEB-2192References guide in html and css
FeatureWEB-5087Suggest more relevant tag names and remove delay
FeatureWEB-27624Code inspection does not scan for deprecated HTML attributes.
FeatureWEB-16881Create inspection to look for deprecated HTML 5 tags and attributes.
FeatureWEB-14791Small tag should be listed as an inline element by default
FeatureWEB-32621Update HTML documentation
FeatureWEB-37374Add "application/ld+json" to `<script type>` completion
FeatureWEB-9469Alphabetically sorting of attributes in html and css (inline css)
FeatureWEB-34660Navigate | Symbol should search for HTML tags by id.
BugWEB-36934React-native tag is incorrectly shown as deprecated
BugWEB-36138"Missing associate label" error given when using aria-label
BugWEB-35193HTML5 Outline shows <td> elements
BugWEB-36794HTML docs: description for parent docs is shown when doc is invoked in completion
BugWEB-26164onload event on STYLE tag is no longer allowed in v 2017.1
BugWEB-34763MathML tags should not be available in the completion list outside <math> tag
BugWEB-38873Wrong WCAG suggestion
BugWEB-36848html 5 boilerplate v7+ falls back to git checkout
BugWEB-36779HTML Documentation: invalid symbols in the description text
BugWEB-36394scoped is marked as deprecated for style tag in vue file
BugWEB-32620HTML documentation: remove links to SitePoint
BugWEB-34950Add inspection: use <em> and <strong> for emphasized or special text
BugWEB-37307"Form input without an associated label" inspection should work when input has a placeholder
BugWEB-36583Tag name editing synchronization lags with some actions
BugWEB-36843HTML Documentation: SVG: empty description with a dot
BugWEB-25857<script onerror="..."> highlight error in .html files
BugWEB-23008HTML5 documentation: "W3C website" links to old HTML4 specification in HTML5 file
BugWEB-36179HTML code style arrangment with order by name order does not rearrange all elements
BugWEB-26169style attribute on script correupt
BugWEB-36795HTML docs: doc is not always available in code completion
BugWEB-37518HTML documentation shows existing tag instead of selected variant
UsabilityWEB-6322Suppress code inspection "Form input without an associated label" when input has placeholder
TaskWEB-38207Html: disable "Image size mismatch" inspection for svg files
JSONFeatureWEB-36487JSON schema in yaml notation
FeatureWEB-37676Specify language injection in a json-schema file
FeatureWEB-36774Add eslintIgnore to package.json schema
FeatureWEB-37295Support non-standard deprecation attributes for JSON Schemas
FeatureWEB-37864Support JSON-schema based code completion for all linters/tools we support for yaml/plain js formats
FeatureWEB-31905Semantic highlighting for JSON files
FeatureWEB-36467JSON: show schema conflict notification for widget, get rid of editor notification bar
FeatureWEB-34933Suggest schemas from schema catalogue and schema schemas in "$schema" completion
BugWEB-35997Single quote completed with double quote in a .json file
BugWEB-38090Don't download the latest JSON v4,6,7 schemas (Always download most recent schemas)
BugWEB-36161JSON: Don't input value to property if it already contains some value
BugWEB-37393If-then-else validation issue
BugWEB-36973JSON validation doesn't allow large integer values, although it should
BugWEB-31887"Wrap with double quotes" without effect ("JSON standard does not allow such tokens")
BugWEB-36189JSON Schemas: Validates to more than one variant gitlab extends script
BugWEB-37731JSON Schema's $ref showing property '' not found
BugWEB-36429JSON: Don't show object/array default values in completion
BugWEB-36383webpack: "Array shorter than 1" when entry bundle array doesn't contain a string literal
BugWEB-37571json schema oneOf not validating correctly
BugWEB-38658Fix type in JSON schema validation for browserslist when used in package.json
BugWEB-31900JSON: Extend Selection doesn't respect camelHump settings
BugWEB-38054File types configuration: removing *.json from JSON and adding it to JSON5 file type lets code analysis run forever
BugWEB-33444JSON Schema mappings are stored with platform-dependent slashes
BugWEB-37261YAML plugin show error: Validates counter ‘if’ branch but no ‘else’ branch is present
BugWEB-37789JSON Schema documentation for additionalProperties not working
UsabilityWEB-36420Branch dropdown position changes
ExceptionWEB-38123Argument for @NotNull parameter 'schemaObject' of com/intellij/json/json5/Json5PsiWalkerFactory.create must not be null
JavaScriptFeatureWEB-37448Missing color for the name of a function expression
FeatureWEB-36971ES6: add a way to disable autoimports from some modules
FeatureWEB-27639Support Unicode property escapes
FeatureWEB-36737ES6: show blacklist settings (Do not import exactly from) in UI
FeatureWEB-37770Add styling option for keys in ES6 destructuring assigment
FeatureWEB-36339Intention to convert properties in constructor to class fields
FeatureWEB-38053Javascript quick doc: add syntax highlighting in the definition section
FeatureWEB-38638Inspection and quick-fix to merge trivial nested template literals
FeatureWEB-33939Suggest class method parameters when ES6 class is extended
FeatureWEB-25533No suggestions to autocomplete missing properties in Flow by expected type
FeatureWEB-32703Auto-import with webpack alias: always use the shortest possible path on import
FeatureWEB-32473Intentions to add/remove ES6 exports
FeatureWEB-36338Use file name as a suggested name for class/enum/interface
FeatureWEB-37805Add code completion for webpack config that returns promise
FeatureWEB-38159Add a quick fix to fix spelling for an unresolved reference if qualifier type has property with similar name
FeatureWEB-36957Keyword completion for 'return' should insert whitespace/semicolon when applicable
FeatureWEB-35756Autocomplete of export default
FeatureWEB-12157Add 'Join subsequent variable declarations' intention
FeatureWEB-38139'Propagate to destructuring declaration' refactoring
FeatureWEB-31773TypeScript 2.8: support jsx pragma
FeatureWEB-36316Code completion for 'switch' cases
FeatureWEB-37931JS/TS: add postfix template to surround expression with call
FeatureWEB-30826TS 'Type mismatch' errors should show quickfix to update type when available
FeatureWEB-37007Allow initialising all fields of a class
FeatureWEB-37930Support ES2019 decorators proposal
FeatureWEB-33449Intention actions and refactoring to replace code by destructuring
FeatureWEB-6907Provide fixes to create object literal properties from unresolved usage
BugWEB-37277No completion provided when using default export in iife format
BugWEB-36023Buffer Static Functions
BugWEB-37413"Can't generate code from Angular Schematics" when using WSL
BugWEB-24817JSDoc: variable annotated with `@function` is not documented correctly in quick doc
BugWEB-35742Documentation popup: missing spaces between links to definitions
BugWEB-38957WebStorm lacks Darcula coloring for some JS-specific elements
BugWEB-37516Javascript classes are not identified correctly when declared with unnamed class expression
BugWEB-38467`top level this` false-positive inspection's warning for class with JSX
BugWEB-36870Replace with destructuring: enable for variables
BugWEB-36193Destructuring is not fully supported in control-flow analysis
BugWEB-36804Weird escape \ character multiplication and reduction on copy/paste
BugWEB-32941Unresolved variable Node
BugWEB-30019The IDE can't recognize some mongoose functionality
BugWEB-23326ES7: Decorating class expressions is treated as a syntax error
BugWEB-28792Add Google Closure like destructured parameters of function in JSDoc
BugWEB-38056'Flip if-else', 'Merge if-else', 'Remove braces', etc. all remove inner functions inside blocks
BugWEB-37148Semantic highlighting doesn't work for `let` variable assignments inside of separate function scope
BugWEB-36466JSdoc: parameter types not inferred when using `@type` + clojure function syntax to annotate a function
BugWEB-36073ES6: import from node core modules are broken
BugWEB-36395Completion for React utility types
BugWEB-31053Fields in ES6 class lose their accessor level on re-assignment
BugWEB-33097Call hierarchy action doesn't work for functional expressions
BugWEB-37373Add/remove ES6 exports. Wrong context detection for arrow/anonymous function
BugWEB-36750Color Scheme: Add "Semantic highlighting" option for the JavaScript, TypeScript, and JSON
BugWEB-36873Introduce new array destructuring doesn't work when invoked inside index
BugWEB-38352JavaScript/TypeScript completion after export default
BugWEB-37149Destructuring can hide unused variable warnings/errors
BugWEB-37112JSDoc return type inference inconsistency between `const` and `let` variables breaks quick documentation and type checking inspections
BugWEB-37324Parameter hints popup menu is always invoked for the base language, wrong options page is shown for TypeScript as a result
BugWEB-36598Types from 'prop-types' are not resolved
BugWEB-38184Javascript spread-constructed object property tooltip does not correctly infer source
BugWEB-36011Flow 'typeof' syntax allows parens, but WebStorm doesn't
BugWEB-36935Destructuring intentions: Better processing of non-integers (shouldn't be available) and large integers (shouldn't die)
BugWEB-36900'Introduce destructuring variables' wrongly shown
BugWEB-36781'Safe delete' is not that safe: should extract side effects
BugWEB-38645Unused local variable inspection works incorrectly with require statements when Node.js coding assistance is disabled
BugWEB-36234Process json file when it's accessed as module.exports property
BugWEB-37986Flow: 'duplicate declaration' error is shown for unnamed function parameters
BugWEB-38198.var postfix template doesn't work after ES6 tagged template
BugWEB-37258Import is marked as Unused if more than one import path is resolved (incorrectly)
BugWEB-30919Quick Documentation thinks that variable is tag name
BugWEB-36241'Remove unused local variable' behaves incorrectly with array destructuring
BugWEB-20459CommonJS: properties of function assigned to module.exports not resolved
BugWEB-36110JS import path setting "Use relative path to root" is broken since 2018.3
BugWEB-28276Renamed default import causes problems when importing commonjs module
BugWEB-35892Symbols from CommonJS module are not resolved when ternary operator is used for the exported value
BugWEB-36068AssertionError when 'Convert parameters to arrow function' for function with optional single parameter
BugWEB-38488NPE when creating a new object property
BugWEB-36010"Object is 'null' or 'undefined'" inspection false positive
BugWEB-37264Incorrect "Type void is not assignable to type () => void" warning
BugWEB-37355Custom predefined libraries are unavailable in JSP files
BugWEB-38666Incorrect auto import when copy/pasting code between files
BugWEB-37297Syntax error: A term expected
BugWEB-36477Module members are not resolved when using @module + @memberof
BugWEB-18054CommonJS: prototype methods of re-exported module should be available in completion
BugWEB-32066resulting typing of axios from index.d.ts is incorrect
BugWEB-36155Don't resolve unqualified references to nested classes in JS
BugWEB-36469Imports with relative paths instead of webpack aliases after file being moved
BugWEB-36872Replace with array destructuring with invalid preceding indexers
BugWEB-37420Invalid Inspection Warnings - Missing semicolon / Selector matches unknown element dummy_selector
BugWEB-37860Do not use LSP with older Flow versions
BugWEB-36271Import completion imports items that cannot be really imported
BugWEB-38757TypeScript type aliases shouldn't be shown in 'extends' clause
BugWEB-37421'Convert ternary to if' breaks variable initialization order
BugWEB-37416Add/Remove ES6 exports: "Remove export" intention: do not remove the whole code block on the export default
BugWEB-38936Remove acton 'Fix all problems in file' for 'Create class/interface' and 'Adjust spelling' quick fixes
BugWEB-3818Incorrect "Variable initializer is redundant" with for loop
BugWEB-37675404 not found in "api" project
BugWEB-37211Find usages doesn't work with node.js require()
BugWEB-36012TypeScript/Flow arrow function return type annotation allows parens, but WebStorm doesn't
BugWEB-38086Editing injection in template string with 'Edit injection' action fails if another template string inside arguments
BugWEB-36268JS code completion fails for object literal property expected types
BugWEB-18051React: create method inside the object
BugWEB-38248Autocomplete problems with properties that start with an underscore
BugWEB-32758js: spurious "Invalid number of arguments, expected 0" inspection for the default sub-class constructor
BugWEB-37294"Unused default export" when importing module dynamically
BugWEB-36875Introduce object destructuring doesn't work within template strings
BugWEB-38833JavaScript name suggestions: don't conflict with the global 'name' variable
BugWEB-38357No completion for @editorjs/editorjs npm package
BugWEB-37750Completion of files in 'import from' show meaningless variants
BugWEB-36947"Introduce destructuring variables" introduces 'Invalid delete operator target'
BugWEB-37912False positive unused variable on writing new code
BugWEB-38544JS: suggest exported commonjs names in completion
BugWEB-36091Import-completion should invoke parentheses insert handler if the item is definitely a function
BugWEB-36742Auto completion with named alias is not working correctly
BugWEB-37642Flow integration super slow on flow 0.92.1
BugWEB-36103Don't suggest items from "@types" packages not directly specified in package.json in import completion
BugWEB-28878Optimizing imports messes up placement of comments if 'Sort imports by modules' is on
BugWEB-38514'Complete current statement' doesn't work for TS enums
BugWEB-34153Broken code after pasting a fragment with escaped symbols
BugWEB-36854Autocompletion gets confused on properties when there are 2 same-named classes in different modules
BugWEB-38758Type evaluation is broken for destructuring patterns in for-of
BugWEB-36623Incorrect warning in javascript
BugWEB-25571Unresolved types when destructuring require()
BugWEB-26037Autocompletion gets confused when imported ES6 classes have the same name
BugWEB-38534JS: do not show members from unknown namespace in top-level completion
BugWEB-37670Unreachable code inspection false positive when breaking from the label-ed block.
BugWEB-38414Auto import in Flow adds path to the IDE bundled definitions for React instead of the project ones
BugWEB-28187ES6: Unused default export
BugWEB-37563Can't type semicolon sign in the color string
BugWEB-18117CommonJS: module property not resolved/completed if module.exports is wrapped in immediately invoked function expression
BugWEB-36298Semantic highlighting doesn't work for `let` and `const` passed as arguments
BugWEB-35445Webpack aliases are not resolved if webpack config function is async
BugWEB-36041Some refactor actions should not be available for throw expressions
BugWEB-37911"Hide parameter hints for this method" only works for last method in chain
BugWEB-36902Introduce destructuring variable: doesn't work for static fields
BugWEB-32587JSDoc: support typescript "export as namespace" modules
BugWEB-37736Flow process is not finished when close IDE
BugWEB-37782Live Templates: "use strict" breaks Iterate... templates
BugWEB-33767\u not escaped when pasted into js string
BugWEB-36821CommonJS: exported Promise not recognized
BugWEB-36879Static member is not accessible for invocation with assignment under arrow function
BugWEB-35455No intellisense when using spread operator for 'module.export'
BugWEB-37958Bug in type inference
BugWEB-34336Module imports become messed up when refactoring
BugWEB-35767TypeScript/ES6: support autoimports for re-export as default of default symbols
BugWEB-34225CommonJS: exported object properties not resolved when assigning `Object.freeze(obj)` to `module.exports`
BugWEB-37583JS: Completion doesn't show nested indexer in the object key
BugWEB-16947CommonJS: prototype methods of exported function not resolved
BugWEB-38649Flow: no clickable links in the error tooltips
BugWEB-32065@type is ignored for requires of packages with typings (index.d.ts) (2018.1 regression)
PerformanceWEB-38158High CPU usage, code analysis never completes when resolving references from "reselect" module
UsabilityWEB-35838'new Javascript file' attaches .js extension after .mjs
UsabilityWEB-36422Do not show index.d.ts file name for items in completion popup
CosmeticsWEB-37760Nested parentheses in Goto Symbol popup
CosmeticsWEB-37759Not ideal layout of JS options page
CosmeticsWEB-36414Update icons used in completion for methods that could be overriden
CosmeticsWEB-36186"Must be lvalue" instead of "ReferenceError: invalid assignment left-hand side"
TaskWEB-38420JavaScript completion: do not show statement-only keywords in expression context
TaskWEB-37952Support built-in decorators for es2019
TaskWEB-38849Node modules: exclude from indexing unnecessary files
TaskWEB-38403ES6: complete sibling files with relative prefix
TaskWEB-38404TypeScript / JavaScript: completion after export
ExceptionWEB-37721Throwable when create react-native project
ExceptionWEB-36918PsiInvalidElementAccessException when call 'Introduce destructuring variables'
ExceptionWEB-37026Quick Doc: IllegalArgumentException on invocation documentation with a large image
ExceptionWEB-37331Flow: LSP: Server crashing on Windows
ExceptionWEB-37608NoClassDefFoundError: jdk/nashorn/internal/runtime/NumberToString
ExceptionWEB-36028'Replace || with &&' causes NullPointerException on expression with throw
JavaScript. FormatterFeatureWEB-37855Prettier: allow importing code style rules from .prettierrc.js/ .prettierrc.toml file
FeatureWEB-7316Feature: Code Style: JS: space before and after unary negate operator
BugWEB-36263Wrong indentation in jsx & tsx files after self closing tags
BugWEB-35776Insert space after <TypeAssertion> in TypeScript
BugWEB-30108Formatting JS/TS with HTML injection and 'Enforce HTML quotes on reformat' enabled breaks code
BugWEB-38042Wrong indentation in tuple types (Flow, TS)
BugWEB-38600Don't remove leading semicolon on reformatting
BugWEB-37232Red error highlights in JS code style preview
BugWEB-38505JavaScript setting for spaces within array brackets are not saved for IDE Global Code Style schema
BugWEB-38992Wrong extra indent for template string argument braces
JavaScript. FrameworksFeatureWEB-37063Angular - inspect type in template bindings
FeatureWEB-17495Angular directive scope attributes not recognized
FeatureWEB-38146Allow a way to override package.json check for Angular 2+
FeatureWEB-35983Improve code completion for Angular bindings
FeatureWEB-35477Support bootstrap-vue components
FeatureWEB-37284Angular - list module as component's related symbol
FeatureWEB-37243Angular - provide auto-import of NgModules during code completion
FeatureWEB-36510Angular - support templates imported with require
FeatureWEB-33517Support React 'defaultProps' + ensure compatibility with TS 3.0 'propTypes'
FeatureWEB-37056Angular - context aware code completion for pipes
FeatureWEB-31541Generate debug configuration for @angular/cli
FeatureWEB-36662Support canonical attribute names completion
FeatureWEB-23865Angular2 Class binding [class.special]="isSpecial"
FeatureWEB-36150Angular - inspect type of expressions result
FeatureWEB-36240Related symbol action for Angular components
FeatureWEB-33464Parameter Hints in Angular Component Template
FeatureWEB-37363Angular: incorrect type of bindings of directives with generics
FeatureWEB-37057Angular - provide quick fix to auto-import NgModule
FeatureWEB-35683Angular: disable Angular language services
FeatureWEB-36071Angular - provide completion for attribute bindings
FeatureWEB-32278Option to not self-close JSX tags when autocompleting
FeatureWEB-35582create-react-app: option to generate project with TypeScript
FeatureWEB-26747Angular directive scope variable with different attribute name are not recognized in HTML
BugWEB-37854Typescript - issues with generic inference from index signatures
BugWEB-38265False positive "unresolved variable value"
BugWEB-27152AngularJS component tag name matching is too restrictive
BugWEB-37276False positive ' Expression result type' inspection for trackBy functions
BugWEB-36591WebStorm gives an error for string interpolation inside Angular template strings
BugWEB-36054Vue.js: support shards-vue components
BugWEB-36114React components created with ref forwarding are not suggested in completion
BugWEB-38550"Not an Angular Module" inspection false positive
BugWEB-38825Angular support doesn't recognize type when QueryList is used in *ngFor
BugWEB-37275React + Typescript: broken completion for functional component (React.FunctionComponent)
BugWEB-38277label tag live template doesn't work on JSX since 2019.1
BugWEB-38448False 'unresolved' error in angular template
BugWEB-35848Component's properties/methods are not resolved in pug templates
BugWEB-38354Angular: wrong exclusions with Angular libraries
BugWEB-22063No completion for props merged with ES6 spread operator
BugWEB-36122'Convert to functional component' produces broken code for components in export default
BugWEB-38080Parser works wrong when deleting some tags in angular templates
BugWEB-36295Angular templates: improve completion suggestions after typing '*'
BugWEB-38154Angular: Inspection "Component or directive matching ... out of current scope"
BugWEB-37320Angular: binding to an @Input that is a method gives a warning
BugWEB-34821No inspection for undefined symbols in pipe expressions.
BugWEB-38174Angular: intentions doesn't work if method is prefixed with `this.`
BugWEB-38734Angular: find usages of private component fields in templates
BugWEB-37791Angular structural directive without argument disables styling
BugWEB-35313Angular - support templates referenced through import statement.
BugWEB-35823Vue.js: support for <keep-alive> tag
BugWEB-29744AngularJS component HTML attribute highlighted as not allowed when multiple definitions exist
BugWEB-38361Angular CLI: schematics are broken with 8.0.0-beta.11
BugWEB-37348Angular: false positive ambiguous component problem in index.html
BugWEB-37278False positive 'Declaration membership in NgModule' inspection when using spread operator
BugWEB-36722Angular template files are not recognized if "@angular/core" is not a direct dependency
BugWEB-36002WebStorm doesn't recognize (focusin) or (focusout) event bindings in Angular templates
BugWEB-38725Angular: Support quickfixes in EL for qualified references
BugWEB-37054Angular - take NgModule structure into account when resolving pipes, directives and components
BugWEB-36076some vuetify.js components dont autocomplete when used with pascal case
BugWEB-37970Regression in 2019.1: Components and Directives used from imported Angular library show up as errors
BugWEB-36386slot-scope not recognized
BugWEB-38183Angular: wrong type for ngFor items if async pipe is used
BugWEB-37520Angular: Wrong case in autocomplete
BugWEB-37737Angular: issues if dot-prefixed templateUrl is relative to base path
BugWEB-37693Angular: Inspection "Component or directive matching ... out of the ... scope" broken if importing ModuleAndProviders
BugWEB-37838Ionic events not recognized by angular inspection
BugWEB-30180New component tag should not always auto complete to self closing for components that require children
BugWEB-35820Issue with spellchecking an expression with & and ;
BugWEB-38034Angular: issues with NgModule import quick-fix for [ngValue]
BugWEB-37283Angular: false positive 'Type string is not assignable to type String("up")|String("down")' on string expression
BugWEB-31288Editor > Code Style > HTML "Add for JSX attributes": None Doesn't Work
BugWEB-31058Incorrect warning: Element XYZ doesn't have required attribute children.
BugWEB-38075Suggest to import FormsModule
BugWEB-37637`Type` is missing in the completion list
BugWEB-35128Web browsers panel is not shown in the angular project
BugWEB-36790Angular (version 7) intellisense not working with symlinks
BugWEB-37384Angular Material error - "More than one component matched on this element"
BugWEB-34133Usages of component prefixed with underscore are not found
BugWEB-36506Extra & symbol on 'New project wizard | React'
BugWEB-37797Angular: incorrect text coloring if char entities are used.
BugWEB-38128Angular inspection false positive "Component or directive matching ... element is out of the current Angular module's scope"
BugWEB-35800React+TypeScript: 'missing required attribute' error reported for required properties passed in by redux `connect`
BugWEB-37137Some vuetify (1.4.6) components have unknown html tags
BugWEB-38234Inspection: false positive "Unresolved function or method then()" on async functions without explicit Promise<> return type. (Angular) WS 2019.1
BugWEB-38180Angular v7 error type detection in template after pipe.
BugWEB-37603Ionic 4 components are reported as undefined tags
BugWEB-36303Angular Schematic list gets reloaded every time invoked
BugWEB-36437Angular directive with selectors that are also listed as inputs do not resolve attribute form from metadata
BugWEB-37647"Must be lvalue" in angular template with non-null assertion
BugWEB-36652Enable auto imports for JavaScript symbols in .vue files
BugWEB-36312Angular support conflicts with other templating languages
BugWEB-37963Angular: code should be colored according to TypeScript color settings
BugWEB-38364Angular: Support metadata references in input/output decorator properties for @syncfusion library
BugWEB-37279Declaration is not included in any module inspection doesn't work correct when inpsection the whole project
BugWEB-37991Regression in 2019.1: Webstorm complains about [ngValue] on <option>
BugWEB-36856Go to definition for some Ionic components takes you to metadata
BugWEB-35634Angular: directives from node modules not present in package.json are not available
BugWEB-37588[TypeScript][React] Component requires props from a Component connected to Redux
BugWEB-38085Angular: no support for NgModule decorator initialized with const
BugWEB-37660JSX: propTypes don't work with spread if they are defined using literal properties
BugWEB-21457Angular2: path in templateUrl changes to path relative to current file on refactoring
BugWEB-37540Angular: auto close opened curly brackets automatically
BugWEB-38458Incorrect "not declared in any Angular module" inspection warning in spec files
BugWEB-36817Completion for 'native' event modifier in Vue.js
BugWEB-36089ng-template is listed twitce in the completion list
BugWEB-32279Support propTypes defined using static getter
BugWEB-37589Some build-in angular modules are marked as not Angular modules
BugWEB-34475Angular Dependency and Angular Schematics actions should not be available for scratches and libraries in the project view
BugWEB-29774AngularJS: don't inject AngularJS in `@` component binding value
BugWEB-38760Angular - no completion item for *ngTemplateOutlet directive
BugWEB-37557TSX: No completion of React components if they inherit from another component
BugWEB-36447Vue options and lifecycle hooks are marked as unused when vuex is present
BugWEB-36111Angular - malformed code causes issues
BugWEB-37915False positive 'File reference problem' for angular template
BugWEB-37396Exception when invoking 'Replace with template string' action in the angular template
BugWEB-37350If directive has multiple selectors, non of them gets recognized in template
BugWEB-35684Angular: ensure Angular support is stub safe
BugWEB-35941Angular 2 HTML binding auto-suggest doesn't treat custom components Input() and Output() as relevant
BugWEB-37644Angular expression comments are incorrectly lexed
BugWEB-37943Angular. Can't resolve the variable name for ngFor items of type 'any'
BugWEB-38150Please support this.property in angular template
BugWEB-28364Validation for location field new new Angular CLI project dialog doesn't work in PyCharm
BugWEB-35197Angular: CSS selector marked as unused if it's used in [ngClass]
BugWEB-38153The variable type is not resolved when using 'slice' pipe
BugWEB-37058Angular - support standard attribute to property mappings
BugWEB-38554Angular, Native Script: provide extension to contribute to template context
BugWEB-36009Convert to Class Component strips comments
BugWEB-35868Type information on template reference variable looks bad
BugWEB-36147'Add import' is suggested even if component has been already auto-imported( js -> ts )
BugWEB-38082PropTypes.shape should support warn on missing required prop inside 'shape'
BugWEB-37798Angular: generic members of parent class not resolved correctly in template
BugWEB-37509Emmet expansion in JSX templates generates Quotes for event handlers
BugWEB-29489Cant 'yarn start' in create-react-app project created via IDEA new project dialog
BugWEB-37132Angular: CSS selectors from component local stylesheets are marked as unused
BugWEB-36119Angular. Invalid items inside the completion list after the "for" word
BugWEB-37318Angular: syntax issues with xml entity references
BugWEB-37879Angular: $event type is wrong in (ngModelChange)
BugWEB-11206AngularJS: Wrong "Unknown HTML tag attribute" warnings
BugWEB-37877Angular: issues with union types
PerformanceWEB-38200IDE hangs on Angular metadata resolving
UsabilityWEB-37414Angular. Template. Autocomple inserts [class.] instead of class attribute
UsabilityWEB-38425UI improvements for inspections and completion presentation for Angular components
CosmeticsWEB-38956Do not show error about missing Angular template property when class is not yet defined
CosmeticsWEB-38979Angular: provide UI for --defaults parameter in new project wizard
TaskWEB-26592Angular: Improve suppression inside component's templates
ExceptionWEB-36170Exception is thrown when removing reference in angular tempate
JavaScript. InspectionsFeatureWEB-36805Inspection and quick fix to move a variable closer to its usage joining with the initializer
FeatureWEB-36124Enable and improve JS inspections "Pointless bitwise expression", "Shift operation by inappropriate constant" and "Incompatible bitwise mask operation"
FeatureWEB-36319More inspections related to 'switch' statements
FeatureWEB-36229Add Inspection for missing switch statement cases
FeatureWEB-37903Inspection and quick-fix to merge variables assigned to same destructuring patterns
FeatureWEB-2385Detect accidental =+ instead of += on string variable
BugWEB-36832Quick fix for 'no default branch in switch statement' is not displayed
BugWEB-36236Suppressing several inspections for one line adds comments in several lines
BugWEB-38316False positive (?) for "Result of assignment expression used" inspection
BugWEB-30494'Replace with template string' incorrectly handles non-string items at start
BugWEB-37025"Condition is always true" inspection for THE standard "is this an object" test
BugWEB-38383False 'redundant typeof check' when using destructuring assignment with default values
BugWEB-36945Don't highlight unreachable 'switch' labels in case of non-strict literal types
BugWEB-36969Function exit points highlighting: highlight 'yield' in generators, better highlight 'throw' in try-catch
BugWEB-37347False positive "Reports pointless bitwise expressions" inspection
BugWEB-36970False positive 'Expression type does not have [Symbol.iterator]' for 'any' type
BugWEB-35108"Missing await for an async function call" is not triggered when requiring async function
BugWEB-36869No notification about missed await if async function call is on the right side of assignment
BugWEB-36920Unused variables inspection/fix behave incorrectly with destructuring
BugWEB-34810False positive "unused function" with <a href="javascript:functionName()" />
BugWEB-36833finally { ... } code incorrectly flagged as unreachable
BugWEB-18936ES6/7 class declaration with getter/setter and default value causes "duplicate declaration" highlight.
BugWEB-35745No notification about missed await near Promise returned function
BugWEB-38138inspection incorrectly reports "variable xyz is declared in clause abc but is being used in clause def"
BugWEB-37738false positive: "Variable initializer is redundant"
BugWEB-36979Destructuring intention actions shouldn't be available on type annotations
BugWEB-32220Not relevant quick-fixes for the missing import statement inspection for PropTypes
BugWEB-36452"Condition is always true" false positive for result of local arrow function
BugWEB-38726Inspections: Typo (Spellcheck) inspection is doubled for the arrow function
BugWEB-33988Infinite while loop incorrectly flags outer try block as unreachable
BugWEB-35539"Unreachable code" inspection false positive with labeled break
BugWEB-38952Intentions: "Generate destructuring pattern": disable for enum literals
BugWEB-31084Node Module exporting a symbol named Promise breaks native symbol resolution
BugWEB-36909"Add this qualifier" quickfix doesn't work in offline inspections results
BugWEB-36304False positive: 'arguments' not allowed
BugWEB-37097inline suggestion of a const variable -> changes outcome
BugWEB-31327"Unreachable code" inspection false positive
BugWEB-34239Not possible to suppress inspection in class decorator
BugWEB-38543Cleanup fixes reported from "Missing module dependency" inspection
BugWEB-29577Good code yellow: Local variable is redundant when restoring original value
BugWEB-31269Inspection "Missing await for async function call inspection" false positive
CosmeticsWEB-37011Inspections: JS: clean up descriptions
CosmeticsWEB-37186'Replace Switch With If' intention has a similar inspection
CosmeticsWEB-36967Typos error in Settings → Editor → Inspections → JavaScript, missed a space in the inspection description
TaskWEB-35027TypeScript / Javascript nullability: further improvements
ExceptionWEB-38515PsiInvalidElementAccessException is thrown for "Create derived class" intention
JavaScript. RefactoringFeatureWEB-32725Postfix templates for destructuring
FeatureWEB-22569ES6 convert var to let/const inspection/intention: support destructuring operator
FeatureWEB-38662'Introduce variable' can introduce spread elements when selection is over multiple array elements/properties
FeatureWEB-36724Add intention to convert between indexed and dotted object notations
FeatureWEB-26313ES6 refactorings: convert promises to async/await
FeatureWEB-33422Destructuring should be used where possible ('Convert parameters to object')
FeatureWEB-34162Add an intention action to quote/unquote object literal properties
FeatureWEB-38308Inspection and cleanup for redundant await/return Promise.resolve() and Promise.reject()
FeatureWEB-38801'Introduce variable' for destructuring patterns in variable declarations
FeatureWEB-38307Inspection for redundant 'return await' and 'await await' + corresponding cleanup for convert-to-async
BugWEB-35600'Convert to class component' should produce propTypes, defaultProps as field declarations if code template contains them
BugWEB-36622Wrong default import when using Move refactoring for React components
BugWEB-37310'Convert parameters to object' shouldn't be available if one of the parameters references 'this'-type
BugWEB-37884'Convert parameters to object' should support rest/spread
BugWEB-37081Use 'const' for the introduced destructuring by default
BugWEB-37064Don't show 'Convert parameters to object' for callback function
BugWEB-33350Fix focus in 'Change signature' dialog when shown from quick fix
BugWEB-37164'Change signature' is not available inside .vue files when return type is mismatched
BugWEB-28356Extract method refactoring is not performed when semicolon is not selected
BugWEB-38208Invalid code is generated when splitting destructuring object
BugWEB-36892'Convert to let/const' breaks code when called in For loop
BugWEB-36898Intention to split variable declaration and initializer incorrectly processes loops
BugWEB-36923Inlining a function inserts an erroneous import for the same file
BugWEB-37227Intentions: "Convert to async function": equal constructions are converted differently
BugWEB-37401'Convert to async function' produces broken code if no semicolons selected in code style settings
BugWEB-37121'Extract type alias' should add an extra type parameter for 'this'
BugWEB-35940Don't suggest to rename file when renaming fields
BugWEB-37301'Replace with destructuring' intention places variables after the preceding when all the variables are in the same list
BugWEB-37270Introduce array destructuring: java.lang.RuntimeException: Document is locked by write PSI operations.
BugWEB-36847Extract method may produce incorrect code when nested function is used in extracted method
BugWEB-2257'Inline function' shouldn't lose side effects in returned expressions
BugWEB-16853Incorrect brace insertion
BugWEB-35443'Create field' creates field outside object
BugWEB-37160Intentions: finally statement is lost after the "Convert to async function" intention invocation
BugWEB-38194Converting string concatenation to template string drops comments
BugWEB-34947"Extract method" refactoring may create method, which doesn't return necessary variables if they are created using object destructuring
BugWEB-36499Wrong for...of intention
BugWEB-16954JavaScript. Error when extracting method from object property
BugWEB-36358Split OR'ed if produces corrupt output
BugWEB-38329"Add braces to arrow function" in JSX replaces function body with `{ return null'; }`
BugWEB-36891Improve 'Join variable declaration and assignment' for loops
BugWEB-38306'Convert to async' doesn't properly process chains with calls as then/catch arguments
BugWEB-36136"Extract variable" refactoring may produce incorrect code if spread operator is used
BugWEB-36630Typescript extract parameter in arrow function doesn't affect call site.
BugWEB-36912Convert between indexed and dotted object notations: should have better availability
BugWEB-35909Inline Function: (Typescript) nested "return" statement of inner anonymous function is lost
BugWEB-36633Webstorm goes unresponsive when trying to extract a variable using ` cmd + option + v `
BugWEB-37205Convert to async function refactoring loses generic parameter
BugWEB-37131Intentions: preserve arguments names with the "Convert to async function" intention
BugWEB-36088On Refactoring - multiple imports are added
BugWEB-37239Intentions: "Convert to async function": correctly convert the anonymous function into IIFE
BugWEB-36799'Extract function' should work when selection contains local functions
BugWEB-37254Replace with indexer access: introduces red code in case of generics
BugWEB-37328'Convert to async function': properly handle same-call then-catch
BugWEB-36725Converting to named function creates unnecessary public modifier
BugWEB-38745Refactoring: Move is too slow and changes import unexpectedly
BugWEB-34668move statement up - last array/object item - same line comment - incorrect comma
BugWEB-36814'Split into declaration and initialization' produces incorrect code
BugWEB-38590'Iterate with for..of' intention action should suggest to iterate with 'for await..of' in case of asynchronous iterable
BugWEB-37888'Introduce object destructuring' should warn if breaking type guard narrowing
BugWEB-38013Convert to async function doesn't play well with destructuring
BugWEB-34393Extract variable shouldn't be available on 'export default function' when corresponding function has overloads
BugWEB-36238'Change signature' fails with TS arrow functions
BugWEB-15758Comma missing after 'Create method' in object literal scope
BugWEB-37280JS 'Extract method' produces extra newlines when selection contains nested function
BugWEB-37313'Safe delete' for variables doesn't check for usages anymore
BugWEB-37163AssertionError: Could not parse TS type from '*[]' when call 'Change signature'
BugWEB-37228Intentions: "Convert to async function": comments in the code blocks are lost after the conversion
BugWEB-37170Remove actions ( 'Introduce local variable' and 'Introduce object destructuring') from embedded expressions
BugWEB-37207Convert to hex/decimal/binary/octal is giving wrong results
BugWEB-37554Don't show Replace with destructuring for nested arrays/objects from the topmost qualifier
BugWEB-33970False positive 'Cannot extract code with conditional return' in extract method
BugWEB-37311'Convert parameters to object and introduce interface' should be available when parameters reference 'this'-type, and should extract generic interface
BugWEB-37462Inlining an arrow function into a options object initializer produces unexpected results, removing the option field name.
UsabilityWEB-37234Mnemonics missing in inline dialog for typescript
UsabilityWEB-37814Move refactor reformats unrelated imports
UsabilityWEB-38742'Propagate to destructuring' should be available on the variable itself
UsabilityWEB-38304Extend availability of 'Convert to async' action to the same scope as 'convert to anymomous/named' are available o
UsabilityWEB-37204Simplify parenthesized expressions when doing extract-refactorings
TaskWEB-37188Better UX for 'generate delegating methods' dialog
ExceptionWEB-37077Exception on 'introduce object destructuring'
ExceptionWEB-37158Intentions: java.lang.Exception is thrown for the "Convert to async function" intention
JavaScript. TemplatesFeatureWEB-10883Mustache Plugin: Add Support for Inerhitance
BugWEB-34584Incorrect default formatting in rwwd React live template
LESSFeatureWEB-36239Support for LESS Maps
BugWEB-37598LESS Wrong Code Format for each() function
BugWEB-38322Less: nested @supports at-rule causes syntax errors
BugWEB-36397Char is missing when renaming variable variable in less
BugWEB-37803Less: nested detached rulesets cause false 'semicolon expected' error.
BugWEB-12669Formatting detached rules
BugWEB-18970Less: incorrect formatting of detached rulesets
BugWEB-24644less-file report an error on using the literal sign '~'
BugWEB-35947Tilda-escaped import is shown as error in Less
LintersFeatureWEB-36988Support @typescript-eslint for automatically linting .ts files using integrated ESLint
FeatureWEB-30614Stylelint support should allow inspection of JS files
FeatureWEB-36890TSLint: Replace 'Lint JavaScript Files' checkbox with detection based on presence of 'jsRules'
FeatureWEB-35990ESLint: Use the runtime config(cliEngine.getConfigForFile) to detect which file types should be linted
BugWEB-36164'Fix all TSLint problems' should be available in context menu
BugWEB-37178Provide quick fixes when running TSLint with typescript-tslint-plugin
BugWEB-37143Missing support for ESLint globals new syntax
BugWEB-37116ESLint depends on location of first linted file
BugWEB-35954Stylelint does not follow ignoreFiles configuration on Windows
BugWEB-38737Importing 'indent' rule from ESLint configuration should disable conflicting settings.
BugWEB-37383Wrong highlighting with typescript-tslint-plugin and whitespace-checking rules in vue
BugWEB-35917Some TSLint rules are not imported from tslint.json
BugWEB-37761Unexpected Language service response - eslint with ts files (vue-parser as parser)
BugWEB-38213Invalid highlights for CRLF line endings when using typescript-tslint-plugin
BugWEB-38038"Apply Linter Code Style Rules" doesn't apply rules if application code style scheme is set until project is reopened
BugWEB-35856'Fix current file with ESLint' doesn't replace line endings when linebreak-style configured in .eslintrc
BugWEB-38490Exception attempting to suppress ESLint errors from the Inspection results tool window
BugWEB-37528typescript-tslint-plugin: invoking 'fix all errors' in vue file breaks code
BugWEB-38096Difficult to turn off TSLint for javascript in 2019.1
BugWEB-36127Some TSLint rules are not imported if config extends 'tslint:latest'
BugWEB-37862Linter errors thrown on initialization should show stacktrace
BugWEB-36803Errors reported by linters should show better tooltip if error message is multiline
BugWEB-37378typescript-tslint-plugin highlights wrong ranges for semicolons rule
BugWEB-38922eslint6 not working
BugWEB-36889ESLint: doesn't work if there is no dependency to it in package.json and auto-detection of configs is enabled
BugWEB-37656eslint.additional.file.extensions registry option should trim space
BugWEB-37019ESLint error tooltip shouldn't evaluate HTML if messages contain fragments of HTML/JSX from current file
BugWEB-37120TSLint Schema for "whitespace" not up to date
BugWEB-37713WSL: Stylelint cannot be started
BugWEB-37547'Suppress all ESLint rules for current file' adds 'null' if 'eslint-disable' already exists at top of file
BugWEB-38881"Reformat with Prettier" should be available for files with shebang
BugWEB-36806'Detect package and configuration file' in linters doesn't unselect custom config file
UsabilityWEB-36808For linter errors with no quick fix provided, show suppress rule actions in the top-level menu
CosmeticsWEB-37027Linters config UI: replace label about automatic configuration with question mark icon with popup
TaskWEB-35989Update condition for running ESLint on .vue files
TaskWEB-38083Remove action to reset changes to code style on importing from TSLint
ExceptionWEB-36681NullPointerException when open file in create-react template project
Live EditPerformanceWEB-36060LiveEdit plugin causes freezes on debug
Node.jsFeatureWEB-37534Docker compose: support Debug mode when "JavaScript file" field is empty
FeatureWEB-12988Basic Node JS template
FeatureWEB-37123Offer the dev an auto-complete list of the environment variables defined in the active project run-time configuration. when process.env is entered in a statement.
FeatureWEB-22231Feature Request: Semver tooltip hinting
FeatureWEB-35765Navigation and resolve for npm script names
FeatureWEB-36167[NodeJS] missing field in packageJsonSchema.json
FeatureWEB-35072ESLint on WSL not work when mount point '/mnt/c' is changed to others (e.g. '/c')
BugWEB-38634The built-in Node module 'module' flagged as not listed in dependencies
BugWEB-36645Use 'bin' property from package.json to run npm/yarn
BugWEB-35836Coding assistance for Node.js requires re-enabling after upgrade to 2018.3
BugWEB-37990Node.js: newly added npm package should become available immediately after npm install
BugWEB-36650Go to definition for package name in package.json doesn't open module in project view
BugWEB-36753'yarn install' from package.json quickfix / not installed dependencies notification should refresh parent directories
BugWEB-36921A window pops up when stopping a run task on windows
BugWEB-33257WSL: can't create create-react-app
BugWEB-37308Navigate and resolve to script files
BugWEB-38176NPM package version is mistakenly reported as not matching range from package.json
BugWEB-36178Cannot auto-detect installed and hoisted package declared in a sub-project package.json
BugWEB-38253Missed update npm dependencies on not actual node_modules in PyCharm
BugWEB-36987Highlight __filename & __dirname as local
BugWEB-37960WSL: Angular Karma: the wrong path is used for old framework versions
BugWEB-36082Having // in package json refreshes indices forever
BugWEB-36048Autocompletion for "import { writeFileSy... }" imports from "node" instead of "fs"
BugWEB-30960Change alignment in 'Package manager' field
BugWEB-36819Open in browser is suggested for 'url' and 'repository' keys in package.json
UsabilityWEB-37992The tool window clear buffer icon (garbage bin) is gone
UsabilityWEB-36831Do not pre-configure working directory in Node.js run configuration template
UsabilityWEB-36855NPM Upgrade via IDE allows multiselect but upgrade only updates last selected package
UsabilityWEB-35968Settings update npm packages gives no indication of activity
ExceptionWEB-37707package.json: Semver check produces Throwable
Pug (ex-Jade)FeatureWEB-7901JADE: add breadcrumbs bar showcasing the nested elements like HTML & HAML have
FeatureWEB-15349Allow multi-line property lists to be indented
BugWEB-14174Jade: Completion: replace obsolete value '5' with actual 'html'
BugWEB-22432Support ES2015 syntax in Jade/Pug unbuffered code
BugWEB-32306Arrow functions are not supported in the script tag in Pug
BugWEB-35735Pug: no tags completion in block section
BugWEB-19541Jade string formatting incorrect if /n is present
BugWEB-36968Pug: accepting completion for doctype removes a preceding space
BugWEB-19320Highlighting breaks for ES6/2015 tagged strings
BugWEB-22802Pug: support ES6 template strings
SASSFeatureWEB-34910Sort CSS properties (aka Rearrange) in SCSS files
FeatureWEB-6015Add color preview box in the left gutter for variable (containing some color value) reference (as it done at its definition)
BugWEB-38149Sass mixin content arguments not recognised
BugWEB-37830Webpack config file written in ES5 with 'exports.default' may cause false 'unresolved file' errors in import statements that use webpack aliases
BugWEB-37834Sass: "@import '~webpack_alias/foo/bar/partial" is not resolved although _partial.scss file exists
BugWEB-36991Sort CSS properties (aka Rearrange) doesn't properly sort nested properties in SCSS
BugWEB-7524SCSS cannot find mixin which is declared later in the file
TypeScriptFeatureWEB-36292Use capitalised variable name as placeholder for the extracted type or interface name
FeatureWEB-37105Support TypeScript 3.4 contextual type inference from generic return types
FeatureWEB-36981TypeScript: add quick fixes for adding library in tsconfig.json
FeatureWEB-37201Introduce smartcast highlighting similar to that we have in Kotlin
FeatureWEB-37610Syntax highlighting in the quick navigate tooltip
FeatureWEB-26429Generate -> Delegate Methods for ES6/TypeScript
FeatureWEB-31972TypeScript / JavaScript: allow relative imports for files under path mappings
FeatureWEB-36291Make Extract TypeScript interface available for a variable holding the object
FeatureWEB-38589Intention action to add explicit enum values for TypeScript enums
FeatureWEB-36375Add new intention to wrap the return type of async method to a global Promise type
FeatureWEB-37122An extra intention action to convert parameters to object + extract interface
FeatureWEB-14945Parameter hints / parameter info / documentation support for rest-tuples with --strictBindCallApply
FeatureWEB-38161Update bundled TypeScript to 3.4
FeatureWEB-37051Support TypeScript 3.4 readonly array/tuple types
FeatureWEB-33130Vue.js: use ts service for vue files
FeatureWEB-36444Support TypeScript 3.3 merged signatures
FeatureWEB-37445Update bundled TypeScript to 3.3
BugWEB-36829False positive 'Item is not redundant' when assigning to typed variable before returning
BugWEB-36373HTML errors in angular application
BugWEB-38500Typescript find usages fails for object/interface keys containing dot
BugWEB-35937TypeScript: typeof works incorrectly with overloads
BugWEB-36019Do not add .ts file extension for filename.tsx when using New TypeScript file
BugWEB-38271Implementing methods for object literal doesn't properly substitute generics
BugWEB-38296introducing interface doesn't work if parameter selected with the type
BugWEB-34136Wrong rewriting of import path after moving a dependent file
BugWEB-37956strictBindCallApply inference for 'bind' is broken because of incorrect comparison of conditional types
BugWEB-38113typeof inspection bug
BugWEB-37650"Specify type explicitly" on a generator function adds the yielded type T, not Iterable<T>
BugWEB-36195Incorrect Typescript intention: "make private" on lambda
BugWEB-37494Circular imports
BugWEB-37592Support for typeof import
BugWEB-36731"Introduce destructuring variable" intention. Read/write usages
BugWEB-37426Type guard flips types in union type where it shouldn't change the type at all
BugWEB-36317'Specify type explicitly' doesn't work for function/lambda expressions and also doesn't properly derive union return types
BugWEB-38509move file under path mappings "*" to "*" breaks references
BugWEB-38022Angular: Short typescript imports are not working
BugWEB-31139Incorrect inference for Record type in conditional type
BugWEB-38270TypeScript editor sometimes stop working
BugWEB-38482Typescript: no property value suggestions for generic type (using conditional types)
BugWEB-36464Destructuring intention actions should better handle 'const' variables
BugWEB-37779Typescript - remove unused constant breaks code
BugWEB-37342Incorrect rename when shorthand property assigned to TS object type / with object return type
BugWEB-37514TypeScript: support keyofStringsOnly compliler option
BugWEB-37552tsserver crashes with assertion on TS side on removing script tag in vue file
BugWEB-37154Add 'readonly' in the completion list
BugWEB-37507'Redundant local variable' inspection is spurious when the variable assignment is used for type widening.
BugWEB-33906Intellij doesn't see $any() as existing method in Angular template
BugWEB-37606"Do not show parameter hints for this method" not suggested for functions types
BugWEB-37727TypeScript non-null assertion operator doesn't help to access nullable object's properties
BugWEB-37129typescript/idea auto create method bug
BugWEB-37488TypeScript: properly expand mapped type with 'any'
BugWEB-37251TypeScript config: "strict" option includes "strictNullChecks"
Bug