Child pages
  • TeamCity 8.1 Release Notes

Versions Compared

Key

  • This line was added.
  • This line was removed.
  • Formatting was changed.

...

  • TW-4037 - Zero success rate histogram bars are not visible
  • TW-4567 - Agent's ownAddress should be resolved on server
  • TW-5070 - External HSQLDB is shut down on TeamCIty exit
  • TW-5254 - Report user-level errors in a user-friendly way for TFS
  • TW-10093 - Resetting search caches produces FileNotFoundException errors in the log
  • TW-13010 - Unable to start TeamCity. Error: Attempt to start more than one TeamCity server connected to the same database
  • TW-14621 - Persistent "Attempt to start more than one TeamCity server connected to the same database. " after abrupt server shutdown
  • TW-14709 - Tomcat leaks-related logging on server stopping (JDBC Driver has been forcibly unregistered)
  • TW-17018 - Start build precondition sometimes allows builds with unsatisfied dependencies to start.
  • TW-17594 - .NET Duplicates produces different results
  • TW-17707 - Parsing failure while reading trx file should cause the build to fail
  • TW-17906 - Error while cloning submodule repository from github if the url doesn't end with '.git'
  • TW-19313 - Custom build checkout directory under agent's work can be deleted on agent start
  • TW-19381 - Free disk space logging logs weird messages (seems to clean when free disk space requirement is already met)
  • TW-19410 - TeamCity should not follow junctions when cleaning checkout directories on agent (checkout directories and .old) - Windows
  • TW-19534 - JGIT: invalid advertisement of 001E# w/ Appharbor.com
  • TW-20288 - Exception in logs when try to search in newly installed TeamCity
  • TW-20798 - Rest: more builds can be returned when querying with untilBuild specified
  • TW-21133 - Copying a Project "bakes-in" parameter values in the copied project and they need to be Reset to restore proper behavior
  • TW-21410 - XML report watcher reports "No reports found" when reports are found, but filtered out by creation timestamp
  • TW-21554 - Powershell runner - script fails but the build succeeds - 'Process exited with code 0'
  • TW-21569 - Teamcity 7.0.3 does not resolve system/ environment properties in maven settings.xml
  • TW-21974 - UnsupportedOperationException: Build has not been populated on Investigations / Muted Tests
  • TW-22438 - 'My Changes' reloads periodically and collapses the expanded tree nodes
  • TW-22984 - Unclear warn in the build log: "Error reading Maven project: Unable to build project '...; it requires Maven version 3.0.3."
  • TW-23200 - Cannot create a user with a password via POSTing XML
  • TW-23372 - DB Lock Attempt Failed After Manual Shutdown of TeamCity (teamcisty-server.sh stop did not work properly?)
  • TW-23792 - system.teamcity.agent.build.checkoutDir.expireHours=never doesn't work
  • TW-23826 - LDAP group synchronization error: "The specified username is already in use by some other user. "
  • TW-23850 - TeamCity windows service agent not respecting buildAgent.properties system.teamcity.agent.build.checkoutDir.expireHours entry
  • TW-24311 - References to invalid VCS roots (no roots with such id present) are silently ignored
  • TW-24926 - TC 7.1.3. Confusing msg when adding a license key which already exists
  • TW-25074 - Eclipse plugin raise an OverlappingFileLockException
  • TW-25077 - Cannot downgrade Eclipse plugin to match TeamCity server version: "No updates are found"
  • TW-25211 - Tests are shown as <no suite> if reported test name starts with reported suite name
  • TW-25625 - Do not redirect first request from user to user's profile if the request is coming not from browser
  • TW-25805 - Windows domain authentication may hang on attempt to create com.sun.jna.platform.win32.WinNT$HANDLEByReference instance
  • TW-25813 - Eclipse plugin. Avoid exception when "Hide Coverage Information in Editors" button is unchecked.
  • TW-26181 - FileNotFoundException in search
  • TW-26227 - rake runner not compatible with test-unit-2.0.0.0
  • TW-26770 - Auto-generated branch can appear without custom build (VCS roots change and build re-queuing on unexpected finish case)
  • TW-26818 - Changes can be not displayed in TeamCity for new branch pointing to commit of another branch not built by the build configuration
  • TW-26834 - Wrong queued build data on change page (builds from unrelated branch are displayed)
  • TW-27255 - Correctly detect new/same compile errors
  • TW-28507 - Unexpected Error while expanding step in Build Log
  • TW-28565 - Statistics charts: Build duration: too small vertical scale
  • TW-28826 - xCode step - Check / reparse project failed when working with Vault VCS plug-in
  • TW-28839 - Failed to start build: BuildPromotionImpl.getPreviousBuildPromotion() may cause deadlock on MS SQL
  • TW-28897 - Entered but not submitted data can be lost on "remove selected"
  • TW-28950 - Cannot create Maven Build configuration from pom file when https URL is used.
  • TW-29263 - Filtering by X axis is confusing: not stated that it is applied
  • TW-29398 - Code coverage chart is smaller in height then other statistics charts
  • TW-29400 - Unarchived subprojects are not displayed in Administration->Projects if parent project is archived.
  • TW-29495 - No sorting on shared resources page
  • TW-29507 - Changed comments in investigate/mute dialog does not always save
  • TW-29759 - With jTDS higher than 1.2.5 TeamCity fails to start
  • TW-29771 - On not running builds in professional mode, provide a link to get evaluation
  • TW-29874 - Use "IntelliJ IDEA" instead of "IDEA" in UI everywhere
  • TW-29907 - Newlines may be lost in build problem e-mail notification
  • TW-29976 - Swabra may kill TeamCity agent during locking processes killing (system process is locking checkout directory)
  • TW-30278 - teamcity 8.0 newly deployed agents jre 1.7.0_21 puts extra quotes in command line batch execution.
  • TW-30580 - Root's project Report Tab configuration is not used in user-accessible UI
  • TW-30646 - Strange vcs-roots-before-project-id-convertor.xml in data directory
  • TW-30679 - Improve Texts on the New Build Step page: Maven Runner
  • TW-30719 - NUnit runner can make the build "failed to start" even if it is not the first step
  • TW-30982 - Hard to find archived project from user UI (no filtering, and hierarchy)
  • TW-31008 - Lots of logging from torrent plugin (Reroute torrent plugin logging into usual log4j config)TW-31016 - Cleanup should find and remove builds belonging to removed build types left by interrupted cleanup process
  • TW-31102 - Accept valid license keys even if there are invalid ones entered
  • TW-31229 - Agent does not connect to the server if IPv6 address is specified in ownAddress setting
  • TW-31251 - Support NuGet 2.7 restore command
  • TW-31655 - To simplify setup of git VCS roots with https with self-signed certificate
  • TW-31692 - Exception in Flush Queue: DatabaseDeadlockException: MySQL DEADLOCK has encountered: Deadlock found when trying to get lock; try restarting transaction
  • TW-31693 - Can't set executable flag: file does not exist or is not a valid file: lcp.cmd
  • TW-31798 - Page is trying to load jquery source map
  • TW-31911 - java.io.IOException: Handshake size read underrrun on agent
  • TW-31928 - TeamCity CCTray XML not compliant with CCTray XSD
  • TW-32087 - Stacktrace in the agent log on canceling build during sources checkout
  • TW-32213 - Test run details on investigations and other pages: no project name is displayed, just build configuration name which is confusing
  • TW-32293 - No validation for Build tag field on Edit project-level report tab dialog
  • TW-32319 - Build cannot be stopped while downloading artifacts via torrent
  • TW-32333 - Report tab with huge title is not deleted
  • TW-32429 - Xcode runner issue in Xcode 5
  • TW-32458 - IE8. JS error on trying to select Add button in Select Run Configuration popup.
  • TW-32523 - Test duration graph shows incorrect statistics for tests
  • TW-32571 - MySQL deadlock on attempt to delete data from action_history table
  • TW-32590 - Teamcity can't start EBS instance it its image was deleted
  • TW-32599 - VCS labeling scope is changed to <All attached roots> if root was detached.
  • TW-32601 - Users are shown link to server health report that they do not have permissions to follow
  • TW-32604 - Investigations view may show incorrect builds for a test
  • TW-32615 - Double plugin resource unpacking on each server start
  • TW-32637 - When creating a VCS Root using v8.0 API the ID field is ignored.
  • TW-32750 - Copy build step to other project should not rename it
  • TW-32792 - Ensure NuGet 2.7 is supported
  • TW-32797 - Failed to publish file in artifacts cache error
  • TW-32806 - Investigate dialog is blinking when project scope is changed.
  • TW-32893 - NPE in the logs form BuildTypeTab.getUserBranch
  • TW-32913 - "$() is null" alert in browser on creating administrator account
  • TW-32927 - Build might not stop on execution timeout (SSH exec runner)
  • TW-32938 - Incorrect page is shown after VCS root change
  • TW-32955 - Agent can break the system massively moving files to .old with "directory is not listed in directory.map" reason
  • TW-32996 - Correct hyperlink in server health report concerning future license expiration.
  • TW-33005 - Total number of licenses is reported incorrectly in License expiration health report.
  • TW-33023 - Server health report item on build configuration looses yellow background
  • TW-33025 - Rename Maven settings storage directory to mavenSettings
  • TW-33026 - Brush up Maven Settings project tab titles
  • TW-33033 - IDEA runner processes Java workdir differently
  • TW-33089 - IE8: JS error on trying to add/edit report tab
  • TW-33114 - Artifacts are published to cache using internal build type id
  • TW-33129 - Rename "Hub" plugin into something more clear for the user
  • TW-33133 - REST call can get 302 redirect instead of 401 unauthorized when JetBrains Hub authorization is active
  • TW-33146 - A new user with number at the end can be created on login
  • TW-33154 - email notification template error on problem auto unmute/remove investigation
  • TW-33165 - Improve agent logging from torrent plugin
  • TW-33167 - Torrent enabling settings are confusing
  • TW-33205 - List of agents is returned with "agents-ref" root tag
  • TW-33210 - Memory leak in Torrent plugin (too many SharingPeer objects)TW-33277 - Improve disk space reporting in QueuePauser and DiskSpaceWatcher
  • TW-33278 - Failed to Move project
  • TW-33321 - Cannot change agent filter on statistics
  • TW-33381 - Two same authentication modules can be inserted into the table
  • TW-33430 - REST: cctray.model.Project depends on Suns XMLGregorianCalendarImpl
  • TW-33432 - Confusing lines int he build log: builder returns 'null' from 'getCompilableFileExtensions', need to update Scala and Kotlin JPS plugins
  • TW-33436 - Unexpected exception when trying to connect second TeamCity instance to the internal HSQL database
  • TW-33446 - Display an encrypted password in Password field on Database connection setup screen.
  • TW-33448 - MySQL. Existing database schema is not correctly detected.
  • TW-33449 - "JPS build failed to load optimized file manager for javac" in the build log on Idea project runner
  • TW-33452 - [TEAMCITY TEMPLATE ERROR] in jabber "You are assigned for build problem investigation" notification
  • TW-33489 - Speedup publishing of artifacts in artifacts cache
  • TW-33498 - Test connection for new VCS root does not work when root name is not specified
  • TW-33504 - Filename on agent logs tab is incorrectly reported
  • TW-33549 - TfsSupport.getCurrentVersion loads server with "Starting new TFS pooled process" in the log
  • TW-33550 - Confusing and excessive ldap logging: "Total results: 1"
  • TW-33552 - Cannot login into TeamCity: RejectedExecutionException: Task java.util.concurrent.FutureTask rejected from java.util.concurrent.ThreadPoolExecutor
  • TW-33561 - TeamCity Idea Plugin 8 ignores Idea 13 SVN command line client option
  • TW-33596 - Clean-up rules for a template are not reset
  • TW-33600 - Upload of Maven settings does not work or uploaded maven settings are not displayed correctly
  • TW-33603 - Problem investigate.mute dialog has "when test passes successfully" options
  • TW-33604 - Gradle runner discovery works too slow
  • TW-33612 - System problems be may not shown on project overview for subprojects
  • TW-33640 - Specify correct "Cannot find build file by path" build problem identity
  • TW-33651 - Project scope is set as <Root> when investigation is reassigned for a build problem.
  • TW-33652 - Exception in inspections runner (Plugin "Emma" was not loaded: required plugin "Coverage" not installed)
  • TW-33655 - Problem investigation might be not displayed on project's Investigations page
  • TW-33661 - Unexpected error on mavenBuildInfo page.
  • TW-33701 - Build can show more changes then it really has according to DVCS graph
  • TW-33707 - Hub user id is not set on login via hub
  • TW-33708 - Agent is hanging trying to download file via torrentTW-33714 - Critical email notification error is not mentioned in teamcity-server.log
  • TW-33725 - Queued build page: Directly assigned agent is not displayed on the queued build page
  • TW-33739 - Duplicating "Sending build.finish.properties.gz file" in the build log
  • TW-33757 - Maven artifact dependency trigger does not support version ranges
  • TW-33758 - Change Windows console title to "TeamCity"
  • TW-33760 - 'Null' reason is provided in Maven Artifact Dependency Trigger for unsupported protocol
  • TW-33761 - Correctly calculate "Error message is logged" build problem identity
  • TW-33781 - javax.el.ELException: Cannot read property: testConnectionSupported when following "Edit VCS root" link from VCS problem popup
  • TW-33796 - Same presentation as for "Actions" for drop-downs on click: "more"
  • TW-33797 - Not user-friendly torrent plugin logging (onAfterAddOrUpdate, Won't create torrent )TW-33799 - Modified comment is not yellow-highlighted in custom build run dialog
  • TW-33809 - <Guess from the Repository URL> feature should work properly for VS TFS online service.
  • TW-33818 - Any registered user can list all users and groups via REST
  • TW-33826 - Personal builds are not listed in build queue via REST API
  • TW-33827 - Queued builds selection is cleared upon clicking upper "Remove" button
  • TW-33830 - Press "Edit" link in Artifact Dependencies doesn't work.
  • TW-33849 - JPS crash => build failed
  • TW-33857 - UI: VCS root and settings pages
  • TW-33858 - LogUtil.describe(Loggable) throws IllegalStateException: @NotNull method LogUtil.describe must not return null
  • TW-33938 - PROJECT_MAPPING_AK constraint violation
  • TW-33958 - Xml ReportProcessor: single +: rule without wildcards may be ignored
  • TW-33962 - Many locked threads on server (BuildFailureListener.onBuildFinish)
  • TW-34002 - Limit number of "TeamCity XML-RPC Executor" threads
  • TW-34034 - Wrong value in FxCopCmdFileVersion system parameter
  • TW-34049 - Inspections build can finish without any inspections data (NPE in InspectionsStatsCalculator)
  • TW-34079 - NPE from SvnCheckoutOnAgentSupport.createClassLoader on agent start
  • TW-34135 - No changes is shown for a build while in fact there are changes
  • TW-34138 - Broken "View change details" link on diff view
  • TW-34140 - Eclipse plugin. Commit after remote run fails for SVNKit (Subclipse 1.8 + JavaHL)
  • TW-34150 - Brush up error messages in the log on performing git cleanup
  • TW-34174 - Default server-side no output timeout is too small for large git repositories
  • TW-34176 - Improve Git server-side checkout "monitoring" data format
  • TW-34242 - Do not show "Show/hide advanced options" toggle when there are no advanced controls
  • TW-34246 - JIRA: "Retrieving data" instead of "Issue not found" on Issue Log
  • TW-34275 - Build steps might run after failed to download artifact dependencies
  • TW-34307 - Project's REST-changed parent project is not saved after server restart
  • TW-34308 - Exception in CharismaBackgroundProcessor on server shutdown
  • TW-34351 - NUnit 2.6.3 does not work
  • TW-34358 - Maven artifact dependency trigger does not work for SNAPSHOT version
  • TW-34359 - My Changes tab have incorrect change element
  • TW-34360 - Wrong changes order on My Changes page
  • TW-34365 - Test connection error for fixed VCS root after following link in VCS problem popup
  • TW-34366 - javax.el.ELException: Cannot read property: estimationForTimeLeft
  • TW-34375 - List of build configuration in usages popup on VCS root page is not sorted
  • TW-34385 - My changes page does not show personal builds of other users
  • TW-34393 - Timeout exception: the process did not produce output longer than 30 seconds
  • TW-34400 - "TeamCity Uninstall Feedback" on upgrade
  • TW-34403 - Empty project name in drop down on Changes tab
  • TW-34412 - No horizontal scroll bar in DiffView
  • TW-34413 - Parameter "Kind" does not update in "Add New Parameter" dialog
  • TW-34422 - IntelliJ plugin does not show active project which is under archive one
  • TW-34423 - Build can have pinInfo element in REST API, while not being pinned
  • TW-34425 - EAP 29687 breaks SauceLabs integration plugin
  • TW-34445 - Add Copy Template action to the list of actions for Template.
  • TW-34448 - Enable <Root Project> as a target for copying template.
  • TW-34449 - Month range is selected for a Statistics chart in build configuration with no builds for the last month
  • TW-34450 - ClassCastException on adding auto-detected build step to build configuration template.
  • TW-34451 - Build failure condition "on specific text in log" works even when disabled
  • TW-34454 - Copy Template dialog is not available using Internet Explorer 8.
  • TW-34468 - Change details page opened from a change on a build configuration loses context
  • TW-34470 - Wrong number of pending builds in popup on changes page
  • TW-34475 - Invalid progress indicator
  • TW-34482 - Investigations are removed but tests are not fixed
  • TW-34483 - Edit Snapshot Dependency dialog is available for inherited build configuration.
  • TW-34487 - Sometimes an agent can be authorized without administrative permissions on the server (locally running agent case)
  • TW-34492 - Confusing message on URL without trailing slash on VCS creation from URL
  • TW-34497 - VCS Labeling feature cannot be added to the template on VCS Roots page.
  • TW-34501 - Current project/build configuration is no longer highlighted in the popup from breadcrumb
  • TW-34505 - Percent type is missing for coverage items on Reported statistic values tab
  • TW-34534 - Generation of JaCoCo coverage report fails with timeout
  • TW-34535 - NPE in Swabra plugin
  • TW-34538 - UI of ruby environment configurator build feature needs polishing
  • TW-34543 - Modified "Checking interval" for a VCS root is not highlighted as changed
  • TW-34544 - Maven triggers and project information do not use custom maven settings
  • TW-34548 - Artifact names with % are processed incorrectly while adding using Choose Files From The Last Build popup
  • TW-34553 - Duplicate VCS Root is not created in case of exactly the same URL.
  • TW-34555 - The warning for invalid Advanced Option should be displayed on page saving in spite of options visibility.
  • TW-34557 - Script arguments misplaced on powershell build step (TC 8.1 build 29687)
  • TW-34568 - "Use own .. repository" is ignored when reading project information
  • TW-34569 - NPE on selecting project as target for snapshot dependency.
  • TW-34573 - Copy Project action redirects to http://teamcity/admin/copyProject.html in IExplorer8.
  • TW-34578 - Maven embedder debug logs are missing
  • TW-34579 - IExplorer8. Error on the page when build configuration is created from template.
  • TW-34591 - My changes shows my changes instead of changes of a user I specified in text field
  • TW-34622 - Eclipse plugin: Cannot commit file deletion to svn after successful remote run
  • TW-34623 - Warn overtime icon while there is no overtime
  • TW-34640 - Update documentation and warnings displayed on an id change
  • TW-34662 - Progress bars might not be displayed occasionally
  • TW-34672 - AccessDeniedException when querying investigations via REST: make the API filter responsibilities according to user permissions
  • TW-34673 - Brush up "Using vcs information" message in the build log
  • TW-34674 - Exception in CollationMismatchProblemReporter on HSQL 1.8
  • TW-34691 - Cannot start TeamCity: SQL error when doing: DML query SQL query: delete from build_type$
  • TW-34712 - Configuration Parameter Name text box: cursor jumps to end constantly
  • TW-34732 - 'Show archived' checkbox on admin page doesn't work
  • TW-34736 - java.lang.IllegalAccessError: tried to access method jetbrains.buildServer.usageStatistics.impl.providers.BaseFeatureUsageStatisticsProvider.a ddUsage(Ljava/lang/String;)V from class jetbrains.buildServer.usageStatistics.impl.providers.MuteUsageStatisticsProvider$1
  • TW-34741 - User can get AccessDeniedException on getting build details via REST: You do not have enough permissions to view user settings
  • TW-34782 - Solution runner discovery does not set target and configuration for discovered runner
  • TW-34806 - maintainDB tool does not restore database from the backup file.
  • TW-34813 - Make "Build queue was paused" a critical health item
  • TW-34815 - Cannot change "teamcity.diskSpaceWatcher.threshold" while the server is running
  • TW-34816 - Brush up teamcity.diskSpaceWatcher.*threshold properties
  • TW-34829 - Build failure condition incorrectly fails the build when control text appears in build log
  • TW-34830 - First opening of an autodetected Xcode build step silently adds default parameters and asks for Save
  • TW-34841 - cctray httpAuth/app/rest/cctray/projects.xml doesn't work
  • TW-34844 - Automatic merge mercurial: no VCS branches found for logical branch 'default' (new)
  • TW-34847 - Xcode project auto discovery should look for project deeper
  • TW-34848 - Server Easy setup doesn't discover MS SQL jdbc driver
  • TW-34858 - Automatic merge: merging can be performed on the second build with no new tests failed, while tests still fail from the previous build on the branch
  • TW-34866 - Too wide text area in "Merge this build sources in VCS" dialog
  • TW-34871 - Diagnostics page does not show heap memory usage
  • TW-34896 - Deadlock in org.apache.maven.wagon.providers.http.commons.logging.impl.WeakHashtable.put
  • TW-34900 - Create new project: parent is ignored
  • TW-34902 - An exception is logged, when opening the backup page for the first time
  • TW-34904 - Unable to easy setup an Oracle DB, if password contains '@' character
  • TW-34921 - On error in the settings files on disk, load what can be loaded (i.e. the project)
  • TW-34936 - Analyzing maven-enforcer-plugin ignores configuration outside of <executions> tag
  • TW-34953 - No builds shown for remote run on Changes page
  • TW-34958 - Add a link to fix action for "Critical error in configuration file"
  • TW-34989 - Error: Bean buildTypeId not found within scope while processing request: POST '/admin/buildTypeHealthStatusItems.html
  • TW-34990 - Unable to easy setup Oracle DB via integrated security
  • TW-34992 - User with administrative permissions for some projects only cannot list all server health items
  • TW-35000 - Inspections .NET build step page fails with JspException

...

  • TW-20594 - Specifying broad patterns in XML reporter build feature can slow down a build
  • TW-23295 - My changes link takes much longer in 7.1
  • TW-23589 - Artifact Wildcard Hangs Up Build
  • TW-24100 - Database restore with maintainDB tool can take hours for large databases
  • TW-24199 - Huge Restoration time of TC6.5 backup with maintainDB tool (6 hours)
  • TW-30849 - BaseBuild.getBuildStatus still needs some speedup
  • TW-32262 - Timeout error while trying to run a personal build with perforce VCS root
  • TW-32808 - MS SQL performance: passing Unicode strings to queries causes wrong conversion that limits indices usage
  • TW-32827 - Memory leak on My Changes page
  • TW-33125 - Slow removing of builds from build queue (AuditLogDataCleaner$4.buildPromotionDeleted)
  • TW-33235 - Changing of torrent settings works too slowTW-33241 - Slow build results page loading (CoveragePageFragment.isAvailable case)
  • TW-34085 - Slow /app/rest/builds/id:.../relatedIssues REST API request in case of many changes in build
  • TW-34111 - Number of UI threads blocked in DownloadedArtifactsLoggerImpl.getDownloadedArtifacts
  • TW-34121 - ResponsibilityRemover.buildFinished is slow
  • TW-34223 - Slow test bulk investigation saving (minutes)
  • TW-34525 - Inefficient processing of '+:**' trigger rule
  • TW-34802 - High memory/cpu in the browser on long opened Build Queue page
  • TW-34803 - High memory/cpu in the browser on long opened (My) Changes page

...