Page tree
Skip to end of metadata
Go to start of metadata
No subsystemBug WEB-53574 Incorrect import quick fix order in case of several declarations with the same name
Task WEB-53582 Unify "require"/"import" support between auto-imports and quick fixes in JavaScript
Bug WEB-53883 Deno: do not run service for built-in lib.d.ts
Performance WEB-53279 PHPStorm low on memory
Bug WEB-53960 Should not report "Unrecognized attribute or property name" for custom attributes on custom web components
CSSBug WEB-53284 Tailwind 3: Completion for classes doesn't work
Bug WEB-53511 Unknown CSS property 'transform-box'
Feature WEB-52425 Support v-bind CSS function in Vue Single-File Components.
Bug WEB-41976 Can't decline suggestions and type `()` or `and` after @media in CSS
Bug WEB-41975 @media is shown twice in CSS code completion suggestions
DebuggerBug WEB-53403 Can't open Debug tool window because of JCEF error
Bug WEB-53642 Debugger memory leak
File WatchersBug WEB-53599 File Watchers: programs running on WSL doesn't work if PATH variable to node is not specified
HTMLBug WEB-53690 Typing '</' does not close the currently open HTML tag but instead opens an intelli-sense autocompletion popup with irrelevant choices
Bug WEB-53723 False positive "Empty tag doesn't work in some browsers" for void tags in Angular template
JavaScriptTask WEB-53539 JavaScript: remove quick fixes with incorrect suggestions
Bug WEB-53441 Download library window shows truncated list of typings
Exception WEB-53470 StackOverflowError on JSTypeStructuralPartEvaluator
Bug WEB-53731 Editing template string causes an exception
Bug WEB-53435 Wrong signature mismatch warnings: multiple Issues interpreting signatures of node child_process functions
Bug WEB-53521 Usages of functions added to ES6 class via @memberof are not found
JavaScript. FormatterBug WEB-53491 Import assertion is removed on optimizing imports
Bug WEB-53469 Code formatting breaks template strings by adding spaces
JavaScript. FrameworksBug WEB-37574 No completion for CSS properties inside inline style (jsx)
Bug WEB-53447 Angular: False Positive "Wrong attribute value" on all kinds of attributes
Bug WEB-53325 For Vue template file, ant-design component imports are marked unused
Bug WEB-53688 Angular. Event keyup.enter is not emitted
Bug WEB-52809 Vue 3: library (naive-ui) component import is marked unused
Performance WEB-53620 UI frozen on working with Vue components
Bug WEB-53861 Angular animation callbacks not recognized
Bug WEB-53909 Angular support - fxFlex attribute is not recognized
Bug WEB-52125 Multiple imports are marked as unused in <script setup>
Bug WEB-52856 Unable to import VUE component from`@headlessui/vue` package
Feature WEB-47399 Angular: support events from custom EventManagerPlugin
Bug WEB-53635 decodeURIComponent() not resolved in Vue template
Bug WEB-53797 Unresolved type Object in Vue template
JavaScript. InspectionsBug WEB-53532 Inconsistent / instabile behaviour of "Unused property" inspection
Bug WEB-53541 Slow operations are prohibited on EDT from ES6ConvertVarToLetConstQuickFix
JavaScript. RefactoringBug WEB-53808 TypeScript: Inline field refactoring incorrectly handles getters
Bug WEB-50246 TypeScript: Refactor: Inline function breaks code
Bug WEB-51079 Typescript: Refactor: Flip if-else results in compile error when using Prettier as default formatter
LESSBug WEB-49795 @import in LESS does not resolve packages in node_modules if `~` is omitted
LintersBug WEB-52594 ESLint 8.0: doesn't work with YarnPnP
Feature WEB-53407 Limit the scope of files to be linted with StyleLint 14+
Node.jsBug WEB-52175 package.json doesn't show suggestion for packages that only exist in private repositories when using yarn
Bug WEB-53716 Support Docker Compose Node.js interpreter when project is located under `\\wsl$\<distro>`
Bug WEB-42178 Yarn PnP: Indirect dependencies are not indexed
Feature WEB-33571 Add node_modules/.bin folder to PATH in Terminal for current project
Bug WEB-53350 NodeJS 17 debugger doesn't work on Windows with IPv6
Bug WEB-52590 Docker: `npm install` fails when project is located under `\\wsl$\<distro>`
Bug WEB-53972 Scratch node.js files aren't executed in project working directory anymore
SASSFeature WEB-30607 @import in scss does not resolve packages in node_modules
Bug WEB-53120 Sass @use / @import statements without tilde aren't being resolved correctly
TypeScriptBug WEB-52762 pnpm: incorrect completion and auto-imports for Node.js built-in classes
Bug WEB-40844 pressing Ctrl+Shift+Enter after key, value pair in object literal should insert comma
Feature WEB-53440 deno: show module urls/names instead of cache filenames
Bug WEB-53370 Deno LSP does not work for .tsx files ("Typescript JSX" file type)
Unit TestsBug WEB-53519 Missing highlighting on gutter for covered by Jest/Mocha tests code lines
Bug WEB-53632 Karma + Node.js 17: can't connect to karma server. There is no server listening on port 9876
Code Analysis. InspectionFeature IDEA-12674 Suggest adding String.trim() to the list of non-internationalised functions.
Bug IDEA-276197 Can't specify inspection severity for several scopes
Code Analysis. Language InjectionBug IDEA-275692 language injection settings > Advanced > Single file option doesn't save
Bug IDEA-282186 "IllegalStateException: Seems you haven't called addPlace()" on analysing of mixed php + html file with conditional comment
Bug IDEA-250588 Language Injection: some explicitly injected languages can't be uninjected via the context menu
Core. DebuggerCosmetics IDEA-283045 Gray icons background color in popup
Bug IDEA-278406 Debugger: unify icons for Add to Watches action in Evaluate Expression toolbar and Variable context menu
Core. File SystemBug IDEA-283046 "External file changes sync may be slow" notification shows internal ID instead of text
Core. LicensingBug IDEA-284532 PHPStorm 2021 failed to start, dropped a "Cannot start" stacktrace
Bug IDEA-282819 Some product EAP links are incorrect
Usability IDEA-281659 Add more detailed message about what is the possible cause of the "Couldnt start {0} EAP due to a login problem. Please contact technical support for assistance" problem
Usability IDEA-283374 When trying to activate Trial without internet connection - no error message will be displayed
Bug IDEA-283469 UI freeze on attempt to delete license with disabled internet access
Core. Plugin ManagementException IDEA-275822 PluginException: Class org.jetbrains.idea.maven.ext.jee.JavaeeFacetImporter must be not requested from main classloader of org.jetbrains.idea.maven.ext plugin [Plugin: org.jetbrains.idea.maven.ext]
Cosmetics IDEA-283165 "No" button should be "Cancel" in "Install Required Plugins" dialog
Bug IDEA-283546 Plugins which store META-INF/plugin.xml directly under the plugin directory cannot be installed
Bug IDEA-283260 No tooltip for installing a plugin
Usability IDEA-283690 Do not suggest to enable the plugin after 'do not suggest this plugin' is invoked for it
Core. Project SettingsBug IDEA-284273 Don't Open in Trust Project Dialogs shown on reopening multiple projects after IDE upgrade breaks IDE
Bug IDEA-280859 trust project dialog: "Don't open" doesn't work for idea started from the command line
Bug IDEA-282352 `Don't open` at `Trust and Open Project?` dialog has to be pressed twice if the project is drag-n-dropped to the welcome screen
Usability IDEA-277454 "Trust and Open Gradle Project" dialog is missing a project name
Bug IDEA-282826 Clicking 'Trust Project' in editor banner does nothing if untrusted project settings were migrated from previous version
Bug IDEA-284145 Don't Open in Trust Project dialog shown after IDE upgrade leaves the project in partially-closed state
Core. Quick DocumentationBug IDEA-284186 Documentation popup jumps when invoked in Project View
Bug IDEA-284184 Edit Source (F4) does not work in quick-doc when pressing F4 on keyboard
Exception IDEA-282959 ShowQuickDocInfoAction should handle INRE
Performance IDEA-284009 High CPU & GPU utilization with documentation docked and other dock open
Feature IDEA-152644 Provide the text search in the Quick Documentation (Ctrl + Q)
Core. Run. ConfigurationsBug IDEA-281386 Can't pass selected system environment variables to WSL in Run configurations
Core. Run. TargetsBug IDEA-282727 DockerCompose target. Focus on the compose container is set only from the second time by debug
Core. SSHBug IDEA-268052 Datagrip does not reconnect through SSH tunnel if connection drops.
EditorBug IDEA-284402 IDE show the quick documentation even not hovering the cursor over that class when enabling the rendered javadoc
Exception IDEA-280637 com.intellij.diagnostic.PluginException: Cannot create class com.intellij.lang.documentation.ide.impl.DocumentationToolWindowManager (classloader=com.intellij.util.lang.PathClassLoader@566776ad) [Plugin: com.intellij]
Bug IDEA-281204 Ctrl+F1 doesn't work in EditorConfig
Bug IDEA-285649 Selection background isn't shown for rendered doc
Editor. Code CompletionTask IDEA-282031 Provide icons for live templates, word completions and HTML tags
Editor. FormatterUsability IDEA-281375 Don't run formatter on save on syntactically invalid file
Lang. XPath and XSLTBug IDEA-284217 Unable to save changes to the "Run XSLT" dialog
Lang. YAMLBug IDEA-281699 Quickfix in the JSON injected into Yaml produces incorrect code
Bug IDEA-280717 Missing "Uninject language/reference" intention after using the "Inject language or reference" intention within a .yaml file
Tools. DockerBug IDEA-277148 Options added with Modify options for a Docker configuration aren't shown
Bug IDEA-285039 Docker: exception on connection to JetBrains Space docker registry
Bug IDEA-285527 Image push. Registry list by push is empty
Bug IDEA-280604 Cannot exit writing multi-line RUN statement in Dockerfile
Bug IDEA-282591 Docker Registry. Pull/Push doesn't work for space jetbrains team registry
Bug IDEA-282409 Docker. java.util.NoSuchElementException at completion at "--platform" frag of FROM instruction in the Dockerfile
Performance IDEA-282416 Docker Registry. Adding space registry with many projects leaded to freezes and thread dumps
Bug IDEA-285219 Docker: Registry configurable: test connection doesn't work
Bug IDEA-282176 Docker. Registry. Space. Empty namespaces list for user
Feature IDEA-283085 Docker: use registry HTTP API to check credentials instead of Docker login
Tools. HTTP ClientBug IDEA-283191 Http client fails with error internal_error with self signed certificates
Exception IDEA-282090 HttpClient: some times get exception failed for REQUEST_TARGET on Tools->HttpClient->Create new request
Bug IDEA-283799 HTTPRequest: broken inside client.test callback
Performance IDEA-278252 Performance problem after running http tests
Bug IDEA-284499 HTTP Client: Do not show file name for run action in context menu
Usability IDEA-284470 HTTP Client does not print URL parameters in output
Bug IDEA-284148 HTTP Client: Variables are not substituted in response view
Usability IDEA-280979 Provide possibility to run request with environment from Run Anythyng
Tools. TerminalBug IDEA-283193 White text on white background
Tools. Test ManagementBug IDEA-282777 Test suite preview lacks a list of test cases
Bug IDEA-282775 Test suite metadata is not suggested in filters
Bug IDEA-282773 Metadata from test suite is not shown in test case preview
User InterfaceBug IDEA-283194 Deadlock while debugging
Usability IDEA-274904 Accidental tool window drag'n'drop instead of resizing
Usability IDEA-257432 Prioritize file path tooltip when editor tab is too narrow
Cosmetics IDEA-271046 Checkbox jumps on hover in the "Rename also" dialog
Bug IDEA-284451 "Evaluation Feedback" popup keeps appearing every 30 sec
Bug IDEA-283347 There is a separator under active project tab in non-fullscreen mode
Performance IDEA-275391 Modal dialog doesn't appear on copying a large number of files, UI isn't accessible
Bug IDEA-271741 Tool window is returned to "Dock Unpinned" mode instead of "Undock"
User Interface. Console ViewBug IDEA-282942 Restore support for `run.processes.with.redirectedErrorStream` registry key in Java run configurations when using Targets API
User Interface. Embedded Browser (JCEF)Bug IDEA-283718 com.intellij.ui.jcef.JCEFHtmlPanel ctor causes disposal error
Bug IDEA-281261 switch to VolatileImage in OSR JCEF
Bug IDEA-281774 Memory leak detected: com.intellij.ui.jcef.JCEFHtmlPanel
User Interface. Favorites/BookmarksBug IDEA-282848 Bookmark icon is invisible in Project View when plugin theme is applied
Bug IDEA-283962 Add bookmark using mouse sets bookmark at wrong line
Usability IDEA-282476 Toggle Bookmark in newly set up project now shows dialog
Bug IDEA-282288 Quick search in Bookmarks tool window is red even if there are matches
Usability IDEA-282926 Only one bookmark is dragged to another list if several bookmarks are selected
Bug IDEA-284600 Excluded directories are not shown in directories in Bookmarks tool window
Usability IDEA-283956 Next/Previous Bookmark navigation no longer confined to single file
Bug IDEA-281897 Directory and file bookmarks break if the directory or file is deleted and recreated
Bug IDEA-284610 Bookmark is not created with Cmd+Click after restoring default settings
Usability IDEA-282746 Drag-and-drop from Project View to Bookmarks tool window is not supported
Bug IDEA-283144 Directory content is not shown in Bookmarks list
Bug IDEA-284429 Different sorting for directories in Bookmark tool window comparing to Project View
Bug IDEA-284280 Inconsistent bookmarks behavior on clicks in gutter
Bug IDEA-282406 Quick search is not invoked in Bookmarks popup
Bug IDEA-284688 New bug in 2021.3 / Bookmarks menu / Cant do file diff
Bug IDEA-282938 Adding non-project file to Bookmarks is not supported
Bug IDEA-284400 "Select In" action is not available in Bookmarks tool window
Bug IDEA-283981 Bookmarks context menu is grayed out on folders
Bug IDEA-282577 Moving class bookmark to another list is not supported in Bookmarks tool window
Cosmetics IDEA-282585 Bookmarks icon is displayed before class icon
User Interface. Find, Replace, UsagesBug IDEA-273156 Invalid Find Usages result: shows "INVALID" twice
Bug IDEA-247553 "Replace in Path" can't replace text if that text is the entire contents of a file
User Interface. MenusException IDEA-283051 Exception on closing second project tab
Bug IDEA-282646 There is a Git main menu item instead of VCS if Git repository is not enabled for a project
Bug IDEA-284421 No icons in menu for items with submenu
User Interface. New Project WizardBug IDEA-282672 New project wizard: JavaScript fields remain on Empty project template
User Interface. PluginsBug IDEA-283341 Installing plugin through tooltip causes an exception
Bug IDEA-282883 Two "Other Tools" groups in installed plugin list
User Interface. Project ViewCosmetics IDEA-282600 Yellow bookmark flags make file names misaligned
User Interface. Recent Files, SwitcherBug IDEA-284736 Can't close open files from Switcher
User Interface. Services ViewBug IDEA-283192 Services view. The item remains for some time in "All Services" by moving into a new tab
Performance IDEA-282843 Services view. Idea Freezes if we type in the Editor during loading data in the Services view
Bug IDEA-283093 ServicesView. Hanging node and ReadAction exception at running aconsole application
User Interface. TabsCosmetics IDEA-280839 [Debug tool window] incorrectly displayed yellow arrow in the Console icon
Bug IDEA-283891 Editor tabs aren't highlighted on mouse hover when the focus is in a toolwindow
User Interface. Tool WindowsBug IDEA-278414 A tool in View Mode Window is instantly getting closed
Version ControlTask IDEA-282234 Additional FUS events for Commit dialog interactions
Version Control. GitBug IDEA-283883 Git Log: wrong tab title when filtering log by date
Bug IDEA-280808 Unshelve file with empty content located in the directory with whitespaces puts file in the wrong location
Bug IDEA-282260 IDEA is not responding after a sequence of GIT actions
Bug IDEA-282605 Attempt to clone from Git fails from the Welcome Screen or with the untrusted project opened
  • No labels