Page tree
Skip to end of metadata
Go to start of metadata
No subsystemFeature WEB-49702 Provide docs for CSSImportRule
Bug WEB-49225 Quick documentation for some deprecated HTML tags should show warning and tag description
Bug WEB-49900 MDN docs are not available for constructor calls
Bug WEB-49530 Quick documentation for pseudo CSS classes is not available in html files
Bug WEB-48451 Vuex symbol resolution not working with namespaced modules
Bug WEB-49620 Provide docs for JavaScript global objects
Bug WEB-49598 ('string = is not valid Windows path') when debug Node.js app via interpreter from container
CSSBug WEB-35215 CSS modules, SCSS/Less: support selectors created using &_suffix
Bug WEB-49387 Show values for CSS properties in the quick documentation popup
DartBug WEB-50043 Dart file move: relative imports become absolute. (Windows only)
DebuggerBug WEB-50050 BlockingOperationException when debug electron app via npm script
Bug WEB-49996 Throwable + IllegalArgumentException + can't press anything in IDE after Force step into
Usability WEB-49896 Rename 'Console' for Node.js
HTMLBug WEB-49285 "loading" attribute of "<img>" tag is reported as not allowed
Bug WEB-49386 Show supported browser versions for HTML tags in the quick documentation popup
Bug WEB-49654 `type` attribute on HTML 'script'/'style' is marked deprecated, but its not
Bug WEB-49690 No documentation for 'onclick' attribute in button tag
JavaScriptBug WEB-43935 'Infer JSDoc parameter types from usages' should paste '*' instead of 'any' to JSDoc
Bug WEB-49764 No suggestion to auto-import commonJS module if the module is required in other files
Bug WEB-49424 Documentation invoked from JSDoc tag can't render definition part properly
Bug WEB-49727 Auto SQL code inject doesn't work with variable in JavaScript string template
Bug WEB-49717 False-positive no overlap for destructured props
Bug WEB-37504 Flow: Works a lot worse than before
Bug WEB-49699 Type is not correctly inferred when iterating over a collection typed with JSDoc using "for .. of" loop
Bug WEB-49462 Type of async function called with `await` is not evaluated correctly
Bug WEB-49869 Highlighting issue in JSDoc @see tag
Bug WEB-49850 'rulezzz' in suggested completion names
Bug WEB-49499 Highlight correct argument in parameter info when using spread in function calls
Bug WEB-49034 Broken formatting in TSX with HTML "Enforce single quote" + removing trailing commas
Bug WEB-49905 Incorrect refactoring rename property (js + jsdoc + ts)
Performance WEB-49859 High CPU usage on file change
JavaScript. FormatterBug WEB-50053 Spaces not removed after parameter property modifiers
JavaScript. FrameworksFeature WEB-43480 Quick documentation for Angular components
Feature WEB-49157 Provide support for Vuex 4 store
Feature WEB-34380 Vue.js: support recognition of CSS classes inside literals in :class bindings
Bug WEB-48778 Auto-import doesn't work for components with doc comments
Bug WEB-48085 Code completion and auto-import don't work for Chakra-UI components
Bug WEB-49657 incorrect import suggestions in react+js for React.createElement()
Bug WEB-49920 Wrong props types validation in Vue 3
Bug WEB-47477 cmd-click on a $refs in vue script should go to the ref in the template instead of where $refs is defined in the vue code
Bug WEB-48980 Unrecognized regular (not binded) "key" attribute in Vue templates
Bug WEB-47054 Vue: Support properties from super class of a decorated component
Bug WEB-49656 'React' is duplicated in completion
Bug WEB-47706 No props completion for function component with propTypes
Bug WEB-49838 Infinite indexing with Vue plugin (EAP 2021.1)
Bug WEB-49901 Actions inside vuex 4 modules have no indication of being in use.
Bug WEB-31701 Vue.js: `ref` attribute is not correctly handled
Bug WEB-49776 Invalid warning of required attributes for components from Chakra-UI
Bug WEB-44925 No completion for React Native component props with react-native@0.62.2 and higher
Bug WEB-49311 Vue 3 + Vuex 4 - Mutations, actions & getters: wrongly marked as unused
Performance WEB-49959 Freezes on vuex completion
Performance WEB-49122 Avoid accessing index if it's not built
Performance WEB-49596 Every press on the mouse right button cause a freezes for a few seconds (approximately: 5s) and is annoying
JavaScript. InspectionsBug WEB-49443 Can be simplified to [...] for (JSDoc + TypeScript)
Bug WEB-49796 "Void function return value used" inspection shouldn't work on IIFE
Usability WEB-46611 Add example to Unfiltered for..in loop inspection description
JavaScript. RefactoringBug WEB-50091 Do not change const to let when applying the 'Replace for...of' intention
Bug WEB-45292 Can‘t Refactor in TypeScript File
LintersFeature WEB-25069 Stylelint: implement auto fixes
Feature WEB-33429 Stylelint: provide a way to specify config file location
Bug WEB-49512 EslintConfigWrapper.RULES leaks references to extensions from unloaded plugins
Usability WEB-49705 "Please specify Node.js interpreter" popups should navigate to Node settings
Node.jsBug WEB-42169 Vue: Support Yarn 2 in PnP mode
TypeScriptFeature WEB-49094 TypeScript 4.2: abstract Construct Signatures
Feature WEB-44914 Move refactoring on TS class or interface: default to file with same name
Bug WEB-49888 Go to defintion and find usages not works with ts imports started with slash
Bug WEB-49802 Provide docs for standard JavaScript interfaces in TS
Bug WEB-49621 Typescript unsuccessful auto-completion for known type. Syntax highlighting gets stuck.
Bug WEB-46680 Union literal completion broken for type created from typeof when using type only import
Bug WEB-49595 No import suggestions for variables that are assigned values vie destructuring
Bug WEB-49779 wrong colour for inferred generics
Bug WEB-50001 Package Type Inference Broken with Yarn 2
Bug WEB-48295 Changes made to imported JSON not immediately recognized by Typescript language service
Bug WEB-43140 export const [ destructured_1, desctructured_2 ] = my_array not being indexed in *.ts files
Bug WEB-50019 Syntax error using `import type thing = require('things')`
Bug WEB-49826 false 'missing required attribute' error for styled components
Performance WEB-49847 Sluggish typing during autocomplete of big firebase angular material projects
Task WEB-49833 Update bundled TypeScript to 4.2
Unit TestsFeature WEB-46202 Jest "update failed snapshot"/"go to snapshot" not available for `toThrowErrorMatchingSnapshot`
Bug WEB-49452 Failed Jest test never completes when running with `--watch`
Bug WEB-48569 Error debugging Mocha tests run with Vue CLI due to "Unknown argument: jobs"
Bug WEB-32836 Coverage reporter is asking for `lcov.info` file if `coverage` is absent in karma.conf.js reporters
Bug WEB-49052 Running All Tests in Jest doesn't show the error message when there is a failed test.
Bug WEB-49873 'Cannot read coverageDirectory option' when re-run Jest tests
Code Analysis. InspectionBug IDEA-192702 Clicking Edit Settings in Insepction Results does nothing
Bug IDEA-130333 Inspection settings: scopes order is not saved
Task IDEA-260048 Show Inspections results in Problems tool window
CoreBug IDEA-258519 IDE fails to open a project from the command line if another project is already opened (perhaps Windows-only)
Usability IDEA-229543 Command-line launcher should not ask which window it's supposed to open the project in
Core. DebuggerBug IDEA-262878 Click on toolbar button "Evaluate expression" no longer uses editor selected text
Bug IDEA-263014 XLightBreakpointPropertiesPanel#myCustomPropertiesPanelWrapper uses wrong layout
Core. DiagramsBug IDEA-263119 JPA: ER Diagram opened not centered
Bug IDEA-264684 JSF Navigation diagram: on unchecking the ShowSelectedNodesWithDependencies the resulted diagram layout is incorrect
Bug IDEA-264695 CDI Dependencies diagram action appears outside the Diagrams menu group and causes exception only
Bug IDEA-264029 UML diagrams fonts are too big in 2021.1 Beta when comparing with 2020.3.2
Bug IDEA-265035 UML diagrams: Kotlin: tooltip over package item shows wrong statistics
Bug IDEA-264679 JSF Navigation diagram: no layout on diagram opening
Bug IDEA-265037 UML diagrams: Kotlin: constructor is shown for object
Bug IDEA-263112 JPA: ER Diagram is not refreshed after adding the attribute
Bug IDEA-264697 CDI Dependencies diagram is always empty
Bug IDEA-211984 UML Diagrams: any action performed from diagram can't be Undone though Undo is shown enabled with correct last action name
Bug IDEA-264693 Java Enterprise toolwindow: CDI Dependencies diagram is opened without layout
Bug IDEA-264690 Spring Beans toolwindow: the beans graphs appear without layout
Bug IDEA-263877 Spring Application Context Dependencies Diagram: on Show Library Models action the layout is not applied
Bug IDEA-263868 Spring Diagrams: with `Show neighbours of the selected nodes` option the results of selection change is ugly (no layout)
Usability IDEA-264691 Add the ApplyCurrentLayout action to the context menu for the toolbar-less diagrams
Exception IDEA-264067 NPE at com.intellij.uml.java.dependency.JavaClassDependencyAnalyzer$MyDependencyCollectingVisitor.isCollect ion
Exception IDEA-263875 ICSE at com.intellij.uml.UmlFileEditorImpl.getData
Exception IDEA-263489 IAE at com.intellij.diagram.presentation.DiagramState.restoreTo
Exception IDEA-264685 Throwable: Read access is allowed from event dispatch thread or inside read-action only
Exception IDEA-264064 NPE at com.intellij.openapi.graph.impl.view.FastNodeCellRendererPainter.paintNode
Exception IDEA-263414 Throwable at com.intellij.psi.impl.file.impl.FileManagerImpl.checkHasNoOtherPsi
Exception IDEA-263561 ISE at com.intellij.spring.perspectives.diagrams.SpringDiagramNode.getIdentifyingElement
Exception IDEA-263255 NPE at com.intellij.uml.java.JavaUmlDataModel.createEdge
Exception IDEA-222077 UML diagram: attempt to add note to diagram popup causes IOOBE
Exception IDEA-262492 CCE at com.intellij.uml.presentation.DiagramPresentationModelImpl.getNodeTooltip
Exception IDEA-262187 Throwable at com.intellij.psi.impl.file.impl.FileManagerImpl.checkHasNoOtherPsi
Core. IDE SettingsBug IDEA-264893 [Choose Runtime dialog] there is no ability to add JBR if it isn't located in ~/Library/Java/JetBrainsRuntime/ folder
Bug IDEA-261869 Choose Runtime - polishing
Usability IDEA-259872 After IDEA update: Propose to use bundled runtime if configured runtime is older
Cosmetics IDEA-227451 Settings > Editor > Code Style > Java > Arrangement items disappear or move on mouse hover
Core. IndexingBug IDEA-264500 VFS cache can't recover automatically after content storage corruption
Bug IDEA-262899 Can't find a file using Search Everywhere/Goto File
Bug IDEA-263200 Shared index trying to attach non-existing chunk
Bug IDEA-263504 Invalidate Caches dialog: reconsider the defaults
Bug IDEA-262428 Do not show public CDN URLs
Bug IDEA-265212 IntelliJ IDEA 2021.1 beta 4 cannot resolves JDK classes
Core. InstallationBug IDEA-262571 clion.sh doesn't allow symlinks
Bug IDEA-263043 Idea fails to start from path contains spaces on linux
Usability IDEA-264060 2021.1 update journey is broken as it requires multiple "check for updates" to produce a fully working installation
Usability IDEA-263364 App started from IDEA cannot access Bluetooth on macOS Big Sur
Usability IDEA-252209 Avoid broken installation on Linux when distributive is unpacked into the same folder
Core. LicensingFeature IDEA-263678 License Panel: hide Evaluate radiobutton for CWM plugin
Bug IDEA-265183 Broken license dialog UI when user has several licenses
Task IDEA-263484 Docker Desktop causes wrong host name to be sent while obtaining floating license
Core. Platform APIBug IDEA-264897 A race condition that leaves daemon hanging
Core. Plugin ManagementBug IDEA-253978 "File type conflict found" on every IDEA start - 3rd party plugins
Exception IDEA-262837 Plugin installation failure - StackOverflowError in findPluginExtensionPointRecursive
Core. Project SettingsBug IDEA-262946 New EAP prints many errors to the log about duplicating LibraryIds
Bug IDEA-99596 Manifest file located under 'main/java' root in Maven module is shown in artifact editor even if it won't be really copied to artifact
Bug IDEA-257476 Modules get lost on changing the 'store generated files externally' option for multimodule maven project
Bug IDEA-257175 IJ resets content root to the incorrect directory
Bug IDEA-260372 Maven projects can't be built after disabling the (not used) dependency
Bug IDEA-222640 Library configured via Project Structure For New Project dialog appears incorrectly in the new projects preventing new project libraries configuring
Bug IDEA-264113 Cannot change library scope second time after clicking "apply" in project structure dialog
Usability IDEA-116209 Allow to directly specify a jar's META-INF/MANIFEST.MF file
Exception IDEA-262073 java.lang.RuntimeException: Unable to get registered settings of #VueCodeStyleSettings when enabling Vue.js plugin with opened .vue file
Core. Run. ConfigurationsBug IDEA-264202 [new run config UI] invoking "command line" fields mnemonics don't move focus during indexing
Bug IDEA-264143 The root node is configurable in the Run/Debug Configurations dialog
Usability IDEA-263886 [new run config UI] Change 'modify option' hotkey on macOS to be Option-M
Usability IDEA-246087 [new run config UI] Improved keyboard navigation to fields
Exception IDEA-262425 PluginException: Cyclic service initialization: RunManager
Exception IDEA-245958 Throwable: Directory index may not be queried for default project
Core. Run. TargetsBug IDEA-262784 Run targets: SSH stops working after installing rsync on Windows
Bug IDEA-262446 Run Targets: SSH: contents of coverageNargs file is not uploaded
Bug IDEA-262289 Run Targets: SSH: attempt to run with coverage fails
Bug IDEA-264026 Run Targets: IDEA coverage/profiler stopped working on Docker target
Bug IDEA-264928 RunTargets. Quarkus. It fails to run on docker target
Bug IDEA-262162 Run Targets: first introspection for WSL target fill JDK path incorrectly
Bug IDEA-261979 SSH target startup is very slow because of files syncing
Bug IDEA-264934 Eternal throbber in target creation wizard
Performance IDEA-262457 Choose run configuration popup is slow on IntelliJ IDEA project
Usability IDEA-262430 Run Targets: SSH allow to select the Gradle home using the path chooser
Usability IDEA-265188 Show popup `Please add /Applications/GoLand.app to Resources -> File Sharing` when GoLand runs from /Applications/ path on macOS
Cosmetics IDEA-258266 Run Targets. Cosmetic UI bugs
Task IDEA-258455 Run Targets: download files from target
Task IDEA-262277 Remote targets for Go Build: Introspection completed with error. Getting environment failed with exit value 1
Exception IDEA-259929 java.nio.file.NoSuchFileException in Docker plugin on pulling the image by creation a run target
Core. Task ManagementUsability IDEA-254355 Provide an ability to assing shortcuts for "Start Timer" and "Stop Timer" actions
EditorBug IDEA-264440 Wrong bold font is used in editor
Bug IDEA-263938 Character moves a little when typing, looks like bounce effect
Bug IDEA-262699 Wrong variant of Iosevka is used for italics
Bug IDEA-258454 Reader Mode options are not applied for opened library file until reopening
Bug IDEA-260496 Font Settings: dropdown uses wrong font when Monospaced selected
Cosmetics IDEA-262330 Font Settings: adjust top of dialogue box (remove extra margins)
Task IDEA-262329 Font Settings: improve search within font dropdown
Task IDEA-260492 Font Settings: modify "Typography Settings" to a group that collapsed by default
Editor. Code CompletionBug IDEA-260190 Lookup popup window is incorrectly sized when there is only one item
Editor. Code Completion. MLBug IDEA-261990 "Machine Learning Code Completion" plugin visits .class files
Editor. Diff and MergeBug IDEA-257651 Diff view detects big diff but change was only small
Bug IDEA-262442 Diff detects changes incorrectly when add empty lines
Editor. Editing TextFeature IDEA-119451 Extend line selection via keyboard shortcut
Bug IDEA-262434 Italic font is broken for Courier in 2021.1 EAP
Bug IDEA-264147 Chosen font variation is ignored in some dialogs
Usability IDEA-260463 EditorTextFieldActionPromoter hides IdeaVim actions
Editor. FormatterBug IDEA-157294 Exporting Code Style profile fails when name is not filesystem-friendly (e.g. it contains a slash in *NIX systems)
Bug IDEA-205999 "else" and "{}" indentation
Bug IDEA-189817 Code format breaks long URLs in code comments
Editor. Intention ActionsBug IDEA-263507 Line join silently changes semantics for nested ifs
Lang. JSONBug IDEA-261811 JsonPath support: the slice operator [start:end:step] is error-highlighted
Bug IDEA-262273 JSONPath: operators are not correctly highlighted on incremental highlighting
Usability IDEA-262172 JsonPath: provide completion by existing keys inside injected fragments
Usability IDEA-262180 Evaluate JSONPath: the font used for the jsonpath expression field should be the same as the editor one
Lang. MarkdownBug IDEA-260339 Formatting removes cpp code sections from Markdown files
Lang. RegExpBug IDEA-262576 Wrong warning about redundant non-capturing group
Lang. Shell ScriptBug IDEA-261565 Every invocation of a shell script create a new terminal tab
Tools. DockerFeature IDEA-262658 Docker. Provide completion of stages names in case of multiple FROM statements in a Dockerfile
Feature IDEA-179935 Docker: provide completion for the environment variables in the Dockerfile
Feature IDEA-171374 Docker: Provide completion for image names in the Dockerfile, DockerCompose files
Feature IDEA-261892 Fold stages in multi-stage Dockerfile
Feature IDEA-262611 Support --platform command line option
Bug IDEA-263039 Docker. WinOS. BuildKit: it fails to run a container
Bug IDEA-262584 Docker. Dockerfile run configuration, Build options field: completion doesn't work after build options without arguments
Bug IDEA-262881 Docker. Build image creates a run configuration with the "run" section
Bug IDEA-263462 Docker. Remove docker.log file
Bug IDEA-263419 Docker. Dockerfile/Image Run configuration.`Bind mounts` field is not removed at removing the option.
Bug IDEA-262654 Dockerfile, Editor, image tags completion: the result list contains many items which are out of scope
Bug IDEA-263457 Docker. Run hangs after adding "Run built image" section and re-run
Bug IDEA-263514 Rider does not work with docker rootless
Bug IDEA-262324 Docker: when buildkit is enabled the image is always built on the Docker desktop, even if other connection is selected
Bug IDEA-264653 Docker. Before launch. Compose in compose parent task doesn't run
Bug IDEA-263058 Docker. BuildKit. Context folder always looks at the project folder
Bug IDEA-263164 Docker-compose. Impossible to run docker-compose on docker-machine
Bug IDEA-186080 Typed YAML: when keys are references, completion for them should not suggest existing sibling keys
Bug IDEA-234252 DockerCompose: image tags completion doesn't work
Bug IDEA-262345 DockerCompose. Run configuration. Scale:`Select Service to Scale` link doesn't add the service into the table
Bug IDEA-263159 Docker. After an invalid connection all run configs fail until I re-connect to the Docker
Bug IDEA-256721 Docker. Impossible to delete connections from the Services view.
Bug IDEA-263269 Docker. Support completion for ARGs in Dockerfiles
Bug IDEA-262619 Docker. Deploy Dockerfile with the pointed target never ends
Bug IDEA-262568 Docker.Container Deploy log tab: Ctrl+C via keyboard doesn't work
Bug IDEA-263086 Options in Run section aren't persistent between Run configuration reopen
Bug IDEA-262349 Docker-compose run configuration: add an explaining tooltip over each option
Bug IDEA-263044 Docker. Exclude the current build stage name from the names completion list after `--from`
Bug IDEA-262501 Docker. Run Dockerfile with the pointed target fails
Bug IDEA-235007 No quotes autocompletion
Bug IDEA-262633 Dockerfile, Editor, images completion: remove `library/` at tags completion
Bug IDEA-263418 Docker. Dockerfile/Image run configuration. Publish all option doesn't work as CLI option
Bug IDEA-262419 show running cli command in docker-compose deploy log
Usability IDEA-262657 Dockerfile, Editor, images completion: auto-appeared completion list contains not correct items list
Usability IDEA-196666 Add --rmi flag support for docker-compose integration
Usability IDEA-262806 Docker: recognize Dockerfiles for Quarkus example files
Cosmetics IDEA-264539 Docker. Connection Settings: the url for Rootless socket on UNIX systems overlaps the option name
Exception IDEA-263927 Exception when open Docker settings on windows
Exception IDEA-262627 com.github.dockerjava.api.exception.BadRequestException at running FROM without arguments by disabled BuildKit
Tools. HTTP ClientBug IDEA-260741 HttpClient: Completion for SSLconfiguration on windows comes with wrong "/"
Bug IDEA-239228 REST does not work with manually configured ssh tunnel SOCKS5 proxy
Exception IDEA-261390 HttpClient: On run request with certificate get java.lang.AssertionError: Wrong line separators: '...y>\n</html>\r\n' at offset 254 exception
Tools. TerminalFeature IDEA-224561 API for custom highlighting of a found text in Terminal
Bug IDEA-264105 Using 2021.1 beta2, opening a terminal the mouse wheel scroll is not working. This used to work.
Bug IDEA-259452 Too fast scroll in Terminal
Bug IDEA-180923 Terminal. Scroll bounce
Task IDEA-228106 Provide API for getting Terminal cursor coordinates
User InterfaceBug IDEA-264220 Initial path under \\wsl$\ is not selected in file tree on opening file chooser dialog
Bug IDEA-87703 Recent files doesn't close when floating Navigation bar appears
Bug IDEA-261894 Editor tabs for modified files that contain errors have wrong text color
Bug IDEA-261723 Welcome Screen size grows after each restart so that its frame doesn't fit the display
Bug IDEA-249791 Switcher cannot display all options
Bug IDEA-265418 'Subpixel' mode is default for the Editor on macOS
Bug IDEA-262148 UI inspector shortcut triggers Alt+Click action on the inspected component
Bug IDEA-263574 Choose Boot Runtime: "Failed to set boot JDK runtime" error on attempt to select JDK in Download JDK dialog
Bug IDEA-227657 "Recent files" popup has UI glitches after removing file
Bug IDEA-261715 Modal progress dialog is hidden on ESC, but Task is not cancelled
Bug IDEA-262234 Native crash due to uncaught exception NSInvalidArgumentException on several modal dialogs on BigSur
Bug IDEA-265019 StackOverflowError on action update
Bug IDEA-263404 EAP user agreement too small to read
Bug IDEA-263915 "Quick switch scheme" popup mnemonics display as "..." with larger appearance font sizes
Bug IDEA-263928 Notification balloons do not appear when the corresponding status bar widget isn't displayed
Bug IDEA-262477 Submenu is not shown on mouse hover
Bug IDEA-263961 Certain combinations of bookmark icon colors are handled incorrectly
Bug IDEA-113995 Jump list: can't open recent projects that have spaces in paths
Bug IDEA-239130 The IDE gets stuck after cancelling opening a project
Usability IDEA-187018 Make F2 "Go to next highlighted error" work in Recent Files/Recently Edited files popups
Usability IDEA-72536 Switcher shortcuts changing is confusing
Usability IDEA-264770 [Choose Runtime dialog] Minimize button closes the Setting IDE boot runtime pop-up and IDE looks like frozen until downloading will be completed
Cosmetics IDEA-262259 Action text is not aligned with mnemonic in popups
Cosmetics IDEA-262729 cosmetic file watcher message
Cosmetics IDEA-262243 Mnemonics color in popups is not changed when the row is selected
Task IDEA-261797 Popups: mnemonics style
User Interface. AccessibilityBug IDEA-257258 camplition popup is not voiced on macOS
User Interface. Action SystemTask IDEA-261330 Action names redefined in IdeUICustomization.projectMessage should be considered in goto action
Task IDEA-263205 Action Popups: Disable separate "next step" button
User Interface. Console ViewBug IDEA-261792 Cannot normally input in Run console
User Interface. ControlsFeature IDEA-212299 Implement Select parent node in UI trees
Bug IDEA-250004 Big Sur: Context menu highlighting breaks if submenu invoked
Bug IDEA-261687 Arrows separators are shown in Copy Path popup
User Interface. Embedded Browser (JCEF)Bug IDEA-261496 Cancelled Navigation in JCEF preview shows error page
Bug IDEA-264004 JCEF JBCefOsrHandlerBrowser failed to invoke JS when global registry value ide.browser.jcef.jsQueryPoolSize is not set.
Bug IDEA-262267 Built-in html preview is not rendered from time to time
Task IDEA-263753 provide ability to configure proxy server for jcef
Task IDEA-262952 allow JBCefBrowser to take focus on show/navigation
User Interface. Find, Replace, UsagesBug IDEA-264313 Find in Files: dots in empty text
User Interface. FocusBug IDEA-209138 Entering/Exiting Full Screen Mode causes the IDE's window to lose focus
Bug IDEA-263483 focus lost after Reformat code
Bug IDEA-249360 Project View scroll jumps down to the previously selected file with "Always select opened file" when switching from another app
User Interface. Keyboard InputBug IDEA-261309 Character is typed in the editor when invoking a dialog through shortcut
Usability IDEA-177432 Switcher shortcut to navigate backwards does not work with combinations other than Shift
User Interface. NavigationBug IDEA-263874 No mnemonics in Switcher opened with one-key shortcut
Bug IDEA-264890 Recent Files / Switcher chooses the first item by default
Bug IDEA-216720 "Ctrl+E" shortcut is displayed in "Recent Files" popup if it was removed from the keymap
Bug IDEA-207163 Recently Edited Files popup doesn't have shortcut for switching between RecentFiles and RecentlyEditedFiles
Bug IDEA-265505 Backspace doesn't update speed search results in recent files
Bug IDEA-102409 Switcher with custom shortcut (e.g. Cmd-I) doesn't disappear when modifier released
Bug IDEA-261860 Navigation to an open file reopens it in active group
Bug IDEA-264409 Cannot open a recent file in splitted window
Usability IDEA-263890 "Recent Files": unexpected focus, does not only filter on files
Exception IDEA-262100 CME at com.intellij.ide.navigationToolbar.NavBarPanel.updateItems
User Interface. Project ViewBug IDEA-257211 Can't navigate to package in external libraries
User Interface. Search EverywhereUsability IDEA-263459 Support screen readers in search dialogs
Version ControlBug IDEA-237029 Selecting text shortcut conflicts with toolwindow resize in Commit toolwindow
Bug IDEA-260241 Ctrl + C copies editor line instead of previous changed chunk content
Version Control. GitBug IDEA-248343 Git Remote add unable to cancel.
Bug IDEA-263695 Can't commit staged changes on the first Commit toolwindow opening
Bug IDEA-262223 Git Commit Template: respect relative paths
Bug IDEA-262301 Git Staging Area: don't group by repository changes in a single-root project
Bug IDEA-264428 Git: pressing OK in "Define Remote" dialog does nothing
Bug IDEA-262518 Cherry-pick with conflict works incorrectly when conflicted file is open in the editor
Usability IDEA-262307 Git Staging Area: allow commit without checking the checkbox when changes from the only one repo are staged
Usability IDEA-262282 Staging operations should not be in the document undo stack.
Support Request IDEA-254998 Failed to start Git process: Unknown WSL distribution (Pengwin - Wlinux)
Exception IDEA-262818 Exception every time then git panel is open
Version Control. GitHubFeature IDEA-263016 Allow filtering branches when selecting one to create a PR
Feature IDEA-142717 GitHub pull request template
Feature IDEA-263015 Ability to start PR creation without opening the toolwindow first
Bug IDEA-263925 GitHub Enterprise: can't view pull requests
Bug IDEA-263686 Pull Requests: changing metadata from no assignees to 1 moves the entire right block to the left
Bug IDEA-263510 GitHub Pull Requests: wrong line separators error on editing PR description
Bug IDEA-262621 GitHub Pull Requests: Cannot display item - Icon cannot be found in 'GithubIcons.Branch', class='org.jetbrains.plugins.github.GithubIcons' for events with branch icon in timeline
Bug IDEA-262590 GitHub Pull Requests: commits with PR links are displayed incorrectly
Bug IDEA-263227 GitHub Pull Requests: wrong branch is preselected in head branch on PR creation if branch checkout was performed while Pull Requests tool window was opened
Bug IDEA-264219 Github Pull Requests: file tree on Commits pane gets stuck in loading state on new pr creation
Performance IDEA-263978 IntelliJ consumes 100% of one core while being idle
Usability IDEA-262615 GitHub Pull Requests: sort alphabetically head branch list on PR creation
Usability IDEA-262857 GitHub Pull Requests: no way to switch between Title and Description inputs from keyboard
Usability IDEA-262835 GitHub Pull Requests: no focused item on "New Pull Request" tab opening
Usability IDEA-233137 GitHub Pull Requests: add tooltip to add comment
Usability IDEA-263182 GitHub Pull Requests: add shortcut to Create Pull Request
Usability IDEA-262613 GitHub Pull Requests: preselect head repo improvements on PR creation in project with multiple remotes
Usability IDEA-263396 GitHub Pull Requests: New Pull Request tab isn't focused when call Create Pull Request action without opening Pull Requests toolwindow
Cosmetics IDEA-264072 GitHub Pull Requests: rename "Create Pull Request" action and button tooltip to "Create Pull Request..."
Cosmetics IDEA-264070 GitHub Pull Requests: add project name on New Pull Request tab
Exception IDEA-262607 GitHub Pull Requests: exception on successful PR creating after failed PR creation
  • No labels