Skip to end of metadata
Go to start of metadata
No subsystemFeature RUBY-27957 Drop support for pre 5.0 Minitest
Bug RUBY-27893 Ruby Trust project notification is shown in a non-Ruby project
CoreBug RUBY-27895 RubyMineLearningProject is considered untrusted
Bug RUBY-27879 Trust project tab is not shown on erb files (multi-psi files)
Libraries. I18nException RUBY-27941 ClassCastException when switching between .erb and .slim
Remote Interpreters. WSLBug RUBY-27184 RM unable to install rails with rvm at Welcome Screen in wsl
Bug RUBY-27752 RM unable to load installed gems when custom WSL used
Ruby. Code CompletionBug RUBY-27874 Autocompletion malfunctioning when using TAB
Bug RUBY-27347 Completion in supported YARD tags lacks some basic types
Ruby. TestsBug RUBY-27963 Clarify test names for Minitest specs
Bug RUBY-27598 Minitest: test tree status is Terminated while all the tests have passed
Bug RUBY-28083 Current implementation of IntelliJ Minitest support conflicts with MiniTest::Reporters
Bug RUBY-26972 Tests tree view: failed tests list is shifting while tests are running
Bug RUBY-26863 Test classes are not completed until ALL tests are completed
Bug RUBY-27969 Test names are shrink in master
Performance RUBY-27742 2020.2 regression: memory leak in tunit_or_minitest_in_folder_runner.rb consumes all the vm's memory (12GB) during a run of "all tests in test"
Usability RUBY-27796 Impossible to understand when Run configuration is for multiple tests
Ruby. Tests. CucumberBug RUBY-26349 Cucumber: Find usages doesn't work from step definitions
Ruby. Type InferenceBug RUBY-27862 False positive Incompatible types using each_with_object - Yard Doc's
Code Analysis. InspectionBug IDEA-265304 "HTTP links are not secure" inspection in `xmlns` schema declaration
Usability IDEA-259519 "No suspicious code found.. in <scope>" message is misleading
CoreFeature IDEA-267076 Collect the "jbr_err" files when using the "Collect Logs and Diagnostic Data" action
Core. DebuggerBug IDEA-260478 Evaluate expression popup opens too small
Exception IDEA-264412 Cannot init component state (componentName=XDebuggerManager, componentClass=XDebuggerManagerImpl) [Plugin: com.intellij]
Core. IDE SettingsBug IDEA-266090 Property 'http://javax.xml.XMLConstants/property/accessExternalDTD' is not recognized on any HTTP Client call
Core. IndexingBug IDEA-264567 shared-indexes: add permanent token auth extension
Bug IDEA-265753 Indexing diagnostics: file provider names may be too long because of batching several subsequent empty providers
Bug IDEA-266171 Scala plugin not working after updating to 2021.1
Exception IDEA-262319 IDEA constantly throws exception blocking class introspection
Core. Navigation and SearchBug IDEA-259137 Indexing/Search sometimes prefers a bad match compared with an exact one
Core. Plugin ManagementBug IDEA-266005 Unable to use the IDEA when installing the incompatible plugin
Core. Project SettingsFeature IDEA-265700 Provide a way to specify required minimum/maximum version of Kotlin plugin for a project
Bug IDEA-265594 If version of a Maven library is changed after updating project configuration, references to classes from that library are shown as errors
Bug IDEA-265821 Trusted location "~/work" is being ignored
Bug IDEA-265194 Allow assertConsistency only in the EAP version of IDE
Bug IDEA-265327 "Persistent ID already exists" exception on opening IDEA project
Bug IDEA-267620 It isn't possible to change custom SDK in module to 'Project SDK'
Bug IDEA-265610 New Trusted Host dialog is too small
Bug IDEA-267244 New Project Model: some files in facets configurations have urls pointing to not-existing paths in <caches>/external_build_system
Performance IDEA-265068 IDE freezes due to long RootsChangeWatcher$1.prepareChange(RootsChangeWatcher.kt:93)
Exception IDEA-264052 Workspace model exceptions: "AddDiffException: addDiff: persistent id already exists. Removing old entity" and others
Core. Quick DocumentationBug IDEA-266963 Font variation selection doesn't affect quick documentation component
Core. Run. ConfigurationsFeature IDEA-264181 Ability to start Remote JVM Debug configuration while indexing
Bug IDEA-266223 Run Configuration validation doesn't work in Run/Debug Configuration dialog
Bug IDEA-263352 Run Configuration Templates For New Projects: no evident possibility to add/edit run configs templates
Bug IDEA-264763 [new run config UI] Hotkeys intermittently don't work
Bug IDEA-261276 [new run config UI] Logs - save console output to file - impossible to hide the option if it's not empty
Bug IDEA-264759 [new run config UI] Field hints render incorrectly when the fields are partially available after scrolling
Usability IDEA-266977 Run/Debug dialog / capturing console output to a file is confusing
Task IDEA-264761 [new run config UI] Add statistics for field hints
Core. Run. TargetsFeature IDEA-255763 Run Targets: provide browse button for jdk and maven for WSL target
Bug IDEA-264908 RunTargets. Docker. Exceptions in plugin Maven and thread dumps by creating a not-maven target for quarkus run consig
Bug IDEA-265916 Run targets. Quarkus. Debug doesn't work
Bug IDEA-266437 Run Targets. Docker. Cannot load class by re-debug via the button on the Idea toolbar
Bug IDEA-266438 Run Targets. Docker. "java.lang.Throwable: Command line hasn't been built yet" at re-debug in the Debug view
EditorBug IDEA-262336 Font Settings: font value missing in dropdown after updating
Editor. Code CompletionBug IDEA-266626 My dark theme shows light code completion suggestions
Editor. Code Completion. MLPerformance IDEA-266091 Freezes in "ML completion. VCS feature calculation" with CVS plug-in
Lang. YAMLBug IDEA-251692 YAML reformatting produces invalid syntax
Tools. DockerFeature IDEA-265307 buildkit support for compose
Bug IDEA-265519 Docker-compose run config: Tags for `remove images on down` show only values without any hint
Bug IDEA-266117 2021.1: Some kind of JAXB-related classloader conflict when the Python, Docker, and Illuminated Cloud 2 plugins are installed and enabled
Tools. HTTP ClientFeature IDEA-244878 Running test rest-api calls times out too quickly
Bug IDEA-261713 HTTP Usage inspection should not be reported for ""
Bug IDEA-265850 SSLConfiguration appears in completion
Bug IDEA-261711 HTTP Usage inspection should ignore ""
Bug IDEA-261937 HTTP Client Dynamic Variable $uuid Not Working
Bug IDEA-257379 HTTP Client Dynamic Variables Not Working
Bug IDEA-265092 "Incorrect HTTP header" inspection should not warn for lowercase http header names
Bug IDEA-263645 HTTP Client: Incorrect URL inserted from URL inlay action for JAX-RS Path on class
Bug IDEA-261716 HTTP Usage inspection should not be reported for the standard JSP taglibs
Bug IDEA-265064 HTTP Client TLS: peer did not return a certificate
Tools. TerminalFeature IDEA-265342 Terminal Colors for custom commands should be configurable
Bug IDEA-265230 "Open in terminal" is always opening root instead of the project file directory
Bug IDEA-267664 Open in Terminal open in wrong folder
User InterfaceBug IDEA-260001 empty marketo form submits from License Activation dialog
Bug IDEA-266204 Increase "what's new" loading timeout
Bug IDEA-264528 i18n: Enable mnemonics in menu will cause IllegalArgumentException in Git project in Chinese/Korean
Bug IDEA-255620 Modal alert boxes in Macos Big Sur are bright white even on a dark theme
Bug IDEA-266540 Welcome screen increase size
Bug IDEA-186369 Data sharing options screen unnecessary, appears repeatedly
Bug IDEA-230649 Favorites and Maven tool windows are closed on project opening though they were opened on project closing
Bug IDEA-263072 Welcome screen grows every time on theme change
Bug IDEA-266506 Issue with built-in preview feature on Idea 2021.1
Bug IDEA-264529 Native crash when opening Trusted Dialog (macOS BigSur) KERN_PROTECTION_FAILURE at 0x0000000110c86008
Usability IDEA-131137 Switcher - add settings to not show tool windows list
Usability IDEA-259451 Large "Got it" tooltip with a long text line
User Interface. ControlsBug IDEA-260589 Press-release-hold Alt doesn't show tool window tabs
User Interface. Find, Replace, UsagesBug IDEA-243458 Find tool window: Pin search tab applies to what has focus, not what was clicked
User Interface. Keyboard InputBug IDEA-262375 Mouse Forward and Back buttons(side buttons) register as "Right Click" when setting a mouse shortcut to them.
Bug IDEA-247432 Switcher popup window shortcuts conflict with Emacs Up/Down key mapping
User Interface. Look and FeelBug IDEA-265581 Freeze at java.desktop@11.0.10/
User Interface. NavigationBug IDEA-211515 RecentFiles: displayed path is not correct for the first file selected on popup opening
Usability IDEA-197930 Recent Files mnemonic
User Interface. Project ViewUsability IDEA-95456 Project View tool window gets wider after each open/close cycle
User Interface. Services ViewCosmetics IDEA-265001 Services run configuration notification should have empty title
Version ControlBug IDEA-266367 i18n: Amend toolbar and Commit message section are not shown under non-modal commit interface under Chinese/Korean
Version Control. GitBug IDEA-248816 "Datasource local storage ignored files" path is generated glitched inside .gitignore
Bug IDEA-264683 Unshelve puts the file in the active changelist ignoring selected one in the unshelve dialog when file is open in the editor
Bug IDEA-264088 Cannot add files/directories to .git/info/exclude
Usability IDEA-262598 Commit message area in "Edit/Squashed commit message" dialogs is too small
Version Control. LogBug IDEA-265042 git log user:me filter is not showing all commits
No subsystemBug WEB-50444 unable to save plugin settings
Bug WEB-50218 Exception when invoking introduce variable
CSSFeature WEB-49111 Inspection "Unknown CSS property" doesn't know about properties added in Chrome 83+
Bug WEB-50486 CSS :where() pseudo-selector is not supported
Bug WEB-50028 CSS :is() pseudo class not supported
Bug WEB-50307 Unknown CCS property "aspect-ratio"
DebuggerBug WEB-50168 Can't debug react-native app with expo
Bug WEB-50166 Documentation missing for Debugging Javascript in Chrome for Rider
JavaScriptFeature WEB-49934 Feature: copy imports from type declaration
Feature WEB-50182 After the `import` keyword provide completion and auto import for named and default exports
Bug WEB-45339 "Unresolved type Promise" in a directory configured as es6
Bug WEB-43428 Copying part of code adds wrong import
Bug WEB-50487 Freeze on putting cursor to 'var'
Bug WEB-50522 JSDoc: correctly highlight parameter default value of Object/Array type
JavaScript. FrameworksFeature WEB-33480 Extract Angular component refactoring
Feature WEB-47799 Support new component options syntax in vue-class-component v8
Bug WEB-50321 "Component or directive is out of the current Angular module's scope" reported for Material components after migrating to Angular 12
Bug WEB-50392 Extract Angular component: error message disappears too fast
Usability WEB-50402 Extract Angular component: extraction of the whole html file doesn't work (using ctrl+a)
JavaScript. InspectionsBug WEB-50319 "Void function return value is used" false positive when function returns never
Bug WEB-50340 Noinspection SpellCheckingInpection multiple times within file
TypeScriptBug WEB-47997 A *.ts file isn't removed from the Project Errors tab in the Problems view, after deleting it
Bug WEB-50272 Typescript 4.3: override and the --noImplicitOverride Flag
Bug WEB-50086 unsupported typescript syntax; nullish coalescing operator with anonymus function
Bug WEB-50098 unsupported typescript syntax; property decorators on rest parameters
Bug WEB-49023 WebStorm cannot infer the correct type for a generic Pipe
Bug WEB-50087 unsupported typescript syntax; literal computed property names in enums
Bug WEB-50576 "as" keyword breaks "updated, but never queried" inspection
Unit TestsBug WEB-49356 mocha-intellij-stringifier fails with BigInt values
AdministrationBug DBE-13019 Cannot add grant to user without any grants
Code GenerationBug DBE-12934 No SQL generated when using INOUT parameter in procedure
Bug DBE-12892 BigQuery: can't drop materialized view via UI
Code HighlightingBug DBE-12994 BigQuery dialect not up-to-date
Data Editor/ViewerBug DBE-12817 MongoDB: cannot convert one numeric type to other numeric type
Bug DBE-12594 Formatted mode for XML removes all spaces
Bug DBE-12910 MongoDB: cannot type float value in integer cell
Bug DBE-12940 "Toggle Soft-Wrap" button in Value Editor gone if select another cell
Bug DBE-11780 Greenplum. [42703] ERROR: column "ctid" does not exist
Bug DBE-12909 Cannot insert correct NumberLong value to MongoDB if a column is not NumberLong
Bug DBE-12985 Date time dialog default day is today, not the date in the table
Data Import/ExportBug DBE-12536 Exasol csv upload extremly slow
Performance DBE-11892 CSV Upload extremely slow
Database MigrationsBug DBE-12873 BigQuery: Invalid default data type `int` for new table creation
Full-Text SearchBug DBE-12967 "Full Text Search" for SQLite should use LIKE to search within LONGVARCHAR fields
IntrospectionFeature DBE-11818 Allow 'datistemplate=true' databases to show up
Bug DBE-13024 Introspection fails for Redshift
Navigation & SearchFeature DBE-12901 Go to database object doesn't display data sources
Bug DBE-12968 Database color settings are not highlighting in "Go to Table/View/Routine..."
Usability DBE-5341 Database: Edit on Oracle synonym could open referred object editor
  • No labels