Skip to end of metadata
Go to start of metadata

RubyMine 2021.1 Release (211.6693.118 build) Release Notes

No subsystemBugRUBY-11618RubyMine 4.5 not opening various file types (*.haml, *.rhtml, *.rxml) in editor
BugRUBY-27884IDE stops responding when 'check regexp' with Repetition(less times) regular expression
CoreCosmeticsRUBY-18360RailsApps Sample wizard needs redesign
Core. ConsolesBugRUBY-278152020.3.2 broke all my run configurations
Core. LocalizationBugRUBY-27362Not all items in the Settings are extracted
Core. SSHBugRUBY-26823SSH session: Rsync link is a dead one
EditorBugRUBY-27498Rails associations are shown as 'rails.codeinsight.call'
BugRUBY-27501Name of class variable is shown with @
UsabilityRUBY-27497Tests are shown as list of 'Ruby:Do block call' in the navigation bar
Lang. RBSFeatureRUBY-27396Add basic symbol support in RBS that provides declarations
FeatureRUBY-27627Add references in RBS
FeatureRUBY-27383Add lexer/parser for RBS language
FeatureRUBY-27733Remove reference from `bool` in RBS
FeatureRUBY-27625Add support for rename in RBS
FeatureRUBY-27670Add support for the "Comment line" action in RBS
FeatureRUBY-27701Allow resolving RBS references to RBS files in the ruby SDK/stdlib
FeatureRUBY-27626Add support for find usages in RBS
FeatureRUBY-27674Add support for "module self types" in resolve in RBS
BugRUBY-27673Add recursion management in RBS resolve
BugRUBY-27762Add support for highlighting declarations of the element under the caret in the editor for RBS
BugRUBY-27689RBS references inside installed gem doesn't work
BugRUBY-27830RBS reference doesn't work for singleton constants
ExceptionRUBY-27718NullPointerException when defining method inside .rbs
ExceptionRUBY-27719java.lang.UnsupportedOperationException when defining method inside .rbs
TaskRUBY-27557RBS: Partially move parser logic to the lexer
RailsUsabilityRUBY-27534Unneeded warning 'This version is not fully supported' for Rails 6.1.0
Ruby. FormatterBugRUBY-25786New line in a multiline method call is deintented on typing a colon
BugRUBY-26933Incorrect Auto-Indentation for 'if then' and 'else' statements followed by a comment.
BugRUBY-27411Inconsistent indentation for brace blocks over multiple lines
BugRUBY-27553Comments before methods break indentation logic when a private accessor modifier is used
BugRUBY-27633Wrong caret position after visibility modifiers
BugRUBY-26757Incorrect indentation for methods with arguments and inline comment
Ruby. InspectionsFeatureRUBY-27428Allow additional comments after noinspection warning suppression comments
BugRUBY-27568False Pattern matching with the 'in' operator requires Ruby 2.7 with Ruby 3.0
Ruby. TestsFeatureRUBY-27660
Add inspection for unresolved references
 FeatureRUBY-27661
 Add new file template for RBS
BugRUBY-26931Minitest fails to start with DRb::DRbConnError
BugRUBY-27797'No tests were found' if rerun failed tests for multiple tests
BugRUBY-27907Test Run Configurations are not created properly
BugRUBY-27818A test file must be provided (Exception) when trying to run minitest configuration from RM 203 in 211
BugRUBY-27798
RSpec run configuration is also suggested when multiple Minitest or Cucumber tests are selected
BugRUBY-27799
Multiple selection in the folder with tests have no file type validation
BugRUBY-27589Minitest fails with uninitialized constant Minitest::RubyMineMinitestParallelTestCaseManager::Set
Ruby. Tests. RSpecBugRUBY-27438Rspec example names field in Run Configuration editor actually doesn't support multiple examples
BugRUBY-27710No tests were found when trying to rerun rspec tests
EditorBugRUBY-27547"CACHED_SMART_POINTER" elements in navigation bar popup
Ruby. PluginBugRUBY-21465Ruby Facet is missing
Remote Interpreters. DockerBugRUBY-27650Cannot add new Docker, Docker-Compose or WSL SDK
Tools. BundlerBugRUBY-27784org.jetbrains.plugins.ruby.gem.GemManager.updateGemset in EDT
No subsystemFeatureIDEA-263914Support YK profiler for M1
BugIDEA-263699[new run config UI] Tooltips for command line fields blinking bug
BugIDEA-263337FileSystemException : Incorrect function in wsl
BugIDEA-251691NPE in com.intellij.openapi.editor.impl.EditorMarkupModelImpl$5.beforeActionPerformed when trying to implement coverage-by-test in custom plugin
BugIDEA-262891Webforms project doesn’t load, UI freezes
BugIDEA-265522WSL2: Cannot assign requested address: bind when /etc/resolv.conf changed
BugIDEA-263502Spock tests fail to start with java.lang.ClassNotFoundException: junit.framework.ComparisonFailure
BugIDEA-262934Cannot read clipboard data
TaskIDEA-263881Update choose runtime UI
Security ProblemIDEA-261832Possible DoS
ExceptionIDEA-262614com.github.dockerjava.api.exception.BadRequestException at running a Dockerfile with ARGs before FROM
ExceptionIDEA-262420Search everywhere throws exception: com.intellij.diagnostic.PluginException: Created extension classloader is not equal to plugin's one.
AndroidBugIDEA-264473Android SDK is not being added automatically to the project structure
BugIDEA-262429Java library module class is unresolved in Android module
BugIDEA-263893Android plugin's database inspector does not work
BugIDEA-246348When open AVD Manager for Android Emulator an error
BugIDEA-262057Android designer. ClassNotFoundException: androidx.appcompat.R$styleable (Apple Silicon)
BugIDEA-237650Can't connect to database in emulator
BugIDEA-264378Android Layout Editor does not show issues in the issues panel
BugIDEA-264009Migrate bintray URLs to cacheredirector in Android Plugin
BugIDEA-256189Error on project opening: Duplicate content roots detected
BugIDEA-261495During the android app test, idea cannot open some files in the simulator
BugIDEA-261070Android Plugin should not show "Gradle files have changed..." in projects with no Android modules
BugIDEA-264333AssetStudio: no default ic_launcher icon
BugIDEA-261858IDEA 2021 EAP unable to debug on physical device via "Attach Debugger" action
UsabilityIDEA-231313IDEA can't launch Android Emulator on Windows when IDEA itself is started from idea64.exe (OK when started from idea.bat)
BuildFeatureIDEA-263998Show warning if gradle script uses gradle-bintray-plugin
BugIDEA-264085BindException: Cannot assign requested address error When trying to build any project on WSL 1
Build. Built-in (JPS)BugIDEA-260359WSL: All files are up-to-date when compiling modified project
Build. GradleBugIDEA-264439Gradle project on WSL: error message in the case of using the JDK located on Windows
BugIDEA-264051The specified Gradle installation directory '\\wsl$\Ubuntu-20.04\wsl$\Ubuntu-20.04\wsl$\Ubuntu-20.04\wsl$\Ubuntu-20.04\wsl$\Ubuntu-20.04\wsl$ ...
BugIDEA-262879Gradle project sync never completes
BugIDEA-264107Gradle groovy scripts debugging doesn't work for projects on WSL
BugIDEA-254884Tests not compatible with gradle configuration cache
UsabilityIDEA-263144Double confirmation when opening a new Gradle project and not trusting it
UsabilityIDEA-260728Gradle init script is not configuration cache compatible
Build. MavenBugIDEA-263481java.lang.ClassNotFoundException: org.jetbrains.idea.maven.server.RemoteMavenServer36 when trying to open maven project located in WSL
BugIDEA-261414Maven distribution installed via package manager does not supported on WSL
BugIDEA-262404Can't import Maven Project in 212.17, Project is untrusted
Code Analysis. InspectionBugIDEA-192702Clicking Edit Settings in Insepction Results does nothing
BugIDEA-130333Inspection settings: scopes order is not saved
TaskIDEA-260048Show Inspections results in Problems tool window
CoreBugIDEA-258519IDE fails to open a project from the command line if another project is already opened (perhaps Windows-only)
UsabilityIDEA-229543Command-line launcher should not ask which window it's supposed to open the project in
Core. DebuggerBugIDEA-262878Click on toolbar button "Evaluate expression" no longer uses editor selected text
BugIDEA-263014XLightBreakpointPropertiesPanel#myCustomPropertiesPanelWrapper uses wrong layout
Core. DiagramsBugIDEA-211984UML Diagrams: any action performed from diagram can't be Undone though Undo is shown enabled with correct last action name
BugIDEA-265037UML diagrams: Kotlin: constructor is shown for object
BugIDEA-264693Java Enterprise toolwindow: CDI Dependencies diagram is opened without layout
BugIDEA-264029UML diagrams fonts are too big in 2021.1 Beta when comparing with 2020.3.2
BugIDEA-263119JPA: ER Diagram opened not centered
BugIDEA-263112JPA: ER Diagram is not refreshed after adding the attribute
BugIDEA-264684JSF Navigation diagram: on unchecking the ShowSelectedNodesWithDependencies the resulted diagram layout is incorrect
BugIDEA-263877Spring Application Context Dependencies Diagram: on Show Library Models action the layout is not applied
BugIDEA-265035UML diagrams: Kotlin: tooltip over package item shows wrong statistics
BugIDEA-264679JSF Navigation diagram: no layout on diagram opening
BugIDEA-264697CDI Dependencies diagram is always empty
BugIDEA-264695CDI Dependencies diagram action appears outside the Diagrams menu group and causes exception only
BugIDEA-264690Spring Beans toolwindow: the beans graphs appear without layout
BugIDEA-263868Spring Diagrams: with `Show neighbours of the selected nodes` option the results of selection change is ugly (no layout)
UsabilityIDEA-264691Add the ApplyCurrentLayout action to the context menu for the toolbar-less diagrams
ExceptionIDEA-264067NPE at com.intellij.uml.java.dependency.JavaClassDependencyAnalyzer$MyDependencyCollectingVisitor.isCollect ion
ExceptionIDEA-263561ISE at com.intellij.spring.perspectives.diagrams.SpringDiagramNode.getIdentifyingElement
ExceptionIDEA-262492CCE at com.intellij.uml.presentation.DiagramPresentationModelImpl.getNodeTooltip
ExceptionIDEA-263489IAE at com.intellij.diagram.presentation.DiagramState.restoreTo
ExceptionIDEA-262187Throwable at com.intellij.psi.impl.file.impl.FileManagerImpl.checkHasNoOtherPsi
ExceptionIDEA-263255NPE at com.intellij.uml.java.JavaUmlDataModel.createEdge
ExceptionIDEA-263414Throwable at com.intellij.psi.impl.file.impl.FileManagerImpl.checkHasNoOtherPsi
ExceptionIDEA-263875ICSE at com.intellij.uml.UmlFileEditorImpl.getData
ExceptionIDEA-222077UML diagram: attempt to add note to diagram popup causes IOOBE
ExceptionIDEA-264064NPE at com.intellij.openapi.graph.impl.view.FastNodeCellRendererPainter.paintNode
ExceptionIDEA-264685Throwable: Read access is allowed from event dispatch thread or inside read-action only
Core. IDE SettingsBugIDEA-264893[Choose Runtime dialog] there is no ability to add JBR if it isn't located in ~/Library/Java/JetBrainsRuntime/ folder
BugIDEA-261869Choose Runtime - polishing
UsabilityIDEA-259872After IDEA update: Propose to use bundled runtime if configured runtime is older
CosmeticsIDEA-227451Settings > Editor > Code Style > Java > Arrangement items disappear or move on mouse hover
Core. IndexingBugIDEA-264500VFS cache can't recover automatically after content storage corruption
BugIDEA-265212IntelliJ IDEA 2021.1 beta 4 cannot resolves JDK classes
BugIDEA-263504Invalidate Caches dialog: reconsider the defaults
BugIDEA-262899Can't find a file using Search Everywhere/Goto File
BugIDEA-263200Shared index trying to attach non-existing chunk
BugIDEA-262428Do not show public CDN URLs
Core. InstallationBugIDEA-262571clion.sh doesn't allow symlinks
BugIDEA-263043Idea fails to start from path contains spaces on linux
UsabilityIDEA-263364App started from IDEA cannot access Bluetooth on macOS Big Sur
UsabilityIDEA-2640602021.1 update journey is broken as it requires multiple "check for updates" to produce a fully working installation
UsabilityIDEA-252209Avoid broken installation on Linux when distributive is unpacked into the same folder
Core. LicensingFeatureIDEA-263678License Panel: hide Evaluate radiobutton for CWM plugin
BugIDEA-265183Broken license dialog UI when user has several licenses
TaskIDEA-263484Docker Desktop causes wrong host name to be sent while obtaining floating license
Core. Platform APIBugIDEA-264897A race condition that leaves daemon hanging
Core. Plugin ManagementBugIDEA-253978"File type conflict found" on every IDEA start - 3rd party plugins
ExceptionIDEA-262837Plugin installation failure - StackOverflowError in findPluginExtensionPointRecursive
Core. ProfilerBugIDEA-264221"Profiler error: Invalid file format" after second profiling session in WSL
BugIDEA-264587Profiler executors unavailable in run toolbar after list of profiler configurations is changed
Core. Project SettingsBugIDEA-257476Modules get lost on changing the 'store generated files externally' option for multimodule maven project
BugIDEA-99596Manifest file located under 'main/java' root in Maven module is shown in artifact editor even if it won't be really copied to artifact
BugIDEA-257175IJ resets content root to the incorrect directory
BugIDEA-264113Cannot change library scope second time after clicking "apply" in project structure dialog
BugIDEA-260372Maven projects can't be built after disabling the (not used) dependency
BugIDEA-262946New EAP prints many errors to the log about duplicating LibraryIds
BugIDEA-222640Library configured via Project Structure For New Project dialog appears incorrectly in the new projects preventing new project libraries configuring
UsabilityIDEA-116209Allow to directly specify a jar's META-INF/MANIFEST.MF file
ExceptionIDEA-262073java.lang.RuntimeException: Unable to get registered settings of #VueCodeStyleSettings when enabling Vue.js plugin with opened .vue file
Core. Run. ConfigurationsBugIDEA-264143The root node is configurable in the Run/Debug Configurations dialog
BugIDEA-264202[new run config UI] invoking "command line" fields mnemonics don't move focus during indexing
UsabilityIDEA-263886[new run config UI] Change 'modify option' hotkey on macOS to be Option-M
UsabilityIDEA-246087[new run config UI] Improved keyboard navigation to fields
ExceptionIDEA-245958Throwable: Directory index may not be queried for default project
ExceptionIDEA-262425PluginException: Cyclic service initialization: RunManager
Core. Run. TargetsBugIDEA-262162Run Targets: first introspection for WSL target fill JDK path incorrectly
BugIDEA-261979SSH target startup is very slow because of files syncing
BugIDEA-262784Run targets: SSH stops working after installing rsync on Windows
BugIDEA-262446Run Targets: SSH: contents of coverageNargs file is not uploaded
BugIDEA-262289Run Targets: SSH: attempt to run with coverage fails
BugIDEA-264934Eternal throbber in target creation wizard
BugIDEA-264026Run Targets: IDEA coverage/profiler stopped working on Docker target
BugIDEA-264928RunTargets. Quarkus. It fails to run on docker target
PerformanceIDEA-262457Choose run configuration popup is slow on IntelliJ IDEA project
UsabilityIDEA-262430Run Targets: SSH allow to select the Gradle home using the path chooser
UsabilityIDEA-265188Show popup `Please add /Applications/GoLand.app to Resources -> File Sharing` when GoLand runs from /Applications/ path on macOS
CosmeticsIDEA-258266Run Targets. Cosmetic UI bugs
TaskIDEA-262277Remote targets for Go Build: Introspection completed with error. Getting environment failed with exit value 1
TaskIDEA-258455Run Targets: download files from target
ExceptionIDEA-259929java.nio.file.NoSuchFileException in Docker plugin on pulling the image by creation a run target
Core. Task ManagementUsabilityIDEA-254355Provide an ability to assing shortcuts for "Start Timer" and "Stop Timer" actions
EditorBugIDEA-264440Wrong bold font is used in editor
BugIDEA-260496Font Settings: dropdown uses wrong font when Monospaced selected
BugIDEA-262699Wrong variant of Iosevka is used for italics
BugIDEA-263938Character moves a little when typing, looks like bounce effect
BugIDEA-258454Reader Mode options are not applied for opened library file until reopening
CosmeticsIDEA-262330Font Settings: adjust top of dialogue box (remove extra margins)
TaskIDEA-260492Font Settings: modify "Typography Settings" to a group that collapsed by default
TaskIDEA-262329Font Settings: improve search within font dropdown
Editor. Code CompletionBugIDEA-260190Lookup popup window is incorrectly sized when there is only one item
Editor. Code Completion. MLBugIDEA-261990"Machine Learning Code Completion" plugin visits .class files
Editor. Diff and MergeBugIDEA-262442Diff detects changes incorrectly when add empty lines
BugIDEA-257651Diff view detects big diff but change was only small
Editor. Editing TextFeatureIDEA-119451Extend line selection via keyboard shortcut
BugIDEA-264147Chosen font variation is ignored in some dialogs
BugIDEA-262434Italic font is broken for Courier in 2021.1 EAP
UsabilityIDEA-260463EditorTextFieldActionPromoter hides IdeaVim actions
Editor. FormatterBugIDEA-205999"else" and "{}" indentation
BugIDEA-157294Exporting Code Style profile fails when name is not filesystem-friendly (e.g. it contains a slash in *NIX systems)
BugIDEA-189817Code format breaks long URLs in code comments
Editor. Intention ActionsBugIDEA-263507Line join silently changes semantics for nested ifs
FrameworksBugIDEA-265383IntelliJ cannot download thymeleaf library via Framework Support
BugIDEA-262890New project Wizards for JVM Frameworks: selected features can't be deleted if they are filtered out by search
BugIDEA-262894New Project Wizards for the JVM Frameworks: don't allow to select unavailable dependencies
BugIDEA-265146Frameworks: StackOverflowError in New Project wizards of Spring and Java EE
UsabilityIDEA-262888Unified New Project Wizards for the JVM Frameworks: speed search should not be invoked on typing
UsabilityIDEA-263580JavaEE Wizard. Save SDK selection for the next project creation
Frameworks. LombokBugIDEA-262693lombok @Builder is broken
PerformanceIDEA-264579Autocomplete is slow with the latest updates with Lombok plug-in querying indices
Frameworks. MicronautFeatureIDEA-260140Micronaut: load supported Java versions for new project wizard from server-side
FeatureIDEA-246320Micronaut: show version of Micronaut for new projects
FeatureIDEA-233827Micronaut: Fold internal stack frames for HTTP server
BugIDEA-235429Micronaut: setter methods of @ConfigurationProperties beans are reported as unused
UsabilityIDEA-257948Micronaut project generating: check the selected java version to match the set project jdk
Frameworks. OSGiFeatureIDEA-138550Support bnd-maven-plugin
Frameworks. QuarkusFeatureIDEA-262757Quarkus: add Kotlin language and Gradle Kotlin options to new project wizard
FeatureIDEA-233828Quarkus: Fold internal stack frames for HTTP server
BugIDEA-265675Quarkus: application port is not shown in Services in debug mode
BugIDEA-261500Quarkus: false-positive CDI bean inspection for @Localized interfaces
BugIDEA-265509Docker container is not removed after stopping Quarkus run configuration on Docker target
BugIDEA-255635Quarkus: new quarkus project freezed on downloading funqy extensions
BugIDEA-263335Quarkus: Can't create new quarkus project with google cloud extensions
Frameworks. SeleniumUsabilityIDEA-264273Selenium: provide Export and Copy actions for Page Object editor
UsabilityIDEA-263297Selenium: support multiselect for Add Element to Page Object action
Frameworks. SpringFeatureIDEA-242594Spring Initializr: Open HELP.md automatically when a new project is created with the wizard
FeatureIDEA-169655Spring MVC model variables don't work with Kotlin
FeatureIDEA-262592"Navigate to the Spring bean declaration(s)" gutter icon not show for the library bean
FeatureIDEA-199674Spring MVC with Kotlin: kotlin configuration classes are not recognized
BugIDEA-263751Spring Cloud: cannot inject CircuitBreakerFactory bean
BugIDEA-263615Select in Spring Beans doesn't work for Sprint Boot auto configuration classes
BugIDEA-186130Spring MVC: parse ViewResolverRegistry explicit prefix()/suffix() calls
BugIDEA-263811Spring Initializr: Application Class Name is not changed for new project
BugIDEA-192941Spring Data: False positive warning on @Cacheable annotation in repository interface
BugIDEA-222139SpringMVC+Thymeleaf. Intellij idea cannot recognize view declaration
BugIDEA-261959Language injection for SQL queries does not work for the new extension methods in Spring Framework
BugIDEA-262331Configuring Thymeleaf ViewResolver via Kotlin is not recognized by the IDEA
UsabilityIDEA-263923Spring Initializr. Cannot reset too long server URL
GroovyBugIDEA-26403Maia 92.65 and 92.81 overwrite and destroy existing Grails run configurations on startup.
Infrastructure. Build ScriptsBugIDEA-262910Duplicate entries in IDEA source archive
Java. Code CompletionFeatureIDEA-262315Complete current statement doesn't work for switch expression
BugIDEA-262124No primitive type suggestions after annotation
BugIDEA-263178Cannot accept boolean completion using exclamation mark in JSPs
PerformanceIDEA-261235code completion in lamda is slow
Java. Code CoverageBugIDEA-263087Coverage throws VerifyError on inline function with default args
Java. Code FormattingBugIDEA-227688Unsetting keep line breaks option doesn't join the lines in method call on reformat
Java. DebuggerBugIDEA-263498Argument for @NotNull parameter 'shortcutSet' of com/intellij/openapi/actionSystem/AnAction.setShortcutSet must not be null
Java. Extract MethodBugIDEA-263865in-place extract method: send started/done events to `RefactoringEventListener`
BugIDEA-262792Extract method doesn't keep the new method name
BugIDEA-262513In-place extract method: rename method template is not created if Android plugin is enabled.
Java. InspectionsBugIDEA-262701Dataflow analysis fails to detect overflow in expression
BugIDEA-239837Suspicious test for oddness not triggers when parentheses added
BugIDEA-264394equals and hashCode are not paired: do not report on Java records
BugIDEA-262774Text on tabs in 'Declaration has JavaDoc problems' inspection options is invisible
BugIDEA-263589Unused declaration entry point configuration dialog window hides some options
Java. Profiler. CPUBugIDEA-262219Async-profiler does not start in wsl
UsabilityIDEA-253842Inform that not all jfr events are shown
Java. RefactoringsBugIDEA-231997Convert anonymous to inner should replace diamond operator with actual type
PerformanceIDEA-227870IDEA freezes when moving files
Java. Tests. JUnitBugIDEA-263902Run Configuration validation doesn't work when started from gutter icon
JavaX. AppServers. Google App EngineBugIDEA-264010Unable to create new projects when Google App Engine plugin is enabled
BugIDEA-261854Cannot setup Google App Engine. Settings are not being saved after restart
JavaX. AppServers. JBossCosmeticsIDEA-128947JBoss is now officially named WildFly
JavaX. AppServers. WebSphere/LibertyFeatureIDEA-254745Add Liberty to the WebSphere application server option
ExceptionIDEA-255496NPE at com.intellij.j2ee.webSphere.deployment.WebSphereDeploymentProvider.getSupportedArtifactTypes
JavaX. CDIBugIDEA-227178Wrong warning in inspection 'CDI (Contexts and Dependency Injection) | Injection Points Ambiguous Dependencies'
BugIDEA-245806CDI: treat the @Named qualifier without value and the @Named qualifier with explicit default value as the same ones on bean injecting
BugIDEA-260809CDI inspection error: Serializable is not a decorated type
JavaX. JPABugIDEA-248315Static string appended to column name in @Table @UniqueConstraint annotations not respected
BugIDEA-260980JPA. Ctrl+click on the table name should navigate to the table in the Database view. Now it opens ddl instead of it.
BugIDEA-167500Confusing representation of abstract generic classes on ER diagram
JavaX. JavaEEUsabilityIDEA-263622JavaEE Wizard. Save App Server selection for the next project creation
JavaX. Web ServicesBugIDEA-264583Microservices: URL Path rename does not work
Lang. Flash and FlexBugIDEA-262697Unable to start Flex/AIR app debugging in 2021.1 EAP. Error running 'AppName': Unknown error.
Lang. JSONBugIDEA-261811JsonPath support: the slice operator [start:end:step] is error-highlighted
BugIDEA-262273JSONPath: operators are not correctly highlighted on incremental highlighting
UsabilityIDEA-262172JsonPath: provide completion by existing keys inside injected fragments
UsabilityIDEA-262180Evaluate JSONPath: the font used for the jsonpath expression field should be the same as the editor one
Lang. MarkdownBugIDEA-260339Formatting removes cpp code sections from Markdown files
Lang. RegExpBugIDEA-262576Wrong warning about redundant non-capturing group
Lang. Shell ScriptBugIDEA-261565Every invocation of a shell script create a new terminal tab
Plugin Development (DevKit)BugIDEA-262082Custom Themes: Cannot change any icon
SpaceFeatureIDEA-263767Add Show in Git Log action to the list of commits in Space reviews
BugIDEA-259762Space Code Reviews: Back to List doesn't refresh the list
BugIDEA-246088Space plugin: handle Share project on Space action being logged out
UsabilityIDEA-260515Space: add an action to navigate to Space Code Reviews Toolwindow
UsabilityIDEA-263342Shorter titles for code review tabs
UsabilityIDEA-262455Always show Space icon on main toolbar
UsabilityIDEA-262242Detect that repository belongs to Space using remote urls
UsabilityIDEA-263632Better tooltip for Space toolbar button
Tools. DockerFeatureIDEA-262611Support --platform command line option
FeatureIDEA-262658Docker. Provide completion of stages names in case of multiple FROM statements in a Dockerfile
FeatureIDEA-261892Fold stages in multi-stage Dockerfile
FeatureIDEA-171374Docker: Provide completion for image names in the Dockerfile, DockerCompose files
FeatureIDEA-179935Docker: provide completion for the environment variables in the Dockerfile
BugIDEA-263159Docker. After an invalid connection all run configs fail until I re-connect to the Docker
BugIDEA-262633Dockerfile, Editor, images completion: remove `library/` at tags completion
BugIDEA-262584Docker. Dockerfile run configuration, Build options field: completion doesn't work after build options without arguments
BugIDEA-262419show running cli command in docker-compose deploy log
BugIDEA-256721Docker. Impossible to delete connections from the Services view.
BugIDEA-263457Docker. Run hangs after adding "Run built image" section and re-run
BugIDEA-262881Docker. Build image creates a run configuration with the "run" section
BugIDEA-263462Docker. Remove docker.log file
BugIDEA-263058Docker. BuildKit. Context folder always looks at the project folder
BugIDEA-262568Docker.Container Deploy log tab: Ctrl+C via keyboard doesn't work
BugIDEA-263044Docker. Exclude the current build stage name from the names completion list after `--from`
BugIDEA-262324Docker: when buildkit is enabled the image is always built on the Docker desktop, even if other connection is selected
BugIDEA-262349Docker-compose run configuration: add an explaining tooltip over each option
BugIDEA-264653Docker. Before launch. Compose in compose parent task doesn't run
BugIDEA-263269Docker. Support completion for ARGs in Dockerfiles
BugIDEA-262619Docker. Deploy Dockerfile with the pointed target never ends
BugIDEA-263086Options in Run section aren't persistent between Run configuration reopen
BugIDEA-263039Docker. WinOS. BuildKit: it fails to run a container
BugIDEA-263419Docker. Dockerfile/Image Run configuration.`Bind mounts` field is not removed at removing the option.
BugIDEA-263418Docker. Dockerfile/Image run configuration. Publish all option doesn't work as CLI option
BugIDEA-263514Rider does not work with docker rootless
BugIDEA-262654Dockerfile, Editor, image tags completion: the result list contains many items which are out of scope
BugIDEA-234252DockerCompose: image tags completion doesn't work
BugIDEA-186080Typed YAML: when keys are references, completion for them should not suggest existing sibling keys
BugIDEA-263164Docker-compose. Impossible to run docker-compose on docker-machine
BugIDEA-235007No quotes autocompletion
BugIDEA-262345DockerCompose. Run configuration. Scale:`Select Service to Scale` link doesn't add the service into the table
BugIDEA-262501Docker. Run Dockerfile with the pointed target fails
UsabilityIDEA-262806Docker: recognize Dockerfiles for Quarkus example files
UsabilityIDEA-262657Dockerfile, Editor, images completion: auto-appeared completion list contains not correct items list
UsabilityIDEA-196666Add --rmi flag support for docker-compose integration
CosmeticsIDEA-264539Docker. Connection Settings: the url for Rootless socket on UNIX systems overlaps the option name
ExceptionIDEA-263927Exception when open Docker settings on windows
ExceptionIDEA-262627com.github.dockerjava.api.exception.BadRequestException at running FROM without arguments by disabled BuildKit
Tools. HTTP ClientBugIDEA-239228REST does not work with manually configured ssh tunnel SOCKS5 proxy
BugIDEA-260741HttpClient: Completion for SSLconfiguration on windows comes with wrong "/"
ExceptionIDEA-261390HttpClient: On run request with certificate get java.lang.AssertionError: Wrong line separators: '...y>\n</html>\r\n' at offset 254 exception
Tools. KubernetesBugIDEA-262936Kubernetes. Editor. Understand "null" value in resource files
BugIDEA-263575[kubernetes] java.lang.Throwable: DataContext shall not be created and queried inside another getData() call.
BugIDEA-261966Helm. Non-default values files: provide quick-help for the values dialog
BugIDEA-239812Kubernetes Plugin prevents normal YAML syntax highlighting.
BugIDEA-263598compute.cnrm.cloud.google.com/v1beta1 does not have editable resources
Tools. TerminalFeatureIDEA-224561API for custom highlighting of a found text in Terminal
BugIDEA-180923Terminal. Scroll bounce
BugIDEA-264105Using 2021.1 beta2, opening a terminal the mouse wheel scroll is not working. This used to work.
BugIDEA-259452Too fast scroll in Terminal
TaskIDEA-228106Provide API for getting Terminal cursor coordinates
User InterfaceBugIDEA-263928Notification balloons do not appear when the corresponding status bar widget isn't displayed
BugIDEA-262234Native crash due to uncaught exception NSInvalidArgumentException on several modal dialogs on BigSur
BugIDEA-263915"Quick switch scheme" popup mnemonics display as "..." with larger appearance font sizes
BugIDEA-264220Initial path under \\wsl$\ is not selected in file tree on opening file chooser dialog
BugIDEA-113995Jump list: can't open recent projects that have spaces in paths
BugIDEA-249791Switcher cannot display all options
BugIDEA-263404EAP user agreement too small to read
BugIDEA-265418'Subpixel' mode is default for the Editor on macOS
BugIDEA-263961Certain combinations of bookmark icon colors are handled incorrectly
BugIDEA-87703Recent files doesn't close when floating Navigation bar appears
BugIDEA-227657"Recent files" popup has UI glitches after removing file
BugIDEA-263574Choose Boot Runtime: "Failed to set boot JDK runtime" error on attempt to select JDK in Download JDK dialog
BugIDEA-261894Editor tabs for modified files that contain errors have wrong text color
BugIDEA-239130The IDE gets stuck after cancelling opening a project
BugIDEA-262148UI inspector shortcut triggers Alt+Click action on the inspected component
BugIDEA-262477Submenu is not shown on mouse hover
BugIDEA-261715Modal progress dialog is hidden on ESC, but Task is not cancelled
BugIDEA-265019StackOverflowError on action update
BugIDEA-261723Welcome Screen size grows after each restart so that its frame doesn't fit the display
UsabilityIDEA-72536Switcher shortcuts changing is confusing
UsabilityIDEA-187018Make F2 "Go to next highlighted error" work in Recent Files/Recently Edited files popups
UsabilityIDEA-264770[Choose Runtime dialog] Minimize button closes the Setting IDE boot runtime pop-up and IDE looks like frozen until downloading will be completed
CosmeticsIDEA-262259Action text is not aligned with mnemonic in popups
CosmeticsIDEA-262729cosmetic file watcher message
CosmeticsIDEA-262243Mnemonics color in popups is not changed when the row is selected
TaskIDEA-261797Popups: mnemonics style
User Interface. AccessibilityBugIDEA-257258camplition popup is not voiced on macOS
User Interface. Action SystemTaskIDEA-263205Action Popups: Disable separate "next step" button
TaskIDEA-261330Action names redefined in IdeUICustomization.projectMessage should be considered in goto action
User Interface. Console ViewBugIDEA-261792Cannot normally input in Run console
User Interface. ControlsFeatureIDEA-212299Implement Select parent node in UI trees
BugIDEA-250004Big Sur: Context menu highlighting breaks if submenu invoked
BugIDEA-261687Arrows separators are shown in Copy Path popup
User Interface. Embedded Browser (JCEF)BugIDEA-262267Built-in html preview is not rendered from time to time
BugIDEA-261496Cancelled Navigation in JCEF preview shows error page
BugIDEA-264004JCEF JBCefOsrHandlerBrowser failed to invoke JS when global registry value ide.browser.jcef.jsQueryPoolSize is not set.
TaskIDEA-263753provide ability to configure proxy server for jcef
TaskIDEA-262952allow JBCefBrowser to take focus on show/navigation
User Interface. Find, Replace, UsagesBugIDEA-264313Find in Files: dots in empty text
User Interface. FocusBugIDEA-263483focus lost after Reformat code
BugIDEA-249360Project View scroll jumps down to the previously selected file with "Always select opened file" when switching from another app
BugIDEA-209138Entering/Exiting Full Screen Mode causes the IDE's window to lose focus
User Interface. Keyboard InputBugIDEA-261309Character is typed in the editor when invoking a dialog through shortcut
UsabilityIDEA-177432Switcher shortcut to navigate backwards does not work with combinations other than Shift
User Interface. NavigationBugIDEA-216720"Ctrl+E" shortcut is displayed in "Recent Files" popup if it was removed from the keymap
BugIDEA-261860Navigation to an open file reopens it in active group
BugIDEA-264890Recent Files / Switcher chooses the first item by default
BugIDEA-102409Switcher with custom shortcut (e.g. Cmd-I) doesn't disappear when modifier released
BugIDEA-207163Recently Edited Files popup doesn't have shortcut for switching between RecentFiles and RecentlyEditedFiles
BugIDEA-264409Cannot open a recent file in splitted window
BugIDEA-263874No mnemonics in Switcher opened with one-key shortcut
BugIDEA-265505Backspace doesn't update speed search results in recent files
UsabilityIDEA-263890"Recent Files": unexpected focus, does not only filter on files
ExceptionIDEA-262100CME at com.intellij.ide.navigationToolbar.NavBarPanel.updateItems
User Interface. Project ViewBugIDEA-257211Can't navigate to package in external libraries
User Interface. Search EverywhereUsabilityIDEA-263459Support screen readers in search dialogs
Version ControlBugIDEA-237029Selecting text shortcut conflicts with toolwindow resize in Commit toolwindow
BugIDEA-260241Ctrl + C copies editor line instead of previous changed chunk content
Version Control. GitBugIDEA-262301Git Staging Area: don't group by repository changes in a single-root project
BugIDEA-262518Cherry-pick with conflict works incorrectly when conflicted file is open in the editor
BugIDEA-262223Git Commit Template: respect relative paths
BugIDEA-263695Can't commit staged changes on the first Commit toolwindow opening
BugIDEA-248343Git Remote add unable to cancel.
BugIDEA-264428Git: pressing OK in "Define Remote" dialog does nothing
UsabilityIDEA-262307Git Staging Area: allow commit without checking the checkbox when changes from the only one repo are staged
UsabilityIDEA-262282Staging operations should not be in the document undo stack.
Support RequestIDEA-254998Failed to start Git process: Unknown WSL distribution (Pengwin - Wlinux)
ExceptionIDEA-262818Exception every time then git panel is open
Version Control. GitHubFeatureIDEA-142717GitHub pull request template
FeatureIDEA-263016Allow filtering branches when selecting one to create a PR
FeatureIDEA-263015Ability to start PR creation without opening the toolwindow first
BugIDEA-264219Github Pull Requests: file tree on Commits pane gets stuck in loading state on new pr creation
BugIDEA-263925GitHub Enterprise: can't view pull requests
BugIDEA-262621GitHub Pull Requests: Cannot display item - Icon cannot be found in 'GithubIcons.Branch', class='org.jetbrains.plugins.github.GithubIcons' for events with branch icon in timeline
BugIDEA-263686Pull Requests: changing metadata from no assignees to 1 moves the entire right block to the left
BugIDEA-263510GitHub Pull Requests: wrong line separators error on editing PR description
BugIDEA-262590GitHub Pull Requests: commits with PR links are displayed incorrectly
BugIDEA-263227GitHub Pull Requests: wrong branch is preselected in head branch on PR creation if branch checkout was performed while Pull Requests tool window was opened
PerformanceIDEA-263978IntelliJ consumes 100% of one core while being idle
UsabilityIDEA-233137GitHub Pull Requests: add tooltip to add comment
UsabilityIDEA-262857GitHub Pull Requests: no way to switch between Title and Description inputs from keyboard
UsabilityIDEA-263396GitHub Pull Requests: New Pull Request tab isn't focused when call Create Pull Request action without opening Pull Requests toolwindow
UsabilityIDEA-263182GitHub Pull Requests: add shortcut to Create Pull Request
UsabilityIDEA-262835GitHub Pull Requests: no focused item on "New Pull Request" tab opening
UsabilityIDEA-262613GitHub Pull Requests: preselect head repo improvements on PR creation in project with multiple remotes
UsabilityIDEA-262615GitHub Pull Requests: sort alphabetically head branch list on PR creation
CosmeticsIDEA-264072GitHub Pull Requests: rename "Create Pull Request" action and button tooltip to "Create Pull Request..."
CosmeticsIDEA-264070GitHub Pull Requests: add project name on New Pull Request tab
ExceptionIDEA-262607GitHub Pull Requests: exception on successful PR creating after failed PR creation
No subsystemFeatureWEB-49702Provide docs for CSSImportRule
BugWEB-49620Provide docs for JavaScript global objects
BugWEB-48451Vuex symbol resolution not working with namespaced modules
BugWEB-49598('string = is not valid Windows path') when debug Node.js app via interpreter from container
BugWEB-49225Quick documentation for some deprecated HTML tags should show warning and tag description
BugWEB-49530Quick documentation for pseudo CSS classes is not available in html files
BugWEB-49900MDN docs are not available for constructor calls
CSSBugWEB-35215CSS modules, SCSS/Less: support selectors created using &_suffix
BugWEB-49387Show values for CSS properties in the quick documentation popup
DartBugWEB-50043Dart file move: relative imports become absolute. (Windows only)
DebuggerBugWEB-49996Throwable + IllegalArgumentException + can't press anything in IDE after Force step into
BugWEB-50050BlockingOperationException when debug electron app via npm script
UsabilityWEB-49896Rename 'Console' for Node.js
HTMLBugWEB-49690No documentation for 'onclick' attribute in button tag
BugWEB-49285"loading" attribute of "<img>" tag is reported as not allowed
BugWEB-49654`type` attribute on HTML 'script'/'style' is marked deprecated, but its not
BugWEB-49386Show supported browser versions for HTML tags in the quick documentation popup
JavaScriptBugWEB-37504Flow: Works a lot worse than before
BugWEB-49869Highlighting issue in JSDoc @see tag
BugWEB-49424Documentation invoked from JSDoc tag can't render definition part properly
BugWEB-49499Highlight correct argument in parameter info when using spread in function calls
BugWEB-49727Auto SQL code inject doesn't work with variable in JavaScript string template
BugWEB-49717False-positive no overlap for destructured props
BugWEB-49034Broken formatting in TSX with HTML "Enforce single quote" + removing trailing commas
BugWEB-49764No suggestion to auto-import commonJS module if the module is required in other files
BugWEB-43935'Infer JSDoc parameter types from usages' should paste '*' instead of 'any' to JSDoc
BugWEB-49850'rulezzz' in suggested completion names
BugWEB-49699Type is not correctly inferred when iterating over a collection typed with JSDoc using "for .. of" loop
BugWEB-49905Incorrect refactoring rename property (js + jsdoc + ts)
BugWEB-49462Type of async function called with `await` is not evaluated correctly
PerformanceWEB-49859High CPU usage on file change
JavaScript. FormatterBugWEB-50053Spaces not removed after parameter property modifiers
JavaScript. FrameworksFeatureWEB-43480Quick documentation for Angular components
FeatureWEB-49157Provide support for Vuex 4 store
FeatureWEB-34380Vue.js: support recognition of CSS classes inside literals in :class bindings
BugWEB-47477cmd-click on a $refs in vue script should go to the ref in the template instead of where $refs is defined in the vue code
BugWEB-44925No completion for React Native component props with react-native@0.62.2 and higher
BugWEB-49311Vue 3 + Vuex 4 - Mutations, actions & getters: wrongly marked as unused
BugWEB-47706No props completion for function component with propTypes
BugWEB-48778Auto-import doesn't work for components with doc comments
BugWEB-48085Code completion and auto-import don't work for Chakra-UI components
BugWEB-49901Actions inside vuex 4 modules have no indication of being in use.
BugWEB-49838Infinite indexing with Vue plugin (EAP 2021.1)
BugWEB-49920Wrong props types validation in Vue 3
BugWEB-49776Invalid warning of required attributes for components from Chakra-UI
BugWEB-49656'React' is duplicated in completion
BugWEB-49657incorrect import suggestions in react+js for React.createElement()
BugWEB-31701Vue.js: `ref` attribute is not correctly handled
BugWEB-48980Unrecognized regular (not binded) "key" attribute in Vue templates
BugWEB-47054Vue: Support properties from super class of a decorated component
PerformanceWEB-49959Freezes on vuex completion
PerformanceWEB-49122Avoid accessing index if it's not built
PerformanceWEB-49596Every press on the mouse right button cause a freezes for a few seconds (approximately: 5s) and is annoying
JavaScript. InspectionsBugWEB-49443Can be simplified to [...] for (JSDoc + TypeScript)
BugWEB-49796"Void function return value used" inspection shouldn't work on IIFE
UsabilityWEB-46611Add example to Unfiltered for..in loop inspection description
JavaScript. RefactoringBugWEB-50091Do not change const to let when applying the 'Replace for...of' intention
BugWEB-45292Can‘t Refactor in TypeScript File
LintersFeatureWEB-33429Stylelint: provide a way to specify config file location
FeatureWEB-25069Stylelint: implement auto fixes
BugWEB-49512EslintConfigWrapper.RULES leaks references to extensions from unloaded plugins
UsabilityWEB-49705"Please specify Node.js interpreter" popups should navigate to Node settings
Node.jsBugWEB-42169Vue: Support Yarn 2 in PnP mode
TypeScriptFeatureWEB-44914Move refactoring on TS class or interface: default to file with same name
FeatureWEB-49094TypeScript 4.2: abstract Construct Signatures
BugWEB-49888Go to defintion and find usages not works with ts imports started with slash
BugWEB-49621Typescript unsuccessful auto-completion for known type. Syntax highlighting gets stuck.
BugWEB-43140export const [ destructured_1, desctructured_2 ] = my_array not being indexed in *.ts files
BugWEB-50019Syntax error using `import type thing = require('things')`
BugWEB-49595No import suggestions for variables that are assigned values vie destructuring
BugWEB-50001Package Type Inference Broken with Yarn 2
BugWEB-46680Union literal completion broken for type created from typeof when using type only import
BugWEB-49826false 'missing required attribute' error for styled components
BugWEB-49779wrong colour for inferred generics
BugWEB-48295Changes made to imported JSON not immediately recognized by Typescript language service
BugWEB-49802Provide docs for standard JavaScript interfaces in TS
PerformanceWEB-49847Sluggish typing during autocomplete of big firebase angular material projects
TaskWEB-49833Update bundled TypeScript to 4.2
Unit TestsFeatureWEB-46202Jest "update failed snapshot"/"go to snapshot" not available for `toThrowErrorMatchingSnapshot`
BugWEB-49452Failed Jest test never completes when running with `--watch`
BugWEB-32836Coverage reporter is asking for `lcov.info` file if `coverage` is absent in karma.conf.js reporters
BugWEB-49052Running All Tests in Jest doesn't show the error message when there is a failed test.
BugWEB-49873'Cannot read coverageDirectory option' when re-run Jest tests
BugWEB-48569Error debugging Mocha tests run with Vue CLI due to "Unknown argument: jobs"
No subsystemBugDBE-12806Jump to source not working correctly after updates
Code CompletionBugDBE-12780No completion for system procedures if they are unquaified
Code GenerationBugDBE-12759unable to get the comment information for the database view field. It's OK in version 2019.3.5.
BugDBE-5615Bug when set an existing column as auto increment primary key
Code HighlightingBugDBE-12833Exasol: support FORCE/KERBEROS PRINCIPAL keywords for user creation
BugDBE-12693Exasol QUALIFY clause
BugDBE-12517False-positive "Unreachable code", PL/SQL
BugDBE-12556'RESTART' is not recognized in PostgreSQL
BugDBE-12775Outdated MariaDB dialect
ConnectivityBugDBE-12559Database plugin doesn't handle MySQL expired passwords
BugDBE-12522Incorrect icons for basic support drivers
UsabilityDBE-12813Pressing the "Plus" button in the Data Sources and Drivers does nothing
Data Editor/ViewerFeatureDBE-12714Add titled separators to context menu of column header
BugDBE-12830Grid quick-doc is broken. getDataContext is invoked on non-EDT
BugDBE-12818MongoDB: maximize doesn't show string values in a column that is detected as numeric
Database ExplorerFeatureDBE-12685'got it' tooltip about '0 of 23' control when first creating the data source.
Database MigrationsBugDBE-12730Comment on routine not supported
BugDBE-12678Missing mandatory keywords when saving stored procedure
BugDBE-12589Unable to open "events" and view error when errors occur
BugDBE-8721`Create New Table` generates SQL that is not accepted by MySQL when {Auto inc, Unique} are set
GeneralBugDBE-12629Context templates for select N rows in Oracle generates invalid query
CosmeticsDBE-12628Incorrect size of resolution scope tree selection
IntrospectionFeatureDBE-8295Generating DDL for MariaDB: include table partition information
FeatureDBE-6811Show offline databases
FeatureDBE-10584Table structure in database window does not show partition information for MariaDB/MySQL
BugDBE-12298Cannot display DDL for mysql 8 view
BugDBE-12786Introspection fails with numeric overflow
BugDBE-4797Intospection interupted if one of DB is offline
Navigation & SearchBugDBE-12609Broken behavior for going to object declaration
Query ConsoleBugDBE-8092Database Console Editor Tab Filename Includes Path
SQL GeneralBugDBE-10132IDE does not execute a PIVOT query
SQL ResolveBugDBE-12779Go to declaration doesn't work with system procedures
Tools IntegrationBugDBE-12634"Restore with mysql" fails with added parameter (max_allowed_packet)

RubyMine 2021.1 RC (211.6693.78 build) Release Notes

Ruby. TestsBugRUBY-27907Test Run Configurations are not created properly
Core. DiagramsBugIDEA-265035UML diagrams: Kotlin: tooltip over package item shows wrong statistics
BugIDEA-264679JSF Navigation diagram: no layout on diagram opening
BugIDEA-265037UML diagrams: Kotlin: constructor is shown for object
BugIDEA-264697CDI Dependencies diagram is always empty
BugIDEA-264690Spring Beans toolwindow: the beans graphs appear without layout
BugIDEA-264695CDI Dependencies diagram action appears outside the Diagrams menu group and causes exception only
BugIDEA-264684JSF Navigation diagram: on unchecking the ShowSelectedNodesWithDependencies the resulted diagram layout is incorrect
BugIDEA-264693Java Enterprise toolwindow: CDI Dependencies diagram is opened without layout
UsabilityIDEA-264691Add the ApplyCurrentLayout action to the context menu for the toolbar-less diagrams
ExceptionIDEA-264685Throwable: Read access is allowed from event dispatch thread or inside read-action only
Core. IndexingBugIDEA-264500VFS cache can't recover automatically after content storage corruption
BugIDEA-265212IntelliJ IDEA 2021.1 beta 4 cannot resolves JDK classes
Core. LicensingBugIDEA-265183Broken license dialog UI when user has several licenses
Core. Project SettingsBugIDEA-257175IJ resets content root to the incorrect directory
Core. Run. TargetsUsabilityIDEA-265188Show popup `Please add /Applications/GoLand.app to Resources -> File Sharing` when GoLand runs from /Applications/ path on macOS
User InterfaceBugIDEA-265418'Subpixel' mode is default for the Editor on macOS
User Interface. NavigationBugIDEA-265505Backspace doesn't update speed search results in recent files
ConnectivityBugDBE-12522Incorrect icons for basic support drivers
Query ConsoleBugDBE-8092Database Console Editor Tab Filename Includes Path

RubyMine 2021.1 Beta 4 (211.6693.18 build) Release Notes

No subsystemBugRUBY-27884IDE stops responding when 'check regexp' with Repetition(less times) regular expression
Core. DiagramsBugIDEA-263868Spring Diagrams: with `Show neighbours of the selected nodes` option the results of selection change is ugly (no layout)
BugIDEA-211984UML Diagrams: any action performed from diagram can't be Undone though Undo is shown enabled with correct last action name
BugIDEA-264029UML diagrams fonts are too big in 2021.1 Beta when comparing with 2020.3.2
BugIDEA-263119JPA: ER Diagram opened not centered
BugIDEA-263877Spring Application Context Dependencies Diagram: on Show Library Models action the layout is not applied
BugIDEA-263112JPA: ER Diagram is not refreshed after adding the attribute
ExceptionIDEA-263875ICSE at com.intellij.uml.UmlFileEditorImpl.getData
ExceptionIDEA-262492CCE at com.intellij.uml.presentation.DiagramPresentationModelImpl.getNodeTooltip
ExceptionIDEA-263414Throwable at com.intellij.psi.impl.file.impl.FileManagerImpl.checkHasNoOtherPsi
ExceptionIDEA-262187Throwable at com.intellij.psi.impl.file.impl.FileManagerImpl.checkHasNoOtherPsi
ExceptionIDEA-263255NPE at com.intellij.uml.java.JavaUmlDataModel.createEdge
ExceptionIDEA-264064NPE at com.intellij.openapi.graph.impl.view.FastNodeCellRendererPainter.paintNode
ExceptionIDEA-222077UML diagram: attempt to add note to diagram popup causes IOOBE
ExceptionIDEA-263561ISE at com.intellij.spring.perspectives.diagrams.SpringDiagramNode.getIdentifyingElement
ExceptionIDEA-264067NPE at com.intellij.uml.java.dependency.JavaClassDependencyAnalyzer$MyDependencyCollectingVisitor.isCollect ion
ExceptionIDEA-263489IAE at com.intellij.diagram.presentation.DiagramState.restoreTo
Core. IDE SettingsBugIDEA-264893[Choose Runtime dialog] there is no ability to add JBR if it isn't located in ~/Library/Java/JetBrainsRuntime/ folder
Core. IndexingBugIDEA-262899Can't find a file using Search Everywhere/Goto File
Core. InstallationUsabilityIDEA-2640602021.1 update journey is broken as it requires multiple "check for updates" to produce a fully working installation
Core. LicensingTaskIDEA-263484Docker Desktop causes wrong host name to be sent while obtaining floating license
Core. Platform APIBugIDEA-264897A race condition that leaves daemon hanging
Core. Project SettingsBugIDEA-264113Cannot change library scope second time after clicking "apply" in project structure dialog
BugIDEA-262946New EAP prints many errors to the log about duplicating LibraryIds
BugIDEA-260372Maven projects can't be built after disabling the (not used) dependency
BugIDEA-257476Modules get lost on changing the 'store generated files externally' option for multimodule maven project
BugIDEA-222640Library configured via Project Structure For New Project dialog appears incorrectly in the new projects preventing new project libraries configuring
Core. Run. ConfigurationsBugIDEA-264143The root node is configurable in the Run/Debug Configurations dialog
Core. Run. TargetsBugIDEA-264934Eternal throbber in target creation wizard
BugIDEA-262289Run Targets: SSH: attempt to run with coverage fails
BugIDEA-262446Run Targets: SSH: contents of coverageNargs file is not uploaded
UsabilityIDEA-262430Run Targets: SSH allow to select the Gradle home using the path chooser
EditorBugIDEA-263938Character moves a little when typing, looks like bounce effect
BugIDEA-264440Wrong bold font is used in editor
Editor. Editing TextBugIDEA-264147Chosen font variation is ignored in some dialogs
Lang. RegExpBugIDEA-262576Wrong warning about redundant non-capturing group
Tools. DockerBugIDEA-264653Docker. Before launch. Compose in compose parent task doesn't run
BugIDEA-186080Typed YAML: when keys are references, completion for them should not suggest existing sibling keys
BugIDEA-234252DockerCompose: image tags completion doesn't work
CosmeticsIDEA-264539Docker. Connection Settings: the url for Rootless socket on UNIX systems overlaps the option name
Tools. HTTP ClientExceptionIDEA-261390HttpClient: On run request with certificate get java.lang.AssertionError: Wrong line separators: '...y>\n</html>\r\n' at offset 254 exception
Tools. TerminalFeatureIDEA-224561API for custom highlighting of a found text in Terminal
BugIDEA-264105Using 2021.1 beta2, opening a terminal the mouse wheel scroll is not working. This used to work.
TaskIDEA-228106Provide API for getting Terminal cursor coordinates
User InterfaceBugIDEA-263404EAP user agreement too small to read
BugIDEA-239130The IDE gets stuck after cancelling opening a project
UsabilityIDEA-264770[Choose Runtime dialog] Minimize button closes the Setting IDE boot runtime pop-up and IDE looks like frozen until downloading will be completed
UsabilityIDEA-187018Make F2 "Go to next highlighted error" work in Recent Files/Recently Edited files popups
User Interface. NavigationBugIDEA-264890Recent Files / Switcher chooses the first item by default
BugIDEA-264409Cannot open a recent file in splitted window
Version Control. GitBugIDEA-248343Git Remote add unable to cancel.
BugIDEA-264428Git: pressing OK in "Define Remote" dialog does nothing
UsabilityIDEA-262307Git Staging Area: allow commit without checking the checkbox when changes from the only one repo are staged
Version Control. GitHubBugIDEA-264219Github Pull Requests: file tree on Commits pane gets stuck in loading state on new pr creation
BugIDEA-263925GitHub Enterprise: can't view pull requests
BugIDEA-263510GitHub Pull Requests: wrong line separators error on editing PR description
BugIDEA-263686Pull Requests: changing metadata from no assignees to 1 moves the entire right block to the left
PerformanceIDEA-263978IntelliJ consumes 100% of one core while being idle
UsabilityIDEA-263396GitHub Pull Requests: New Pull Request tab isn't focused when call Create Pull Request action without opening Pull Requests toolwindow
CosmeticsIDEA-264072GitHub Pull Requests: rename "Create Pull Request" action and button tooltip to "Create Pull Request..."
CosmeticsIDEA-264070GitHub Pull Requests: add project name on New Pull Request tab
DartBugWEB-50043Dart file move: relative imports become absolute. (Windows only)
DebuggerBugWEB-50050BlockingOperationException when debug electron app via npm script
JavaScriptBugWEB-49034Broken formatting in TSX with HTML "Enforce single quote" + removing trailing commas
JavaScript. FormatterBugWEB-50053Spaces not removed after parameter property modifiers
JavaScript. FrameworksPerformanceWEB-49959Freezes on vuex completion
JavaScript. RefactoringBugWEB-50091Do not change const to let when applying the 'Replace for...of' intention
TypeScriptFeatureWEB-44914Move refactoring on TS class or interface: default to file with same name
BugWEB-50019Syntax error using `import type thing = require('things')`
BugWEB-49888Go to defintion and find usages not works with ts imports started with slash
BugWEB-50001Package Type Inference Broken with Yarn 2
PerformanceWEB-49847Sluggish typing during autocomplete of big firebase angular material projects
No subsystemBugDBE-12806Jump to source not working correctly after updates
Code CompletionBugDBE-12780No completion for system procedures if they are unquaified
Code GenerationBugDBE-12759unable to get the comment information for the database view field. It's OK in version 2019.3.5.
Code HighlightingBugDBE-12833Exasol: support FORCE/KERBEROS PRINCIPAL keywords for user creation
BugDBE-12693Exasol QUALIFY clause
BugDBE-12517False-positive "Unreachable code", PL/SQL
BugDBE-12556'RESTART' is not recognized in PostgreSQL
BugDBE-12775Outdated MariaDB dialect
ConnectivityUsabilityDBE-12813Pressing the "Plus" button in the Data Sources and Drivers does nothing
Data Editor/ViewerBugDBE-12830Grid quick-doc is broken. getDataContext is invoked on non-EDT
BugDBE-12818MongoDB: maximize doesn't show string values in a column that is detected as numeric
GeneralBugDBE-12629Context templates for select N rows in Oracle generates invalid query
IntrospectionFeatureDBE-6811Show offline databases
BugDBE-4797Intospection interupted if one of DB is offline
BugDBE-12786Introspection fails with numeric overflow
SQL GeneralBugDBE-10132IDE does not execute a PIVOT query
SQL ResolveBugDBE-12779Go to declaration doesn't work with system procedures

RubyMine 2021.1 Beta 3 (211.6556.9 build) Release Notes

Core. ConsolesBugRUBY-278152020.3.2 broke all my run configurations
Lang. RBSBugRUBY-27830RBS reference doesn't work for singleton constants
Code Analysis. InspectionBugIDEA-192702Clicking Edit Settings in Insepction Results does nothing
CoreBugIDEA-258519IDE fails to open a project from the command line if another project is already opened (perhaps Windows-only)
Core. DebuggerBugIDEA-262878Click on toolbar button "Evaluate expression" no longer uses editor selected text
Core. InstallationUsabilityIDEA-263364App started from IDEA cannot access Bluetooth on macOS Big Sur
Core. LicensingFeatureIDEA-263678License Panel: hide Evaluate radiobutton for CWM plugin
Core. Project SettingsBugIDEA-99596Manifest file located under 'main/java' root in Maven module is shown in artifact editor even if it won't be really copied to artifact
Core. Run. ConfigurationsBugIDEA-264202[new run config UI] invoking "command line" fields mnemonics don't move focus during indexing
UsabilityIDEA-246087[new run config UI] Improved keyboard navigation to fields
UsabilityIDEA-263886[new run config UI] Change 'modify option' hotkey on macOS to be Option-M
Core. Run. TargetsBugIDEA-261979SSH target startup is very slow because of files syncing
TaskIDEA-258455Run Targets: download files from target
Core. Task ManagementUsabilityIDEA-254355Provide an ability to assing shortcuts for "Start Timer" and "Stop Timer" actions
EditorBugIDEA-258454Reader Mode options are not applied for opened library file until reopening
Editor. Editing TextUsabilityIDEA-260463EditorTextFieldActionPromoter hides IdeaVim actions
Editor. Intention ActionsBugIDEA-263507Line join silently changes semantics for nested ifs
Lang. JSONBugIDEA-261811JsonPath support: the slice operator [start:end:step] is error-highlighted
UsabilityIDEA-262180Evaluate JSONPath: the font used for the jsonpath expression field should be the same as the editor one
Tools. DockerBugIDEA-256721Docker. Impossible to delete connections from the Services view.
BugIDEA-262568Docker.Container Deploy log tab: Ctrl+C via keyboard doesn't work
UsabilityIDEA-196666Add --rmi flag support for docker-compose integration
ExceptionIDEA-263927Exception when open Docker settings on windows
User InterfaceBugIDEA-264220Initial path under \\wsl$\ is not selected in file tree on opening file chooser dialog
BugIDEA-263961Certain combinations of bookmark icon colors are handled incorrectly
BugIDEA-263928Notification balloons do not appear when the corresponding status bar widget isn't displayed
BugIDEA-263915"Quick switch scheme" popup mnemonics display as "..." with larger appearance font sizes
BugIDEA-249791Switcher cannot display all options
BugIDEA-227657"Recent files" popup has UI glitches after removing file
User Interface. Action SystemTaskIDEA-261330Action names redefined in IdeUICustomization.projectMessage should be considered in goto action
User Interface. Console ViewBugIDEA-261792Cannot normally input in Run console
User Interface. Embedded Browser (JCEF)BugIDEA-264004JCEF JBCefOsrHandlerBrowser failed to invoke JS when global registry value ide.browser.jcef.jsQueryPoolSize is not set.
TaskIDEA-263753provide ability to configure proxy server for jcef
User Interface. Find, Replace, UsagesBugIDEA-264313Find in Files: dots in empty text
User Interface. NavigationBugIDEA-263874No mnemonics in Switcher opened with one-key shortcut
UsabilityIDEA-263890"Recent Files": unexpected focus, does not only filter on files
User Interface. Project ViewBugIDEA-257211Can't navigate to package in external libraries
User Interface. Search EverywhereUsabilityIDEA-263459Support screen readers in search dialogs
Version ControlBugIDEA-260241Ctrl + C copies editor line instead of previous changed chunk content
BugIDEA-237029Selecting text shortcut conflicts with toolwindow resize in Commit toolwindow
No subsystemBugWEB-48451Vuex symbol resolution not working with namespaced modules
CSSBugWEB-35215CSS modules, SCSS/Less: support selectors created using &_suffix
DebuggerBugWEB-49996Throwable + IllegalArgumentException + can't press anything in IDE after Force step into
UsabilityWEB-49896Rename 'Console' for Node.js
HTMLBugWEB-49285"loading" attribute of "<img>" tag is reported as not allowed
JavaScriptBugWEB-49499Highlight correct argument in parameter info when using spread in function calls
BugWEB-49905Incorrect refactoring rename property (js + jsdoc + ts)
JavaScript. FrameworksFeatureWEB-49157Provide support for Vuex 4 store
BugWEB-49901Actions inside vuex 4 modules have no indication of being in use.
BugWEB-49920Wrong props types validation in Vue 3
BugWEB-49311Vue 3 + Vuex 4 - Mutations, actions & getters: wrongly marked as unused
JavaScript. InspectionsBugWEB-49443Can be simplified to [...] for (JSDoc + TypeScript)
UsabilityWEB-46611Add example to Unfiltered for..in loop inspection description
TypeScriptFeatureWEB-49094TypeScript 4.2: abstract Construct Signatures
BugWEB-48295Changes made to imported JSON not immediately recognized by Typescript language service
BugWEB-49826false 'missing required attribute' error for styled components
Unit TestsFeatureWEB-46202Jest "update failed snapshot"/"go to snapshot" not available for `toThrowErrorMatchingSnapshot`
BugWEB-49873'Cannot read coverageDirectory option' when re-run Jest tests
BugWEB-49052Running All Tests in Jest doesn't show the error message when there is a failed test.
BugWEB-32836Coverage reporter is asking for `lcov.info` file if `coverage` is absent in karma.conf.js reporters
BugWEB-49452Failed Jest test never completes when running with `--watch`
DB IntrospectionBugDBE-12298Cannot display DDL for mysql 8 view
DB RefactoringBugDBE-12730Comment on routine not supported
DB Schema ViewsFeatureDBE-12685'got it' tooltip about '0 of 23' control when first creating the data source.
Data ViewsFeatureDBE-12714Add titled separators to context menu of column header

RubyMine 2021.1 Beta 2 (211.6432.10 build) Release Notes

Tools. BundlerBugRUBY-27784org.jetbrains.plugins.ruby.gem.GemManager.updateGemset in EDT
Core. IDE SettingsCosmeticsIDEA-227451Settings > Editor > Code Style > Java > Arrangement items disappear or move on mouse hover
Core. IndexingBugIDEA-263200Shared index trying to attach non-existing chunk
BugIDEA-262428Do not show public CDN URLs
Core. InstallationUsabilityIDEA-252209Avoid broken installation on Linux when distributive is unpacked into the same folder
Core. Plugin ManagementBugIDEA-253978"File type conflict found" on every IDEA start - 3rd party plugins
Core. Project SettingsUsabilityIDEA-116209Allow to directly specify a jar's META-INF/MANIFEST.MF file
Core. Run. ConfigurationsExceptionIDEA-245958Throwable: Directory index may not be queried for default project
Core. Run. TargetsBugIDEA-262784Run targets: SSH stops working after installing rsync on Windows
PerformanceIDEA-262457Choose run configuration popup is slow on IntelliJ IDEA project
CosmeticsIDEA-258266Run Targets. Cosmetic UI bugs
ExceptionIDEA-259929java.nio.file.NoSuchFileException in Docker plugin on pulling the image by creation a run target
Editor. Code Completion. MLBugIDEA-261990"Machine Learning Code Completion" plugin visits .class files
Editor. Editing TextFeatureIDEA-119451Extend line selection via keyboard shortcut
Tools. DockerBugIDEA-263462Docker. Remove docker.log file
BugIDEA-263159Docker. After an invalid connection all run configs fail until I re-connect to the Docker
BugIDEA-263457Docker. Run hangs after adding "Run built image" section and re-run
BugIDEA-263419Docker. Dockerfile/Image Run configuration.`Bind mounts` field is not removed at removing the option.
BugIDEA-263418Docker. Dockerfile/Image run configuration. Publish all option doesn't work as CLI option
BugIDEA-263514Rider does not work with docker rootless
BugIDEA-263164Docker-compose. Impossible to run docker-compose on docker-machine
BugIDEA-235007No quotes autocompletion
Tools. HTTP ClientBugIDEA-239228REST does not work with manually configured ssh tunnel SOCKS5 proxy
BugIDEA-260741HttpClient: Completion for SSLconfiguration on windows comes with wrong "/"
User InterfaceBugIDEA-262234Native crash due to uncaught exception NSInvalidArgumentException on several modal dialogs on BigSur
BugIDEA-261723Welcome Screen size grows after each restart so that its frame doesn't fit the display
BugIDEA-261715Modal progress dialog is hidden on ESC, but Task is not cancelled
BugIDEA-87703Recent files doesn't close when floating Navigation bar appears
BugIDEA-263574Choose Boot Runtime: "Failed to set boot JDK runtime" error on attempt to select JDK in Download JDK dialog
UsabilityIDEA-72536Switcher shortcuts changing is confusing
User Interface. AccessibilityBugIDEA-257258camplition popup is not voiced on macOS
User Interface. Action SystemTaskIDEA-263205Action Popups: Disable separate "next step" button
User Interface. ControlsBugIDEA-250004Big Sur: Context menu highlighting breaks if submenu invoked
User Interface. FocusBugIDEA-263483focus lost after Reformat code
User Interface. Keyboard InputUsabilityIDEA-177432Switcher shortcut to navigate backwards does not work with combinations other than Shift
User Interface. NavigationBugIDEA-207163Recently Edited Files popup doesn't have shortcut for switching between RecentFiles and RecentlyEditedFiles
BugIDEA-102409Switcher with custom shortcut (e.g. Cmd-I) doesn't disappear when modifier released
BugIDEA-216720"Ctrl+E" shortcut is displayed in "Recent Files" popup if it was removed from the keymap
Version Control. GitBugIDEA-263695Can't commit staged changes on the first Commit toolwindow opening
BugIDEA-262223Git Commit Template: respect relative paths
No subsystemBugWEB-49900MDN docs are not available for constructor calls
BugWEB-49598('string = is not valid Windows path') when debug Node.js app via interpreter from container
BugWEB-49225Quick documentation for some deprecated HTML tags should show warning and tag description
CSSBugWEB-49387Show values for CSS properties in the quick documentation popup
JavaScriptBugWEB-49764No suggestion to auto-import commonJS module if the module is required in other files
BugWEB-49869Highlighting issue in JSDoc @see tag
BugWEB-49850'rulezzz' in suggested completion names
PerformanceWEB-49859High CPU usage on file change
JavaScript. FrameworksBugWEB-49838Infinite indexing with Vue plugin (EAP 2021.1)
PerformanceWEB-49596Every press on the mouse right button cause a freezes for a few seconds (approximately: 5s) and is annoying
JavaScript. RefactoringBugWEB-45292Can‘t Refactor in TypeScript File
LintersBugWEB-49512EslintConfigWrapper.RULES leaks references to extensions from unloaded plugins
UsabilityWEB-49705"Please specify Node.js interpreter" popups should navigate to Node settings
TypeScriptBugWEB-46680Union literal completion broken for type created from typeof when using type only import
TaskWEB-49833Update bundled TypeScript to 4.2
Unit TestsBugWEB-48569Error debugging Mocha tests run with Vue CLI due to "Unknown argument: jobs"

RubyMine 2021.1 Beta 1 (211.6305.26 build) Release Notes

Ruby. TestsBugRUBY-27797'No tests were found' if rerun failed tests for multiple tests
BugRUBY-27818A test file must be provided (Exception) when trying to run minitest configuration from RM 203 in 211
BugRUBY-27798
RSpec run configuration is also suggested when multiple Minitest or Cucumber tests are selected
BugRUBY-27799
Multiple selection in the folder with tests have no file type validation
FeatureRUBY-27660
Add inspection for unresolved references
FeatureRUBY-27661
 Add new file template for RBS

RubyMine 2021.1 EAP5 (211.6222.3 build) Release Notes

Lang. RBSBugRUBY-27762Add support for highlighting declarations of the element under the caret in the editor for RBS
Ruby. Tests. RSpecBugRUBY-27710No tests were found when trying to rerun rspec tests
Code Analysis. InspectionBugIDEA-130333Inspection settings: scopes order is not saved
TaskIDEA-260048Show Inspections results in Problems tool window
Core. InstallationBugIDEA-262571clion.sh doesn't allow symlinks
Core. Project SettingsBugIDEA-262628Trusted host is not recognized if recorded with protocol
ExceptionIDEA-262073java.lang.RuntimeException: Unable to get registered settings of #VueCodeStyleSettings when enabling Vue.js plugin with opened .vue file
Core. Run. TargetsBugIDEA-262162Run Targets: first introspection for WSL target fill JDK path incorrectly
TaskIDEA-262277Remote targets for Go Build: Introspection completed with error. Getting environment failed with exit value 1
EditorBugIDEA-260496Font Settings: dropdown uses wrong font when Monospaced selected
CosmeticsIDEA-262330Font Settings: adjust top of dialogue box (remove extra margins)
TaskIDEA-262329Font Settings: improve search within font dropdown
TaskIDEA-260492Font Settings: modify "Typography Settings" to a group that collapsed by default
Editor. FormatterBugIDEA-157294Exporting Code Style profile fails when name is not filesystem-friendly (e.g. it contains a slash in *NIX systems)
BugIDEA-205999"else" and "{}" indentation
BugIDEA-189817Code format breaks long URLs in code comments
Lang. JSONBugIDEA-262273JSONPath: operators are not correctly highlighted on incremental highlighting
UsabilityIDEA-262172JsonPath: provide completion by existing keys inside injected fragments
Lang. MarkdownBugIDEA-260339Formatting removes cpp code sections from Markdown files
Lang. Shell ScriptBugIDEA-261565Every invocation of a shell script create a new terminal tab
Tools. DockerFeatureIDEA-171374Docker: Provide completion for image names in the Dockerfile, DockerCompose files
FeatureIDEA-261892Fold stages in multi-stage Dockerfile
FeatureIDEA-262611Support --platform command line option
BugIDEA-262349Docker-compose run configuration: add an explaining tooltip over each option
BugIDEA-262654Dockerfile, Editor, image tags completion: the result list contains many items which are out of scope
BugIDEA-262419show running cli command in docker-compose deploy log
BugIDEA-262633Dockerfile, Editor, images completion: remove `library/` at tags completion
BugIDEA-262345DockerCompose. Run configuration. Scale:`Select Service to Scale` link doesn't add the service into the table
UsabilityIDEA-262657Dockerfile, Editor, images completion: auto-appeared completion list contains not correct items list
UsabilityIDEA-262806Docker: recognize Dockerfiles for Quarkus example files
ExceptionIDEA-262627com.github.dockerjava.api.exception.BadRequestException at running FROM without arguments by disabled BuildKit
Tools. TerminalBugIDEA-180923Terminal. Scroll bounce
BugIDEA-259452Too fast scroll in Terminal
User InterfaceBugIDEA-262148UI inspector shortcut triggers Alt+Click action on the inspected component
BugIDEA-113995Jump list: can't open recent projects that have spaces in paths
CosmeticsIDEA-262729cosmetic file watcher message
User Interface. ControlsFeatureIDEA-212299Implement Select parent node in UI trees
User Interface. Embedded Browser (JCEF)BugIDEA-261496Cancelled Navigation in JCEF preview shows error page
BugIDEA-262267Built-in html preview is not rendered from time to time
User Interface. NavigationBugIDEA-261860Navigation to an open file reopens it in active group
Version Control. GitBugIDEA-262301Git Staging Area: don't group by repository changes in a single-root project
UsabilityIDEA-262282Staging operations should not be in the document undo stack.
Version Control. GitHubUsabilityIDEA-233137GitHub Pull Requests: add tooltip to add comment
JavaScriptBugWEB-49462Type of async function called with `await` is not evaluated correctly
BugWEB-49424Documentation invoked from JSDoc tag can't render definition part properly
BugWEB-43935'Infer JSDoc parameter types from usages' should paste '*' instead of 'any' to JSDoc
JavaScript. FrameworksFeatureWEB-43480Quick documentation for Angular components
BugWEB-48778Auto-import doesn't work for components with doc comments
BugWEB-48980Unrecognized regular (not binded) "key" attribute in Vue templates
BugWEB-31701Vue.js: `ref` attribute is not correctly handled
BugWEB-49656'React' is duplicated in completion
BugWEB-47054Vue: Support properties from super class of a decorated component
BugWEB-47477cmd-click on a $refs in vue script should go to the ref in the template instead of where $refs is defined in the vue code
BugWEB-48085Code completion and auto-import don't work for Chakra-UI components
JavaScript. RefactoringBugWEB-49416Extract method refactoring results in a broken code if Prettier is used as default formatter
LintersFeatureWEB-25069Stylelint: implement auto fixes
TypeScriptBugWEB-43140export const [ destructured_1, desctructured_2 ] = my_array not being indexed in *.ts files
BugWEB-49595No import suggestions for variables that are assigned values vie destructuring
BugWEB-49621Typescript unsuccessful auto-completion for known type. Syntax highlighting gets stuck.

RubyMine 2021.1 EAP4 (211.6085.3 build) Release Notes

Lang. RBSFeatureRUBY-27733Remove reference from `bool` in RBS
FeatureRUBY-27625Add support for rename in RBS
FeatureRUBY-27670Add support for the "Comment line" action in RBS
Remote Interpreters. DockerBugRUBY-27650Cannot add new Docker, Docker-Compose or WSL SDK
Code Analysis. DuplicatesBugIDEA-219100"Duplicate code fragment" reported for symlinked files
UsabilityIDEA-260645Duplicate finder sometime doesn't show file paths
Code Analysis. InspectionFeatureIDEA-237242"Unstable API Usage" inspection should work for sources as well as libraries
BugIDEA-261916JetBrains analysis annotations do not work on annotation methods
Code Analysis. Language InjectionFeatureIDEA-214466temporal language injection should support multi-line string literals with margins (Scala, Kotlin)
CoreBugIDEA-261794Throwing `ControlFlowException` on AWT thread may cause `AWT-EventQueue-0` to die and freezes the IDE's `AWT-EventQueue-1` thread
Core. IDE SettingsBugIDEA-262228Code Style Settings are messed up
BugIDEA-261026Nothing here in Preferences | Editor | File and Code Templates
CosmeticsIDEA-251455Some inspections' description texts starts with an extra empty line
Core. IndexingBugIDEA-261754JSDetectingProjectFileScanner makes the scanning executor starve
Core. InstallationBugIDEA-261720Error updating EAP version
BugIDEA-261321Mac Launcher does not request Rosetta 2 to be installed, if run with x86_64-only JBR on Apple Silicon/M1
Core. Navigation and SearchBugIDEA-261644"Data Flow To Here" yields no results for record constructor parameters
Core. Platform APIFeatureIDEA-207237New API for ConsoleInputFilterProvider
Core. Plugin ManagementBugIDEA-261981Web Services settings infinite loading
BugIDEA-235321Vagrant plugin can suggest restart on disabling
TaskIDEA-173176Use the latest version of kotlin-runtime library for build process if several plugins depends on different Kotlin versions
Core. Project SettingsBugIDEA-261800java.lang.RuntimeException: Unable to get registered settings of #VueCodeStyleSettings when trying to open Code Style settings
BugIDEA-261802java.lang.Throwable: Can't find the language with ID Vue when disabling Vue.js plugin
Core. Run. ConfigurationsBugIDEA-261259Alternative coverage runner option disappears at reopening
BugIDEA-261930Run configuration's working directory disappeared after setting it to an empty value
CosmeticsIDEA-261879Edit configuration templates - configurations list is collapsed
Core. Run. TargetsBugIDEA-261637Run Targets: Can not download single file via SSH
BugIDEA-255964"Run on" combobox in run configuration editor should show WSL under "New target"
BugIDEA-259877Run Targets: run junit with all in package type doesn't work on WSL target
BugIDEA-261178Support introspection for WSL run target
TaskIDEA-260008Target tests for WSL
Core. SSHBugIDEA-261740Incorrect ServerAliveInterval=1 and ServerAliveCountMax=0 that disconnects SSH session immediately
EditorCosmeticsIDEA-260493Add border to separate breadcrumbs and Font Settings
Editor. Code Completion. MLBugIDEA-2620905 second freezes in completion in Java Files
BugIDEA-262094Handle ignoring of matching case properly
Editor. Diff and MergeBugIDEA-261968Diff-view in editor: toolbar may remain black when LaF theme is changed
Editor. Editing TextUsabilityIDEA-227988Add an option to change tab character rendering
Lang. JSONBugIDEA-261817JsonPath support: improve the colors for different types of literals
BugIDEA-261815JsonPath support: operators completion doesn't work if it is partially typed
BugIDEA-261813JsonPath support: 'contains' operator is reported as error
BugIDEA-261921JsonPath: inject JSONPath language to com.jayway.jsonpath.WriteContext methods that accept jsonpath as parameter
BugIDEA-261920JsonPath: the strict (type safe) equals operators are not supported
Lang. MarkdownBugIDEA-255284Markdown mermaid ClassDiagram annotations generate syntax error
Lang. Shell ScriptBugIDEA-261571False "Typo" highlighting on certain `test` commands
BugIDEA-261684bash: fails to resolve a function with a parens "()" body
Tools. DockerBugIDEA-172645Option to run only one stage or all stages of dockerfile
BugIDEA-261768Container log not visible if the execution of the container is too quick
Tools. HTTP ClientBugIDEA-261717HTTP Usage inspection should ignore localhost
TaskIDEA-261957Remove `com.intellij.ws` from HTTP Client plugin
Tools. TerminalBugIDEA-188414Default powershell colors are barely visible in Intellij theme
UsabilityIDEA-182750Darcula theme: unreadable errors in local and SSH terminals
CosmeticsIDEA-196703IntelliJ terminal dosent match colors on iTerm ZSH theme
User InterfaceBugIDEA-261408Submenu that is shown on the left disappears before the cursor gets there
BugIDEA-236698List items are not shown on Mac Touch Bar
BugIDEA-261958Fix context hints in Run Options
UsabilityIDEA-260462Focus is moved to preview tab when opening HTML file in built-in preview
UsabilityIDEA-259215Incorrect numeration of themes and keymaps in IDE and Project Settings, if there are more than 9 items
TaskIDEA-260948Updates settings dialog redesign
TaskIDEA-260101Group headers for lists
User Interface. AccessibilityBugIDEA-261695Choose Declaration list is no accessible
TaskIDEA-261087Make com.intellij.ui.TitledSeparator accessible
TaskIDEA-260436Add an UI inspector to display the accessibility hierarchy
ExceptionIDEA-261841java.lang.ClassCastException when try to run the UI Inspector
User Interface. FocusBugIDEA-261798Modal progress dialog doesn't grab focus
User Interface. Look and FeelBugIDEA-201293Some colors are not changed on switching theme
User Interface. Project ViewFeatureIDEA-248876Show horizontal scrollbar in trees only when visible area contains items wider than viewport
User Interface. Search EverywhereBugIDEA-261863"Make File Writable" action cannot be searched by "Writable"
Version Control. GitFeatureIDEA-256885Git Stage: Support committing different git roots separately
BugIDEA-261638Access from EDT is not allowed in GitVFSListener
BugIDEA-261593Cherry-pick with dialog could miss some changes
BugIDEA-261550choose upstream path - Git Root cut - path partial visible
UsabilityIDEA-257569Cannot find Resolve conflicts... in the new Git menu
Version Control. Local HistoryExceptionIDEA-248074LocalHistoryLog - Assertion failed: not balanced 'begin/end-change set' calls
Version Control. LogBugIDEA-257628Typo in git "committed date" when committer and author differ
No subsystemPerformanceWEB-48133Freeze after sync with file system on WSL (PhoneGap, Jade plugins)
PerformanceWEB-48488Webstorm hangs with resolving reference
JavaScriptBugWEB-49506Unwanted character escaping in `Template literals`
TaskWEB-48616Smart suggestion variable and function names based on file name
JavaScript. FrameworksPerformanceWEB-47515Slow syntax/error higlighting
JavaScript. InspectionsFeatureWEB-48305JavaScript: Add an inspection to check usages of void function
TaskWEB-49631Remove 'Using function arguments object outside function' inspection
LintersFeatureWEB-47837ESLint support for CoffeeScript files
FeatureWEB-49181Support ESLint in MDX files
FeatureWEB-47511Lint Javascript in Laravel Blade files with ESLint
BugWEB-47908TypeScript files are not linted when `@babel/eslint-parser` parser is specified in the config
ExceptionWEB-49593'Access is allowed from event dispatch thread with IW lock only.' when open a project
TypeScriptBugWEB-49327Webstorm auto import does not work properly with inherited aliases
PerformanceWEB-49218Performance issue if the project contains many tsconfig-s
PerformanceWEB-43639Resolution of augmentations may be slow
Unit TestsBugWEB-49314Cannot debug karma v6 test code (error in karma-intellij-debug.js)
DB IntrospectionTaskDBE-12513Error while introspecting H2 database: Syntax Error
Data ViewsBugDBE-12410Unable to access referenced data
BugDBE-12575Filtering (and foreign Key referencing) does not work on binary columns
PerformanceDBE-11578Smaller page size limit for MongoDB
SQL CompletionExceptionDBE-12561Throwable at com.intellij.sql.psi.impl.SqlImplUtil.quoteIdentifier
SQL HighlightingBugDBE-12492Ambiguous column name isn't reported in qualified with CTE name
BugDBE-12553Analytic functions are marked as error for H2
BugDBE-12500Can't use type cast inside "PARTITION OF" clause
BugDBE-12528TODO comments ignored in procedure bodies for PostgreSQL

RubyMine 2021.1 EAP3 (211.5538.3 build) Release Notes

Lang. RBSFeatureRUBY-27701Allow resolving RBS references to RBS files in the ruby SDK/stdlib
FeatureRUBY-27626Add support for find usages in RBS
FeatureRUBY-27674Add support for "module self types" in resolve in RBS
BugRUBY-27673Add recursion management in RBS resolve
BugRUBY-27689RBS references inside installed gem doesn't work
ExceptionRUBY-27718NullPointerException when defining method inside .rbs
ExceptionRUBY-27719java.lang.UnsupportedOperationException when defining method inside .rbs
Ruby. PluginBugRUBY-21465Ruby Facet is missing
Code Analysis. DependenciesBugIDEA-261323Add "This Module" scope to Call Hierarchy
Code Analysis. DuplicatesBugIDEA-255779Code duplicates in headless mode does not work in IntelliJ IDEA 2020.2.3
Code Analysis. Language InjectionBugIDEA-196921Kotlin: Wrong inspection errors at @Query in case of more then 2 string parts
BugIDEA-196924Kotlin: @Query. Adding/removing "newlines" should not lead to language injection disappearing
CoreBugIDEA-260361UAST ClassSetImpl leaks references to JSP plugin classes
BugIDEA-260332Workspace model leaks Kotlin facets on Kotlin plugin unload
BugIDEA-261020FileInEditorProcessor.showHint leaks PsiFile from unloaded plugin
Core. DebuggerBugIDEA-261405java.lang.Object cannot be cast to class com.intellij.util.keyFMap.KeyFMap when starting scala REPL and debugger cannot be started afterwards
Core. DiagramsBugIDEA-261035i18n: Diagrams: "New" Menu: "Constructor" is hardcoded
BugIDEA-261015i18n: Preferences/Settings: Tools: Diagrams: hardcode strings
Core. IDE SettingsBugIDEA-261409Plugins are not shown anymore
BugIDEA-255402'Default project directory' setting is ignored
BugIDEA-255681Editor's color scheme has IJ Light theme instead of Darcula after restoring IDE settings
CosmeticsIDEA-251453Some description text of Inspections settings has non-consistent padding
Core. IndexingBugIDEA-257724Indexing diagnostics: collect stats on SnapshotInputMappings
BugIDEA-258515Request full index rebuild if MapInputException caused by corrupted persistent storage
BugIDEA-256129Make possible to discover a plugin which breaks indexing
Core. InstallationBugIDEA-260882Broken index file in proxy-vole-1.0.5-jb.2.jar
BugIDEA-260909CLion no longer starts after removing left-over files of older installations
UsabilityIDEA-247751Startup script overwtites "UNAME"
Core. Navigation and SearchBugIDEA-261098Go to usages (CMD+B) not working for variables declared with `var` in Java 11
Core. Plugin ManagementBugIDEA-235514Terminal plugin requires restart on disabling
BugIDEA-261296Can't install or update any plugin
Core. Project SettingsBugIDEA-260512Android facets are gone
BugIDEA-259203Code Style settings: tabs and indents & func call arguments are lost during dynamic plugin load
Core. Run. ConfigurationsFeatureIDEA-233142Allow storing run configurations outside of .idea
BugIDEA-259609"<no module>" can not be selected
BugIDEA-261491RunConfigurationsComboBoxAction.myButton leaks reference to disposed project
ExceptionIDEA-261037RunConfigurationTypeUsagesCollector.lambda$getMetrics$0
EditorBugIDEA-242414Inlay code vision hints can't be seen when using 'Hight contrast' theme
CosmeticsIDEA-260494Font Settings: add a bottom panel with the help text "Enter any text to preview" to preview
Editor. Editing TextBugIDEA-261199Right click resets selection of multiple lines
Editor. FormatterBugIDEA-239008CodeStyleCachedValueProvider$AsyncComputation leaks reference to PSI File via TransientCodeSettings on plugin unload
Lang. XPath and XSLTBugIDEA-261002i18n: Edit: Find: Find by XPath: hardcode string
Lang. YAMLBugIDEA-246131Exception when injecting language into YAML quoted string literal using JSON schema
Tools. DockerFeatureIDEA-261079Docker: Dockerfile: Multi-staging: Add visual separators between stages in the editor
FeatureIDEA-261275move BuildKit enabling to run configuration
FeatureIDEA-261169possibility of tag validation in fragmented UI
BugIDEA-261350Docker-compose run configuration. Scale: it is possible to add some scales to one service
Tools. HTTP ClientBugIDEA-261343HTTP Usage inspection is shown for the thymeleaf namespace
BugIDEA-260232Add "password" to "SSLConfiguration"
UsabilityIDEA-261392HttpClient: Need some advice how to edit password for certificate
Tools. TerminalBugIDEA-253663Separate background and foreground terminal/ANSI colors
CosmeticsIDEA-201445The Terminal view has an ugly thick gray vertical scrollbar track that never goes away
User InterfaceBugIDEA-261454Memory leaks via multiple DragHelper instances stored in IdeKeyboardFocusManager::keyEventDispatchers
BugIDEA-260545No indents in new popups UI
BugIDEA-261133Main menu is not shown on Windows
BugIDEA-243071SplitButtonAction leaks reference to disposed project
BugIDEA-257145SVG with embedded base64 PNG is not rendered
BugIDEA-261403Hover selection color in Darcula is incorrect for tables and popups
BugIDEA-260688New popups UI: Numbers disappear in menu item when opening submenu
BugIDEA-261400New popups UI: schemas are switched on hover in DataGrip
BugIDEA-250740LightEdit: no menu on Linux with global menu support
BugIDEA-261041ToolTipManager leaks references to UI components holding PSI of plugin being unloaded
UsabilityIDEA-260546Pressing Esc in popup submenu should bring focus back to menu
UsabilityIDEA-141556Welcome Screen: Recent projects list: search should work within groups
UsabilityIDEA-260866Expand the minimized editor split on clicking the tab or its code area
CosmeticsIDEA-260683New popups UI: Menu item is not highlighted when submenu is opened
User Interface. Action SystemBugIDEA-238354Touch bar leaks actions on plugin unload
User Interface. Embedded Browser (JCEF)TaskIDEA-261425jcef: add method for setting css background color
User Interface. Find, Replace, UsagesBugIDEA-170038Find in Path dialog does not close automatically when clicking the code area
User Interface. FocusBugIDEA-193427Debug Tool window in Unpinned, Undock, Floating, Window modes disappears after clicking "New Watch", "Set Value"
Version ControlBugIDEA-250477Option to view All changed files disapearing randomly
BugIDEA-261046Correctly dispose `ConfigurableUi` from `BaseCommitMessageInspection#createOptionsConfigurable` if it implements `Disposable`
Version Control. GitBugIDEA-251945Can't resolve merge conflicts
UsabilityIDEA-260806Git Rebase dialog shows the "Select a new base" error on opening
ExceptionIDEA-261251Exception on diff preview opening after dynamic plugin unloading
Version Control. LogBugIDEA-261290Navigation to a rebased commit from "Go To Hash/Branch/Tag" shows incorrect error message
UsabilityIDEA-254354Branch list doesn't focus item on right click
No subsystemCosmeticsWEB-48885Help popup references WebStorm instead of PyCharm
ExceptionWEB-49409InvocationTargetException when running Jest configuration with Coverage
CSSFeatureWEB-8295Show selector specificity for CSS code
BugWEB-49410Don't show docs for HTML tag when caret is on CSS class selector
BugWEB-40212The CSS env function is flagged as unknown
ExceptionWEB-49193ClassCastException: GruntfileManager cannot be cast to GruntfileManager
DartTaskWEB-49464Support new Dart syntax: Generalized Type Aliases
File WatchersBugWEB-49445"$/FilePathRelativeToProjectRoot$" is not treated as a file specific macro
JSONBugWEB-49403Empty .jsonl files show error
JavaScriptBugWEB-49429Cannot fetch external documentation error in JavaScript doc popup for standard methods
CosmeticsWEB-49078'Expand optional chaining and nullish coalescing to explicit checks': update intention's example
Unit TestsBugWEB-49534Cucumber.js: run configuration for scenario outline
BugWEB-49309Cucumber.js plugin breaks when feature file uses Example/Rule syntax
No subsystemBugDBE-12264Code: 417, e.displayText() = DB::Exception: Expected ANY or ALL in JOIN section, because setting (join_default_strictness) is empty, e.what() = DB::Exception
SQL HighlightingFeatureDBE-12470Support MariaDB Compound Statements outside of Stored Programs
BugDBE-12371MariaDB SQL dialect: Incorrect handling of 'FOR SHARE' and 'RETURNING'
BugDBE-12493Incorrect syntax with min_active_rowversion
BugDBE-12499Can't pass multiple values in the ROWS FROM clause

RubyMine 2021.1 EAP2 (211.5538.3 build) Release Notes

EditorBugRUBY-27547"CACHED_SMART_POINTER" elements in navigation bar popup
Lang. RBSFeatureRUBY-27627Add references in RBS
Ruby. FormatterBugRUBY-27553Comments before methods break indentation logic when a private accessor modifier is used
BugRUBY-27633Wrong caret position after visibility modifiers
Ruby. InspectionsBugRUBY-27568False Pattern matching with the 'in' operator requires Ruby 2.7 with Ruby 3.0
Ruby. TestsBugRUBY-27589Minitest fails with uninitialized constant Minitest::RubyMineMinitestParallelTestCaseManager::Set
Code Analysis. DependenciesBugIDEA-260616i18n: Dependency Viewer: title of tool window is hardcoded
Code Analysis. InspectionBugIDEA-260297Unencrypted HTTP usage inspection throws exception on Rust non string literals
UsabilityIDEA-258873Navigating in inspection results requires to press too many keys
UsabilityIDEA-249566Make it more obvious that inspection options are related to the selected scope
CosmeticsIDEA-259713Inspection configuration UI: Remove black border around severity icon
CoreBugIDEA-260330AlreadyDisposedException from Space plugin on dynamic plugin unload
BugIDEA-260524Memory leak: Disposed BreadcrumbsXmlWrapper retained via listener of PostprocessReformattingAspect$LangPomModel
Core. IDE SettingsFeatureIDEA-245847A way to run an IDE script from command line
FeatureIDEA-247100Sync IDEA platform SDKs with those installed by asdf-java
Core. Image ViewerBugIDEA-260894Add Copy action to the BufferedImage display
Core. IndexingBugIDEA-260379Async file listener should not lose events
BugIDEA-259897shared-indexes: invalidate caches dialog should ask about shared indexes
BugIDEA-259273Shared index storage should support a large chunk amount
BugIDEA-259783shared-indexes: unload exception in JDKs
TaskIDEA-260427Stale index auto-repair
TaskIDEA-257723Integration performance tests with in-memory IDE
Core. InstallationBugIDEA-260798Wrong vmoptions used after update to CLion 2021.1 EAP
Core. Project SettingsBugIDEA-260248Project Structure dialog: changes in module name aren't applied if module dependencies were changed at the same time
BugIDEA-260145Cannot rename module with custom (i.e. non project-default) JDK
BugIDEA-249398Persistent AddDiffException on project open after quitting IDEA
Core. Quick DocumentationBugIDEA-260323i18n: Documentation: Tool window title is not localized
Core. Run. ConfigurationsBugIDEA-258398@argfile shortening method isn't available in run configuration templates in some projects
BugIDEA-259116Wrong invocation of Run File action when file starts with #!
CosmeticsIDEA-260033[new run config UI] extra artifacts on "Got it" tooltip
Core. Run. TargetsUsabilityIDEA-258269Run Targets. Fix layout of the SSH wizard
Core. SSHBugIDEA-260890"Can't copy sources" -> Connection failed -> Caused by: RemoteCredentials is not set in FileSystemOptions
BugIDEA-259658Move advanced settings from Deployment to Unified SSH
Core. Task ManagementExceptionIDEA-260686Cannot edit tasks
EditorBugIDEA-259724Allow to 'Exclude Recursively' 'External Libraries' when create custom scope
BugIDEA-259828Filter is not applied when scope changed
UsabilityIDEA-259829Default width of custom scopes is too narrow
Editor. Color SchemesBugIDEA-254501Dark editor color scheme is not remembered
Editor. CopyrightBugIDEA-260480i18n: Preferences/Settings: Editor: CopyRight: Formatting: hardcode strings under JSP/JSPX/XML setting pages
Editor. Diff and MergeFeatureIDEA-156485Allow copying a file from another branch in Compare with branch view
BugIDEA-257651Diff view detects big diff but change was only small
Editor. Editing TextBugIDEA-208441"//region" matches a wrong "//endregion" sometimes.
Editor. FormatterBugIDEA-226055"Space before colon in foreach" setting isn't presented in code style preview
BugIDEA-188397Incorrect indent after Enter after curly brace on the same line
BugIDEA-254557Need to press code reformat or optimize imports shortcut multiple times to make it work
CosmeticsIDEA-163806indention in JavaDoc after <br> tag
Lang. Shell ScriptBugIDEA-259764|& operator breaks shell script editor
Lang. XPath and XSLTExceptionIDEA-259818Running XSLT debugger with Saxon engine fails with exception
Tools. DockerFeatureIDEA-210514Support Docker buildkit/build enhancements
FeatureIDEA-260147add completion for docker cli options
BugIDEA-202612Docker: Registry, test connection. Can't save "Server" changes.
BugIDEA-259426can't open Docker image run configuration while indexing
BugIDEA-255049Refactoring service name in docker-compose.yml does not work correctly
BugIDEA-183170Docker: registry rename doesn't work
BugIDEA-260400Docker-compose. RunConfig. Impossible to delete "field" options
BugIDEA-260319IllegalArgumentException when adding new Docker run target in WebStorm
UsabilityIDEA-184524DockerCompose run configuration: Pull of images happens without any log messages
ExceptionIDEA-260105'Can't launch `desktop list`' when debug Node.js app via interpreter from Docker
ExceptionIDEA-260150java.lang.Throwable: Path conflict. Existing symlink: SymlinkData in the container Files tab
Tools. HTTP ClientFeatureIDEA-137125Add support in the REST Client tool to define a client TLS certificate
Tools. TerminalFeatureIDEA-222917Add support for terminal on FreeBSD
BugIDEA-259657Resizing terminal eats output
BugIDEA-153321native pty executor library issue: can't build\run\debug any project
BugIDEA-240040Losing lines from the bottom of the Terminal Window when the window is resized horizontally
BugIDEA-260566Terminal width is limited to 80 characters
CosmeticsIDEA-218038[Terminal] current dir path is mixed after window resizing and sh file executing
ExceptionIDEA-129259Terminal plugin won't start on FreeBSD
User InterfaceFeatureIDEA-82829Maximize editor window should hide other editor in split view
BugIDEA-257112Settings | Plugins: Can't disable plugin if its dependencies are not loaded
BugIDEA-260093Big Sur: Empty bar appears at the bottom after closing the project tab
BugIDEA-259483Pinned preview tab bug
BugIDEA-259863Got it tooltip for Reader Mode does not appear after fresh start
BugIDEA-255506Inline debugger dialog incorrectly sized on Ubuntu
BugIDEA-254692Impossible to select menu entries from popup of the hidden toolbar button
BugIDEA-260543"Choose run configuration" popup is not opened with shortcut
BugIDEA-258560Big Sur: Empty bar appears above the navigation bar after closing the project tab
BugIDEA-207152"File | New Scratch File" isn't shown in custom "Quick Lists"
BugIDEA-259944New Scratch File does not appear in a Quick List
BugIDEA-260344Built-in HTML preview should have white page background by default
BugIDEA-260260Notification is missing after recording async profiler snapshot
BugIDEA-257834Cannot open cloned project while another one is being opened
UsabilityIDEA-227224'Delete line to start' doesn't work in text areas
ExceptionIDEA-259970java.lang.Throwable on "Close All Projects" if there are more than two projects opened
User Interface. AccessibilityFeatureIDEA-200170High Contrast Theme should be applied by default on first launch if "High Contrast" mode is applied in Windows
User Interface. ControlsFeatureIDEA-260013UI for independent submenu in popups
BugIDEA-251059Two-line empty text with a link is cropped
BugIDEA-260619Empty elements in table after hover
User Interface. Embedded Browser (JCEF)BugIDEA-259096JCEF: window.cefQuery_XXXXXX_XX is not a function for query created after the browser is shown
User Interface. Find, Replace, UsagesBugIDEA-260227Ctrl+Click on an argument in lambda does not show usages.
BugIDEA-244348Find Popup: missing Tooltip for "Show Filter Popup"
User Interface. GraphicsUsabilityIDEA-220771The delay when detaching editor tabs is too long
User Interface. NavigationBugIDEA-254742Preview tab automatically switching to a real tab
BugIDEA-255955Navigation bar is empty when opening a second project
User Interface. Project ViewBugIDEA-256683"Enable preview tab" function only works on"Project" view,not working on other views on IDEA 2020.3.
User Interface. Search EverywhereBugIDEA-231624Can't find "show code folding outline" option via Find Action
Version ControlBugIDEA-169090Wrong highlighting of copy-pasted fragment in editor gutter
BugIDEA-209585"Clear initial commit message" setting overwrites fixup message
BugIDEA-237387Git Branches popup is displaced
BugIDEA-203694Grouping changes by Repository shows submodule object change as part of submodule, but it is in the root repo
UsabilityIDEA-259716Use submenu to configure double-click behavior - Diff vs Source
UsabilityIDEA-257543Nothing happens if 'Resolve conflicts' is pressed after all conflicts have been resolved
UsabilityIDEA-251017Missing mnemonic for VCS menu
Version Control. GitBugIDEA-246614Modification lines are not highlighted in gutter after dynamic plugin unloading
BugIDEA-257461Missing arrows in stash camper window
BugIDEA-258247Git Staging Area: commit message doesn't save in "Commit Message History" after commit
UsabilityIDEA-255504Git Rebase dialog: Hash from upstream field does not copied to new base field on adding --onto option
UsabilityIDEA-260641Rename Revert to Rollback in Git Stage
ExceptionIDEA-260333Exception on project opening after switching from non-modal to stage mode while project was closed
Version Control. GitHubBugIDEA-259888GitHub Pull Requests: Empty content of Pull Requests toolwindow when account token is invalid
BugIDEA-259924GitHub Pull Requests: Deleted remote remains open
BugIDEA-259886GitHub Enterprise: unable to load and add pull request multi-line comments
Version Control. SubversionBugIDEA-257549Subversion fails on Build for AppleSilicon ARM (aarch64) due to missing native sqlite lib
No subsystemBugWEB-49227at-rule properties are not correctly resolved to MDN
TaskWEB-47518Hide Node.js field from tool integration configuration pages
ExceptionWEB-49200Selecting an option in completion in React causes an exception in HTTP Client plugin
JSONFeatureWEB-31888Add support for JSON Lines file format (.jsonl filename extension)
JavaScriptBugWEB-49224No completion for exported modules within destructured require()
BugWEB-49290JavaScript private class members # syntax: member name starting with "include" reported as error
BugWEB-49250False positive invalid code with property computed with combination of "in" and ternary operators
BugWEB-49307Opening project in new version of IDE changes settings of JavaScriptSettings component in .idea/misc.xml
BugWEB-48803Import suggest does not work for "render" react-dom method
BugWEB-49249javascript statement parsing error in Ultimate 2020.3
BugWEB-49149In JSX files a syntax error is still reported after correction
PerformanceWEB-48983Webstorm 2020.3.x MacOS slow and high CPU compared to 2020.2
TaskWEB-49259Show suggestions from string literals only on Ctrl-Space
TaskWEB-12462TypeScript: Implicit return of object literal in lambdas wrongly reported as "never used"
JavaScript. FrameworksFeatureWEB-43748input missing associated label error when using @angular/material
FeatureWEB-41922Don't report 'missing associated label' warning when using <input> in Bootstrap <b-form-group> with label
BugWEB-49229MDN documentation for tags in TSX is broken
BugWEB-36025Wrong ID tag recognition ('missing associated label' warning) if it is set as vue prop
BugWEB-33969Angular: "Form input without an associated label or title attribute " warning in case of property binding
BugWEB-41733Angular: "Missing associated label" when using attribute binding for 'aria-label'
JavaScript. InspectionsBugWEB-43129Type Mismatch warning when setting current value of a useRef() to a custom type
LintersBugWEB-49013Prettier doesn't work on save or reformat if trailing space is accidentally added to glob pattern
Node.jsBugWEB-49297docker-desktop is available in the 'WSL | Linux distribution' list
SASSBugWEB-14547SASS. "Expand shorthand css property" removes variable.
TypeScriptBugWEB-48903Update bundled schema for tsconfig.json
No subsystemTaskDBE-12439Create icons for sortHistory and filterHistory
DB ConnectivityFeatureDBE-10828Do not include password to data source name for "Data sources from URL" action
DB RefactoringBugDBE-12422Renaming MySQL JSON column with default value
BugDBE-12445SQL Generator produces DEFAULTS in grants for routines for PostgreSQL
Data ViewsFeatureDBE-6704Loading Datagrip tables with descending order as default
BugDBE-10165SELECT for Athena is generated without LIMIT clause
UsabilityDBE-11933DataGrip is copying truncated data to clipboard without warning
SQL HighlightingFeatureDBE-12302Support ClickHouse REMOVE DEFAULT clause
FeatureDBE-12473Better highlighting in Run Configurations
BugDBE-12289Multiple PL/SQL Declarations in WITH clause
BugDBE-12227Specify Null Bheaviour in Window Function
BugDBE-12285ILIKE ANY is not recognized

RubyMine 2021.1 EAP1 (211.4961.28 build) Release Notes

No subsystemBugRUBY-11618RubyMine 4.5 not opening various file types (*.haml, *.rhtml, *.rxml) in editor
TaskRUBY-27557RBS: Partially move parser logic to the lexer
CoreCosmeticsRUBY-18360RailsApps Sample wizard needs redesign
Core. LocalizationBugRUBY-27362Not all items in the Settings are extracted
Core. SSHBugRUBY-26823SSH session: Rsync link is a dead one
EditorBugRUBY-27498Rails associations are shown as 'rails.codeinsight.call'
BugRUBY-27501Name of class variable is shown with @
UsabilityRUBY-27497Tests are shown as list of 'Ruby:Do block call' in the navigation bar
Lang. RBSFeatureRUBY-27396Add basic symbol support in RBS that provides declarations
FeatureRUBY-27383Add lexer/parser for RBS language
RailsUsabilityRUBY-27534Unneeded warning 'This version is not fully supported' for Rails 6.1.0
Ruby. FormatterBugRUBY-25786New line in a multiline method call is deintented on typing a colon
BugRUBY-26933Incorrect Auto-Indentation for 'if then' and 'else' statements followed by a comment.
BugRUBY-27411Inconsistent indentation for brace blocks over multiple lines
BugRUBY-26757Incorrect indentation for methods with arguments and inline comment
Ruby. InspectionsFeatureRUBY-27428Allow additional comments after noinspection warning suppression comments
Ruby. TestsBugRUBY-26931Minitest fails to start with DRb::DRbConnError
Ruby. Tests. RSpecBugRUBY-27438Rspec example names field in Run Configuration editor actually doesn't support multiple examples
Code Analysis. InspectionFeatureIDEA-31168Specify inspection profile used for code analysis at check-in time
BugIDEA-254506"Reference to non-localized string" false positive for parameter of 'when' statement
BugIDEA-255980Inspection settings is quite slow to appear
BugIDEA-195685Newly created scope doesn't appear right away in 'Scopes Order'
BugIDEA-258992Can't switch to project inspection profile from application inspection profile with the same name
BugIDEA-222161Inspection profiles UI problems
BugIDEA-257753Inspections configuration: Prevent using shared scopes in IDE-saved inspections
BugIDEA-259617Can't export inspection results to HTML
BugIDEA-258991ProfileChangeAdapter.profileActivated() events are never published
PerformanceIDEA-256481Inspect code spends a long time "scanning scope"
UsabilityIDEA-255125Inspect Code on Commit action inspects source files from outside of project source roots
CosmeticsIDEA-185794In Inspections dialog, the severity block changes position
CosmeticsIDEA-259365Make the inspection description text area a description text
CosmeticsIDEA-259454Add vertical spacing in inspection configuration right panel
Code Analysis. Language InjectionBugIDEA-254971Java Parameter Language Injection Settings has bad resize behaviour
Code Analysis. Structural SearchBugIDEA-257374Open Replacement dialog automatically when selecting replace pattern from history
BugIDEA-256936Structural search fails to find match because of comment
BugIDEA-228320Unsupported replace pattern An expression can not be replaced with a non-expression
BugIDEA-257893Incorrect index usage for searching JS
BugIDEA-254985primitive array not matched with variable template
BugIDEA-256009Filter live indicator is not live enough
BugIDEA-259108Search for simple recursion produces incorrect results
BugIDEA-259106Exception when trying to match recursion
BugIDEA-254329SSR false match: repeated variables are not matched correctly
TaskIDEA-254848Remove obsolete tooltip option
CoreBugIDEA-245099File type of unloaded plugin can be leaked due to file type caching
Core. DebuggerBugIDEA-256193Setting inline watch to empty value in Variables/Watches view doesn't remove it from the view
BugIDEA-256108Inline watches: Pressing Esc should only undo Set Value interaction and should cancel new Watch addition
UsabilityIDEA-256357Inline watches: when adding inline watch don't switch focus and don't open the Debug tool window if it was closed
Core. DiagramsPerformanceIDEA-259231UI Freeze when right-clicking on the intellij folder in IDEA
Core. File SystemBugIDEA-258608File become unavailable after rewrite with python
BugIDEA-256146Case-sensitive folders on Windows are not recognised
BugIDEA-252213WSL2: Can't select workspace
Core. IDE SettingsBugIDEA-259129idea.bat cannot set %JDK% from %USER_JDK64_FILE% if %APPDATA% contains spaces.
BugIDEA-255673When plugin that registers its own file type is installed, the notification is shown that suggests to revert the association to the incorrect file type
BugIDEA-256106WindowsLookAndFeel is not migrated to IntelliJLaf / JetBrainsLightTheme, defaults to Darcula
UsabilityIDEA-250146Make ignore.virus.scanning.warn.message possible to revert via UI
UsabilityIDEA-253968Import Settings from the backup overwrites the backup
CosmeticsIDEA-253866Reword option "Open matching files as text and auto-detect file type by content"
CosmeticsIDEA-235958Import settings message is too complicated
Core. IDE Settings. SharingBugIDEA-254948JDK classes are not properly resolved after setting up a new SDK
Core. IndexingBugIDEA-254057Exception on exit after plugin unloading
BugIDEA-258372Save shared index version inside the index directory
BugIDEA-258484shared indexes generator is broken: file based index is not initialized by the time the command "dump-shared-index" is called
PerformanceIDEA-257855Excessive memory allocation when the IDE in idle
Core. InstallationTaskIDEA-257798Bundle Kotlin 1.4.21 with Intellij IDEA 2021.1
TaskIDEA-255426[Apple Silicon] Convert launcher binary to universal format
ExceptionIDEA-257865CCE at com.intellij.database.actions.AddDataSourceFromPath$1.<init>
Core. LicensingTaskIDEA-256171Force using EAP license for paid EAP-enabled plugins running in an EAP IDE build
Core. Navigation and SearchFeatureIDEA-256847YAML: highlight both usages of PsiElement and Reference under caret if they have the same TextRange
BugIDEA-250259Go To action opens file inside generated sources
BugIDEA-259121"Go to File" shows a lot of directories first but no files
UsabilityIDEA-256350Search using non english characters stopped working
UsabilityIDEA-252492Do not show Calculator results in Search Everywhere if no operators are used
Core. Platform APIBugIDEA-252628Make com.intellij.psi.search.scope.packageSet.PackageSetBase#contains(VirtualFile, NamedScopesHolder) non "abstract"
BugIDEA-253543JvmElementActionsFactory#createChangeParametersActions does not expose existing parameter annotations
TaskIDEA-228078Scratch files should have their language file types, not ScratchFileType
Core. Plugin ManagementBugIDEA-257906Incorrect wording of "Loaded because enabled for another project" info text
BugIDEA-203746New plugin page: depended plugin is not installed after user hit 'Proceed' in depending plugin installation
BugIDEA-257167Cryptic error message on start
BugIDEA-255055Unable to load/unload plugin when extension point defined in optional config file
BugIDEA-257854Unclear/incorrect behavior on switching between per-project states
BugIDEA-257851Per-project plugin is not becoming enabled for all projects if action was invoked from another project, but becomes enabled only for the first opened project after IDEA restart
BugIDEA-255042Unable to unload plugin that uses module extension if project has no modules
BugIDEA-254204Plugin is not unloaded after the last project was closed
BugIDEA-259183JavaFX Runtime for Plugins: An unexpected core classloader: class com.intellij.util.lang.PathClassLoader
CosmeticsIDEA-257857"Loaded because enabled for another project" doesn't fit plugin info block
Core. Project SettingsBugIDEA-257767Module settings not saved in .idea folder
BugIDEA-257959Project language level covers Java Preview warning dialog
PerformanceIDEA-252694Freeze during processing changed project configuration files
ExceptionIDEA-257252UnsupportedOperationException at com.intellij.framework.detection.impl.DetectedFrameworksData.updateFrameworksList
Core. Quick DocumentationFeatureIDEA-258058Support bimodality of the {@return} Standard Doclet tag
CosmeticsIDEA-258219Quick Doc: Typo in the description of JSP contentType
Core. RefactoringsBugIDEA-235126During dialog-based rename, substituteElementToRename is called twice
BugIDEA-258166"Refactor / Rename" on resource file picks wrong file
ExceptionIDEA-121424Throwable at com.intellij.ide.impl.DataManagerImpl$MyDataContext.getData
Core. Run. ConfigurationsBugIDEA-259247Alt-Enter shows action groups that do nothing
BugIDEA-256715"Repeat N times" option in JUnit run configuration is shown twice
BugIDEA-256734Invalid got it tooltip for 'Repeat N times'
BugIDEA-254720Command line shortening: don't suggest for non-java process
UsabilityIDEA-254515Get rid of unclear "user-local default" option in "Shorten command line" field in JVM-based run configurations
CosmeticsIDEA-257477Fix tooltips in Java and JUnit dialogs
Core. Run. TargetsBugIDEA-257693Run Targets: Additional java/maven runtimes from SSH wizard not added to SSH target
BugIDEA-258035Run Targets: After introspection for SSH target, JDK path have extra white space at the end which fails app run
BugIDEA-260005Hide Run Targets UI from the IDEs with no supported language runtimes
BugIDEA-257453Run Targets: JDK path for SSH target not filled during introspection
BugIDEA-258084Run Targets: JUnit: attempt to run 'all in package' run configuration fails with SSH target
TaskIDEA-259479Run Targets: enable run.targets key by default in 2021.1 EAP
Core. SSHBugIDEA-258583Prefer ECDSA/ED25519 host keys when connecting to an SSH server
EditorFeatureIDEA-235188Add ability to reserve separate window for a tab
BugIDEA-259753Unable to open java file in LightEdit mode, UnsupportedOperationException occurs
BugIDEA-253077--wait option: terminal waits for whole editor window to be closed when light editor was opened with restored previously opened files
BugIDEA-255156Light Editor doesn't remember changed windows size
BugIDEA-255295Reader Mode options are not applied for file when switching it to read-only mode
Editor. Code CompletionUsabilityIDEA-258892Rename "SmartType completion" to "Type-matching completion"
Editor. Diff and MergeFeatureIDEA-228934Add option to launch 3-way-diff directly
BugIDEA-211809Blank diff results loose all user changes
BugIDEA-256076Extra pixel on editor diff markers
BugIDEA-255639Compare File with Editor action should be disabled in file context menu when Diff Preview is opened in Editor
BugIDEA-258704Clicking on a change marker in left gutter adds a breakpoint if the code block is folded
UsabilityIDEA-224087Exiting Diff Viewer with a non-file-backed pane looses changes
CosmeticsIDEA-240718Caret is placed in the right pane when a blank Diff window is opened
CosmeticsIDEA-255482White line on diff highlighters on 2,25 scaling
CosmeticsIDEA-239121diff viewer artefacts (reggression)
Editor. Editing TextFeatureIDEA-219868Add "Find in Path" to editor context menu for selected text
CosmeticsIDEA-203151Remove toolbar in Quick Definition dialog
Editor. FormatterBugIDEA-192807Enter calculates wrong indent
Editor. Intention ActionsBugIDEA-236593Docker: java.lang.Throwable: Assertion failed at opening a Dockerfile
Editor. TextMate BundlesBugIDEA-258528TextMate plugin pollutes the log with "Failed to parse textmate regex" exceptions
Lang. JSONFeatureIDEA-247214JSONPath Language
BugIDEA-258751JsonQuoteHandler is not called inside JSON5 documents
Lang. MarkdownBugIDEA-258796Unnecessary backslash escape in triple-backticked bash block
BugIDEA-251645Leaf nodes shouldn't be displayed as expandable in structure view
BugIDEA-254499Markdown preview uses wrong colors with dark editor color theme
Lang. RegExpFeatureIDEA-228664Regexp inspection to warn about redundant non-capturing group
BugIDEA-255232Unclear highlighting and warning in RegExp tester
Lang. Shell ScriptBugIDEA-256714Shell script syntax highlighting mangled after a parameter expansion
Lang. XPath and XSLTBugIDEA-207408XSLT debugger broken on Java 9+
Lang. YAMLBugIDEA-212875YAML indentation bugs when copy-paste
Tools. DockerFeatureIDEA-178690Docker: Make it possible to Cancel the "run" in the DockerView.
FeatureIDEA-259073Environment variables for Docker mounts
BugIDEA-260102Docker. Almost all tabs for containers are empty if container has mounted volumes
BugIDEA-259230Docker compose run fails with the error `settings.upTimeout must not be null`
BugIDEA-259061disable deploy action for deploying node
BugIDEA-259303Docker. Settings on the Tools page are wrong red marked
BugIDEA-255269java.io.IOException: java.nio.channels.ClosedChannelException at attempt to write in the disconnected console
BugIDEA-259025NPE at running a docker-compose file
BugIDEA-256367Can not connect to docker daemon on mac in master with error java.lang.NoClassDefFoundError: com/sun/jna/LastErrorException
BugIDEA-259400Log spamming by Docker integration when host is not available anymore
UsabilityIDEA-258853Incorrect field order in docker volume mapping configuration (UX)
UsabilityIDEA-199742Docker command line preview should not contain linebreaks
UsabilityIDEA-210374Docker image run configuration environment variable input should be like the one for Docker-compose
ExceptionIDEA-259024com.intellij.docker.agent.ApiTaskException: Can't retrieve image ID from build stream at Deploy stop
Tools. HTTP ClientFeatureIDEA-239340Support line numbers in HTTP Response Run frame
FeatureIDEA-239140Support foldings in HTTP Response Run frame
FeatureIDEA-251651HttpClient: need easiest way to copy body of request response (button)
FeatureIDEA-249252Microservices: show warning for incorrect or unknown HTTP header names
FeatureIDEA-252880Fold automatically response files links for 6th oldest and further
BugIDEA-256102HttpClient's lexer holds JS elements types after JS plugin unloding
BugIDEA-257460Http Client. Strange response if selected more than one request
BugIDEA-255548HttpClient: get multiple env files error on attempt to run request with variables
UsabilityIDEA-247549Add "scroll to top" button in response console
Tools. TerminalFeatureIDEA-257024Provide session ids
BugIDEA-172320SSH Terminal: Change default encoding to UTF
BugIDEA-206708Terminal: honor 'Close session when it ends' option
UsabilityIDEA-117484Can't select all terminal output
User InterfaceFeatureIDEA-254286Add plugin version for each "Non-Bundled Plugin" to "copy" button on the "About" dialog
FeatureIDEA-242086Add actions "close all projects" and "close all but this projects"
BugIDEA-255669"Got it" popup changes its position on switching tabs
BugIDEA-252551Opacity in colorpicker disappeared
BugIDEA-251940Some icons became brighter
BugIDEA-255549Empty line at the top of the value popup
BugIDEA-256423Big Sur: Non-native alert for project opening is shown if opening a project while Find in Path is opened
BugIDEA-256329Big Sur: wrong z-order of dialogs and alerts causing UI lock
BugIDEA-233135scrolling code tabs with mouse wheel could be much faster
BugIDEA-220248Incorrect UI panels width after reopening DataGrip
BugIDEA-255056Unexpected location of "unsplit"
BugIDEA-259352Cmd+Shift+Up/Down resizes tool window at the bottom instead of moving the line up/down
BugIDEA-257817Issue with highlighting of push combo-button in Push dialog
BugIDEA-249645AbstractPopup with AdText: wrong height after pack()
BugIDEA-255675Welcome screen: Changing combobox values on Customize tab switches focus to Projects tab
UsabilityIDEA-258895Rename "import popup" to "auto-import tooltip"
UsabilityIDEA-196260"Stretch tool window to *" is disabled via right click/gear icon/find action but not via Window -> Active Tool Window -> Resize
UsabilityIDEA-254272Add tooltips for all tool window buttons
UsabilityIDEA-256948Place toolbar on the top of the table
UsabilityIDEA-223541Inspection scopes on groups cannot be differentiated in the UI
UsabilityIDEA-176682Editor tab: `module-info.java` file label could be optimized
UsabilityIDEA-251659Clicking Color preview changes CSS color format
UsabilityIDEA-255394Got it popups from different features overlap
CosmeticsIDEA-211724HTML escape entities appear in the status bar when the tooltip is html-based
CosmeticsIDEA-259206OK-Cancel buttons should be right-aligned in message dialogs on Windows
CosmeticsIDEA-255039Fix icon alignment in the Navbar
TaskIDEA-257575Change color picker move/nudge shortcuts
TaskIDEA-209631Sort open windows by name in Window menu
TaskIDEA-219895Implement typography system
TaskIDEA-190854Replace plus icons with modifiers with one plus icon with dropdown
TaskIDEA-253581Switch IDE theme directly as entries are selected in the Appearance combo box
TaskIDEA-195753Add setting for tree line height
User Interface. AccessibilityBugIDEA-254108In the appearance tab, the label is not associated with the "font size:" combobox
BugIDEA-256940The list of file types Associate with Idea does not spoken elements
BugIDEA-250862On the welcome screen in the customization tab, labels are not associated with combo boxes
TaskIDEA-258233Set the project tree view to accessible Name
User Interface. Action SystemBugIDEA-259561Ctrl-D shortcut in Editor invokes Diff instead of line duplicating
User Interface. ControlsTaskIDEA-255170Got It tooltip: do not close on click outside
User Interface. Find, Replace, UsagesBugIDEA-253378Wrong local usage highlighting in injections
BugIDEA-257087Find Usages context menu item not visible until second right click
UsabilityIDEA-212226Find in Path dialog: option to open results in a separate tab should be keyboard-accessible
User Interface. FocusBugIDEA-259513Extra editor tab lose focus when switch between source/header
User Interface. GraphicsUsabilityIDEA-256044Close All But Pinned Broken / Missing
User Interface. Keyboard InputBugIDEA-242263Using hot keys to access "Quick Switch Schemes" Populates a search box with letter 'Q'
User Interface. Look and FeelBugIDEA-256913Theme is not changed to light when changing Editor color scheme to classic light and applying bright theme for IDE
BugIDEA-258213Nightly build doesn't show buttons
BugIDEA-254098Mac title bar is bright for tool windows opened in float mode (when whole theme is dark)
CosmeticsIDEA-201983High contrast theme: there is no separator on a button with separator
TaskIDEA-216859Color keys: unregistered root background
TaskIDEA-216858Color keys: use color keys for the mouse shortcut area
User Interface. NavigationFeatureIDEA-253560Cannot navigate from folded reference to property bundle in Kotlin
BugIDEA-193601New SE: No 'Continue search...' link when no results found on applied filter
CosmeticsIDEA-227322When quickfix is found by Find Actions, it contains raw html
User Interface. PluginsBugIDEA-256506Checkboxes in Plugins don't work
BugIDEA-257267Webstorm is suggesting usage of Intelij Idea Ultimate
BugIDEA-255478Double confirm for IDE restart
UsabilityIDEA-254729Unify the updates dialog
UsabilityIDEA-259158"Plugin updates installed" notification should not be sticky
User Interface. Project ViewFeatureIDEA-208072"File Nesting" support in "Project Files"
BugIDEA-248797Packages View shows useless empty packages from libraries
TaskIDEA-209057Changes "for current project" and “for new project” components in Preferences/Settings
User Interface. Search EverywhereFeatureIDEA-256078Add link to open Find in Path when no results found in SE
FeatureIDEA-255672Search Everywhere: file names in results should be the same with editor tab header
FeatureIDEA-255488Search Everywhere: make "Shown Contributors" filter application-wide
BugIDEA-259261Remove suggestion to find in files on Actions and Git tab
UsabilityIDEA-253918Better rounding of results in Search Everywhere calculations
TaskIDEA-256217Untidy results in the Search Everywhere calculator
ExceptionIDEA-259361Search Everywhere: Exception when results contain rendered HTML
Version ControlFeatureIDEA-217323Add Revert current Line action to Alt+Enter
BugIDEA-256998Throwable at com.intellij.openapi.vcs.ex.ChangelistsLocalLineStatusTracker: Attempt to register duplicate trackers
BugIDEA-215959Non-modal commit: the changelist name should be used as default commit message value
BugIDEA-257313Rebase message contains unprintable characters on macOS Big Sur
BugIDEA-255154Some symbols in author name does not shown
BugIDEA-258646Commit action is disabled in the file context menu.
BugIDEA-236524show commit options popup is not honouring the screen top
UsabilityIDEA-254160Refresh icon is not clear enough for Fetch
TaskIDEA-259993Hide the selection logic change under registry and disable for now
Version Control. GitBugIDEA-226786Synchronous execution on EDT from GitApplyChangesProcess$ResolveLinkListener.hyperlinkUpdate
BugIDEA-251850Choose upstream branch fails if some of repositories are in Detached Head
BugIDEA-256674Git Staging Area: gutter markers ignore configured border colors
BugIDEA-253049Git Staging Area: "Delete Files from Git" dialog shouldn't pop up on deleting unversioned files
BugIDEA-257593A file called .git is detected as git root.
BugIDEA-251265Search everywhere doesn't find action Annotate with Git Blame by request "git blame"
BugIDEA-254571"Create Git repository" action fails when the project is in WSL
UsabilityIDEA-259241Jump to Source is missing in file context menu when staging area is enabled
UsabilityIDEA-250748Git Merge dialog: The text in branch combobox isn't pre-selected after first git merge action invocation
UsabilityIDEA-108310Git: provide icon for 'Fetch' command in VCS/Git menu
CosmeticsIDEA-254366Rename the 'Rebase my GitHub fork' action to 'Sync Fork'
CosmeticsIDEA-259428"Failed to stage files" balloon incorrectly appears on staging file from ignored directory
CosmeticsIDEA-255833Branches in Git Log: Add tooltip for branches setting icon
Version Control. GitHubFeatureIDEA-233916Support adding comments to Multi-Line on pull request
BugIDEA-257505GitHub Pull Requests: can't add multiline comment
BugIDEA-244211GitHub PRs: Comment markdown - multiple newlines are not rendered correctly
BugIDEA-255058GitHub Pull Requests: Empty editor is opened on moving pull request tab to new window
BugIDEA-256782GitHub Pull Requests: the images in PR timeline doesn't load
CosmeticsIDEA-252595Inconsistent PR number formatting
Version Control. Local HistoryBugIDEA-235371When selecting 'Get' on VCS history extra space being added at the top of the file.
Version Control. PerforceTaskIDEA-252894Open-source Perforce plugin
Version Control. SubversionBugIDEA-257274i18n: VCS: Subversion: hardcode strings in SVN window
No subsystemFeatureWEB-48771Ship MDN documentation with IDE
DebuggerBugWEB-48558Don't suggest to Open in Browser Vue and other template files on built-in web server
HTMLBugWEB-49001Support data-* attribute in SVG 2.0 files
BugWEB-36210Allow ARIA accessibility attributes in SVG elements
JavaScriptFeatureWEB-11205Move statement up/down and comments
FeatureWEB-29361Better color scheme highlighting for javascript jsdoc comment block
BugWEB-48989JSRegExpModifierProvider treats 'm' as Pattern.DOTALL instead of Pattern.MULTILINE
BugWEB-48901JSDoc: return type not correctly inferred from @return when assigning imported function
BugWEB-49082Add support for type parameters in anonymous class expressions
BugWEB-49081Support declare on class fields
BugWEB-47219module.exports = class Foo doesn't work like module.exports = Foo;
BugWEB-14586No means to override Type Library Inspection error.
BugWEB-43860"Element not exported" shown for class field declared in constructor
BugWEB-42617Not recognizing TypeScript generics in JavaScript
BugWEB-48945Invalid suggestion list for plain text string
BugWEB-48567/** should expand into the doc comment in empty file
BugWEB-47223Inject CSS in Element.closest
BugWEB-47179Subclass of Event.target type is not recognised
BugWEB-47305Typo in word: false positive
BugWEB-18414JSDoc examples syntax highlighting artefact
BugWEB-40528Incorrect JS autocompletion
BugWEB-49156Incorrect syntax error "yield is not allowed as identifier in strict mode" in a generator function
BugWEB-48318Wrong code references for static methods in JavaScript
PerformanceWEB-49073High CPU usage
UsabilityWEB-48904Request a way to include dynamic references when refactoring names
TaskWEB-49030Support this annotations in functions
TaskWEB-48969Add help tooltip for "Unambigous imports on the fly" option
ExceptionWEB-49154PsiInvalidElementAccessException: Element: class com.intellij.lang.javascript.psi.impl.JSReferenceExpressionImpl because: containing file is null
JavaScript. FrameworksFeatureWEB-43748input missing associated label error when using @angular/material
BugWEB-49064Using getter in React defaultProps breaks JSX syntax
BugWEB-49137Quick fix 'Add import statement' doesn't work for 'React'
BugWEB-48038No autocompletion for makeStyles/createStyles
BugWEB-49135Incorrect import suggestions for React methods
JavaScript. InspectionsFeatureWEB-10308Ability to suppress inspection for file
FeatureWEB-49032Don't report "unused property toString" when the property is implicitly used in template literal
BugWEB-18700JSDon @callback tag description isn't displayed in documentation modal window
BugWEB-47292Inspection 'Mismatched query and update of collection' isn't shown for array
BugWEB-46924JS: outer captured variable assigned in a closure is marked unused
JavaScript. RefactoringBugWEB-47108Quick-fix 'Create field' creates field outside the function's scope
Node.jsFeatureWEB-48961Support Yarn PnP with ES modules (.pnp.cjs)
TypeScriptBugWEB-48950"Ambient declaration should have no body" false positive when function declaration followed by block statement
BugWEB-48627"Mismatched query and update of collection" warning should not be shown for unused variables
Unit TestsFeatureWEB-48850Detect mocha config file automatically
BugWEB-48673Jest: save Coverage report according options in jest.config.js when call 'Run with Coverage'
DB ConsoleBugDBE-11564JS arrow functions are not parsed in MongoDB consoles
UsabilityDBE-11731Query execution for unsupported DBMS
UsabilityDBE-11359Add option to turn off tab title shortening for datasource consoles
DB IntrospectionBugDBE-12247Incorrect grants in Postgres
BugDBE-12032PG/GP Sources introspection inefficient due to forgoten join
DB Schema ViewsBugDBE-12283'Show Generated Objects' setting does not always filter objects
Data Import & ExportFeatureDBE-11815ability to add the SQL query code when uploading data to Excel (append query text to exported data)
FeatureDBE-10465First row is header in the context menu
Data ViewsFeatureDBE-12306The option to ‘auto-transpose’ when the result set is only a single record
BugDBE-6239Moving database table views forgets hidden columns

  • No labels