Skip to end of metadata
Go to start of metadata

RubyMine 2020.1.4 (201.8743.13 build) Release Notes

Core. IndexingPerformance IDEA-238706 Accessing index during PSI events
Core. InstallationBug IDEA-242552 IDEA doesn't start after update to 2020.2 EAP2 (202.5103.13)
Core. LicensingBug IDEA-245166 Do not popup license dialog for "optional"-licensed plugins, after license expiration
Core. Plugin ManagementException IDEA-241872 "Unexpected core classloasder" exception prevents startup
Tools. TerminalUsability IDEA-244778 Consider renaming 'Smart Command Handling' to 'Run Commands using IDE'
Navigation & SearchBug DBE-11084 'Go to declaration or usages' not working on routines in query console window
SQL Format and StyleBug DBE-11093 Formatting rules are ignored when formatting a constructor inside type body

RubyMine 2020.1.4 RC (201.8743.4 build) Release Notes

Core. IndexingPerformanceIDEA-238706Accessing index during PSI events
Core. InstallationBugIDEA-242552IDEA doesn't start after update to 2020.2 EAP2 (202.5103.13)
Core. LicensingBugIDEA-245166Do not popup license dialog for "optional"-licensed plugins, after license expiration
Core. Plugin ManagementExceptionIDEA-241872"Unexpected core classloasder" exception prevents startup
Tools. TerminalUsabilityIDEA-244778Consider renaming 'Smart Command Handling' to 'Run Commands using IDE'
Localization. ChineseBugIDEA-242047All languages: Cannot open context menu in project view
Navigation & SearchBugDBE-11084'Go to declaration or usages' not working on routines in query console window
SQL Format and StyleBugDBE-11093Formatting rules are ignored when formatting a constructor inside type body
Lang. ERBBugRUBY-26376ERB: reformatting removes code inside the each loop
Lang. ERBBugRUBY-26377ERB: variable is marked as not used in the each loop

RubyMine 2020.1.3 (201.8538.34 build) Release Notes

Core. LocalizationBug RUBY-26282 All languages: RubyMine run configurations fields are not fitted
Bug RUBY-26351 All languages: Bundle actions in run anything are partly translated
Ruby. Code InsightPerformance RUBY-26400 RubyMine 2020.1.1: high CPU usage without any specific actions
CoreBug IDEA-243130 GoLand 2020.1.3 closes main window and can't bring to front if press ESC on `goland --help` window.
Bug IDEA-241340 Timeout in tests during BaseFixture.disposeRootDisposable caused by LaterInvocator
Core. File SystemBug IDEA-241524 When I create new files using de Angular CLI, the files are not visible immediately in the Project tab
Bug IDEA-239947 Deadlock between EDT and Jar file attributes updater
Core. IDE SettingsUsability IDEA-240607 Import Settings should warn if user has incorrectly selected a folder without settings
Core. InstallationBug IDEA-242558 Patches for the IDE with 32-bit JDK are not applied
Core. Plugin ManagementBug IDEA-240538 Theme plugin auto apply after update reseting previous settings
Core. Project SettingsBug IDEA-238053 Project Structure dialog does not apply changes when Eclipse project format is used
Usability IDEA-240068 error: java: error: release version 15 not supported when compiling project with JDK_X language level in misc.xml
Editor. Large FilesBug IDEA-243589 IDE freeze / crash when large file is truncated
Tools. DockerBug IDEA-240719 Docker's multi-tab drawing problem
Bug IDEA-236451 Docker: Exec tabs for a container are closed only from the second time.
User InterfaceBug IDEA-240549 Minor: missing space in Reopen Project dialog
Performance IDEA-238301 Subpixel(LCD) text is slow with UI font in 2020.1, switching to greyscale antialiasing helps
User Interface. GraphicsBug IDEA-242042 Some icons are missing and some hardly visible in the Main menu
User Interface. Project ViewPerformance IDEA-237974 UI freeze: com.intellij.openapi.module.impl.ModuleGroupersKt.splitByDotsJoiningIncorrectIdentifiers
Version Control. LogBug IDEA-221930 Checkout revision keymap is gone.
No subsystemBug WEB-45758 Stuck Typescript Code Analysis and InvalidPathException
CoffeeScriptBug WEB-45537 CoffeeScript import can no longer be automatically inserted
JavaScriptBug WEB-45402 Structure view for JavaScript file fails to filter attributes and methods
Performance WEB-45974 Webstorm stucks on indexing
Exception WEB-45611 Code Analysis Crashes when trying to commit
JavaScript. FrameworksBug WEB-45531 Error reported when using Vue filters with specific names
Bug WEB-45546 Vuex: inspection text is empty on unresolved Vuex symbols
TypeScriptBug WEB-45065 Extra # is added after completing #-private fields
DB ConnectivityBug DBE-10963 pgpass fails to parse if it has blank lines in it
DB ConsoleBug DBE-9876 Force executing queries in read-only mode runs the wrong query
Bug DBE-10837 Error: invalid identifier in Snowflake
DB DiffBug DBE-10727 Compare schemas does not respect the column order
DB RefactoringUsability DBE-10543 Button layout exactly the wrong way round (Compare DDL with Database)
Data ViewsUsability DBE-8336 Shorten tab names in DataGrid with placement on the right/left
Usability DBE-10707 Generated filter from Filter By context menu clears MongoDB projection
PL & DDL EditorFeature DBE-5756 Database - Adding datasource as DDL - adding whole folders besides files only
SQL CompletionFeature DBE-11004 SQL Server Does Not Recognize "ADD SENSITIVITY CLASSIFICATION" Statement
SQL Format and StyleBug DBE-10779 Wrong indent when a command starts with a comment
SQL GeneralBug DBE-10999 Index creation with INCLUDE NULL KEYS causes error
Bug DBE-10726 No ability to create a DDL data source if there are no folders attached
SQL GenerationBug DBE-10334 Modify table action no more works from the editor
Bug DBE-10724 Snowflake Table Creation Generates Invalid DDL w/ Comments on Primary Keys
SQL HighlightingBug DBE-11007 ORDER BY ... FOR JSON in subquery
Bug DBE-10778 MariaDB Dialect JSON_QUERY not recognized
Bug DBE-10748 Errors in SQL Editor for correct Oracle SQL statements
SQL ResolveFeature DBE-10457 New quick fix: refresh schema

RubyMine 2020.1.3 RC (201.8538.18 build) Release Notes

No new changes comparing to Preview build.

Preview build changes - RubyMine 2020.1.3 Preview (201.8538.2 build) Release Notes

RubyMine 2020.1.3 Preview (201.8538.2 build) Release Notes

Core. LocalizationBugRUBY-26282All languages: RubyMine run configurations fields are not fitted
BugRUBY-26351All languages: Bundle actions in run anything are partly translated
Ruby. Code InsightPerformanceRUBY-26400RubyMine 2020.1.1: high CPU usage without any specific actions
CoreBugIDEA-243130GoLand 2020.1.3 closes main window and can't bring to front if press ESC on `goland --help` window.
BugIDEA-241340Timeout in tests during BaseFixture.disposeRootDisposable caused by LaterInvocator
Core. File SystemBugIDEA-241524When I create new files using de Angular CLI, the files are not visible immediately in the Project tab
BugIDEA-239947Deadlock between EDT and Jar file attributes updater
Core. IDE SettingsUsabilityIDEA-240607Import Settings should warn if user has incorrectly selected a folder without settings
Core. InstallationBugIDEA-242558Patches for the IDE with 32-bit JDK are not applied
Core. Plugin ManagementBugIDEA-240538Theme plugin auto apply after update reseting previous settings
Core. Project SettingsBugIDEA-238053Project Structure dialog does not apply changes when Eclipse project format is used
UsabilityIDEA-240068error: java: error: release version 15 not supported when compiling project with JDK_X language level in misc.xml
Tools. DockerBugIDEA-240719Docker's multi-tab drawing problem
BugIDEA-236451Docker: Exec tabs for a container are closed only from the second time.
User InterfaceBugIDEA-240549Minor: missing space in Reopen Project dialog
PerformanceIDEA-238301Subpixel(LCD) text is slow with UI font in 2020.1, switching to greyscale antialiasing helps
User Interface. GraphicsBugIDEA-242042Some icons are missing and some hardly visible in the Main menu
User Interface. Project ViewPerformanceIDEA-237974UI freeze: com.intellij.openapi.module.impl.ModuleGroupersKt.splitByDotsJoiningIncorrectIdentifiers
Version Control. LogBugIDEA-221930Checkout revision keymap is gone.
No subsystemBugWEB-45758Stuck Typescript Code Analysis and InvalidPathException
CoffeeScriptBugWEB-45537CoffeeScript import can no longer be automatically inserted
JavaScriptBugWEB-45402Structure view for JavaScript file fails to filter attributes and methods
PerformanceWEB-45974Webstorm stucks on indexing
ExceptionWEB-45611Code Analysis Crashes when trying to commit
JavaScript. FrameworksBugWEB-45546Vuex: inspection text is empty on unresolved Vuex symbols
BugWEB-45531Error reported when using Vue filters with specific names
TypeScriptBugWEB-45065Extra # is added after completing #-private fields
DB ConnectivityBugDBE-10963pgpass fails to parse if it has blank lines in it
DB ConsoleBugDBE-9876Force executing queries in read-only mode runs the wrong query
BugDBE-10837Error: invalid identifier in Snowflake
DB DiffBugDBE-10727Compare schemas does not respect the column order
DB RefactoringUsabilityDBE-10543Button layout exactly the wrong way round (Compare DDL with Database)
Data ViewsUsabilityDBE-8336Shorten tab names in DataGrid with placement on the right/left
UsabilityDBE-10707Generated filter from Filter By context menu clears MongoDB projection
PL & DDL EditorFeatureDBE-5756Database - Adding datasource as DDL - adding whole folders besides files only
SQL CompletionFeatureDBE-11004SQL Server Does Not Recognize "ADD SENSITIVITY CLASSIFICATION" Statement
SQL Format and StyleBugDBE-10779Wrong indent when a command starts with a comment
SQL GeneralBugDBE-10999Index creation with INCLUDE NULL KEYS causes error
BugDBE-10726No ability to create a DDL data source if there are no folders attached
SQL GenerationBugDBE-10724Snowflake Table Creation Generates Invalid DDL w/ Comments on Primary Keys
BugDBE-10334Modify table action no more works from the editor
SQL HighlightingBugDBE-11007ORDER BY ... FOR JSON in subquery
BugDBE-10778MariaDB Dialect JSON_QUERY not recognized
BugDBE-10748Errors in SQL Editor for correct Oracle SQL statements
SQL ResolveFeatureDBE-10457New quick fix: refresh schema

RubyMine 2020.1.2 (201.7846.78 build) Release Notes

Remote Interpreters. DockerFeatureRUBY-19283Docker: support RuboCop with remote interpreter
Code Analysis. DependenciesBugIDEA-237275Exception when open settings for Usages opened from Code vision hint
Code Analysis. InspectionBugIDEA-238616Inspection 'Return null or something nullable from lambda in transformation method' incorrectly flags Consumer in Mono.doOnNext
CoreBugIDEA-2375192020.1 doesn't start when %APPDATA% points to a UNC share (enterprise Windows setup)
BugIDEA-231783Sometimes IDEA does not start after installation on Windows
BugIDEA-239124PathMacrosImpl state is not persisted
Core. File SystemBugIDEA-236701JARs with case-sensitive class names do not work properly on case-insensitive OS
BugIDEA-238210File watcher failed to start. Heap corruption.
Core. IDE SettingsFeatureIDEA-31438Add IntelliJ IDEA (No Plugins) Start Menu entry ala Firefox/Thunderbird/etc.
BugIDEA-237012Critical startup error after updating PyCharm CE that have paid marketplace plugin installed via Toolbox
BugIDEA-238800Add an extension point to define a configurable group
BugIDEA-237709Unable to add just installed JDK to IDEA's list of runtimes
Core. IndexingBugIDEA-237219Deadlock when updating plugins during indexing
Core. InstallationBugIDEA-228859Wrong project name and path when opening project with shell script
BugIDEA-239103bin/fsnotifier64 Access denied during update from 2020.1.1 to 2020.1.1 Build #IC-201.7223.58
Core. Navigation and SearchFeatureIDEA-219697Navigate to File should honor the Sources directories first
TaskIDEA-230766Next/Previous occurrence actions don't work when Find Usages is open and the focus is in the editor
Core. RefactoringsBugIDEA-238440Multiple RenameHandlers for single element triggers HandlersChooser on element right click
Core. Run. ConfigurationsBugIDEA-237594IntelliJ 2020.1: Module path is empty if run configuration uses "@argfile" or "JAR manifest"
Core. SSHBugIDEA-237455net.schmizz.sshj.sftp.SFTPException: No such file
EditorBugIDEA-237629When I change the line separator to LF the change is not taken into account until I save the file. If I change from LF to CR then the file is saved automatically
BugIDEA-234948'Unsplit All' action doesn't work
BugIDEA-235849Editor leaks reference to highlighter of unloaded plugin
PerformanceIDEA-240681Column selection mode is slow
Editor. Code CompletionBugIDEA-238623Completion is not sorted by ML because of new weighers
BugIDEA-238617Don't check relevance features if model trained without positions from standard ranking algorithm
Editor. Diff and MergeBugIDEA-238054Missing method name when collapsing unchanged fragments in diff
UsabilityIDEA-236053Conflicts dialog is opened extremely small
Editor. Editing TextFeatureIDEA-168218'Copy as Rich Text' should use some fallback font
Editor. Intention ActionsBugIDEA-236961idea hangs on "removing redundant imports", seems like on a single file
ExceptionIDEA-233778Intention preview: Exception when preview is not available
Lang. Shell ScriptBugIDEA-232910Shell: nested expressions of parameter expansion are not highlighted/parsed
Tools. DockerBugIDEA-234512Images console: F1 should lead to the new help
BugIDEA-234942DockerCompose: Errors about invalid format by using env. vars in images values
Tools. HTTP ClientBugIDEA-239147HTTP Client: environment file is generated in Scratches for the HTTP Requests file from scratches but can't be used
BugIDEA-236414HTTP Client: not specified path variables values treating: action links don't work
UsabilityIDEA-236212Do not show popup if there is only one environment
CosmeticsIDEA-240184[Upsource] Discussion in HttpRequestErrorFixFilter.kt in review IDEA-CR-62118
ExceptionIDEA-238004HTTP Client: show ClearReadOnlyStatus dialog on MoveHTTPRequests refactoring performing in case of read-only files
User InterfaceBugIDEA-235385Tab is not detached when crossing the IDEA frame
BugIDEA-241358Tab is not dropped to another window with detached tab
PerformanceIDEA-235635Idea freezes with AppleSystemUIFont when Event Log is opened (MultilineTreeCellRenderer takes a lot of time doing stringWidth)
CosmeticsIDEA-238209Create Desktop Entry - Result wording badly structured
User Interface. AccessibilityBugIDEA-235804In screen reader mode, it is not possible to add an SSH interpreter
User Interface. Embedded Browser (JCEF)BugIDEA-236310[mac] JCEF crashes when run after JavaFX
User Interface. Look and FeelBugIDEA-227157Some text in "IDE and Plugin Updates" popups in dark themes is gloom
User Interface. NavigationFeatureIDEA-236263Add tooltip on the tabs in the search everywhere popup dialog
No subsystemBugWEB-45384WSL2: Prettier: Error applying code style rules from configuration file
BugWEB-45155WSL2: ESLint: Error applying code style rules from configuration file
BugWEB-45382WSL2: TSLint: Error applying code style rules from configuration file
BugWEB-45159WSL2: Can't analyse webpack.config.js in vue template project
TaskWEB-44824Wanted: direct patches from 2019.1.4 to 2020.1
CSSUsabilityWEB-10013CSS/SCSS formatter needs to be aware of CSS3 grid-layout properties
DebuggerBugWEB-43829Debugging Vue.js with TypeScript in .vue file is only randomly recognizing the RemoteUrl
BugWEB-45707Debugger can't connect sometimes
BugWEB-44912Debugging Vue.js + Typescript doesn't work
HTMLBugWEB-45429SVG: Attributes are shown as invalid when using `svg:` prefix
JavaScriptBugWEB-44874[JS] Missed signatures for a library (node-fetch)
BugWEB-44868Webstorm doesn't show completion for attributes of classes referenced through JSDoc from other files
BugWEB-45181Material UI: Unstable resolve of props in react components(JSX)
BugWEB-44843Wrong type inference with discord.js
PerformanceWEB-45024High CPU usage on editing
PerformanceWEB-45371Recursive generators: JS code analysis never ends
JavaScript. FrameworksBugWEB-45672Ivy: issues with Material table support
BugWEB-36561Vue.js: Support expression statements in event bindings
BugWEB-45270Inherited component or directive properties not recognized, when built with Ivy
JavaScript. RefactoringBugWEB-20177Incorrect handling of 'this' in lambda in extract method
Node.jsBugWEB-45203Show node packages with WSL UNC paths properly
PerformanceWEB-39488Scanning node_modules directory with many files freezes IDE on project open
SASSFeatureWEB-45196SASS math module: support new functions and variables
TypeScriptFeatureWEB-44952Consider tsconfig*.json as extended json (in addition to tsconfig.json itself)
BugWEB-43636'Implement all members' fix suggests extra properties when using spreads
BugWEB-39705Auto-import should use library name when importing modules/components from Angular libraries
BugWEB-45284'ref' live template should only be available at top of the file
BugWEB-453092020.1 breaks my JavaScript extensions for bundled type libs
BugWEB-44848TypeScript quick doc: show type alias member for object types
PerformanceWEB-45369IDE freezes during TypeScript code completion in react projects with styled components
DB ConsoleFeatureDBE-9417Improve usability of "Run script" feature.
BugDBE-7578Introspection runs after read-only mode restriction
DB IntrospectionBugDBE-107152020.1.3 version throws error on running queries and tables refresh: time zone abbreviation "novst" is not used in time zone "Asia/Novosibirsk"

RubyMine 2020.1.2 RC2 (201.7846.59 build) Release Notes

EditorBugIDEA-234948'Unsplit All' action doesn't work
PerformanceIDEA-240681Column selection mode is slow
User InterfaceBugIDEA-220281Sometimes text on commit message is black on grey background (Darcula)
BugIDEA-241358Tab is not dropped to another window with detached tab
BugIDEA-235385Tab is not detached when crossing the IDEA frame
PerformanceIDEA-235635Idea freezes with AppleSystemUIFont when Event Log is opened (MultilineTreeCellRenderer takes a lot of time doing stringWidth)
User Interface. Look and FeelBugIDEA-227157Some text in "IDE and Plugin Updates" popups in dark themes is gloom
DebuggerBugWEB-44912Debugging Vue.js + Typescript doesn't work
JavaScriptBugWEB-44868Webstorm doesn't show completion for attributes of classes referenced through JSDoc from other files
JavaScript. FrameworksBugWEB-45672Ivy: issues with Material table support
DB IntrospectionBugDBE-107152020.1.3 version throws error on running queries and tables refresh: time zone abbreviation "novst" is not used in time zone "Asia/Novosibirsk"

RubyMine 2020.1.2 RC (201.7846.31 build) Release Notes

Core. IDE SettingsBugIDEA-238800Add an extension point to define a configurable group
User Interface. Look and FeelBugIDEA-227157Some text in "IDE and Plugin Updates" popups in dark themes is gloom
DebuggerBugWEB-43829Debugging Vue.js with TypeScript in .vue file is only randomly recognizing the RemoteUrl
TypeScriptBugWEB-453092020.1 breaks my JavaScript extensions for bundled type libs
BugWEB-39705Auto-import should use library name when importing modules/components from Angular libraries
DB IntrospectionBugDBE-107152020.1.3 version throws error on running queries and tables refresh: time zone abbreviation "novst" is not used in time zone "Asia/Novosibirsk"

RubyMine 2020.1.2 Preview (201.7846.2 build) Release Notes

Remote Interpreters. DockerFeatureRUBY-19283Docker: support RuboCop with remote interpreter
Code Analysis. DependenciesBugIDEA-237275Exception when open settings for Usages opened from Code vision hint
Code Analysis. InspectionBugIDEA-238616Inspection 'Return null or something nullable from lambda in transformation method' incorrectly flags Consumer in Mono.doOnNext
CoreBugIDEA-239124PathMacrosImpl state is not persisted
BugIDEA-231783Sometimes IDEA does not start after installation on Windows
BugIDEA-2375192020.1 doesn't start when %APPDATA% points to a UNC share (enterprise Windows setup)
Core. File SystemBugIDEA-236701JARs with case-sensitive class names do not work properly on case-insensitive OS
BugIDEA-238210File watcher failed to start. Heap corruption.
Core. IDE SettingsFeatureIDEA-31438Add IntelliJ IDEA (No Plugins) Start Menu entry ala Firefox/Thunderbird/etc.
BugIDEA-237709Unable to add just installed JDK to IDEA's list of runtimes
BugIDEA-238800Add an extension point to define a configurable group
BugIDEA-237012Critical startup error after updating PyCharm CE that have paid marketplace plugin installed via Toolbox
Core. IndexingBugIDEA-237219Deadlock when updating plugins during indexing
Core. InstallationBugIDEA-228859Wrong project name and path when opening project with shell script
BugIDEA-239103bin/fsnotifier64 Access denied during update from 2020.1.1 to 2020.1.1 Build #IC-201.7223.58
Core. Navigation and SearchFeatureIDEA-219697Navigate to File should honor the Sources directories first
Core. RefactoringsBugIDEA-238440Multiple RenameHandlers for single element triggers HandlersChooser on element right click
Core. Run. ConfigurationsBugIDEA-237594IntelliJ 2020.1: Module path is empty if run configuration uses "@argfile" or "JAR manifest"
Core. SSHBugIDEA-237455net.schmizz.sshj.sftp.SFTPException: No such file
EditorBugIDEA-237629When I change the line separator to LF the change is not taken into account until I save the file. If I change from LF to CR then the file is saved automatically
BugIDEA-235849Editor leaks reference to highlighter of unloaded plugin
Editor. Code CompletionBugIDEA-238623Completion is not sorted by ML because of new weighers
BugIDEA-238617Don't check relevance features if model trained without positions from standard ranking algorithm
Editor. Diff and MergeBugIDEA-238054Missing method name when collapsing unchanged fragments in diff
UsabilityIDEA-236053Conflicts dialog is opened extremely small
Editor. Editing TextFeatureIDEA-168218'Copy as Rich Text' should use some fallback font
Editor. Intention ActionsBugIDEA-236961idea hangs on "removing redundant imports", seems like on a single file
ExceptionIDEA-233778Intention preview: Exception when preview is not available
Lang. Shell ScriptBugIDEA-232910Shell: nested expressions of parameter expansion are not highlighted/parsed
Tools. DockerBugIDEA-234512Images console: F1 should lead to the new help
BugIDEA-234942DockerCompose: Errors about invalid format by using env. vars in images values
Tools. HTTP ClientBugIDEA-236414HTTP Client: not specified path variables values treating: action links don't work
BugIDEA-239147HTTP Client: environment file is generated in Scratches for the HTTP Requests file from scratches but can't be used
UsabilityIDEA-236212Do not show popup if there is only one environment
CosmeticsIDEA-240184[Upsource] Discussion in HttpRequestErrorFixFilter.kt in review IDEA-CR-62118
ExceptionIDEA-238004HTTP Client: show ClearReadOnlyStatus dialog on MoveHTTPRequests refactoring performing in case of read-only files
User InterfaceCosmeticsIDEA-238209Create Desktop Entry - Result wording badly structured
User Interface. AccessibilityBugIDEA-235804In screen reader mode, it is not possible to add an SSH interpreter
User Interface. Embedded Browser (JCEF)BugIDEA-236310[mac] JCEF crashes when run after JavaFX
User Interface. NavigationFeatureIDEA-236263Add tooltip on the tabs in the search everywhere popup dialog
No subsystemBugWEB-45384WSL2: Prettier: Error applying code style rules from configuration file
BugWEB-45155WSL2: ESLint: Error applying code style rules from configuration file
BugWEB-45382WSL2: TSLint: Error applying code style rules from configuration file
BugWEB-45159WSL2: Can't analyse webpack.config.js in vue template project
TaskWEB-44824Wanted: direct patches from 2019.1.4 to 2020.1
CSSUsabilityWEB-10013CSS/SCSS formatter needs to be aware of CSS3 grid-layout properties
HTMLBugWEB-45429SVG: Attributes are shown as invalid when using `svg:` prefix
JavaScriptBugWEB-44874[JS] Missed signatures for a library (node-fetch)
BugWEB-45290Type is always unset for destructuring props in a functional component signature
BugWEB-44843Wrong type inference with discord.js
BugWEB-45181Material UI: Unstable resolve of props in react components(JSX)
PerformanceWEB-45371Recursive generators: JS code analysis never ends
PerformanceWEB-45024High CPU usage on editing
JavaScript. FrameworksBugWEB-45270Inherited component or directive properties not recognized, when built with Ivy
BugWEB-36561Vue.js: Support expression statements in event bindings
JavaScript. RefactoringBugWEB-20177Incorrect handling of 'this' in lambda in extract method
Node.jsBugWEB-45203Show node packages with WSL UNC paths properly
PerformanceWEB-39488Scanning node_modules directory with many files freezes IDE on project open
SASSFeatureWEB-45196SASS math module: support new functions and variables
TypeScriptFeatureWEB-44952Consider tsconfig*.json as extended json (in addition to tsconfig.json itself)
BugWEB-39705Auto-import should use library name when importing modules/components from Angular libraries
BugWEB-44848TypeScript quick doc: show type alias member for object types
BugWEB-43636'Implement all members' fix suggests extra properties when using spreads
BugWEB-453092020.1 breaks my JavaScript extensions for bundled type libs
PerformanceWEB-45369IDE freezes during TypeScript code completion in react projects with styled components
DB ConsoleFeatureDBE-9417Improve usability of "Run script" feature.
BugDBE-7578Introspection runs after read-only mode restriction

RubyMine 2020.1.1 (201.7223.94 build) Release Notes

Core. LocalizationBug RUBY-25928 Not localized strings in RM
Remote Interpreters. WSLBug RUBY-26141 IntelliJ/RubyMine doesn't think gems are installed in project when using WSL + rbenv
Ruby. DebuggerFeature RUBY-26283 [Debugger]Add support for ruby 2.7.1
Bug RUBY-26269 Debase Gem fails to build with MSVC
Ruby. InspectionsBug RUBY-26192 Empty line after text in offenses
Bug RUBY-17699 attr_accessor + helper_method are causing inspection warning
Ruby. Tests. CucumberBug RUBY-25925 Cucumber: steps cannot be resolved or are resolved incorrectly in case of scenario outline parameters
Tools. YARDBug RUBY-26068 MethodAnnotationData changes aren't processed until file reload
Code Analysis. InspectionBug IDEA-1206 IG: DuplicateStringLiteral Suppression Ignored
Code Analysis. Language InjectionBug IDEA-235519 Cannot inject language 'Language: file-reference' because it has no ParserDefinition
Code Analysis. Structural SearchBug IDEA-233908 'No filters added' is always on SSR panel
CoreBug IDEA-236153 Maven dependency change triggers JDK detection in a loop
Core. File SystemException IDEA-234557 RejectedExecutionException: Already shutdown
Core. IDE SettingsBug IDEA-236874 When IDEA starts after RestoreDefaultSettings invocation, no Customize IDEA wizard is shown, if there were custom vmoptions in original config
Bug IDEA-235853 After Restore Default Settings invocation IDEA restarts with previously used vmoptions instead of clear default ones
Bug IDEA-237059 SSH Configurations: allow saving password until IDE restart
Bug IDEA-237277 IndexOutOfBoundsException at enabling 'Render Documentation comments'
Bug IDEA-236989 Auto update to 2020.1 made JDK configuration invalid
Core. InstallationBug IDEA-237332 "Cannot load a JDK class: com.sun.jdi.Field" error when a custom JRE 8 is used instead of a bundled one
Core. LicensingBug IDEA-235344 Licence server address is cleared when it's unreachable
Bug IDEA-236244 Confirmation dialog which appears on attempt to close License Activation is tiny (no text only buttons)
Bug IDEA-237175 IDEA 2020.1 Activation Window repeatedly requests activation when using Activation Code
Bug IDEA-237100 Missing license validation error messages in the license dialog
Core. Platform APIBug IDEA-236404 @NotNull PsiSubstitutor.EMPTY can be null
Core. Plugin ManagementBug IDEA-235901 Plugins settings broken in 2020.1 beta
Bug IDEA-235313 When IDEA is started with clear/imported configs but with not cleared plugins, the Plugins dialog displayed by 'Plugin updates available...' notification is incorrect
Bug IDEA-237554 Disabled plug-ins are shown as enabled in Settings | Plugins
Bug IDEA-234917 Updatable plugin is not shown after following "Plugin Updates Available" link from Welcome screen
Bug IDEA-237113 IDE doesn't suggest update for incompatible plugin if update version is lower than existing plugin version
Bug IDEA-235665 Unclear wording for update of paid plugin in IDE
Bug IDEA-237407 Disabled plug-ins are no longer logged in idea.log
Core. Project SettingsBug IDEA-235968 Improper detection of JDK version
Bug IDEA-235717 Validation settings use localizable strings as keys in configuration files
Core. Quick DocumentationUsability IDEA-235934 Change option for showing rendered javadocs to "Render all documentation comments"
Core. RefactoringsBug IDEA-233700 Inline rename suggestion is no longer shown after undoing changes
Bug IDEA-236875 No rename suggestion after erasing declaration name and typing-in another one
Bug IDEA-233425 Unnecessary Refactoring gutter after Undo signature change
Performance IDEA-235908 Moving directory takes forever
Core. Run. ConfigurationsBug IDEA-236969 Current run configuration is not shown in the combo box after project reopen if it is the only run config in the project and it is stored as a file.
Core. Run. External ToolsBug IDEA-233252 Context menu (right click) stops working when there're remote and usual external tools with the same name
Bug IDEA-229467 External tool in run configuration before launch stops run configuration from running
Core. SSHBug IDEA-237896 SSH Configuration: username is lost when user opens deployment configuration
Bug IDEA-236693 SSH configurations: no events while settings' loading
EditorBug IDEA-236584 List bullets are cropped in rendered documentation
Bug IDEA-231883 LightEdit: Unable to close tab with Command + W
Bug IDEA-235182 Javadoc Rendered View Cuts Off Text
Bug IDEA-236689 Vertical scroll bar is shown unnecessarily in editor hover popup
Bug IDEA-236411 LightEdit: Non-project file protection message on attempt to edit a new file
Performance IDEA-237965 2020.1 performance regression: High CPU usage during navigation (UnifiedEditorRangeHighlighter)
Usability IDEA-236536 Javadoc icons enabling/disabling comes into effect only after file reopening
Usability IDEA-236518 New javadoc rendered view doesn't display multiple authors
Cosmetics IDEA-236952 LightEdit: Remove "Show Context Actions" from context menu
Exception IDEA-236548 LightEdit: opening binary files should not fail
Editor. Code CompletionPerformance IDEA-235762 Spring Data JPA Query by Method Name Performance Issue
Editor. Diff and MergePerformance IDEA-235817 Editor freezes for seconds while comparing two big xml files
Editor. Editing TextBug IDEA-234928 Modified file is not saved automatically by IDE on frame deactivation if it was opened in LightEdit previously
Bug IDEA-235890 Delete lines above 'in-editor Javadoc rendering' deletes Javadoc
Editor. Intention ActionsBug IDEA-236039 Intention preview: always unavailable on the last line in a file
Lang. XMLBug IDEA-199733 Xml declaration should precede all document content wrongly shown for <?xml-stylesheet?> processing instruction
Tools. DockerBug IDEA-234981 Docker: Save in containers doesn't work
Bug IDEA-237999 Remote docker stop working after update
Tools. HTTP ClientBug IDEA-236157 Link in scratch file is broken
Usability IDEA-235915 HTTP Client: Move requests refactoring is not discoverable
Usability IDEA-235677 Provide more descriptive message about unknown variable in HTTP Client
Usability IDEA-235921 HTTP Client: Move Requests refactoring: provide more convenient way to select/deselect all requests
Cosmetics IDEA-235914 HTTP Client: Move HTTP Requests dialog looks bad with custom (enlarged) font
Tools. TerminalBug IDEA-209282 IDEA Terminal uses wrong PATH environment variable when go plugin is installed
User InterfaceBug IDEA-235925 Show file name and product name in Light Edit mode on Windows
Bug IDEA-220087 "Open new tabs at the end" preference has no effect whatsoever
Bug IDEA-237691 Kotlin update is failing on IDEA 2020.1
Bug IDEA-236949 Entering zen mode closes "other" open files
Bug IDEA-222902 Path to active tab is copied to clipboard if "Copy Reference" action was invoked for any other tab
Usability IDEA-231790 Small tooltips
Usability IDEA-235674 Close context menus and popups on the second click
Cosmetics IDEA-236911 Re-word Search Everywhere tooltip
Cosmetics IDEA-235917 Selection looks weird when rendered doc is active
Cosmetics IDEA-234710 Find in Path: Missing bottom border of a "Find" field
Cosmetics IDEA-236192 Large padding in dialogs in 2020.1
Exception IDEA-236507 Argument for @NotNull parameter 'c' of com/intellij/openapi/wm/impl/IdeFocusManagerImpl.requestFocus must not be null
User Interface. ControlsBug IDEA-236138 Node arrow is not visible after creating the connection
Performance IDEA-236848 ExpandableTextField performance is very bad for non-monospace case on macOS
User Interface. FocusBug IDEA-235391 Some tool windows are not focused on opening
User Interface. Project ViewBug IDEA-236105 Select In Project View does not work for the first time when Project View is Dock Unpinned
Version ControlBug IDEA-231108 Apply patch fails to add some new files to source control
Bug IDEA-1197 svn integration
Bug IDEA-230833 Commit changes / Unversioned files - Add to VCS and Show Diff are executed for all unversioned files
Version Control. GitBug IDEA-235233 Selecting a group node in Branches resets all filters
Version Control. SubversionBug IDEA-228828 IDEA does not propose to delete dir in svn when deleting a dir
No subsystemFeature WEB-30930 No icon for Firefox Developer Edition browser
Bug WEB-44485 JavaScript: inspection-based intentions don't work in scratch files
Bug WEB-43906 Run prettier on save: freeze while saving file
Bug WEB-44978 .env.local, .env.development and other .env.* files have Text file type by default since 2020.1
Performance WEB-44548 WebStorm 2019.3.4 stops responding after unfocused main window
Cosmetics WEB-44417 To update an Edge icon for Edge Chromium
DebuggerBug WEB-44721 Go plugin breaks node debugger in Intellij Ultimate 2020.1 RC
Bug WEB-34979 Electron render process debugging for Angular app served by `ng serve` + electron '--serve' doesn't work
HTMLBug WEB-45089 'data-*' attributes not recognized in html inside xslt
Bug WEB-43138 Angular: image paths are incorrectly resolved in HTML file
JavaScriptBug WEB-44541 Awful WebStorm type checking error: "Condition is always true since types '...' and 'null' have no overlap"
Bug WEB-43389 Quick Documentation: line breaks are not rendered in @example section
Bug WEB-44520 TypeScript: completion doesn't work for aliases inside generic parameters
Bug WEB-44332 Typings resolution is broken when adding 'node_modules' to webpack resolve.modules
Bug WEB-44959 JSDoc: Inherited <pre> elements from another class are not displayed properly
Performance WEB-44844 CPU spikes when editing after updating to 2020.1
Performance WEB-45028 UI Freeze on project opening with JSFileStubBuilder.buildStubTree
Usability WEB-40680 no method separators when using arrow functions
JavaScript. FrameworksFeature WEB-43773 Hammerjs events are not recognized in Angular templates
Feature WEB-44920 Vuex: support doesn't work with Nuxt.js project structure
Feature WEB-41451 Vue.js: support v-slot in PHP, Twigs and other file types
Feature WEB-43988 data properties of Vue single file component exported with module.exports not resolved
Feature WEB-44976 Support for vuex modules created via functions
Bug WEB-45252 Constant re-indexing when two projects are opened.
Bug WEB-44766 Suggestions for ExtJs classes do not work
Bug WEB-42056 Vue.js: don't suggest same attribute again
Bug WEB-43035 Code completion doesn't work with Angular plugin if `export default` is used
Bug WEB-44880 Class NgxsFeatureModule is not an Angular module
Bug WEB-44601 Angular: attributes contributed with @Attribute are sometimes not recognized.
Usability WEB-44181 Don't use override completion for standard React component methods in TypeScript
Task WEB-44730 I18n Angular plugin
Task WEB-44559 Angular: Enable 'Inaccessible component member in AOT mode' inspection by default
JavaScript. InspectionsBug WEB-44972 ES/TS: Conditional expression with identical branches in ternary expression - false positive (regression)
Bug WEB-44528 invalid error inspection for `delete window.Worker`
LintersFeature WEB-44070 Support ESLint 6.7 Suggestions API
Feature WEB-24452 Allow to run ESLint fix on save
Node.jsBug WEB-44507 WSL2: Node process can't be stopped from the IDE
Bug WEB-44669 [pnpm] Code Completion and indexing does not work
Bug WEB-44714 Rubymine cannot find asdf-installed yarn executable
Task WEB-44491 Get 'Can not enable node.js coding assistance' warning when debug via remote interpreter
SASSFeature WEB-37969 baseUrl in tsconfig.json is ignored when resolving Sass imports via ~file.scss
TypeScriptBug WEB-44981 Freezes in TypeScript projects because of slow tsservice responses
Bug WEB-44613 Imports using typings inserted as `from "@types/<package>"` instead of `from "<package>"`
Bug WEB-44775 No method separators when using arrow functions in TypeScript
Bug WEB-45003 Broken syntax highlighting in some TypeScript type aliases
Bug WEB-44909 No class name completion on default classes
Bug WEB-44966 "Navigate | Type Declaration" does not work for union types
Bug WEB-44859 Vue: "Optimize import" should keep "type" keyword
Bug WEB-44557 Can't find constructor usages of class from imported module while using Node.js and TypeScript
Bug WEB-44995 Can't start TypeScript service in projects with Yarn pnp when TypeScript is not in the root folder
Bug WEB-44746 `Create field`intention scrambling enum order
Bug WEB-44463 TypeScript service doesn't work when project is in WSL2
Unit TestsBug WEB-44698 WebStorm does not use the right mocha executable
No subsystemBug DBE-10532 Incorrect splitting of prefixed literal strings for Spellchecker.
DB AdministrationFeature DBE-7018 MySQL: ability to configure expired password
DB ConnectivityBug DBE-10100 DataGrip drops the driver icon when a driver configuration is duplicated.
Bug DBE-5439 Can not connect to MySQL using SSL CA root certificate
DB ConsoleBug DBE-10383 Can not copy cell parts from In-Editor results
Bug DBE-9957 "Always Select Opened Element" in Services window can't be disabled
Performance DBE-10408 UI freeze when editing SQL string
DB IntrospectionBug DBE-10034 snowflake introspection does not handle composite primary keys
Bug DBE-10290 New schemas are not displayed in the Database view even after a refresh of the view.
DB Schema ViewsFeature DBE-8121 Dedicated node for trigger functions in the database tree view
Bug DBE-10429 ExecutionException when refreshing schemas with schema patterns specified
Data Import & ExportFeature DBE-10484 A slightly pleasant usability for Dump Data dialog
Bug DBE-10113 Some background tasks are not viewable / findable
Bug DBE-5082 CSV export doesn't escape a double quote
Usability DBE-10577 Add Column Header and Row Header checkboxes to Export Data dialog
Data ViewsFeature DBE-9993 Pasting dataset exceeding current data view should create new lines
Bug DBE-9272 Cannot Save LOB from results of complex queries (double WHERE)
Bug DBE-7816 Timestamp errors when manually appending, updating Redshift records
Bug DBE-10489 SAP HANA updates in table editor fails due to lack of quotes
Bug DBE-9171 Database result for Clikhouse shows null in non-nullable column
Usability DBE-1845 Automatic CSV data editor
Usability DBE-8019 Database table view scrollable past the last row
Usability DBE-10139 Keep title text when renaming tab
Usability DBE-4039 data view > clone selected record (lack of icon)
Usability DBE-10572 Selection is not restored when table is transposed
Usability DBE-2752 Edit as Table: provide predefined Space placeholder for separators
Navigation & SearchBug DBE-10350 Filtered objects appears in search/database navigation
SQL CompletionBug DBE-7307 Abbreviation completion doesn't work in Modify table
SQL Format and StyleFeature DBE-10604 Add support for wrapping/chopping for long DDL statements
Bug DBE-10602 Inconsistent code reformat using language injection
Bug DBE-10467 Postgres formatting OFFSET clause
SQL GeneralBug DBE-10412 Index/Foreign Key Code Generation Name formatting
Bug DBE-10309 Oracle: create search index statement fails to execute from DataGrip
SQL GenerationBug DBE-10219 Deleting Column with Column-Owned Sequence Generates Unnecessary DROP Statement
Bug DBE-10431 Datagrip trigger charset
SQL HighlightingFeature DBE-10410 Amazon Redshift MATERIALIZED VIEW Syntax Not Supported
Bug DBE-10561 SQL syntax highlight issue - Doesn't recognize `INDEXED BY` keyword
Bug DBE-10328 Parsing error with SQLite FILTER() without OVER Window
Bug DBE-10295 In PostgreSQL, `generate_series` is incorrectly highlighted as an error
Bug DBE-10548 Editor does not recognize "accessible by" clause on Package-method level
Bug DBE-10354 "SELECT FOR SHARE" syntax not supported by console
Bug DBE-10294 IntelliJ IDEA Ultimate considers GRANT ROLE TO USER being wrong in MariaDB
Bug DBE-9695 Invalid highlight of automatically named columns
SQL ResolveBug DBE-10483 Resolve MongoDB collections that are accessed using bracket notation
Bug DBE-10482 Resolve MongoDB collections with dots in name
Bug DBE-9952 PostgreSQL driver doesn't correctly handle "unnest" functions
Tools IntegrationBug DBE-7623 "Restore with mysql" is possible on read-only database connection

RubyMine 2020.1.1 RC (201.7223.64 build) Release Notes

Ruby. DebuggerFeatureRUBY-26283[Debugger]Add support for ruby 2.7.1
Ruby. Tests. CucumberBugRUBY-25925Cucumber: steps cannot be resolved or are resolved incorrectly in case of scenario outline parameters
Core. IDE SettingsBugIDEA-237059SSH Configurations: allow saving password until IDE restart
BugIDEA-236989Auto update to 2020.1 made JDK configuration invalid
BugIDEA-236874When IDEA starts after RestoreDefaultSettings invocation, no Customize IDEA wizard is shown, if there were custom vmoptions in original config
Core. InstallationBugIDEA-237332"Cannot load a JDK class: com.sun.jdi.Field" error when a custom JRE 8 is used instead of a bundled one
Core. RefactoringsUsabilityIDEA-227118Show popup with retry on attempt to invoke non dumb aware action during indexing
Core. Run. External ToolsBugIDEA-229467External tool in run configuration before launch stops run configuration from running
BugIDEA-233252Context menu stops working when there're remote and usual external tools with the same name
Core. SSHBugIDEA-237896SSH Configuration: username is lost when user opens deployment configuration
Tools. DockerBugIDEA-237999Remote docker stop working after update
User InterfaceBugIDEA-236949Entering zen mode closes "other" open files
Version Control. SubversionBugIDEA-228828IDEA does not propose to delete dir in svn when deleting a dir
DartBugWEB-44834Dart: Show Parameter Info doesn't work in v2020.1
BugWEB-44984Dart plugin is using the old dart logo as icon
HTMLBugWEB-45089'data-*' attributes not recognized in html inside xslt
JavaScript. FrameworksFeatureWEB-44976Support for vuex modules created via functions
FeatureWEB-41451Vue.js: support v-slot in PHP, Twigs and other file types
TypeScriptBugWEB-44909No class name completion on default classes
BugWEB-44981Freezes in TypeScript projects because of slow tsservice responses
BugWEB-45003Broken syntax highlighting in some TypeScript type aliases
DB ConsolePerformanceDBE-10408UI freeze when editing SQL string
Data Import & ExportUsabilityDBE-10577Add Column Header and Row Header checkboxes to Export Data dialog
Data ViewsFeatureDBE-9993Pasting dataset exceeding current data view should create new lines
BugDBE-7816Timestamp errors when manually appending, updating Redshift records
BugDBE-10489SAP HANA updates in table editor fails due to lack of quotes
BugDBE-9171Database result for Clikhouse shows null in non-nullable column
UsabilityDBE-8019Database table view scrollable past the last row
UsabilityDBE-10572Selection is not restored when table is transposed
UsabilityDBE-2752Edit as Table: provide predefined Space placeholder for separators
UsabilityDBE-4039data view > clone selected record (lack of icon)
UsabilityDBE-10139Keep title text when renaming tab
SQL Format and StyleFeatureDBE-10604Add support for wrapping/chopping for long DDL statements
BugDBE-10602Inconsistent code reformat using language injection
SQL HighlightingBugDBE-10328Parsing error with SQLite FILTER() without OVER Window
BugDBE-10548Editor does not recognize "accessible by" clause on Package-method level
BugDBE-10561SQL syntax highlight issue - Doesn't recognize `INDEXED BY` keyword
SQL ResolveBugDBE-10483Resolve MongoDB collections that are accessed using bracket notation

RubyMine 2020.1.1 Preview (201.7223.30 build) Release Notes

Core. LocalizationBugRUBY-25928Not localized strings in RM
Remote Interpreters. WSLBugRUBY-26141IntelliJ/RubyMine doesn't think gems are installed in project when using WSL + rbenv
Ruby. InspectionsBugRUBY-26192Empty line after text in offenses
BugRUBY-17699attr_accessor + helper_method are causing inspection warning
Tools. YARDBugRUBY-26068MethodAnnotationData changes aren't processed until file reload
Code Analysis. InspectionBugIDEA-1206IG: DuplicateStringLiteral Suppression Ignored
Code Analysis. Language InjectionBugIDEA-235519Cannot inject language 'Language: file-reference' because it has no ParserDefinition
Code Analysis. Structural SearchBugIDEA-233908'No filters added' is always on SSR panel
Core. File SystemExceptionIDEA-234557RejectedExecutionException: Already shutdown
Core. IDE SettingsBugIDEA-236989Auto update to 2020.1 made JDK configuration invalid
BugIDEA-235853After Restore Default Settings invocation IDEA restarts with previously used vmoptions instead of clear default ones
BugIDEA-236874When IDEA starts after RestoreDefaultSettings invocation, no Customize IDEA wizard is shown, if there were custom vmoptions in original config
BugIDEA-237277IndexOutOfBoundsException at enabling 'Render Documentation comments'
Core. InstallationBugIDEA-237332"Cannot load a JDK class: com.sun.jdi.Field" error when a custom JRE 8 is used instead of a bundled one
Core. LicensingBugIDEA-237175IDEA 2020.1 Activation Window repeatedly requests activation when using Activation Code
BugIDEA-235344Licence server address is cleared when it's unreachable
BugIDEA-236244Confirmation dialog which appears on attempt to close License Activation is tiny (no text only buttons)
BugIDEA-237100Missing license validation error messages in the license dialog
Core. Platform APIBugIDEA-236404@NotNull PsiSubstitutor.EMPTY can be null
Core. Plugin ManagementBugIDEA-237113IDE doesn't suggest update for incompatible plugin if update version is lower than existing plugin version
BugIDEA-235901Plugins settings broken in 2020.1 beta
BugIDEA-235665Unclear wording for update of paid plugin in IDE
BugIDEA-237407Disabled plug-ins are no longer logged in idea.log
BugIDEA-237554Disabled plug-ins are shown as enabled in Settings | Plugins
BugIDEA-235313When IDEA is started with clear/imported configs but with not cleared plugins, the Plugins dialog displayed by 'Plugin updates available...' notification is incorrect
BugIDEA-234917Updatable plugin is not shown after following "Plugin Updates Available" link from Welcome screen
Core. Project SettingsBugIDEA-235717Validation settings use localizable strings as keys in configuration files
BugIDEA-235968Improper detection of JDK version
Core. Quick DocumentationUsabilityIDEA-235934Change option for showing rendered javadocs to "Render all documentation comments"
Core. RefactoringsBugIDEA-233700Inline rename suggestion is no longer shown after undoing changes
BugIDEA-236875No rename suggestion after erasing declaration name and typing-in another one
BugIDEA-233425Unnecessary Refactoring gutter after Undo signature change
PerformanceIDEA-235908Moving directory takes forever
Core. Run. ConfigurationsBugIDEA-236969Current run configuration is not shown in the combo box after project reopen if it is the only run config in the project and it is stored as a file.
Editor. Code CompletionPerformanceIDEA-235762Spring Data JPA Query by Method Name Performance Issue
Editor. Diff and MergePerformanceIDEA-235817Editor freezes for seconds while comparing two big xml files
Editor. Editing TextBugIDEA-234928Modified file is not saved automatically by IDE on frame deactivation if it was opened in LightEdit previously
BugIDEA-235890Delete lines above 'in-editor Javadoc rendering' deletes Javadoc
Editor. Intention ActionsBugIDEA-236039Intention preview: always unavailable on the last line in a file
Lang. XMLBugIDEA-199733Xml declaration should precede all document content wrongly shown for <?xml-stylesheet?> processing instruction
Tools. DockerBugIDEA-234981Docker: Save in containers doesn't work
BugIDEA-237999Remote docker stop working after update
Tools. HTTP ClientBugIDEA-236157Link in scratch file is broken
UsabilityIDEA-235677Provide more descriptive message about unknown variable in HTTP Client
UsabilityIDEA-235915HTTP Client: Move requests refactoring is not discoverable
UsabilityIDEA-235921HTTP Client: Move Requests refactoring: provide more convenient way to select/deselect all requests
CosmeticsIDEA-235914HTTP Client: Move HTTP Requests dialog looks bad with custom (enlarged) font
Tools. TerminalBugIDEA-209282IDEA Terminal uses wrong PATH environment variable when go plugin is installed
User Interface. ControlsBugIDEA-236138Node arrow is not visible after creating the connection
PerformanceIDEA-236848ExpandableTextField performance is very bad for non-monospace case on macOS
User Interface. FocusBugIDEA-235391Some tool windows are not focused on opening
User Interface. Project ViewBugIDEA-236105Select In Project View does not work for the first time when Project View is Dock Unpinned
Version Control. GitBugIDEA-235233Selecting a group node in Branches resets all filters
Version Control. SubversionBugIDEA-228828IDEA does not propose to delete dir in svn when deleting a dir
No subsystemFeatureWEB-30930No icon for Firefox Developer Edition browser
BugWEB-43906Run prettier on save: freeze while saving file
BugWEB-44485JavaScript: inspection-based intentions don't work in scratch files
BugWEB-44978.env.local, .env.development and other .env.* files have Text file type by default since 2020.1
PerformanceWEB-44548WebStorm 2019.3.4 stops responding after unfocused main window
CosmeticsWEB-44417To update an Edge icon for Edge Chromium
DartFeatureWEB-34709Spelling typos are not shown in Dart string literals
FeatureWEB-44567Dart plugin: Support pub outdated action
BugWEB-44896Dart code highlighting flashes on typing in 2020.1
DebuggerBugWEB-44721Go plugin breaks node debugger in Intellij Ultimate 2020.1 RC
BugWEB-34979Electron render process debugging for Angular app served by `ng serve` + electron '--serve' doesn't work
HTMLBugWEB-43138Angular: image paths are incorrectly resolved in HTML file
JavaScriptBugWEB-44959JSDoc: Inherited <pre> elements from another class are not displayed properly
BugWEB-44520TypeScript: completion doesn't work for aliases inside generic parameters
BugWEB-44541Awful WebStorm type checking error: "Condition is always true since types '...' and 'null' have no overlap"
BugWEB-44332Typings resolution is broken when adding 'node_modules' to webpack resolve.modules
BugWEB-43389Quick Documentation: line breaks are not rendered in @example section
PerformanceWEB-45028UI Freeze on project opening with JSFileStubBuilder.buildStubTree
PerformanceWEB-44844CPU spikes when editing after updating to 2020.1
UsabilityWEB-40680no method separators when using arrow functions
JavaScript. FrameworksFeatureWEB-44976Support for vuex modules created via functions
FeatureWEB-44920Vuex: support doesn't work with Nuxt.js project structure
FeatureWEB-41451Vue.js: support v-slot in PHP, Twigs and other file types
FeatureWEB-43773Hammerjs events are not recognized in Angular templates
FeatureWEB-43988data properties of Vue single file component exported with module.exports not resolved
BugWEB-44766Suggestions for ExtJs classes do not work
BugWEB-44601Angular: attributes contributed with @Attribute are sometimes not recognized.
BugWEB-43035Code completion doesn't work with Angular plugin if `export default` is used
BugWEB-42056Vue.js: don't suggest same attribute again
BugWEB-44880Class NgxsFeatureModule is not an Angular module
UsabilityWEB-44181Don't use override completion for standard React component methods in TypeScript
TaskWEB-44730I18n Angular plugin
TaskWEB-44559Angular: Enable 'Inaccessible component member in AOT mode' inspection by default
JavaScript. InspectionsBugWEB-44972ES/TS: Conditional expression with identical branches in ternary expression - false positive (regression)
BugWEB-44528invalid error inspection for `delete window.Worker`
LintersFeatureWEB-44070Support ESLint 6.7 Suggestions API
FeatureWEB-24452Allow to run ESLint fix on save
Node.jsBugWEB-44507WSL2: Node process can't be stopped from the IDE
BugWEB-44669[pnpm] Code Completion and indexing does not work
BugWEB-44714Rubymine cannot find asdf-installed yarn executable
TaskWEB-44491Get 'Can not enable node.js coding assistance' warning when debug via remote interpreter
SASSFeatureWEB-37969baseUrl in tsconfig.json is ignored when resolving Sass imports via ~file.scss
TypeScriptBugWEB-44859Vue: "Optimize import" should keep "type" keyword
BugWEB-44995Can't start TypeScript service in projects with Yarn pnp when TypeScript is not in the root folder
BugWEB-44966"Navigate | Type Declaration" does not work for union types
BugWEB-45003Broken syntax highlighting in some TypeScript type aliases
BugWEB-44746`Create field`intention scrambling enum order
BugWEB-44909No class name completion on default classes
BugWEB-44557Can't find constructor usages of class from imported module while using Node.js and TypeScript
BugWEB-44775No method separators when using arrow functions in TypeScript
BugWEB-44463TypeScript service doesn't work when project is in WSL2
BugWEB-44613Imports using typings inserted as `from "@types/<package>"` instead of `from "<package>"`
Unit TestsBugWEB-44698WebStorm does not use the right mocha executable
DB AdministrationFeatureDBE-7018MySQL: ability to configure expired password
DB ConnectivityBugDBE-10100DataGrip drops the driver icon when a driver configuration is duplicated.
BugDBE-5439Can not connect to MySQL using SSL CA root certificate
DB ConsoleBugDBE-9957"Always Select Opened Element" in Services window can't be disabled
BugDBE-10383Can not copy cell parts from In-Editor results
DB Schema ViewsFeatureDBE-8121Dedicated node for trigger functions in the database tree view
Data Import & ExportFeatureDBE-10484A slightly pleasant usability for Dump Data dialog
BugDBE-5082CSV export doesn't escape a double quote
BugDBE-10113Some background tasks are not viewable / findable
Data ViewsFeatureDBE-9993Pasting dataset exceeding current data view should create new lines
BugDBE-7816Timestamp errors when manually appending, updating Redshift records
BugDBE-9272Cannot Save LOB from results of complex queries (double WHERE)
UsabilityDBE-2752Edit as Table: provide predefined Space placeholder for separators
UsabilityDBE-1845Automatic CSV data editor
UsabilityDBE-4039data view > clone selected record (lack of icon)
UsabilityDBE-10139Keep title text when renaming tab
Navigation & SearchBugDBE-10350Filtered objects appears in search/database navigation
SQL Format and StyleBugDBE-10467Postgres formatting OFFSET clause
SQL GeneralBugDBE-10412Index/Foreign Key Code Generation Name formatting
BugDBE-10309Oracle: create search index statement fails to execute from DataGrip
SQL GenerationBugDBE-10219Deleting Column with Column-Owned Sequence Generates Unnecessary DROP Statement
BugDBE-10431Datagrip trigger charset
SQL HighlightingFeatureDBE-10410Amazon Redshift MATERIALIZED VIEW Syntax Not Supported
BugDBE-9695Invalid highlight of automatically named columns
BugDBE-10294IntelliJ IDEA Ultimate considers GRANT ROLE TO USER being wrong in MariaDB
BugDBE-10354"SELECT FOR SHARE" syntax not supported by console
BugDBE-10295In PostgreSQL, `generate_series` is incorrectly highlighted as an error
SQL ResolveBugDBE-9952PostgreSQL driver doesn't correctly handle "unnest" functions

RubyMine 2020.1 (201.6668.156 build) Release Notes

No subsystemBug RUBY-26063 Missing space in No Ruby SDKs found notification
CoreBug RUBY-26002 Don't allow querying type of calls that are passed blocks
Bug RUBY-26024 indent guide does not reach the end of the method block
Cosmetics RUBY-25909 Fix the Action name in `bundle` for run anything to all be lowercase
Lang. ERBBug RUBY-24197 .js.erb files cannot handle ES6 syntax
Remote InterpretersFeature RUBY-25943 Unified SSH: When no SSH configs added, SSH Configurations window shows only 'Nothing to show' text
Bug RUBY-25948 Credentials for SSH deployment configuration are gone when going back from RubyMine 2020.1 EAP6 to RubyMine 2019.3.3
Bug RUBY-25942 Unified SSH: drop list SSH configuration doesn't show whole text when no SSH configuration created
Remote Interpreters. DockerBug RUBY-25111 Cannot stop rails application running with docker remote interpreter
Task RUBY-25927 Change text of Ruby Docker Settings
Ruby. Code CompletionBug RUBY-22477 Incorrect path completion in require_relative
Bug RUBY-25841 Don't display constants twice in completion
Ruby. Code InsightBug RUBY-25891 Incorrect detection of overriden method
Ruby. DebuggerBug RUBY-25997 Debugger skips breakpoints in case of enabled coverage (ruby <2.5.0)
Bug RUBY-26009 Debugger doesn't stop on a breakpoint in case of inheritance from BasicObject
Bug RUBY-25996 Attach to process doesn't show any processes in case of remote interpreter
Bug RUBY-25553 fails to step into super
Bug RUBY-26078 RM doesn't show correct methods to step into if method called with parameters
Ruby. InspectionsBug RUBY-25995 Incorrect highlight for "incorrect argument count" when no args passed
Bug RUBY-25360 The replace safe navigation operator with nested nil checks doesn't work with query methods
Bug RUBY-25988 "!" and "?" symbol key suffixes are not ignored by the spell checker
Bug RUBY-25916 Unnecessary "Parameter shadows an outer parameter" inspection for underscore variable
Bug RUBY-25508 False positive 'Incorrect call argument count' inspection
Bug RUBY-25687 False missing argument error is shown for .select method
Bug RUBY-23617 Incorrect fix for unused local variable
Ruby. ParsingFeature RUBY-24952 Update numbered parameters support to the new '_' syntax instead of '@'
Bug RUBY-25968 Syntax errors in tap and do block
Bug RUBY-26006 RubyMine freeze on parsing a file
Ruby. Run ConfigurationsBug RUBY-25869 RubyMine opens an incorrect browser page when the 'Start JavaScript debugger' option is enabled
Ruby. TestsCosmetics RUBY-25880 Rename Test::Unit to Minitest in a Rails view
Ruby. Type InferenceBug RUBY-26008 Missing types in standard library stubs
Bug RUBY-25953 Type checking does not happen for keyword arguments
Ruby. Version ManagersBug RUBY-25186 RVM Not playing nicely with 2018.3.1+ and RVM 1.29.9
Core. File SystemBug IDEA-65174 OS fsnotifier unable to see changes under symlink/subfolders until restart/no notifier works correctly.
Core. IDE SettingsBug IDEA-235697 Settings search via "Find Action" doesn't work
Bug IDEA-235940 SSH Configurations steal focus
Bug IDEA-235325 After Restore Default Settings invocation IDEA treats the plugins incorrectly
Bug IDEA-235413 AbstractTreeUi.myElementToNodeMap leaks reference to configurable of unloaded plugin
Bug IDEA-235713 Don't automatically import configs for debug IDEA instance
Bug IDEA-235857 "Cannot read scheme" - IDE fails to load its own configuration xml file from .idea folder if the file contains byte-order mark
Bug IDEA-233857 Do not check "Visible only for this project" by default when create SSH configuration
Bug IDEA-233499 Rename SSH configuration dynamically
Usability IDEA-233305 Provide ability to start the IDE with an empty config
Usability IDEA-234079 Show Import Config dialog if idea.config.path is explicitly specified in vmoptions.
Task IDEA-233301 Log the automatically imported configs
Exception IDEA-226651 Internal error when create Desktop Entry
Core. IDE Settings. SharingException IDEA-234617 java.lang.Throwable at com.intellij.cloudConfig.CloudConfigManager.connectThisInstanceOperation
Core. IndexingException IDEA-231678 AE at com.intellij.util.indexing.MemoryIndexStorage.setBufferingEnabled
Core. InstallationBug IDEA-233816 Symlinked Rubymine Configuration leads to being unable to open multiple projects via CLI
Bug IDEA-236950 WebStorm upgrade from 2019.3.4 to 2020.1: conflicts in installation area
Bug IDEA-235899 On updating IDEA, a new Python plugin version is downloaded but not actually installed
Core. LicensingBug IDEA-231811 Excessive number of writes to idea.key
Cosmetics IDEA-227658 Date in license dialog is not fully visible
Core. Platform APIFeature IDEA-234013 Add Extension Point to contribute additional details into About popup
Bug IDEA-233783 Deadlock in InterfaceExtensionPoint
Core. Plugin ManagementBug IDEA-236699 Welcome Wizard: disabling default plugins doesn't work
Bug IDEA-235025 IDEA freeze on Spring Messaging plugin disabling
Bug IDEA-235397 Unreadable error message
Bug IDEA-234528 Can't execute shell script after enabling shell plugin without restart
Bug IDEA-233742 Bundled dynamic plugin become downloaded and has strictly defined version after disable/enable
Bug IDEA-235945 Plugins, installed during IDE customization, not-installed after IDE launch
Bug IDEA-234729 Restart suggestion not always shown on plugin unload failure
Bug IDEA-234122 Exception and freeze on disabling Markdown plugin when .md file is opened
Bug IDEA-235176 Do not suggest plugins supporting exact filenames for files already supported by exact filename by installed plugins
Usability IDEA-231815 Treat the situation when both bundled and downloaded plugin exist more user-friendly
Exception IDEA-234123 Exception on enabling Commander plugin
Exception IDEA-234030 Exceptions when invoking Search everywhere after disabling HTTP Client plugin
Exception IDEA-230987 Throwable at com.intellij.util.indexing.FileBasedIndexImpl.dropRegisteredIndexes after updating plugins
Core. Project SettingsBug IDEA-232634 IJ 2020 EAP regression for project hot reload after 'gradle idea'
Bug IDEA-230707 unable to multi select when adding library dependency
Bug IDEA-229737 Empty error message box on stopping JDK downloading
Core. Quick DocumentationBug IDEA-235078 JavaDoc: Empty space before parameters in rendered documentation fragment
Bug IDEA-229804 Quick doc on hover is shown after mouse moving away from editor area
Cosmetics IDEA-208369 Don't show module in quickdoc for local declarations
Core. Run. ConfigurationsBug IDEA-235725 WSL2: unable to run application
Bug IDEA-235710 Rider: incorrect run configuration share location being shown in the run configuration editor
Core. Run. TargetsBug IDEA-236232 [run.target] Pull docker target always pulls "latest" tag, even for "openjdk:8"
Core. SSHFeature IDEA-234840 Custom name and rename for SSH config
Bug IDEA-236520 SSH configuration changes disappear from Settings dialog on Apply pressing
Usability IDEA-236191 Add button to rename ssh config to toolbar
Core. StatisticsBug IDEA-233990 Data sharing dialog is shown twice
Editor. Editing TextBug IDEA-233340 Hitting <Tab> at the end of the buffer leaves the editor and goes to the sidebar panel
Bug IDEA-232792 Double click on a parameter does not highlight usages in function
Bug IDEA-235703 In-editor Javadoc leaves large gap between comment and code
Usability IDEA-235716 Broken GoTo (ctrl+click) in rendered javadocs
Editor. FormatterBug IDEA-231481 Detected file indent does not seem to be invalidated after the code is fully re-formatted
Bug IDEA-230976 IDEA is modifying .idea\codeStyles\Project.xml
Bug IDEA-233647 Log contains too many ' INFO - rojectCodeStyleSettingsManager - Saving Project code style '
Editor. Intention ActionsBug IDEA-233784 Intention preview: Infinite loading and exception(Should be invoked only when having a document)
Editor. Large FilesBug IDEA-234404 [Large File Editor] AssertionError: File text mismatch
Bug IDEA-234864 [Large File Editor] AssertionError: file/doc text length different
Editor. TextMate BundlesBug IDEA-232235 '<' in HTML DOCTYPE is highlighted as bad character when using textmate bundles
Lang. Shell ScriptBug IDEA-229741 New Shell Script Run Configuration breaks Debugging of Java applications when using shell script in before launch setup
Tools. DockerFeature IDEA-219125 Docker. Support --gpus command line option
Bug IDEA-234261 DockerCompose: completion should work for images in quotes
Bug IDEA-235678 Docker: error about parsing this key for some forms of --gpus
Bug IDEA-234250 Docker. Image Console: the old Pull dialog is called from context menus and via buttons
Bug IDEA-234210 Docker: support `--sysctl` in docker run configuration CLI options
Bug IDEA-233884 Docker: inspect container doesn't work
Bug IDEA-216531 Docker: support custom credential stores / helpers
Bug IDEA-234229 Docker. Pull images. No result by completion with one symbol
Bug IDEA-234231 IOException: Pipe broken, pipe id: `ImagePullPanel.pipe:plug` at attempt to pull an image
Bug IDEA-234265 DockerCompose: provide inspection errors for invalid images format
Bug IDEA-234944 DockerCompose: Add navigation from images in quotes to the docker hub
Bug IDEA-234233 Docker: Don't pull all the images by "tomcat: "
Performance IDEA-235826 Rider freezes after Clean and Build inside DockerFileDetector
Usability IDEA-234994 Recognize Dockerfile.jvm and Dockerfile.native as docker files
Usability IDEA-234982 Docker: Set focus at console command line by Exec->bash on a container
Cosmetics IDEA-232754 Docker Plugin - bad English in error message when plugin can't reach file system root
Task IDEA-234571 Internationalize Docker plugin. Round 2
Exception IDEA-234266 java.util.concurrent.ExecutionException at completion for invalid tags
Exception IDEA-233998 IDE exception when trying to run Dockerfile configuration with `Run build image` option disabled
Exception IDEA-233298 Docker: com.github.dockerjava.api.exception.InternalServerErrorException at calling Exec command
Tools. HTTP ClientBug IDEA-234435 Generate HTTP Request: correctly treat read-only files
Bug IDEA-234891 Can't rename host in http client
Bug IDEA-234539 HTTP Client: Server base path marked as red without error
Bug IDEA-235298 HTTP Client: Can't generate all requests from MultipleBasePaths yaml specification
Bug IDEA-234388 Provide more fast way to create HTTP Request via gutter.
Bug IDEA-234656 Completion hint is disappearing after "clear read-only flag" dialog
Usability IDEA-234659 Add text and selection in template
Usability IDEA-234739 Http Client: more comfortable "move refactoring"
Task IDEA-235567 Add FUS to generation in HTTP Editor
Tools. TerminalBug IDEA-234406 Split sessions are lost when moving terminal tab to the editor – disable the action for split sessions
Bug IDEA-234503 Provide keyboard navigation between split terminals
Exception IDEA-234523 Throwable when move terminal tab to editor
User Interface. AccessibilityBug IDEA-234385 Screen reader does not read "Search Everywhere" dialog name when it is invoked
User Interface. Action SystemException IDEA-234033 NPE at com.intellij.openapi.actionSystem.impl.ActionManagerImpl.unregisterAction
User Interface. FocusBug IDEA-235551 Esc does not return focus to Editor from Find panel if a toggle is focused
User Interface. Look and FeelBug IDEA-206402 Mac proxy icon missing in the title bar
Bug IDEA-235462 Extra space in "New file" dialog
User Interface. Project ViewBug IDEA-223785 Project Tree view during Drag/Drop horizontal scroll is jarring and gets in the way
Usability IDEA-231440 can i control `details in tree view` format?
Version Control. GitBug IDEA-234159 Changes of submodule objects do not appear in Local Changes
Bug IDEA-234426 AssertionError when opening changed project file in light mode on Windows
Bug IDEA-234795 Can no longer select differences in new commit tab
Bug IDEA-234374 Strange sorting when "Group by directory" is enabled
Usability IDEA-174600 Git Interactive Rebase dialog: allow to remove commit via Backspace or Delete
Usability IDEA-216780 Amend button is undiscoverable
Usability IDEA-233381 After restart selected tab is switched from "Local Changes" to "Log"
Version Control. MercurialBug IDEA-233629 Mercurial auth script is not compatible with older python versions.
Exception IDEA-233283 update failed for AnAction with ID=hg4idea.CompareWithBranch
Version Control. SubversionBug IDEA-234491 Cannot checkout Subversion project from Welcome screen
No subsystemFeature WEB-44187 Run Prettier on save - add jsx and tsx files by default
Bug WEB-43941 VueJS plugin with vuex-smart-module not working in IntelliJ IDEA v 2019.3 with destructuring assignment
Bug WEB-42930 Duplicate script tag message for multiple <script> tags in Laravel Blade file
Bug WEB-44221 Completion for object literal properties with "this." behaves incorrectly for TypeScript explicit this specifications
Bug WEB-44149 Run prettier on save triggers in other project "Non-Project Files Protection
Bug WEB-44183 Remove inspection 'Unresolved JavaScript variable' from injections
Bug WEB-44076 IndexOutOfBoundsException when Introduce field
Bug WEB-44222 Completion for object literal properties with 'this.' doesn't properly handle non-identifier property names
Performance WEB-43007 Import optimization in TypeScript is too slow to be used as a trigger on save
Usability WEB-44108 Improve presentation of long paths
Task WEB-44295 Do not show browser icons in XML files
Task WEB-44337 Bundle the Grazie plugin with WebStorm
CoffeeScriptBug WEB-35585 support dynamic imports in coffeescript
DartTask WEB-44167 Create 'Dart Web' run configuration type by default to run/debug Dart web applications
DebuggerBug WEB-44064 Electron Main Debug Not Working
Bug WEB-44400 When re-run failed Karma tests in debug mode, debugger doesn't stop on breakpoint
Bug WEB-44313 JS Debugger: problems with source resolution when content is symlinked
Bug WEB-43747 When attaching to a running Mocha test, debugger doesn't consider breakpoints in the first launch
Bug WEB-44306 Reference Error in the list of threads when debugging an npm script with nodemon
Bug WEB-44425 Apply 'do not step into' to library roots other than 'node_modules'
Bug WEB-44245 Debugger works improperly
Usability WEB-43215 Remove line separator between input and corresponding output in JavaScript debug console
Usability WEB-43277 Replace Drop Frame with Restart Frame action
HTMLFeature WEB-40474 Support Vue in HTML files containing a Vue CDN or local file link
Performance WEB-43760 UI freezing because of calling XmlTag#getDescriptor on EDT
JavaScriptFeature WEB-44208 Inject TypeScript JSX and JSX when `jsx` and `tsx` language tags are used
Bug WEB-43955 Show empty custom JSDoc tags in quick documentation
Bug WEB-44168 Can't go to declaration for modules imported from sub namespaces.
Bug WEB-42929 Type hint of "this" keyword malfunctioning in WebStorm.
Bug WEB-44256 TypeScript constrained @template in jsdoc
Bug WEB-38447 Properties defined with ES6 getters/setters are shown as functions in quick documentation
Bug WEB-43689 Resolve for symbols from JavaScript libraries doesn't work in test files in IntelliJ IDEA
Bug WEB-44308 Inline function should parenthesize object literals if inlining inside shorthand arrow
Bug WEB-41997 an unresolved identifier "type" is highlighted as a used local var
Bug WEB-44255 JSX: parse several consecutive tags
Bug WEB-32548 Remove redundant escape quickfix breaks the regexp
Bug WEB-42099 incorrect classification of a for on loop variable as global
Bug WEB-31303 Quick Doc: Markdown: recognize table syntax
Bug WEB-44177 Inspection 'Unused global symbol' doesn't work for methods whose name consists of one / two letters
Bug WEB-38449 Show inferred type in completion when using ES6 getters/setters
Bug WEB-36237 Structure view: different view of Setter & Getter in js & ts
Bug WEB-43923 JavaScript: Vue 2.6.11 not properly analyzed
Bug WEB-44175 No autocomplete on material-ui createStyles in pure JS
Bug WEB-44370 Exception showing JSDoc comment containing "pre" tag
Bug WEB-44008 Incorrect import from Node.js core modules
Bug WEB-44162 Quick documentation is empty
Bug WEB-37405 Javascript RegExp error: Unclosed character class
Bug WEB-36755 No autocompletion if npm package's package.json doesn't contain types property
Performance WEB-44069 Quick Documentation: Fetching documentation takes a lot of time (~5 sec)
Usability WEB-44119 fn.call() does not prompt import
JavaScript. FrameworksFeature WEB-44180 Angular: Support new Ivy metadata format and enable Ivy by default
Feature WEB-41565 Vue: Support for Composition API
Feature WEB-44371 Vue: improve type evaluation with composition API and support Vue 3
Bug WEB-40709 Angular: Component or directive properties inherited from an abstract library class are not recognized
Bug WEB-43160 Completion for compound React components from semantic-ui-react
Bug WEB-44487 Vue.js: SOE when `include` tag present in HTML file
Bug WEB-44140 Incorrect Angular "Missing or invalid component declaration in module" inspection
Bug WEB-39018 Autocompletion not working for "react-testing-library" and "dom-testing-library" modules
Bug WEB-42364 Angular modules aren't recognized if installed with pnpm
Bug WEB-40778 Angular directives with the transloco library
Bug WEB-41402 `innerHTML` is not recognized as valid attribute if the brackets are omitted
Bug WEB-44388 Wrong Copy and Paste in TSX files
Usability WEB-43720 Customizable VueJs language injection
Task WEB-42901 Use "npx" as the default option for all generators (that support the npx command)
JavaScript. InspectionsBug WEB-44314 JavaScript inspection "Duplicate case label" assumes incorrect comparison operator
Bug WEB-30679 JS: invalid "redefining of eval is not allowed" error
Bug WEB-42918 "const variable without initializer" from assigning PHP to inline JS, not short tags
Bug WEB-44053 False positive 'Expression statement is not assigned or call' inside js expression statement fragment fully injected in a literal
Bug WEB-44343 unary operator with exponential operator error
JavaScript. RefactoringBug WEB-44283 Inline function only inlines the first line of the function if used in shorthanded arrow function
Usability WEB-43163 Perform inline rename for global top-level symbols used only in the current file or is unused
Live EditBug WEB-43334 Live Edit in HTML does not work with vue installed via npm
Bug WEB-43476 Live edit does not work with XHTML file
Bug WEB-37042 LiveEdit HTML element highlight feature not working
Node.jsBug WEB-44322 Show brew installations of pnpm in "Package manager" drop-down list
Bug WEB-41288 Destructuring makes the variable resolution fails
Bug WEB-44392 Show "pnpm install" instead of "npm install" if pnpm configured
Usability WEB-25409 node_modules and linked subproject does not refresh automaticaly
Pug (ex-Jade)Bug WEB-43803 Syntax error for arrow functions inside objects in Pug
TypeScriptBug WEB-39540 Not support tsx in SFC of vue.js
Bug WEB-44052 Paired ' or " is not inserted in generics lists before '>'
Bug WEB-35365 No autocomplete on material-ui createStyles
Bug WEB-44214 Quick documentation shows link only to one related declaration when they are merged
Bug WEB-44236 No properties are suggested for conditional type which involves generics
Bug WEB-44000 JSDoc: do not show mdn urls for non-standard types from lib.d.ts
Bug WEB-42460 Autocompletion suggests properties that are not allowed by TypeScript (generics + property map)
Bug WEB-44060 Literal vaules are not suggested in template strings
Bug WEB-44137 Optimize incompatible literals and literal vs primitive combinations to 'never'
Bug WEB-31257 No 'number'/'string' items in completion for enum members in static context
Bug WEB-44046 Type guards are not applied in TSX markup
Bug WEB-44037 TypeScript: quick navigate/ quick doc should escape element name from the typescript service
Bug WEB-44011 JSDoc: do not expand simple typescript aliases
Bug WEB-44335 Show information about an object when calling the quick doc on 'this'
Bug WEB-44003 Shouldn't expand conditional types for raw generics
Bug WEB-44321 TS: problem with generics in Vue composition API with reactive wrapper.
Bug WEB-43997 Incorrect inferring from a type with multiple call signatures
Bug WEB-44258 Invalid 'static method is not accessible' for static member access via 'this'
Bug WEB-44166 Quick documentation hangs when react HOC is defined
Bug WEB-44009 JSDoc: incorrect type presentation for properties
Bug WEB-44237 Generic constraints are not always taken into account and are buggy with conditionals when expanding generic type to object type
Bug WEB-44394 Resolve is broken when import is shorthand
Bug WEB-44160 Incorrect editor highlighting when using generic function as a generic parameter
Bug WEB-44312 TS: problems with inference of generic default values of generics
Bug WEB-34561 Code completion/types when using the React.createContext-API is inaccurate (with TypeScript)
Bug WEB-44273 Number literals are not considered when evaluating possible branches for switch statements (i.e for "create missing switch branch" inspection)
Bug WEB-38460 TypeScript: jest.spyOn no longer auto-completes parameter values (2019.1.1)
Bug WEB-44262 Typescript readonly parsing with indexed types
Bug WEB-28642 TypeScript. Go To Declaration opens base class instead of needed. Idea [2017.2.3].
Performance WEB-43982 High cpu usage when editing typescript
Task WEB-44105 TypeScript: use quick doc from service for unresolved references
Task WEB-44027 Update bundled TypeScript to 3.8
Task WEB-44294 Support TS 3.9 awaited type (at least minimally)
Unit TestsBug WEB-44377 Failed mocha tests cannot be rerun in debug mode
Bug WEB-43995 'Highlight problem line in test' inspection doesn't work for jest when using WSL node interpreter
No subsystemBug DBE-10189 "Preview update" does not work when table is not introspected
DB ConnectivityBug DBE-10087 SSL Handshake Error Connecting to newly built MySQL 5.7.29 Server
Bug DBE-10067 Cannot connect to MySQL via SSH with $ in database name
DB ConsoleFeature DBE-8332 Navigation to Execute options from query-chooser dropdown
DB IntrospectionFeature DBE-8674 Display indexes for view
Feature DBE-6417 MS SQL: support rules introspection
Feature DBE-6868 Support sparse columns
Bug DBE-4769 MS SQL/Azure: Support sequences
Bug DBE-10298 Stored procedures support in Redshift introspection
DB RefactoringBug DBE-10185 "Preview update" does not work when using alias
Data Import & ExportFeature DBE-5858 Better error message when importing data
Feature DBE-10338 New action: export to database... in the context menu of CSV file
Bug DBE-9654 CSV/TXT Import to MSSQL Database without importing an id value
Bug DBE-10172 CSV Formats settings are reset on restart
Usability DBE-10333 Make CSV extractor default
Data ViewsFeature DBE-4123 Support native excel format export
Usability DBE-10307 Text search hides all the other buttons
Usability DBE-6414 Databrowser Escape from Search Ctrl-F
Usability DBE-8733 Enable "Hide column" actions inside data view
SQL CompletionBug DBE-9882 SQL editor needlessly quotes identifiers (tables, columns, stored procedures) for Intersystems Caché databases
Bug DBE-9758 Database console autocomplete autoquotes everything in jdbc presto connection
Bug DBE-10012 Bad completion for GROUPING SETS
SQL Format and StyleBug DBE-10202 Case sensitivity not respected for procedures/functions in packages
SQL GenerationBug DBE-10396 Unable to resolve class com.intellij.database.model.DasObjectWithSource
Bug DBE-10259 The drop cascade checkbox of the Confirm Drop Schema Dialog does nothing!
SQL HighlightingFeature DBE-8365 Redshift stored procedures support
Bug DBE-10182 Cassandra 'CONSISTENCY' command is not supported
Bug DBE-10273 Good code red: CAST to varchar without length not accepted by DataGrip
Bug DBE-10268 PostgrSQL Identity columns syntax check bug

RubyMine 2020.1 RC (201.6668.69 build) Release Notes

Ruby. DebuggerBugRUBY-25553fails to step into super
Core. IDE SettingsBugIDEA-235940SSH Configurations steal focus
BugIDEA-235713Don't automatically import configs for debug IDEA instance
BugIDEA-235843Restore Default Settings doesn't uninstall plugins if they are stored not inside the config dir
UsabilityIDEA-233305Provide ability to start the IDE with an empty config
UsabilityIDEA-234079Show Import Config dialog if idea.config.path is explicitly specified in vmoptions.
Core. Plugin ManagementBugIDEA-235176Do not suggest plugins supporting exact filenames for files already supported by exact filename by installed plugins
BugIDEA-235397Unreadable error message
UsabilityIDEA-231815Treat the situation when both bundled and downloaded plugin exist more user-friendly
Core. Run. TargetsBugIDEA-236232[run.target] Pull docker target always pulls "latest" tag, even for "openjdk:8"
Core. SSHFeatureIDEA-234840Custom name and rename for SSH config
UsabilityIDEA-236191Add button to rename ssh config to toolbar
Tools. DockerPerformanceIDEA-235826Rider freezes after Clean and Build inside DockerFileDetector
ExceptionIDEA-233298Docker: com.github.dockerjava.api.exception.InternalServerErrorException at calling Exec command
User Interface. Find, Replace, UsagesTaskIDEA-217878Update appearance of find/replace pop-up
User Interface. FocusBugIDEA-235551Esc does not return focus to Editor from Find panel if a toggle is focused
Version Control. GitUsabilityIDEA-216780Amend button is undiscoverable
DB ConnectivityBugDBE-10087SSL Handshake Error Connecting to newly built MySQL 5.7.29 Server
DB IntrospectionFeatureDBE-6868Support sparse columns
FeatureDBE-6417MS SQL: support rules introspection
BugDBE-10298Stored procedures support in Redshift introspection
Data Import & ExportFeatureDBE-10338New action: export to database... in the context menu of CSV file
UsabilityDBE-10333Make CSV extractor default

RubyMine 2020.1 Beta2 (201.6668.21 build) Release Notes

CoreBugRUBY-26002Don't allow querying type of calls that are passed blocks
Remote InterpretersBugRUBY-25942Unified SSH: drop list SSH configuration doesn't show whole text when no SSH configuration created
Ruby. DebuggerBugRUBY-25997Debugger skips breakpoints in case of enabled coverage (ruby <2.5.0)
BugRUBY-26078RM doesn't show correct methods to step into if method called with parameters
Core. IDE SettingsBugIDEA-235325After Restore Default Settings invocation IDEA treats the plugins incorrectly
BugIDEA-235843Restore Default Settings doesn't uninstall plugins if they are stored not inside the config dir
BugIDEA-235713Don't automatically import configs for debug IDEA instance
BugIDEA-235413AbstractTreeUi.myElementToNodeMap leaks reference to configurable of unloaded plugin
BugIDEA-235857"Cannot read scheme" - IDE fails to load its own configuration xml file from .idea folder if the file contains byte-order mark
BugIDEA-235697Settings search via "Find Action" doesn't work
UsabilityIDEA-234079Show Import Config dialog if idea.config.path is explicitly specified in vmoptions.
UsabilityIDEA-233305Provide ability to start the IDE with an empty config
Core. InstallationBugIDEA-235899On updating IDEA, a new Python plugin version is downloaded but not actually installed
Core. LicensingCosmeticsIDEA-227658Date in license dialog is not fully visible
Core. Plugin ManagementBugIDEA-233742Bundled dynamic plugin become downloaded and has strictly defined version after disable/enable
BugIDEA-235025IDEA freeze on Spring Messaging plugin disabling
Core. Project SettingsBugIDEA-230707unable to multi select when adding library dependency
BugIDEA-232634IJ 2020 EAP regression for project hot reload after 'gradle idea'
BugIDEA-229737Empty error message box on stopping JDK downloading
Core. Quick DocumentationBugIDEA-235078JavaDoc: Empty space before parameters in rendered documentation fragment
BugIDEA-229804Quick doc on hover is shown after mouse moving away from editor area
UsabilityIDEA-210449Unuseful parameters quick doc
CosmeticsIDEA-208369Don't show module in quickdoc for local declarations
Core. Run. ConfigurationsBugIDEA-235725WSL2: unable to run application
BugIDEA-235710Rider: incorrect run configuration share location being shown in the run configuration editor
Editor. Editing TextBugIDEA-235703In-editor Javadoc leaves large gap between comment and code
UsabilityIDEA-235716Broken GoTo (ctrl+click) in rendered javadocs
Editor. FormatterBugIDEA-231481Detected file indent does not seem to be invalidated after the code is fully re-formatted
Editor. Large FilesBugIDEA-234404[Large File Editor] AssertionError: File text mismatch
BugIDEA-234864[Large File Editor] AssertionError: file/doc text length different
Tools. DockerBugIDEA-216531Docker: support custom credential stores / helpers
BugIDEA-234231IOException: Pipe broken, pipe id: `ImagePullPanel.pipe:plug` at attempt to pull an image
BugIDEA-235678Docker: error about parsing this key for some forms of --gpus
ExceptionIDEA-233298Docker: com.github.dockerjava.api.exception.InternalServerErrorException at calling Exec command
Tools. HTTP ClientBugIDEA-235298HTTP Client: Can't generate all requests from MultipleBasePaths yaml specification
BugIDEA-234539HTTP Client: Server base path marked as red without error
UsabilityIDEA-234739Http Client: more comfortable "move refactoring"
User Interface. AccessibilityBugIDEA-234385Screen reader does not read "Search Everywhere" dialog name when it is invoked
User Interface. Look and FeelBugIDEA-206402Mac proxy icon missing in the title bar
BugIDEA-235462Extra space in "New file" dialog
User Interface. Project ViewBugIDEA-223785Project Tree view during Drag/Drop horizontal scroll is jarring and gets in the way
Version Control. GitBugIDEA-234159Changes of submodule objects do not appear in Local Changes
No subsystemTaskWEB-44337Bundle the Grazie plugin with WebStorm
DebuggerBugWEB-44425Apply 'do not step into' to library roots other than 'node_modules'
BugWEB-44400When re-run failed Karma tests in debug mode, debugger doesn't stop on breakpoint
BugWEB-44064Electron Main Debug Not Working
UsabilityWEB-43277Replace Drop Frame with Restart Frame action
UsabilityWEB-43215Remove line separator between input and corresponding output in JavaScript debug console
JavaScriptBugWEB-44162Quick documentation is empty
BugWEB-44256TypeScript constrained @template in jsdoc
BugWEB-37405Javascript RegExp error: Unclosed character class
JavaScript. FrameworksBugWEB-44487Vue.js: SOE when `include` tag present in HTML file
TaskWEB-42901Use "npx" as the default option for all generators (that support the npx command)
JavaScript. InspectionsBugWEB-42918"const variable without initializer" from assigning PHP to inline JS, not short tags
JavaScript. RefactoringUsabilityWEB-43163Perform inline rename for global top-level symbols used only in the current file or is unused
Live EditBugWEB-43334Live Edit in HTML does not work with vue installed via npm
BugWEB-43476Live edit does not work with XHTML file
Node.jsBugWEB-44392Show "pnpm install" instead of "npm install" if pnpm configured
Pug (ex-Jade)BugWEB-43803Syntax error for arrow functions inside objects in Pug
TypeScriptBugWEB-44214Quick documentation shows link only to one related declaration when they are merged
BugWEB-44394Resolve is broken when import is shorthand
BugWEB-39540Not support tsx in SFC of vue.js
BugWEB-44335Show information about an object when calling the quick doc on 'this'
DB ConsoleFeatureDBE-8332Navigation to Execute options from query-chooser dropdown
DB IntrospectionFeatureDBE-8674Display indexes for view
Data Import & ExportFeatureDBE-5858Better error message when importing data
Data ViewsUsabilityDBE-10307Text search hides all the other buttons
SQL CompletionBugDBE-9758Database console autocomplete autoquotes everything in jdbc presto connection
BugDBE-9882SQL editor needlessly quotes identifiers (tables, columns, stored procedures) for Intersystems Caché databases

RubyMine 2020.1 Beta1 (201.6487.23 build) Release Notes

No subsystemBugRUBY-26063Missing space in No Ruby SDKs found notification
Remote Interpreters. DockerBugRUBY-25111Cannot stop rails application running with docker remote interpreter
Ruby. DebuggerBugRUBY-25996Attach to process doesn't show any processes in case of remote interpreter
Ruby. Type InferenceBugRUBY-26008Missing types in standard library stubs
Core. File SystemBugIDEA-65174OS fsnotifier unable to see changes under symlink/subfolders until restart/no notifier works correctly.
Core. IndexingExceptionIDEA-231678AE at com.intellij.util.indexing.MemoryIndexStorage.setBufferingEnabled
Core. LicensingBugIDEA-231811Excessive number of writes to idea.key
Core. Plugin ManagementBugIDEA-234122Exception and freeze on disabling Markdown plugin when .md file is opened
ExceptionIDEA-230987Throwable at com.intellij.util.indexing.FileBasedIndexImpl.dropRegisteredIndexes after updating plugins
Editor. FormatterBugIDEA-233647Log contains too many ' INFO - rojectCodeStyleSettingsManager - Saving Project code style '
BugIDEA-230976IDEA is modifying .idea\codeStyles\Project.xml
Tools. DockerFeatureIDEA-219125Docker. Support --gpus command line option
BugIDEA-234944DockerCompose: Add navigation from images in quotes to the docker hub
UsabilityIDEA-234994Recognize Dockerfile.jvm and Dockerfile.native as docker files
UsabilityIDEA-234982Docker: Set focus at console command line by Exec->bash on a container
CosmeticsIDEA-232754Docker Plugin - bad English in error message when plugin can't reach file system root
TaskIDEA-234571Internationalize Docker plugin. Round 2
ExceptionIDEA-234266java.util.concurrent.ExecutionException at completion for invalid tags
Tools. HTTP ClientBugIDEA-234656Completion hint is disappearing after "clear read-only flag" dialog
BugIDEA-234435Generate HTTP Request: correctly treat read-only files
BugIDEA-234891Can't rename host in http client
UsabilityIDEA-234659Add text and selection in template
Tools. TerminalBugIDEA-234406Split sessions are lost when moving terminal tab to the editor – disable the action for split sessions
BugIDEA-234503Provide keyboard navigation between split terminals
ExceptionIDEA-234523Throwable when move terminal tab to editor
Version Control. GitBugIDEA-234795Can no longer select differences in new commit tab
BugIDEA-233679Mnemonics doesn't work in Interactive rebase dialog on Mac
UsabilityIDEA-174600Git Interactive Rebase dialog: allow to remove commit via Backspace or Delete
UsabilityIDEA-233381After restart selected tab is switched from "Local Changes" to "Log"
Version Control. MercurialBugIDEA-233629Mercurial auth script is not compatible with older python versions.
Version Control. SubversionBugIDEA-234491Cannot checkout Subversion project from Welcome screen
No subsystemTaskWEB-44295Do not show browser icons in XML files
DebuggerBugWEB-44245Debugger works improperly
BugWEB-44313JS Debugger: problems with source resolution when content is symlinked
BugWEB-44306Reference Error in the list of threads when debugging an npm script with nodemon
JavaScriptBugWEB-42099incorrect classification of a for on loop variable as global
BugWEB-36237Structure view: different view of Setter & Getter in js & ts
BugWEB-44370Exception showing JSDoc comment containing "pre" tag
BugWEB-32548Remove redundant escape quickfix breaks the regexp
BugWEB-44308Inline function should parenthesize object literals if inlining inside shorthand arrow
BugWEB-41997an unresolved identifier "type" is highlighted as a used local var
JavaScript. FrameworksFeatureWEB-44371Vue: improve type evaluation with composition API and support Vue 3
BugWEB-44388Wrong Copy and Paste in TSX files
BugWEB-42364Angular modules aren't recognized if installed with pnpm
JavaScript. InspectionsBugWEB-44343unary operator with exponential operator error
BugWEB-44314JavaScript inspection "Duplicate case label" assumes incorrect comparison operator
JavaScript. RefactoringBugWEB-44283Inline function only inlines the first line of the function if used in shorthanded arrow function
Live EditBugWEB-37042LiveEdit HTML element highlight feature not working
Node.jsBugWEB-44322Show brew installations of pnpm in "Package manager" drop-down list
UsabilityWEB-25409node_modules and linked subproject does not refresh automaticaly
TypeScriptBugWEB-44258Invalid 'static method is not accessible' for static member access via 'this'
BugWEB-44312TS: problems with inference of generic default values of generics
BugWEB-44273Number literals are not considered when evaluating possible branches for switch statements (i.e for "create missing switch branch" inspection)
BugWEB-44236No properties are suggested for conditional type which involves generics
BugWEB-44321TS: problem with generics in Vue composition API with reactive wrapper.
BugWEB-42460Autocompletion suggests properties that are not allowed by TypeScript (generics + property map)
BugWEB-44237Generic constraints are not always taken into account and are buggy with conditionals when expanding generic type to object type
BugWEB-44052Paired ' or " is not inserted in generics lists before '>'
BugWEB-44262Typescript readonly parsing with indexed types
TaskWEB-44294Support TS 3.9 awaited type (at least minimally)
Unit TestsBugWEB-44377Failed mocha tests cannot be rerun in debug mode
Data ViewsUsabilityDBE-8733Enable "Hide column" actions inside data view
SQL Format and StyleBugDBE-10202Case sensitivity not respected for procedures/functions in packages
SQL GenerationBugDBE-10259The drop cascade checkbox of the Confirm Drop Schema Dialog does nothing!
SQL HighlightingBugDBE-10273Good code red: CAST to varchar without length not accepted by DataGrip
BugDBE-10268PostgrSQL Identity columns syntax check bug

RubyMine 2020.1 EAP8 (201.6251.5 build) Release Notes

CoreBugRUBY-26024indent guide does not reach the end of the method block
Ruby. DebuggerBugRUBY-26009Debugger doesn't stop on a breakpoint in case of inheritance from BasicObject
Ruby. InspectionsBugRUBY-23617Incorrect fix for unused local variable
BugRUBY-25995Incorrect highlight for "incorrect argument count" when no args passed
BugRUBY-25988"!" and "?" symbol key suffixes are not ignored by the spell checker
Ruby. ParsingFeatureRUBY-24952Update numbered parameters support to the new '_' syntax instead of '@'
BugRUBY-26006RubyMine freeze on parsing a file
Core. IDE Settings. SharingExceptionIDEA-234617java.lang.Throwable at com.intellij.cloudConfig.CloudConfigManager.connectThisInstanceOperation
Core. Plugin ManagementBugIDEA-234729Restart suggestion not always shown on plugin unload failure
BugIDEA-234528Can't execute shell script after enabling shell plugin without restart
ExceptionIDEA-234123Exception on enabling Commander plugin
ExceptionIDEA-234030Exceptions when invoking Search everywhere after disabling HTTP Client plugin
Core. StatisticsBugIDEA-233990Data sharing dialog is shown twice
Editor. Intention ActionsBugIDEA-233784Intention preview: Infinite loading and exception(Should be invoked only when having a document)
Tools. DockerBugIDEA-234265DockerCompose: provide inspection errors for invalid images format
BugIDEA-234250Docker. Image Console: the old Pull dialog is called from context menus and via buttons
BugIDEA-234233Docker: Don't pull all the images by "tomcat: "
BugIDEA-234261DockerCompose: completion should work for images in quotes
Tools. HTTP ClientBugIDEA-234388Provide more fast way to create HTTP Request via gutter.
User Interface. Action SystemExceptionIDEA-234033NPE at com.intellij.openapi.actionSystem.impl.ActionManagerImpl.unregisterAction
Version Control. GitBugIDEA-234374Strange sorting when "Group by directory" is enabled
BugIDEA-234426AssertionError when opening changed project file in light mode on Windows
No subsystemFeatureWEB-44187Run Prettier on save - add jsx and tsx files by default
BugWEB-44149Run prettier on save triggers in other project "Non-Project Files Protection
BugWEB-44183Remove inspections from injections
BugWEB-44222Completion for object literal properties with 'this.' doesn't properly handle non-identifier property names
BugWEB-44221Completion for object literal properties with "this." behaves incorrectly for TypeScript explicit this specifications
CoffeeScriptBugWEB-35585support dynamic imports in coffeescript
DartTaskWEB-44167Create 'Dart Web' run configuration type by default to run/debug Dart web applications
HTMLPerformanceWEB-43760UI freezing because of calling XmlTag#getDescriptor on EDT
JavaScriptFeatureWEB-44208Inject TypeScript JSX and JSX when `jsx` and `tsx` language tags are used
BugWEB-44175No autocomplete on material-ui createStyles in pure JS
BugWEB-38449Show inferred type in completion when using ES6 getters/setters
BugWEB-38447Properties defined with ES6 getters/setters are shown as functions in quick documentation
BugWEB-44008Incorrect import from Node.js core modules
BugWEB-44177Inspection 'Unused global symbol' doesn't work for methods whose name consists of one / two letters
BugWEB-42929Type hint of "this" keyword malfunctioning in WebStorm.
BugWEB-31303Quick Doc: Markdown: recognize table syntax
BugWEB-44255JSX: parse several consecutive tags
BugWEB-44168Can't go to declaration for modules imported from sub namespaces.
UsabilityWEB-44119fn.call() does not prompt import
JavaScript. FrameworksBugWEB-43160Completion for compound React components from semantic-ui-react
BugWEB-39018Autocompletion not working for "react-testing-library" and "dom-testing-library" modules
BugWEB-40709Angular: Component or directive properties inherited from an abstract library class are not recognized
BugWEB-41402`innerHTML` is not recognized as valid attribute if the brackets are omitted
BugWEB-40778Angular directives with the transloco library
BugWEB-44140Incorrect Angular "Missing or invalid component declaration in module" inspection
JavaScript. InspectionsBugWEB-30679JS: invalid "redefining of eval is not allowed" error
Node.jsBugWEB-41288Destructuring makes the variable resolution fails
TypeScriptBugWEB-44137Optimize incompatible literals and literal vs primitive combinations to 'never'
BugWEB-44166Quick documentation hangs when react HOC is defined
BugWEB-34561Code completion/types when using the React.createContext-API is inaccurate (with TypeScript)
BugWEB-44160Incorrect editor highlighting when using generic function as a generic parameter
BugWEB-38460TypeScript: jest.spyOn no longer auto-completes parameter values (2019.1.1)
PerformanceWEB-43982High cpu usage when editing typescript
No subsystemBugDBE-10189"Preview update" does not work when table is not introspected
DB RefactoringBugDBE-10185"Preview update" does not work when using alias
Data Import & ExportBugDBE-9654CSV/TXT Import to MSSQL Database without importing an id value
BugDBE-10172CSV Formats settings are reset on restart

RubyMine 2020.1 EAP7 (201.6073.15 build) Release Notes

Code InsightBugRUBY-25891Incorrect detection of overriden method
CompletionBugRUBY-22477Incorrect path completion in require_relative
BugRUBY-25841Don't display constants twice in completion
IDECosmeticsRUBY-25909Fix the Action name in `bundle` for run anything to all be lowercase
InspectionsBugRUBY-25687False missing argument error is shown for .select method
BugRUBY-25916Unnecessary "Parameter shadows an outer parameter" inspection for underscore variable
BugRUBY-25508False positive 'Incorrect call argument count' inspection
BugRUBY-25360The replace safe navigation operator with nested nil checks doesn't work with query methods
ParsingBugRUBY-25968Syntax errors in tap and do block
Remote InterpretersFeatureRUBY-25943Unified SSH: When no SSH configs added, SSH Configurations window shows only 'Nothing to show' text
BugRUBY-25948Credentials for SSH deployment configuration are gone when going back from RubyMine 2020.1 EAP6 to RubyMine 2019.3.3
Run ConfigurationsBugRUBY-25869RubyMine opens an incorrect browser page when the 'Start JavaScript debugger' option is enabled
Type InferenceBugRUBY-25953Type checking does not happen for keyword arguments
Core. IDE SettingsBugIDEA-233857Do not check "Visible only for this project" by default when create SSH configuration
TaskIDEA-233301Log the automatically imported configs
Core. InstallationBugIDEA-233816Symlinked Rubymine Configuration leads to being unable to open multiple projects via CLI
Core. Platform APIFeatureIDEA-234013Add Extension Point to contribute additional details into About popup
BugIDEA-233783Deadlock in InterfaceExtensionPoint
Editor. Editing TextBugIDEA-233340Hitting <Tab> at the end of the buffer leaves the editor and goes to the sidebar panel
BugIDEA-232792Double click on a parameter does not highlight usages in function
Editor. TextMate BundlesBugIDEA-232235'<' in HTML DOCTYPE is highlighted as bad character when using textmate bundles
Lang. Shell ScriptBugIDEA-229741New Shell Script Run Configuration breaks Debugging of Java applications when using shell script in before launch setup
Tools. DockerBugIDEA-234229Docker. Pull images. No result by completion with one symbol
BugIDEA-233884Docker: inspect container doesn't work
BugIDEA-234210Docker: support `--sysctl` in docker run configuration CLI options
ExceptionIDEA-233998IDE exception when trying to run Dockerfile configuration with `Run build image` option disabled
User Interface. Project ViewUsabilityIDEA-231440can i control `details in tree view` format?
Version Control. MercurialExceptionIDEA-233283update failed for AnAction with ID=hg4idea.CompareWithBranch
No subsystemBugWEB-44076IndexOutOfBoundsException when Introduce field
BugWEB-42930Duplicate script tag message for multiple <script> tags in Laravel Blade file
PerformanceWEB-43007Import optimization in TypeScript is too slow to be used as a trigger on save
UsabilityWEB-44108Improve presentation of long paths
DebuggerBugWEB-43747When attaching to a running Mocha test, debugger doesn't consider breakpoints in the first launch
HTMLBugWEB-40474Support Vue in HTML files containing a Vue CDN or local file link
JavaScriptBugWEB-43955Show empty custom JSDoc tags in quick documentation
BugWEB-36755No autocompletion if npm package's package.json doesn't contain types property
BugWEB-43689Resolve for symbols from JavaScript libraries doesn't work in test files in IntelliJ IDEA
BugWEB-43923JavaScript: Vue 2.6.11 not properly analyzed
BugWEB-44012JSDoc: show jsdoc with type for exported default expressions
PerformanceWEB-44069Quick Documentation: Fetching documentation takes a lot of time (~5 sec)
JavaScript. FrameworksFeatureWEB-41565Vue: Support for Composition API
UsabilityWEB-43720Customizable VueJs language injection
JavaScript. InspectionsBugWEB-44053False positive 'Expression statement is not assigned or call' inside js expression statement fragment fully injected in a literal
TypeScriptBugWEB-44060Literal vaules are not suggested in template strings
BugWEB-44011JSDoc: do not expand simple typescript aliases
BugWEB-44009JSDoc: incorrect type presentation for properties
BugWEB-28642TypeScript. Go To Declaration opens base class instead of needed. Idea [2017.2.3].
BugWEB-35365No autocomplete on material-ui createStyles
BugWEB-43997Incorrect inferring from a type with multiple call signatures
BugWEB-44037TypeScript: quick navigate/ quick doc should escape element name from the typescript service
BugWEB-44000JSDoc: do not show mdn urls for non-standard types from lib.d.ts
BugWEB-44003Shouldn't expand conditional types for raw generics
BugWEB-44046Type guards are not applied in TSX markup
BugWEB-31257No 'number'/'string' items in completion for enum members in static context
TaskWEB-44027Update bundled TypeScript to 3.8
TaskWEB-44105TypeScript: use quick doc from service for unresolved references
Unit TestsBugWEB-43995'Highlight problem line in test' inspection doesn't work for jest when using WSL node interpreter
DB ConnectivityBugDBE-10067Cannot connect to MySQL via SSH with $ in database name
Data ViewsUsabilityDBE-6414Databrowser Escape from Search Ctrl-F
SQL CompletionBugDBE-10012Bad completion for GROUPING SETS
SQL HighlightingFeatureDBE-8365Redshift stored procedures support
BugDBE-10182Cassandra 'CONSISTENCY' command is not supported

RubyMine 2020.1 EAP6 (201.5985.36 build) Release Notes

No subsystemBugRUBY-25847RubyMine suggests running a Rake task using the Ruby run/debug configuration
CucumberBugRUBY-25275Cannot run feature with Cucumber 4.0.0.rc3
DebuggerBugRUBY-25748Attach to process kills puma(rails) process
BugRUBY-25789"Add watches" for a variable does not calculate correct value
BugRUBY-25817Pin To Top: possible to pin to top some elements, which shouldn't be pinned
IDEBugRUBY-25775Tools | Analyze Stack Trace or Thread Dump is disabled
InspectionsBugRUBY-24272Super call out of method. False positive. define_method
RakeUsabilityRUBY-24673Don't display an error about rake tasks everytime I open/create a new rails project
UsabilityRUBY-25883Stop pre-populating "rake" dialog with "rake migr"
Remote InterpretersBugRUBY-25908Unified SSH: Incorrect tab behavior when adding new SSH
UsabilityRUBY-24389Options in 'Configure Remote Ruby Interpreter' dialog could be rearranged
Ruby Version ManagersUsabilityRUBY-25937List Ruby Platform
Run ConfigurationsBugRUBY-25962Working directory is replaced with $MODULE_DIR$ in run configurations
Type InferenceBugRUBY-25918inline private/protected method definition breaks YARD type lookup
BugRUBY-25876Don't prioritize method annotation data over type inferred by symbolic execution if data is inherited
Code Analysis. InspectionFeatureIDEA-97040Concurrency inspection could ensure that methods annotated with @GuardedBy were only invoked when a lock is held.
Code Analysis. Language InjectionFeatureIDEA-223930Add "MIME Type" to "inject language/reference" intention
FeatureIDEA-224128Add "HTTP Header" to "inject language/reference" intention
Core. DebuggerTaskIDEA-225637EPs to make dynamic
Core. IDE SettingsBugIDEA-233500SSH Configurations: Check "Save password" by default
BugIDEA-222954Incorrect Recent projects after importing settings from previous version (2019.2)
BugIDEA-233219ImportSettings dialog is shown on idea 2020.1 build start if no configs exist in ~\AppData\Roaming\JetBrains\
BugIDEA-233478Layout of 'Local port' textfield in ssh configurations dialog isn't aligned
CosmeticsIDEA-233704UI: Replace "Insert macro" in File Watchers and External Tools with inline button
Core. Plugin ManagementBugIDEA-233296Unable to disable plugin "Java EE: Web Services"
BugIDEA-233429Plugin privacy note for JetBrains plugin
BugIDEA-232580IDEA prompts to restart after disabling bundled LAF plugins if this LAF is applied
Core. Run. ConfigurationsFeatureIDEA-233142Allow storing run configurations outside of .idea
FeatureIDEA-218785Support FilePrompt macro for run configurations
UsabilityIDEA-233549Run Configurations: Use "inline add" button for macros in Working Directory
Editor. Editing TextExceptionIDEA-232678AE at com.intellij.psi.impl.DiffLog$ReplaceEntry.<init>
Editor. Intention ActionsExceptionIDEA-233415NPE when quickly close intention settings
Editor. Large FilesTaskIDEA-233521Large File Editor: internationalisation
Lang. JSONFeatureIDEA-233082JSON schemas should be available for .json/.yaml scratch files
Lang. XMLBugIDEA-232980I can't seem to be able to get my XML to use my local DTD
Tools. TerminalFeatureIDEA-141172Provide ability to display terminal sessions vertically/horizontally side-by-side
TaskIDEA-231958Terminal tool window: extract to bundles context menus
User Interface. Find, Replace, UsagesBugIDEA-232898typing 3 ascii chars into the find in path search field in regex mode locked up the ide and pegged one core (java process)
Version Control. GitBugIDEA-233514Deleting branches from a multi-repository project in Git toolwindow is painful
BugIDEA-232630Toolbar buttons disappear after expansion and collapsion in interactive rebase dialog
UsabilityIDEA-232511Missing Squash in Rebasing Commits dialog
CosmeticsIDEA-233853Git Interactive Rebase Dialog UI is broken on Mac
CosmeticsIDEA-233740Branches: visual artifacts on collapsed pane
Version Control. LogBugIDEA-233502Open commit in new Git Log tab should focus selected commit
No subsystemBugWEB-43933Common table expressions in strings don't cause SQL language injection albeit they should
BugWEB-43854Optional chaining should always add ' | undefined' to the tail type
JavaScriptFeatureWEB-31345Show all JSDoc-style tags in the documentation popup
FeatureWEB-43506Update presentation of private fields and methods in the quick navigation and documentation popups
BugWEB-38576Javascript: `@return` type annotation assumes the first part is always the type annotation
BugWEB-42971Conditional default parameter assigning in the arrow function gives an error
BugWEB-42316JSDoc @summary contents aren't shown in Quick documentation
BugWEB-43917Don't show documentation popup on string literals
BugWEB-43979Weird behavior on copying string element from one array to another in typescript source
BugWEB-43398'Introduce field' shouldn't be available before 'super' call
BugWEB-43824Incorrect 'infer parameter types' for conditional statements for checking whether a variable is defined or not
BugWEB-43885Presentation improvements in quick documentation
BugWEB-43935'Infer JSDoc parameter types from usages' should paste '*' instead of 'any' to JSDoc
JavaScript. FrameworksFeatureWEB-42964multiple props in slot-scope or v-slot with vue.js causes "unexpected tokens in slot prop declaration"
ExceptionWEB-43924StackOverflowError when index template meteor project
ExceptionWEB-43862kotlin.KotlinNullPointerException with IDEA 2019.3.3 and Vue.js plugin 193.6494.25
JavaScript. InspectionsBugWEB-43932Inspections -> Javascript -> Probable Bugs -> Constructor return primitive value: considers every method which name starts with a capital letter a constructor
Node.jsBugWEB-43761packages.json freezes IDE when hovering package name
ProfilingBugWEB-41341V8 CPU profiling with recent versions of node fails with "bad option: --log-timer-events"
TypeScriptFeatureWEB-38071Auto-insert parenthesis after inserting decorator using auto-completion
FeatureWEB-43901Add a property of object to interface by Alt+Enter in TypeScript
BugWEB-43230Should optimize intersections of primitives with null or undefined to 'never'
BugWEB-43310Typescript 3.7.2 string enum missing method in Angular html template
BugWEB-43945ES6: quick doc doesn't work for import aliases
BugWEB-43884Typescript parameter-properties are not resolved under --noImplicitThis
BugWEB-43030Incorrect type inference in TypeScript when function is overloaded
BugWEB-43820Do not report 'Promise is ignored' for dynamic resolve results in TypeScript
BugWEB-43944TypeScript: quick doc works incorrectly for functions in some cases
BugWEB-41688TypeScript - Implement class members with generics produces wrong signature
BugWEB-43910Type 'any' has incorrect color in quick documentation
UsabilityWEB-43909Autopopup isn't suggested inside property bracket notation
TaskWEB-43393TypeScript quick documentation: use inferred type from the ts service
Data ViewsBugDBE-9174Fallback font doesn't work correctly for table names
SQL CompletionBugDBE-10144How can I supress the suggestion of "member of" when typing mem... in the filter row?
BugDBE-10107Create table completion of "if exists" clause
UsabilityDBE-10036Not relevant completion items when using Postfix Completion
SQL GeneralFeatureDBE-9939Structure view for the block statement
SQL HighlightingFeatureDBE-10131Subquery folding improvement
BugDBE-9988Parameters in COALESCE marked as redundant when they are not due to a full outer join.
BugDBE-10125DataGrip highlights by mistake unused line for distinct operator
BugDBE-9878Clickhouse SQL dialect missing some newer features
TaskDBE-10134Redundant coalesce false positive
SQL ResolveBugDBE-10119Resolve of function's return type in non-default schema

RubyMine 2020.1 EAP5 (201.5616.16 build) Release Notes

DebuggerBugRUBY-25690step over or into on a return or break in a block, resumes
BugRUBY-25720Sidekiq debugger crashes after first breakpoint
BugRUBY-25817Pin To Top: possible to pin to top some elements, which shouldn't be pinned
DockerBugRUBY-24854Adding docker-compose SDK hangs and cannot be cancelled
UsabilityRUBY-25828Add docker-compose sdk mostly is unsuccessfully from the first time
Rails. Code InsightBugRUBY-25673fails to resolve :verify_authenticity_token in a skip_before_action call
Type InferenceBugRUBY-25686Error in parallel assignment types
Core. DiagramsBugIDEA-232758Argument for @NotNull parameter 'defaultValue' of com/intellij/util/ObjectUtils.notNull must not be null for DIAGRAM_NODE_BACKGROUND
Core. IDE SettingsUsabilityIDEA-199232Remove Import Settings dialog on upgrade to new major version
UsabilityIDEA-232586Importing custom VM options on first launch should not ask about rebooting
UsabilityIDEA-232670Don't sync the actions_summary file
Core. IndexingBugIDEA-220511Cannot resolve symbol after switching branch
Core. Navigation and SearchBugIDEA-2314032020 versions of IDEs stopped navigating to files from Toolbox App extension while 2019 versions still do
Core. Plugin ManagementBugIDEA-233045Last installed plugin is marked as "Incompatible with the current AppCode version" in case of using Apply button after installation
BugIDEA-232665Bundled plugin build is not shown
BugIDEA-232671update plugin in wellcome window didn't show restart dialog
UsabilityIDEA-232631While updating multiple plugins via UpdateAll action, suggest to restart only once
UsabilityIDEA-232413Recursive plugin deinstallation message is useless
ExceptionIDEA-214841Installing plugins with dependencies: java.lang.AssertionError after installation plugin with dependency
Core. Quick DocumentationBugIDEA-232853"Show on Mouse Move" option disappears from quick doc popup when toolbar is shown
Editor. Code CompletionBugIDEA-231346Wrong null item in the completion list
Editor. Diff and MergeFeatureIDEA-231341Editing selection misses `Move line up/down` actions
BugIDEA-232800Can't diff from shelf anymore
Editor. Intention ActionsBugIDEA-231109Exception opening invention preview for 'Add on-demand static import'
Editor. TextMate BundlesBugIDEA-232576Open File or folder hangs out RIder UI completely
Lang. Shell ScriptBugIDEA-232776Shell: eval in a pipe displayed as syntax error
BugIDEA-232777Shell: syntax error displayed for <<< here-string
Lang. XMLBugIDEA-232914Unexpected highlighting of child tags in HTML
Tools. DockerBugIDEA-233297Docker: file chooser doesn't work
User Interface. AccessibilityBugIDEA-227618Cannot switch tab when adding new module in project settings
Version Control. GitUsabilityIDEA-232128Branches: favorite branches could be show above groups
ExceptionIDEA-232623Undo commit: Access is allowed from write thread only
Version Control. GitHubBugIDEA-232712GitHub PullRequests: Improper background if comment is left on the last line of the file
No subsystemFeatureWEB-38335Run Prettier on saving files
BugWEB-43879Run prettier on save: change default glob pattern
BugWEB-43777Error loading tooltip
BugWEB-43777Error loading tooltip
BugWEB-43768TypeScript Refactor Extract Method inserts erroneous '<T>' before extracted method name.
BugWEB-43821Webstorm giving false compiler errors for setters
BugWEB-43772Files from node_modules shouldn't affect the "New File" dialog
BugWEB-43750Spring Boot: 'Debug' button is missing when static web assets are located in resources folder
BugWEB-42990Quick Documentation: dl/dt/dd tags are not rendered
CosmeticsWEB-43800'Enabled' column is not fully displayed in 'Settings | Languages & Frameworks | JavaScript | Libraries'
ExceptionWEB-43809PluginException when create fresh node.js express project
JavaScriptBugWEB-43438JSDoc Promise return type not shown in quick documentation
BugWEB-40387Invalid syntax error warning in JS file when placing JSX inside template literal
BugWEB-43223Type is always unset when destructuring props in JavaScript React components
BugWEB-43788Incorrect 'this' in decorators
UsabilityWEB-35571Quick Documentation should show type information if nothing else is known
TaskWEB-43749`#field` syntax is obsolete now for private-fields, we should always use `this.#field` instead
JavaScript. FrameworksFeatureWEB-43638Vuex: support Object-Style commit and dispatch
FeatureWEB-43548Vuex: support code completion for Vuex store symbols within Vuex store code
FeatureWEB-30491Vuex: implement store symbol resolution within Vuex store
FeatureWEB-43789Vuex: Support `import * as ...` syntax in store initialization
BugWEB-42405False positive no overlap for component with prop types
BugWEB-43751Auto-import is not suggested for components defined via React.memo (when @types/react are not installed)
JavaScript. InspectionsBugWEB-43306TypeScript code assistant suggest incorrectly suggest to simplify expression with optional chaining
TaskWEB-43807Update 'JavaScript general errors' inspection
TaskWEB-43811Rename 'JSDoc validation' to 'Syntax errors and unresolved references in JSDoc'
JavaScript. RefactoringBugWEB-27466Fix 'create variable/field' from decorators and class body
BugWEB-43757Extract / create from unresolved actions don't infer expression type from containing property
Node.jsBugWEB-43754`npm` panel not show as expected
TypeScriptFeatureWEB-43465Mark .d.ts.map files as excluded and nest them under corresponding .ts file
BugWEB-43491Duplicate 'Compile TypeScript' actions in 'Find Action' when focus is on tsconfig.json
BugWEB-42363Expected type generics not evaluated for a class with inherited-only constructor
BugWEB-43830Generics insert handler shouldn't insert type arguments before an already existing identifier
BugWEB-42965[Typescript] Inline documentation for inferred arrow functions type doesn't work
BugWEB-43852Should not infer types from generic lambdas in function arguments
BugWEB-43444Unnecessary information for Type in quick documentation
BugWEB-43744Incorrect type inference with nullish coalescing and nullable types
BugWEB-42678Remove empty ellipsis in type hints when collapsing
BugWEB-43742Make 'Remove type declaration' action respect code style settings
BugWEB-43765Path completion in imports doesn't work when using "*" path mappings
BugWEB-40689wrong auto import from namespace inside of module
BugWEB-43471Typescript imports from namespaces are shown in Go To Symbol menu
BugWEB-39170TS: Inaccurately displaying "type: any" when tuple-destructuring an object with Object.entries(), where object indexer type is "number" (and not "string")
BugWEB-43775narrowed is fail with nest `a ? b : (c ? d : f)`
BugWEB-43419Vue Single File Components & TS: Selecting an Enum Completion places the Enum on top of the file instead inside the <script> block
BugWEB-43497Switch statement lambda expression lookahead breaks inner statement parsing
BugWEB-43792"Navigate | Type Declaration" does nothing
DB ConsoleBugDBE-5150SQL Server: A MERGE statement must be terminated by a semi-colon (;).
DB IntrospectionBugDBE-10114Truncate table should not trigger schema synchronization
BugDBE-9910Cloud Oracle: Introspection fails with ORA-00942 because no table SYS.TYPE$
Data Import & ExportBugDBE-5888"Dump with mysqldump" fails if mysql user password is blank
Data ViewsBugDBE-10017Hidden but their names are not crossed out in structure view
SQL CompletionBugDBE-9946ClickHouse engine autocomplete ignores letter size
BugDBE-9990No completion for MySQL enum when caret inside quotes
SQL GeneralBugDBE-10083The "shutdown abort" command is treated as an error
SQL HighlightingFeatureDBE-10045Support for Sequence Storage Engine MariaDB syntax
FeatureDBE-10018Quick Doc on wildcard can show column list
BugDBE-9991Quote missing for column in "Replace column number with a name"
BugDBE-10044DataGrip makes some valid statements red as error
BugDBE-10105Postgres: INSERT INTO ... CROSS JOIN ... ON CONFLICT is marked as error
BugDBE-9949mysql datasource,`stop slave` prompts an error
UsabilityDBE-9934db2 hierarchical queries syntax support
SQL ResolveBugDBE-9938Clickhouse alter syntax dont know about table's column

RubyMine 2020.1 EAP4 (201.5259.19 build) Release Notes

Code InsightBugRUBY-25810Strange "arg1" and "argm1" options in completion for ruby 2.7 stubs
PerformanceRUBY-25324Code Insight high CPU usage
IDECosmeticsRUBY-24535Add an icon for Symbol
RHTMLBugRUBY-25800ERB: no automatic indentation in case Webpacker and Vue are added to the project and Vue.js plugin is installed
RailsFeatureRUBY-3315Switch to DB schema from model
UsabilityRUBY-24574Improve navigation from a rails model/controller/thing to related item
Rails. Code InsightBugRUBY-25647Incorrect Rails warning in ApplicationController
Code Analysis. InspectionBugIDEA-232351Exception during PyCharm launch: nSystem.impl.ActionManagerImpl - Assertion failed
Core. DebuggerTaskIDEA-232047Debugger : extract to bundles
Core. IDE SettingsBugIDEA-232420PyCharm fails to save multiple live templates created
BugIDEA-227800Registry. 'Restart required' message is shown for cases when nothing has changed
BugIDEA-232097File Templates are saved to the incorrect folder
UsabilityIDEA-201163Left key behavior in the Settings tree is inconsistent with other trees
Core. InstallationFeatureIDEA-231898Add .kts to "Create Associations" when installing IntelliJ IDEA
BugIDEA-230734PyCharm uses entitlements to relax the security on the hardened runtime environment
Core. Plugin ManagementBugIDEA-231952Assertion error on uninstalling ini plugin
BugIDEA-231964Plugins: Do not show Install Required Plugins dialog if required plugin(s) are dynamic ones and have been just installed
BugIDEA-232593Couldn't complete installation of dynamic plugins. Exception: class com.intellij.ide.plugins.PluginNode cannot be cast to class com.intellij.ide.plugins.IdeaPluginDescriptorImpl
BugIDEA-232439It is impossible to disable incompatible plugins
BugIDEA-198479Plugins page: popup is not updated when IDE frame moved
BugIDEA-208558Wrong counting of downloaded enabled plugins in the tab Installed
BugIDEA-232600All dynamic plugins prompt to restart IDEA on every enable and disable
Core. Project SettingsUsabilityIDEA-219373Scala SDK data is deleted from libraries/*.xml when Scala plugin is not enabled
TaskIDEA-231216Two <No SDK> options in Projet SDK popup
Core. Quick DocumentationUsabilityIDEA-231778Javadoc rendering does not apply JetBrains Mono consistently
UsabilityIDEA-232455Documentation shown on hover may prevent from using the debugger tooltips
CosmeticsIDEA-232507Add option to enable/disable quick doc on mouse hover to the quick doc popup
Core. Run. ConfigurationsCosmeticsIDEA-200420Temporary configurations limit field size
Editor. Code CompletionFeatureIDEA-231373Treat overloaded method calls as empty so IDEA doesn't introduce spaces within the parentheses
Editor. Color SchemesBugIDEA-231942Changing editor color scheme from light to dark lost the selected theme
BugIDEA-231936New light color scheme is not applied when config is imported
Editor. Diff and MergeBugIDEA-232209Diff window is not scrolling to the first changed fragment on opening
BugIDEA-232322Preview diff changes size of split view
UsabilityIDEA-89710File diff shows usages of element of caret of original editor
Editor. Editing TextFeatureIDEA-159484Add combinations for ligatures in font preview text box
BugIDEA-230941When I press "⌥ + o" or "⌥ + p", I get a wrong character '\uffff'. (default emacs keymap)
Lang. JSONFeatureIDEA-232277Add HAR file type and JSON schema mapping
Lang. RegExpUsabilityIDEA-230642Check RegExp is unnecessarily slow
Tools. DockerTaskIDEA-232299Internationalize Docker plugin
User Interface. Embedded Browser (JCEF)BugIDEA-231063[jcef] implement custom scheme for "file://" protocol
Version Control. GitBugIDEA-231802Revert changes: revert changelist is still displayed after revert was aborted
BugIDEA-232303toString() results are visible/editable in the new rebase window
BugIDEA-94470Case-renamed file disappears from the Changes view on Save
BugIDEA-231681Git branches toolwindow: empty folders are not filtered out
BugIDEA-232562IDEA checks Git version twice when clone dialog is opened
Version Control. LogBugIDEA-216882Diff is not available for changes in external repositories Log
No subsystemFeatureWEB-39998Show property names in completions for indexers
BugWEB-43680Extract parameter causes an exception when invoking inside arrow function
UsabilityWEB-9655Clean-up "New File" dialog
TaskWEB-43677Please make the AWS Toolkit plugin featured in WebStorm
JavaScriptFeatureWEB-34743Support Proposal Logical Assigment: syntax-only
BugWEB-42887'Infer parameter types from usage' causes a freeze when searching for references takes too long
BugWEB-43487JavaScript Array.map() false positive "Contents of collection 'filterNames' are updated, but never queried"
JavaScript. FrameworksBugWEB-43354WebStorm can't recognize Quasar components as of version 1.7.4 (1.7.3. works)
PerformanceWEB-43017Slow scroll in new version 2019.3
UsabilityWEB-43570Vue.js: Make sure plugin is I18N-ed
JavaScript. InspectionsTaskWEB-43640Disable "Unterminated statement" inspection in JavaScript
JavaScript. RefactoringBugWEB-43568'Extract variable' causes an exception in script tag when call inside arrow functions
TaskWEB-43600'Infer parameters from usages' improvements
LintersBugWEB-43643Prettier: incorrect path to prettier package stuck
Node.jsBugWEB-43683'Path mappings' field is missed when create Node remote RC
TypeScriptFeatureWEB-38859Implementing a property with functional type should result in a method implementation
BugWEB-42635'Implement All members' expands type aliases unnecessarily
BugWEB-43663Renaming refactor doesn't refactor callbacks passed to functions
BugWEB-43708Accessing properties after optional chain in conditional causes WebStorm to discount optional chain when calculating type narrowing
BugWEB-43239Generic type not substituted on narrowing
BugWEB-43710typescript keyword completion within '<>' fails when has `=`
BugWEB-43653TypeScript: 'constructor' suggestion erases access modifier
Unit TestsFeatureWEB-33822Jest update all snapshots in file
BugWEB-43467test runner fail when there has a exits run conf with same name
DB ConnectivityFeatureDBE-3522Integration with pgpass

RubyMine 2020.1 EAP3 (201.4865.8 build) Release Notes

Code CoverageBugRUBY-19424simplecov_starter should not print anything on stdout: "Include/Exclude patterns: ..."
CompletionBugRUBY-25387Shift checkbox Show position changes in completion popup to the right and down
DebuggerFeatureRUBY-25432Ruby Debugger pin field to top
BugRUBY-25675Segfault when Pause Program invoked during [Webpacker] Compiling...
BugRUBY-25774step into goes to the wrong target (and related issues)
BugRUBY-25769debugging vm crash on a step into
ExceptionRUBY-25813IDE exception when variable being clicked with RMB in 2020.1 EAP3
DockerBugRUBY-25781Rails Run configuration automatically uses 0.0.0.0 instead of 127.0.0.1 on Windows for docker-sdk
IDEBugRUBY-24356Prevent "Usage in extend/include/prepend" usage type from being triggered with RSpec include method
BugRUBY-25773Disabling the YAML plugin makes RubyMine unable to launch
TaskRUBY-25763Remove obsolete bundle unlock action
TestsBugRUBY-25719Improper escaping when rerunning a single minitest testwhose name includes a single quote
BugRUBY-25782Wrong rspec executable file is taken in case both /bin/rspec and /script/spec are present
Code Analysis. Structural SearchBugIDEA-231441Enum constant argument lists and enum constant initializers are not matched
Core. IDE SettingsExceptionIDEA-228348SystemHealthMonitor - NPE
Core. InstallationFeatureIDEA-195719Extract Java support to a separate plugin in IntelliJ IDEA
TaskIDEA-203640Remove dependency from intellij.platform.util to platform.resources.en
Core. Platform APIBugIDEA-228248avoid "Calculate method parameter info in non UI thread" to restart daemon
Core. Plugin ManagementBugIDEA-231564Plugin disabling by toggling it off in the Find Action popup disables a lot of plugins that don't depend on it
BugIDEA-231658Plugins: on enabling plugin the plugin(s) it depends on are not enabled automatically
BugIDEA-231814Enabling/disabling dynamic plugin via Actions always suggests restarting
CosmeticsIDEA-231654Plugins: correct text in 'Disable Dependent plugins' dialog
ExceptionIDEA-231648AE at com.intellij.ide.plugins.newui.RestartButton.lambda$new$0
ExceptionIDEA-231562Velocity plugin enabling causes exception
Core. Run. TargetsBugIDEA-231610Java debug for docker target fails with `Ports are not available: socket: too many open files`
Core. SSHExceptionIDEA-230859IDE Exception when trying to start SSH session
Core. StatisticsTaskIDEA-229358Please make com.intellij.statistics.validation.customWhiteListRule dynamic
Editor. Editing TextFeatureIDEA-160396Make `Delete to line start` action behavior consistent with Mac
BugIDEA-229719Editor loses selection when context menu is opened
Editor. Intention ActionsPerformanceIDEA-228916IntentionAction.isAvailable() shouldn't be called in EDT on F2 / Shift+F2
Lang. JSONBugIDEA-231779JSON Schema Validator: Integer values restricted to 32 bit during validation
Lang. Shell ScriptBugIDEA-231148Shell: Parsing error for quoted string expansion $'...'
Lang. XPath and XSLTUsabilityIDEA-231642Add proper highlighting of injected XPath in macOS/Windows Light
Tools. DockerFeatureIDEA-218179--network is not a recognized docker build option
BugIDEA-207582Cannot use more than one terminal in container using exec `/bin/bash`.
PerformanceIDEA-217045Docker. FileChooser: expanding folders/opening files from docker-machine containers leads to freezes or makes idea work slowly
User Interface. AccessibilityBugIDEA-225647Mnemonics not working on "View Mode" menu items.
User Interface. Console ViewUsabilityIDEA-231959Cannot see whole Java path on Windows in Run/Debug console
User Interface. ControlsCosmeticsIDEA-225998Scroll bars background is not transparent
User Interface. FocusBugIDEA-231836Focus is moved to wrong IDE windows when modal dialog appears
BugIDEA-202932Unexpected workspace switching after showing MacSheets dialog
User Interface. Keyboard InputBugIDEA-219679Keymaps plugins don't work in AppCode and DataGrip
User Interface. Look and FeelFeatureIDEA-232027Make selection in IntelliJ scheme lighter to leave highlighting
BugIDEA-231665Dracula theme broken with 201.3803.71 update
User Interface. NavigationBugIDEA-231596Enum method is not correctly selected in navbar
BugIDEA-231342Weird nav bar for lambda: surrounding class is missing
CosmeticsIDEA-231316Select the whole line in NavBar popup
User Interface. Project ViewUsabilityIDEA-224710Project view does not show current focus when selecting via keyboard
No subsystemBugWEB-43539Yeoman requires restart after disable
CSSBugWEB-43562Exception after enabling postCSS plugin
DebuggerBugWEB-43315"Step into" does not work for libraries in 2020.1
JSONBugWEB-43566JSON: incorrect syntax after adding a single quote
JavaScriptBugWEB-41959Type is not inferred for named function imported through jsdoc
BugWEB-43614Inline type info not truncated
BugWEB-43622Remove braces intention results in invalid code
BugWEB-43612Flow: statement expected is thrown when a UnionTypeAnnotation is used as type annotation of type parameters.
PerformanceWEB-43019PHPStorm 2019.3 slow perfomance, autocomplete and inline validation take between 1 and 5 seconds to complete
UsabilityWEB-43319A popup to select a field name overlaps on popup 'Introduce field'
JavaScript. FrameworksFeatureWEB-43549Vuex: support namespaced mappers in components
FeatureWEB-43540Vuex: implement store symbols resolution in decorated components
FeatureWEB-26950Vuex: implement store symbols resolution within Vue components
FeatureWEB-43542Vuex: support root actions from namespaced modules
FeatureWEB-43541Vuex: implement resolution of store symbols in qualified references
JavaScript. InspectionsBugWEB-43623unnecessary parentheses in javascript is not unnecessary
JavaScript. RefactoringBugWEB-40377"Replace if-else with ?:" in Vue SFC breaks code
BugWEB-42462'Replace ?: with if-else' produces red code
BugWEB-43507'Introduce field' breaks before generators when code style for semicolons is to omit semicolons
BugWEB-42461AssertionError when call 'Replace with indexer access'
BugWEB-12591Extract variable not pulling near ocurrence
BugWEB-42500"Extract" refactorings don't properly handle ASI rules
BugWEB-25891`Extract variable` does not correctly work with scopes
BugWEB-43573Exclude occurrences in type predicate from refactoring
BugWEB-9805JS: wrong code scope computing
ExceptionWEB-42459AssertionError when call 'Introduce variable' or 'Introduce parameter' in handlebar template
Node.jsFeatureWEB-43383Recognise more .env.* files
BugWEB-43370IllegalStateException when trying to add remote interpreter
SASSBugWEB-43552Disable/Enable Sass plugin throws exception
TypeScriptFeatureWEB-27333TypeScript refactoring: generate type specifier when extracting variable
FeatureWEB-26987TypeScript: "Create Method" should generate signature with return type
BugWEB-43615TypeScript optional chaining is incorrectly resolved when type aliases are used
BugWEB-29438Refactor / Extract Field: Type is not generated
PerformanceWEB-43240High CPU Usage and long waiting when autocomplete in vuex project
UsabilityWEB-41450Provide better handling for long inlay hints (particularly React.useState)
CosmeticsWEB-42210Improve presentation of inlay hints for parameters that have type recursion
TaskWEB-43594Improve "Explicit member type" inspection
Unit TestsBugWEB-43584Unable to run single Karma test with karma-jasmine >= 3.1.0
No subsystemBugDBE-8871Can no longer add "external schemas" in schema list (Redshift)
DB DiffBugDBE-8835Schema diff comparison with DDL. Don't show differences for native and default words
DB IntrospectionBugDBE-8344Viewing or editing procedures on DB2 for i (AS/400) systems fails
BugDBE-4856Azure: db_id() doesn't work, we need a workaround
BugDBE-8504DB Synchronize failure
DB RefactoringBugDBE-8889Sqlite Constraint Check lost when table is modified
DB Schema ViewsUsabilityDBE-1476Change shortcut for Refresh action in Database Tool Window
Data Import & ExportFeatureDBE-2640[Feature Request] Download query output as markdown table
BugDBE-8732CSV Import - please swap default LOB from Text to varchar(max) to better support modern (post 2005) versions of SQL Server
Data ViewsBugDBE-8857Query width gets wider and wider with each return (visual bug)
BugDBE-8788BLOB Record modifications in Database explorer, after automatic reload, shows a Java object reference
SQL CompletionBugDBE-8785Some objects are not loaded in the completion popup
SQL Format and StyleBugDBE-8845Cursors need to be left-aligned
SQL GeneralBugDBE-10031Everything is red
SQL GenerationBugDBE-8826After editing a package, the last ; is removed during submission to database
SQL HighlightingFeatureDBE-8330Datagrip literals auto-injection

RubyMine 2020.1 EAP2 (201.4515.22 build) Release Notes

Code CoverageUsabilityRUBY-14333Coverage report in the IDE differs from report in the HTML browser
Code InsightPerformanceRUBY-25487Suboptimal caching due to recursion prevention during symbol hierarchy traversal
UsabilityRUBY-3397Find usages of new call should find all new instance creations of given class
CompletionFeatureRUBY-24577Override method by typing it's name in derived class
DebuggerBugRUBY-25618ruby vm crash on a step into
BugRUBY-25679ruby vm crash on a step
DockerUsabilityRUBY-25193Service field in docker-compose sdk dialog is shown without placeholder
EditingExceptionRUBY-25652IDE exception when trying to double click inside a HEREDOC
IDEBugRUBY-25298Echoed input and duplicated prompt in IRB and Rails consoles
UsabilityRUBY-25518Remove the 'Run with sudo' option for Bundler since it should not be run as root
RailsBugRUBY-25761Rails console doesn't start in 2020.1 EAP
RefactoringsBugRUBY-25648Calling `Override Methods...` inside methods doesn't work the way it's expected
BugRUBY-25650Visibility isn't inhereted in `Override method` action
UsabilityRUBY-25649Don't run template on `Override method` action
Core. IDE SettingsBugIDEA-230500Fail to change the sync account after I delete the account
TaskIDEA-169262Settings: move "Tooltip initial delay" option under registry key
Core. IDE Settings. SharingTaskIDEA-231281Fix Sync Settings to JBA options location in the Main menu
Core. InstallationBugIDEA-231073Uninstalling IDEA doesn't delete caches and config
UsabilityIDEA-230819Installed custom plugins are lost after updating if custom idea.config.path is used
Core. Navigation and SearchBugIDEA-230721Method name in "Recent Locations" is truncated unnecessarily
UsabilityIDEA-147434Navigation bar: File list should use natural sort order
Core. Platform APIFeatureIDEA-230423Allow to call commitDocument in background threads for documents with non-physical files
TaskIDEA-230811Report IDE error when the same reference resolves to non-equivalent results in different threads
Core. Plugin ManagementBugIDEA-229772IDE freezes after updating plugins
Core. Project SettingsCosmeticsIDEA-227208Grammatical error in IDEA UI for setting up project
Core. Quick DocumentationBugIDEA-230513Parameter Info doesn't work for Java and Kotlin methods
BugIDEA-231385External documentation providers shouldn't be running under read lock
Core. Run. ConfigurationsBugIDEA-230605The beforeRun Maven tasks before run Application
UsabilityIDEA-231069Edit Run Configurations dialog: new RC adding doesn't work when you use quick search for navigation to node with subnodes
Editor. Editing TextBugIDEA-231047Auto-import on the fly doesn't work in files modified in non-default changelist
Editor. Intention ActionsFeatureIDEA-222636Intention preview
Lang. Shell ScriptBugIDEA-231408Shell Script plugin: Bash Terminal rewrites script file path in a way that bash shell can't read it
BugIDEA-227953Shell script: terminal tabs are not respecting the run configuration title
Lang. XPath and XSLTUsabilityIDEA-230950XPath in language injection fragments is highlighted with confusing red color in Darcula
Tools. DockerFeatureIDEA-190810Support for multiple tags when building
Tools. TerminalBugIDEA-231032Cannot open new terminal tab in RubyMine
ExceptionIDEA-231286"Open in Terminal" action fails to run
User Interface. ControlsBugIDEA-230825Color Scheme UI: field with color value is always showing truncated text
User Interface. Embedded Browser (JCEF)BugIDEA-230863JCEF white flash on load
User Interface. Find, Replace, UsagesBugIDEA-209596"Invoke Show Usages again to search in all files" doesn't work
BugIDEA-231072intellij idea incorrect processing of regex: “regular expression matches empty string”
BugIDEA-230545'Search Accessors' dialog is shown simultaneously with 'Show Usages' results popup
User Interface. Look and FeelBugIDEA-228042Project description floats freely on screen
User Interface. NavigationUsabilityIDEA-11943Navigation bar: Alt-F1 should immediately open list
User Interface. Services ViewExceptionIDEA-231056AE at com.intellij.database.dataSource.DataSourceStorage.readState
Version Control. GitBugIDEA-228523When cherry-picking with git, the automatically opened Commit dialog deselects the first file
BugIDEA-231282Throwable at com.intellij.vcs.log.impl.PostponableLogRefresher.addLogWindow
BugIDEA-230743Clone button stays disabled after installing Git
Version Control. LogCosmeticsIDEA-228572Git log: two different colors for link rendering
No subsystemBugWEB-43484'Introduce variable' breaks for 'as' type casts in TypeScript if no whitespace after parentheses
ExceptionWEB-43488NullPointerException when enable prettier plugin
HTMLBugWEB-43422"Insert closing tag on tag completion" can't be unchecked & saved
JSONBugWEB-43447Java process of IDE stays alive after ide is closed if project contains JS files
JavaScriptFeatureWEB-43397JavaScript: enable completion autopopup in string literals if the context type is an union type with string literals
BugWEB-43327React.js: "Expand selection" works incorrectly in Redirect tag expression
BugWEB-43443syntax error on object spread with `in` and conditional operator
BugWEB-41899Do not suggest Class as a class name after the `class` keyword
BugWEB-20508Quick Definition of default item imported via ES6 import statement results in viewing import statement not definition in actual import
BugWEB-43375'Extract field' doesn't insert element with this when invoking inside array or indexer
BugWEB-43307"Extract constant" does not work when selecting incomplete part of the expression in a function return
BugWEB-43351'Extract variable' does not work when selecting the last part of the expression with minus
PerformanceWEB-43493IDE Freeze in 2019.3.2
UsabilityWEB-43369Popup 'Extract field' jumps to first occurrence
UsabilityWEB-41072Show file path in "Choose declaration" popup
JavaScript. FormatterUsabilityWEB-43227Improve action name in the intentions popup when suggesting to import code style
JavaScript. FrameworksBugWEB-42012jsconfig.json is not supported in *.vue files
BugWEB-38949'Closing Tag' suggestion box incorrectly suggests tags which have already been properly closed in JSX files
BugWEB-42439Live Templates: Angular: correctly expand a template invoked in the class context
BugWEB-43348Code completion doesn't work unless React typings are installed
JavaScript. InspectionsBugWEB-42349'Assignment used as condition' should not be reported for mutable loop conditions
UsabilityWEB-43346Improve warning in the Potentially invalid constructor usage inspection
JavaScript. RefactoringBugWEB-43332Introduce Variable leaves unnecessary parentheses
BugWEB-39734Extract field: should introduce after the initialization in constructor
BugWEB-43435Introduce variable fails with parenthesized expressions in return in if-else without braces
BugWEB-39972Move module member: should not be available when caret is on reference to readonly library file
BugWEB-43309'Introduce variable' adds braces in the wrong sequence for arrow functions nested in invocations
BugWEB-38311'Change signature' doesn't work with tagged template usages
BugWEB-43483'Extract variable' removes parent expression when called on a string without quotes
BugWEB-43344Introduce field: wrong scope detection when extracting a constant substring of a template literal referencing inner vars
ExceptionWEB-39078Exception when invoking in-place introduce var from expression with parenthesized occurrences
ExceptionWEB-42437'Extract variable' causes an exception in script tag in HTML
LintersBugWEB-43396Support Prettier with Yarn PnP >= 2.0.0-rc23
BugWEB-43384Support ESLint with Yarn PnP >= 2.0.0-rc23
Node.jsFeatureWEB-38187IntelliJ IDEA cannot find Yarn binary when Yarn is installed with Yarn Version Manager
BugWEB-43414Support Mocha with Yarn PnP >= 2.0.0-rc23
BugWEB-43298Can't install packages with yarn 2.0.0-rc22
SASSBugWEB-43264SASS/SCSS inspection error when using '#' with '$'
TypeScriptFeatureWEB-43379Support using ttypescript as Typescript language service
BugWEB-40099TypeScript - incorrect "Remove unused field" quick fix
BugWEB-43352TypeScript: mapping between ".ts" and ".d.ts" files works incorrectly for variables
BugWEB-42061Typescript code completion (For casting return type)
BugWEB-40535Quick documentation for import types in TypeScript TSDoc
BugWEB-43431Completion should autopopup for object type members
BugWEB-43406Improve completion after 'readonly' in types
BugWEB-43238'Generate destructuring patterns' fails on assignment property of enum
BugWEB-40503TS: Incorrect completion in generics
BugWEB-42139Add JSON files to Typescript import completion
BugWEB-42812Add `declare` Property Modifier to completion
PerformanceWEB-43333TS: Auto-import quick-fix consumes a lot of EDT time
UsabilityWEB-41913Impossible to differentiate entries with same name in the same-named files in Search Everywhere, Go to Class, and Go to Symbol
TaskWEB-42637Investigate support for TypeScript with Yarn 2
Unit TestsBugWEB-43355In failed karma tests links follow to localhost, not to the file system
BugWEB-43290Running single Jest test fails if a project directory is a symlink
DB DiagramBugDBE-9903DB Diagram shows constraint differently in 2019.3 version
DB IntrospectionBugDBE-9980Auto sync is not working if create schema and objects from console
DB Schema ViewsUsabilityDBE-7219"Import from sources" action is unclear
SQL CompletionPerformanceDBE-9844Huge freeze during autocomplete database table names in joins

RubyMine 2020.1 EAP1 (201.3803.68 build) Release Notes

No subsystemBugRUBY-25492RubyMine 2019.3 freezes or "grey outs" after a few minutes
Code InsightFeatureRUBY-25529Add "Namespace declaration" usage type classification for modules
FeatureRUBY-25514Improve text-based resolve to consider parameters and call arguments
FeatureRUBY-25512Add text-resolve to `super` for inside modules
FeatureRUBY-24976as a fallback, symbol to method resolution support should be available everywhere
BugRUBY-25206RubyMine does not handle overridden predicate and bang methods
BugRUBY-22865Group BasicObject children with Object/Kernel in auto completion
BugRUBY-22562YARD - RubyMine adds excessive lines between @params tags generated for a method
BugRUBY-24915`super` type isn't recognized
BugRUBY-24935RubyMine think that empty singleton method returns `Class`
BugRUBY-21841add type prioritization during type inference.
BugRUBY-23950File.open not correct type inference depending on whether block passed or not
BugRUBY-15259Support Module#module_function
BugRUBY-24546`Class` type isn't recognized correctly
BugRUBY-25269instance_eval/instance_exec context type inference
BugRUBY-16379Type hinting doesn't work proper inside a block (YARD)
BugRUBY-18296Find usages for method does not respect super calls
BugRUBY-24988Overridden Object#class Object#to_s Class#new method wrong type inference
BugRUBY-25226YARD can't recognize top level namespace like "::Kernel", "::String"
BugRUBY-24729"Add @param tag" bugs
BugRUBY-18544trailing comma in a method call is not flagged as an error
BugRUBY-25044RubyMine doesn't expand constant conditions in ternary operators
BugRUBY-24759First method declaration is opened automatically if multiple declarations are available
BugRUBY-24146"go to implementations" for constants does not work
BugRUBY-25271fails to resolve symbols passed to Object#method
UsabilityRUBY-24560Tidy up resolve of `self`/`nil`/`true`/`false`
CosmeticsRUBY-25375Go to declaration display is different for dynamic elements
TaskRUBY-23434Factory Bot - remove dependency on ModelSymbol
TaskRUBY-24760Remove `RTypeWithContext`
CucumberBugRUBY-24324Cucumber tags are coloured white and not teal as before
DebuggerFeatureRUBY-25397Debase-0.3.0.beta19 doesn't install with ruby-2.7.0-preview3
FeatureRUBY-24510Obtain ruby collections elements lazily
FeatureRUBY-16846rails console in the debugger should have a separate debugger console
BugRUBY-24961F7 does not step into super
BugRUBY-24839"connecting to debugger" dialog that flashes too briefly to be read, every time you debug, is not helpful
BugRUBY-24105hash string value inspections are not quoted
BugRUBY-24992Debugger doesn't enter while, if and until blocks
BugRUBY-24940Pause program button doesn't work with ruby-debug-ide 0.8.0.beta6
BugRUBY-25398Pause program button doesn't work when debugger attached to project
BugRUBY-25176Debugger couldn't stop on the breakpoint
BugRUBY-25664Segfault when trying to run irb/rails console in debug mode with ruby 2.7.0
BugRUBY-25155debugger loop stepping problems
BugRUBY-25478Debugger error when debugging multithread rails app
BugRUBY-24895Attach to process doesn't stop on previously created breakpoints
BugRUBY-24993Debugger doesn't step into .call method
BugRUBY-24836hash inspection does not show a nil key
BugRUBY-25048Debugger works incorrectly with rescue ensure block
BugRUBY-25290IDE Exception when debugging
BugRUBY-20930Ruby Debug IDE GEM fails to install from RubyMine with system Ruby
BugRUBY-25477Debugger crash when debugging multithreading app
BugRUBY-24991Set breakpoin All options selects only single line
BugRUBY-25030Debugger doesn't stop in controllers
BugRUBY-24983F7 on `begin` steps into the method invoked on the next line and steps out back to the begin line
BugRUBY-25028Debug fails when debug view templates
BugRUBY-25641an earlier breakpoint prevents a later one from breaking
BugRUBY-25619smart step into does not step, resumes
BugRUBY-24984ruby 2.4.6 vm crash stepping into a method in an if block in a begin block
BugRUBY-17357debugger callstack frames don't show correct names for meta-programming defined methods
BugRUBY-24797Attach to local process doesn't work
BugRUBY-25029Debugger doesn't show next line correctly
BugRUBY-24781"Uncaught exception: uninitialized constant" when starting a Rails app in debug mode
BugRUBY-25107Interactive console cuts output at 1000 chars
BugRUBY-24688Got Exception : DebuggerThread are not supposed to be traced... with new Ruby-debug-ide 0.8.0 beta3
BugRUBY-24981F7 does not step into initialize
BugRUBY-25442debase 0.3.0.beta19 Segmentation Fault on Ruby 2.6.5 when introducing syntax errors
BugRUBY-25135RubyMine does not allow to perform Smart Step Into using Shift+F7 when 'Always perform smart step into' is disabled
BugRUBY-24834step into gets stuck on "Can't step into method because it has a c-level implementation"
BugRUBY-25163Debugger doesn't step into super with variables
BugRUBY-24831Experimental debugger doesn't stop on breakpoints with ruby 2.7.0-preview1
BugRUBY-25039The new experimental debugger does not stop at the breakpoint in RSpec test running with Spring and ruby 2.6.3.
BugRUBY-24982New Debugger ignores breakpoints in rescue blocks
BugRUBY-25336Debugger fails to start with jruby-9.2.9.0
UsabilityRUBY-25234Add styling to symbols in debug variables screen
UsabilityRUBY-25020Message about installation debug gems mentions only debase
DockerBugRUBY-25421IP Address in Rails run configuration is 127.0.0.1 instead of 0.0.0.0 on Windows
BugRUBY-25236Docker: working dir is not passed in case of exec mode
BugRUBY-25500NPE if run app in debug with Docker sdk
BugRUBY-19694Server pid is not removed after stop remote debug with docker-sdk
BugRUBY-25431Breakpoints are not hit in case of multi-module project with docker-compose SDK
ExceptionRUBY-25335RM unable to fetch gems with docker SDK
EditingUsabilityRUBY-25454[REGRESSION] Space after hash for line comment
CosmeticsRUBY-25341Consider removing "Edit Ruby19RegExp fragment" intention action
IDEFeatureRUBY-11850Option to filter variables in the Structure view
FeatureRUBY-8054Feature Request: Add the IDEA Copyright plugin to RM ...
FeatureRUBY-24658Offer to search for the parent method when invoking find usages
FeatureRUBY-24906Multi line todo's no longer work
FeatureRUBY-25554Update "Go to Super" to offer all candidate super methods, not just the immediate
BugRUBY-25090Run Anything remember text in command which wasn't run
BugRUBY-24615Find usages of a fake YARD element has strange text in the tab
BugRUBY-24997Redundant options in Tools menu
BugRUBY-22179Possible to install Ruby plugin to RubyMine
BugRUBY-25095Search `rake migrat` doesn't display rake db:migrate in Run anything
BugRUBY-24290Switch Rake tasks/Rails Generators to Run Anything
BugRUBY-25476Search everywhere doesn't search through yml files via YAML path
BugRUBY-25323Export Settings doesn't work
BugRUBY-18758Ruby SDK and Gems list refresh produce visual glitching
BugRUBY-25305Run/Debug options not presented in context menu right after toggle breakpoint
BugRUBY-25026RM Internal Error with clean initial configuration
BugRUBY-25483[RubyMine 2019.3][File and Code Templates] Predefined template variables were replaced as empty string after files created
BugRUBY-21440New Rails project wizard: rendering issue and constant refreshing while typing the app's name
BugRUBY-25073RM projects moved below Web Projects in Create New Project wizard
BugRUBY-24845move cursor to code block end/begin does not work for opened singleton classes
BugRUBY-24396Update ruby class/module/method & other relevant elements to support "ctrl click/hover" for "Show usages of X"
BugRUBY-25313Ctrl hover with mouse shows wrong tooltip for undefined superclass clauses
BugRUBY-25366Keymaps in 2019.3 are changed
PerformanceRUBY-25391IDE is extremly slow and freezing during regular work
UsabilityRUBY-24575Tidy up our inspection/intention settings text and groupings
UsabilityRUBY-25093Add filter include undocumented for Rake tasks/Rails Generators in Run Anything
UsabilityRUBY-25520Provide the capability to install Bundler whose version differs from installed in SDK
UsabilityRUBY-25247Ensure help commands in Run Anything are sorted logically
UsabilityRUBY-25036Custom matcher for rails generate and space after rails g
CosmeticsRUBY-25145Update remaining Ruby File templates to use new template selection dialog
CosmeticsRUBY-24670Move "Run Rails Generator..." below "Ruby File/Class" in new dialog
CosmeticsRUBY-25212Rename "New Scratch File" to just "Scratch File" in project view "New" context menu
TaskRUBY-24291Change Ruby plugin file version from date to the build number
TaskRUBY-25351Remove old Darcula migration code
InspectionsFeatureRUBY-23098Implement possibility to configure RuboCop severeties mapping
FeatureRUBY-24386Add warnings for lambdas without blocks in 2.7 and above
BugRUBY-24951noinspection comments do not function when tab is used as indentation
BugRUBY-25235Incorrect warning: return statement inside class or module body
BugRUBY-24716'Add @param tag' inspections displays in search by inspection results block's variable as not annotated
BugRUBY-24156super in initialize shows arguments for class not super class. flagged as error
BugRUBY-25389%w inspection uses parens when it should use brackets
BugRUBY-24273Super call with no super classes actually defined. False positive. Dynamic class initialization
BugRUBY-25320Duplicate spellchecker warnings for classes, modules and alias statements
BugRUBY-24874Incorrect "Don't put space before arguments parentheses" with range as array declaration
BugRUBY-25634invalid "super call with no superclass defined" for a Module.new{} block
BugRUBY-24865Incorrect "Safe navigation can be omitted" inspection
BugRUBY-24801Ruby parser error
BugRUBY-25270"!" and "?" method suffixes are not ignored by the spell-checker
BugRUBY-22401Useless assignment inspection incorrectly deletes assignment when last line in a method
UsabilityRUBY-25043Update texts for intentions
UsabilityRUBY-25371Update elements that intentions can be invoked on
ExceptionRUBY-25184IDE exception while code writing
ParsingBugRUBY-24756Parser finds fault with valid block parameters
BugRUBY-22349Lexer/Parser sometimes does not reparse "corrected" syntaxes
BugRUBY-24780Trailing comma is not allowed in method definition
BugRUBY-24827Unexpected syntax error in changing inherit class
ProfilerBugRUBY-23795'Attach to' doesn't show any process for profiler on Windows
BugRUBY-25031ruby-level calls color in profiler graph changed to blue
RailsFeatureRUBY-15415default Property Key for I18n string value creation
FeatureRUBY-25325Rails 6 raises deprecation warning after running an application with the explicitly specified server
BugRUBY-25091YAML error on value with embedded Ruby code
BugRUBY-24928IDE Error when trying to run Tools|Run Rails Generator...
BugRUBY-24752YAML editor reports invalid property key
BugRUBY-19092Class names are not recognized when prefixed with "::"
BugRUBY-24949Rails Generators action is available for non-rails projects
BugRUBY-25285Don't show "Rails console" in Run Anything for non-rails projects
BugRUBY-13581Navigate to test file does not work when model is in nested folder
ExceptionRUBY-25248No suggestion in rails console when application stopped on breakpoint in rails view
ExceptionRUBY-24694Exception renaming a class
Rails. Code InsightFeatureRUBY-3953Type support for fixtures call
FeatureRUBY-12472Support autocomplete for additional column types and options in create model/migration
BugRUBY-24931Incorrect name resolve when used with db migration file
BugRUBY-24095'Missing argument' raised when using ActiveRecord "take" method
BugRUBY-24163False warning "Extra call argument" for order method
BugRUBY-25293RM doesn't resolve routes
BugRUBY-24957fails to resolve a method symbol passed to .try!, when the method is otherwise resolvable
BugRUBY-25274Gutter icon for name-spaced classes is missing
BugRUBY-24970symbols passed to rails `delegate` don't resolve
BugRUBY-25434RubyMine hang frequently
BugRUBY-24404invalid "extra call argument" inspection for has_one assoc
BugRUBY-16272editor fails to resolve partials in view folders of superclasses
BugRUBY-24954fails to resolve :unless attribute symbols on validation helper methods
BugRUBY-25410Completion contains incorrect "instance_predicate" value from "class_attribute"
BugRUBY-25190Add self-type support in rails syntactic sugar methods `test '' do ... end` & friends
BugRUBY-25611"Unexpected parameter value for method call" when delegating to a Ruby expression
BugRUBY-24651Fix support for find usages on rails enums
BugRUBY-25469Treating valid YAML as invalid ruby code in Rails locale file
BugRUBY-24129ActionMailer: Wrong autocompletion, nonexistent create_* and deliver_* methods
BugRUBY-21636polymorphic associations support does not work with concerns
Rails. ParamdefsBugRUBY-23300Ensure used association references in parameters support polymorphic associations
RakeFeatureRUBY-23953Gutter run icons for Rake tasks missing
BugRUBY-25252Rake tasks could be not uploaded into Run Anything popup
RefactoringsBugRUBY-22561Delegate call type creates references that refer to the call, not the arguments - this impacts rename refactoring, find usages, etc.
BugRUBY-15023Cannot Rename overrided methods
Ruby Version ManagersCosmeticsRUBY-24753Infinite Updating message when using rbenv-gemset in Settings section
Ruby. FormatterFeatureRUBY-24792Feature request: Code Style option to choose between inline or multiline empty class
FeatureRUBY-17293option to align method chains to the start of the chain (initial receiver)
BugRUBY-24748Extra indentation added for second & subsequent arguments in class methods
BugRUBY-20969New line in multi-line hash definition is not indented when typing
BugRUBY-24524Minitest do block has spaces instead of the tabs as in settings
RubyGemsBugRUBY-25354vendor cached git gems are not shown in external libraries
BugRUBY-19743External libraries still shows global version of git gem if it's located in vendors/cache and global libraries simultaneously
TestsFeatureRUBY-23649Navigating to test via command should create test file if not existing
BugRUBY-9998Mailer related tests/specs are not found
BugRUBY-25118Rerun failed tests doesn't work for minitest
BugRUBY-25011`subject` local variable is mixed up with RSpec's `subject`
BugRUBY-25230Set "test" and "spec" as default "test source" folders for simple ruby applications, and gems
BugRUBY-25228Create new "Ruby Test" for Minitest/Test::Unit should ensure test files end with "Test"
BugRUBY-25035Debug 'All Specs in […]': default file name mask does not work (surplus apostrophes)
BugRUBY-16131Ruby plugin doesn't detect methods of described_class in specs
BugRUBY-25064Minitest tests: there're no run gutters in the Editor
UsabilityRUBY-20386No detection which Test Framework is used in the project
UsabilityRUBY-24174Test run Configurations show list of loaded files which is useless
UsabilityRUBY-20915Running Single Tests with shoulda gem and minitest is not possible
TaskRUBY-24742Do not show menu Item to run Minitest on RSpec files and vice versa
Type InferenceBugRUBY-25630Incompatible types: Class <-> Object
WSLBugRUBY-25284Gem downloading hangs after adding WSL as a remote interpreter
Code Analysis. DuplicatesBugIDEA-221014Many "JavaScript/TypeScript" entries in duplicate settings.
Code Analysis. InspectionFeatureIDEA-227586Warn on returning Nullable from Flux/Mono transformation should support method reference
BugIDEA-218302On pressing F2 only one problem is shown in the inspections tooltip
BugIDEA-227840Intention does nothing when rethrow exception
BugIDEA-229184@Contract falsely report warning for methods that contain unchecked casts
BugIDEA-227141Quickfixes in the Inspections view are reordered
BugIDEA-222909Typo that selected in Inspection Results tree is not highlighted in batch editor
BugIDEA-229617NullPointerException in ex.GlobalInspectionContextImpl
BugIDEA-198830Slow inspections in IDEA
BugIDEA-230363Freeze in StreamApiMigrationInspection when StringBuilder-append-loop is followed by append to another StringBuilder
BugIDEA-220740Run Inspection -> Custom Scope value is not persisted
BugIDEA-224533Inspections from command line fail with "TFBlockNameValidness descriptionUrl==TFBlockNameValidness "
PerformanceIDEA-220137Do not run inspection iterations if LocalInspectionTool returned PsiElementVisitor.EMPTY_VISITOR
UsabilityIDEA-221001Quick fixes on an inspection warning should have higher priority than Run/Debug actions
UsabilityIDEA-227280Running Inspections From Command Line: Errors logged for every missing description
Code Analysis. Language InjectionFeatureIDEA-217838Text blocks: edit injection fragment should trim left spaces
FeatureIDEA-221416AssertJ language injection rules as built-in rules
FeatureIDEA-106449Support template language injection
FeatureIDEA-230418Apache DbUtils: add language injections for AsyncQueryRunner
BugIDEA-230409jOOQ: DSLContext.batch() injections disappear at adding comma before the next `string` param
BugIDEA-223046Strange highlighting in injected HTML text block
BugIDEA-218402Database plugin - SQL syntax highlighting is not working in JavaScript strings if DECLARE is used
ExceptionIDEA-221436NullPointerException when move folders in project tree
Code Analysis. Structural SearchFeatureIDEA-203910Find enhanced switch statements and switch expressions
FeatureIDEA-229632Support regex type filter and allow to select/switch in UI
FeatureIDEA-223337Search for Java methods should find methods with receiver parameter
BugIDEA-225633matching multiple fields in single declaration fails
BugIDEA-224120Replace element with unmatched annotation variable fails
BugIDEA-219700'Search Structurally' with selection uses scope different from selected in UI
BugIDEA-227210Extra semicolon inserted on replace
BugIDEA-196360Replace structurally removes spaces between repeated elements
BugIDEA-65982Structural search and replace doesn't correctly substitute annotation parameters
BugIDEA-226256Can't find comments in XML/HTML
BugIDEA-221361Replace variable number of parameters with fixed type correctly
BugIDEA-223146PsiInvalidElementAccessException: Element class : on SSR replacing annotation
BugIDEA-224957Searching for javadoc with text and doc tag ignores text
BugIDEA-227675Structural search doesn't work with JSX
BugIDEA-226388Existing template "<li> not contained in <ul> or <ol>" doesn't work
BugIDEA-221558SSR inline preview does't get updated on editor document change
BugIDEA-224871"does not match anything" warning when searching string literal
Core. DebuggerBugIDEA-224914move watch up/down doesn't work
BugIDEA-220181Debugger ignores stepping filters when using new directed step-into
UsabilityIDEA-225449View action for multiline strings in debugger
CosmeticsIDEA-222515Doubled single quote: Source file changed or found source file does not correspond to the breakpoint''s file
ExceptionIDEA-227153NPE at com.intellij.xdebugger.impl.evaluate.quick.XDebuggerInstanceTreeCreator$InstanceEvaluatorTreeRootVal ue.computeChildren
Core. DiagramsFeatureIDEA-229795Support record creation on UML diagrams
BugIDEA-223512UML Diagram: missing "Save as UML" button on a toolbar
BugIDEA-210021Undo is not afailable for file after some diagram is shown for it
ExceptionIDEA-222053NewJavaDiagram action causes NPE
Core. File SystemFeatureIDEA-224971fsnotifier: support osxfs mounts
FeatureIDEA-152607Non-destructive "safe write" mode
BugIDEA-224079Open File or Project only showing one directory in home
BugIDEA-228441"Must not intern long path" exception when importing a Maven project
PerformanceIDEA-218043Freezes in scheduleInitialVfsRefresh
Core. IDE SettingsFeatureIDEA-26855Store IDEA caches under LOCALAPPDATA directory by default
FeatureIDEA-22407Follow XDG directories on Linux
FeatureIDEA-215428Add relative file path live template function
BugIDEA-221456Options for Inlay Hints are rendered too slow
BugIDEA-219420"Editor | Inlay Hints" settings are not persisted between restarts
BugIDEA-211157File and Code Templates shows incorrect include header for Default scheme
BugIDEA-228645Some of the bundled plugins only show up when searched for in the actions panel and not in the Plugins page.
BugIDEA-221939Settings for new project are applying only after restart
BugIDEA-222803Customize Menus - Navigation Bar popup menu items are not saving
BugIDEA-227350Deleted projects automatically reappear on welcome screen after restart
BugIDEA-198276Registry returns default values (not the user ones) at early stages of application loading
BugIDEA-225446Make inlay hint list in settings searchable
ExceptionIDEA-223425Shell environment not loaded
Core. IDE Settings. SharingBugIDEA-220697Intellij 2019.2 cannot sync settings on linux
BugIDEA-229449Settings sync via JetBrains Account broken after update
BugIDEA-219853Cannot enable nor trigger IDE Settings Sync
UsabilityIDEA-208370"Invalid credentials. Click to authorize" tooltip should make it clear which credentials exactly are invalid
CosmeticsIDEA-207765Illegible small font on regular DPI monitor for dialog IDE Settings: Sync Plugin
Core. IndexingFeatureIDEA-225580Make "find in path" work in dumb mode via TrigramIndex, IdIndex
PerformanceIDEA-219456Contentless indices load file content due to file type detection
UsabilityIDEA-227471IDE unusable after copying a folder from explorer to project
ExceptionIDEA-224749Possible `IndexNotReadyException` when adding package-info.java
Core. InstallationFeatureIDEA-194011Turn vcs.log.graph module into a healthy maven dependency
BugIDEA-206343[JRE 11 installers] There is suggestion to download jre for 32bit launchers, but it is jre 8
BugIDEA-224100Windows launcher is fragile under externally-imposed SetDllDirectory context
BugIDEA-224371Allow to use custom size for spalsh image in launcher.
BugIDEA-228606IDEA community lacks "Community" in the installation path
BugIDEA-222834Cannot open project by relative path across different IDEA instances
BugIDEA-196722Toolbox idea shell script is no longer able to understand relative paths on macOS
BugIDEA-230993Relocate application directories on macOS
UsabilityIDEA-206803Restart WildFly server after update despite canceling
TaskIDEA-220738Bundle Kotlin 1.3.50 with IntelliJ IDEA
TaskIDEA-224517Add additional logging to macOS launcher to find out why bundled JBR is not picked up
TaskIDEA-219542Enable Bytecode Verification by default
TaskIDEA-227756Bundle Kotlin 1.3.61 with IntelliJ IDEA
TaskIDEA-191884Extract platform classes to separate JARs in IDEs distributions
TaskIDEA-224889Please add release/eap/nightly flag to product-info.json
TaskIDEA-224508Bundle Kotlin 1.3.60 with IntelliJ IDEA
Core. LicensingBugIDEA-227677dotTrace and dotCover losing license from License Server after Rider restart
BugIDEA-227355New license dialog: different license info
BugIDEA-227707Critical startup error related to the license server registration
PerformanceIDEA-222244IDE start takes several minutes when there is no network connection
UsabilityIDEA-230372Trim spaces in credentials fields
Core. Navigation and SearchFeatureIDEA-160274Field Call Hierarchy
FeatureIDEA-222802Feature request: Quick Type Declaration
BugIDEA-221398Go to Declarations and Usages from popup doesn't jump to class definition
BugIDEA-2252112019.3 EAP unable to find file with "Content Root Path"
BugIDEA-227390Cannot see hierarchy of subclasses with the same name loaded from different modules
Core. Platform APIFeatureIDEA-203508Provide an API for mixing goto results from different sources
FeatureIDEA-219946API to determine a command-line, which started current IDEA
BugIDEA-223074IDEA has to report regarding corrupted files / plugins
BugIDEA-229061WinProcessListHelper.exe crashes on Windows 7
BugIDEA-225026submitTransaction code shouldn't be executed inside just appeared progresses
BugIDEA-223894PluginException trying to use ServiceManager to get service with multiple constructors
BugIDEA-219855Unable to build an empty IDEA plugin project with 2019.2 target
BugIDEA-226561Disposer.register should be documented to throw IncorrectOperationException when the parent disposable is disposed
BugIDEA-225641Large soft-reference cache (1.3GB) on ResolveCache.myPhysicalMaps
BugIDEA-220169Bug in matching words with the same ending and starting letters in pair words by MinusculeMatcher
BugIDEA-228530False positive "Suspicious package-private access" with unrelated package-private no-arg superconstructor
BugIDEA-223709RubyMine 2013.EAP creating more than 800 threads on opening, freezing the IDE and slowing the computer for several seconds
UsabilityIDEA-212107Need a way to respond to file edit without creating a FileEditor in a plugin
TaskIDEA-228809Fail tests when a recursion prevention leads to prohibited caching
TaskIDEA-224840Move ApiStatus annotations to java-annotations library
Core. Plugin ManagementBugIDEA-231059IDEA UI Freeze on disabling dynamic plugin
BugIDEA-225468"Notification group Profiling is already registered" on installing first theme plugin
BugIDEA-229608Custom Plugin Repositories dialog: Just entered link is empty after reopening dialog
BugIDEA-226071'null' values instead of Settings tabs are displayed on clicking "Cancel" in Settings dialog after installing a keymap
BugIDEA-224020dialog IDE and Plugin Updates doesn't appear on installing a plugin and closing the Plugins dialog
BugIDEA-224401"Updatable" plugin is duplicated in plugins list until restart
BugIDEA-222461Plugins management: incompatible plugins reporting is incorrect
BugIDEA-224881Color scheme is available upon IDEA restart after uninstalling theme plugin
BugIDEA-224223Theme plugins installed from disk disappear after update
BugIDEA-231059IDEA UI Freeze on disabling dynamic plugin
BugIDEA-225120Search bar in Plugins Marketplace does not react to some search query changes
BugIDEA-225613Theme plugin installed from welcome screen on first start is not available until restart
BugIDEA-222061plugin can not be installed just after IDEA downloading and installing
BugIDEA-222960Plugin conflict between included plugin and Markdown Navigator
BugIDEA-225451IDEA dies with low memory on updating the applied theme plugin
BugIDEA-224408No label on enable/disable theme plugin after clicking on Apply
BugIDEA-226516Null pointer exception in `IdeaPluginDescriptorImpl.readDependencies` when installing the official Rust plugin.
BugIDEA-219259Queries in plugin list unavailable during indexing
BugIDEA-224230Updating theme plugin from incompatible version requires IDE restart to apply changes
BugIDEA-198510Action "Install plugin from disk" is not found in Find Action
BugIDEA-226962Can't install Rust plugin on 2020.1 nightly
BugIDEA-225552Plugin.xml parsing: strip whitespace from <depends> plugin ID tag value
BugIDEA-224855Plugin Manager: a lot of plugins are falsely marked as uncompatible
BugIDEA-225615Theme plugin is shown as uninstalled after disabling
BugIDEA-223587Plugin Settings: No way to disable dependent plugins once the user pressed "cancel" in the corresponding question dialog
BugIDEA-225789Keymap is not added if Apply button is pressed after keymap plugin installation
BugIDEA-224220Theme is partially changed after uninstalling plugin
BugIDEA-226608"ReSharper (macOS)" keymap is applied on Windows by default after installing Resharper keymap plugin
BugIDEA-225295Theme is reset to broken "IntelliJ" theme after uninstalling light theme plugin which was installed over dark theme
BugIDEA-209769Transitive optional plugin XML dependency does not work
BugIDEA-229856Settings of a plugin aren't saved if the plugin is unloaded without restart
BugIDEA-223517Can't disable plugin with missing dependency
UsabilityIDEA-226216On theme plugin updating the theme is applied automatically though the different look'n'feel has been used before
UsabilityIDEA-218479Text on plugin pages with images is cut by right border, no horizontal scrollbar is available
UsabilityIDEA-205043Plugin Manager Dialog steals focus when the Settings dialog is opened
CosmeticsIDEA-218594Plugins: ugly dialogs on downloading failure
TaskIDEA-225980Remove JB modifier from plugin logos
ExceptionIDEA-224191AE at com.intellij.application.options.colors.ColorAndFontOptions.initAll
ExceptionIDEA-224649Throwable at com.intellij.ide.plugins.newui.MyPluginModel.applyEnableDisablePlugins
ExceptionIDEA-224976Exception in dynamic plugin loader on installing a theme plugin after first IDE start
ExceptionIDEA-224650NPE at com.intellij.ide.plugins.newui.MyPluginModel.addProgress
Core. Project SettingsBugIDEA-222246Inspection settings are not saved
BugIDEA-223248No VCS tab in Settings for New Projects in fresh EAP instance
BugIDEA-221596JavaDoc and annotations paths may be reordered in *.iml file on save
BugIDEA-221500New module created in Project Structure dialog may get explicit module group assigned breaking grouping by module names
BugIDEA-226998IllegalStateException error when clicking "create new project" link.
BugIDEA-227598Editor - Duplicates - settings for Kotlin, Javascript, Typescript and Actionscript reset after reopening Phpstorm in default settings and in project settings
BugIDEA-223730java.util.ConcurrentModificationException at com.intellij.openapi.projectRoots.impl.UnknownSdkType.getInstance(UnknownSdkType.java:31)
BugIDEA-223363IDE deletes newly added library configuration files if external storage is enabled
BugIDEA-217659On new project creating the file withe name "$PRODUCT_WORKSPACE_FILE$" is created in .idea
BugIDEA-186751Repository library: disallow manual editing of library with transitiveDeps=true
UsabilityIDEA-94764Import Project from Existing Sources: source roots and module roots are incorrectly detected
TaskIDEA-177242Run FrameworkDetector#detect on background thread
ExceptionIDEA-222934Cyclic service initialization for bookmarks
Core. Quick DocumentationBugIDEA-225727QuickDoc works incorrectly with getCustomDocumentationElement API
BugIDEA-220127Anchor links within the same document don't work sometimes
BugIDEA-216893Quick documentation is shown even without moving the mouse
BugIDEA-205986QuickDoc popup is not restored in the Editor from the Tool Window
BugIDEA-226374Constant String field evaluation shows PsiType prefix
BugIDEA-227429QuickDoc doesn't update after selecting a different item for selection popup of "Implement method" and "Use existing implementation" intentions
BugIDEA-212331Anchor links do not work in QuickDoc
BugIDEA-228532Hard to get inspection error description when documentation popup is opened as a tool windows
UsabilityIDEA-225426Quick doc on hover doesn't work with injections
UsabilityIDEA-225722Quick doc popup font is either too small or too big
CosmeticsIDEA-225391Labels in the documentations popup are not properly aligned
ExceptionIDEA-218404Edit Source in QuickDoc popup toolbar throws NPE
Core. RefactoringsFeatureIDEA-129547Rename module and directory at the same time
BugIDEA-222073Error:build: Cannot determine build data storage root for project C:/Users/timur.yuldashev/IdeaProjects/Jigsaw/CannotBuild
BugIDEA-224673ProjectImpl leaked when IDE is closed during in-place refactoring
PerformanceIDEA-214780TouchBar action update freezes UI thread for a long time
UsabilityIDEA-227118Show modal dialog with progress on attempt to invoke non dumb aware action during indexing
ExceptionIDEA-219687"java.lang.Throwable: AWT events are not allowed inside write action" on Undo during Rename operation
Core. Run. ConfigurationsBugIDEA-183885Maven goals executed as 'run before/after' tasks are not run in the Services view despite settings for maven run configurations
BugIDEA-215194Run console toolbar is not separated from console editor when new tabs is enabled
BugIDEA-222962Run Anything: invocations history is lost after new command entering
BugIDEA-222233Copy-paste behavior in the Environment Variables editor
BugIDEA-219327Run/Debug actions on toolbar aren't shown until 'Edit Configurations' dialog is opened
BugIDEA-216291No paste button in Tomcat Run/Debug configuration Startup/Connection
BugIDEA-93940Run/Debug Folders: DnD should support multiple items
BugIDEA-157989"Stop" button does not work when the IDE is launched as a background task
BugIDEA-216053A UI freeze on every opening of a run configuration with a custom JRE
BugIDEA-224132Run Configurations: the tasks added as beforeRun tasks seem to be executed in parallel
BugIDEA-210252[Environment variables] when pasting smth in addition to the existing value - the whole value is replaced
BugIDEA-215196Runner content ui has left border when its toolbar is not visible and new tabs is enabled.
BugIDEA-131597Filtering is not applied to "irrelevant" run configurations
PerformanceIDEA-219923Avoid running run configuration producers on EDT
UsabilityIDEA-220223Group run configuration templates
UsabilityIDEA-182361Make the new Run Dashboard Visible by default under View - Tool Windows -
CosmeticsIDEA-227160Add text disclaimer to run/debug configuration template page
ExceptionIDEA-200833Exception occurs on clicking run configuration after renaming Main class
Core. Run. TargetsFeatureIDEA-224928Add 'Manage Targets' to the Run menu
FeatureIDEA-224139Add pre-filled values for language runtime paths
BugIDEA-225182Java debug does not work for Docker target for JDK 9+
Core. SSHBugIDEA-224997FileNotFoundException when no permissions for reading ~/.ssh/known_hosts
BugIDEA-220081SSHJ: Hash hosts in known_hosts file setting ignored
Core. StatisticsExceptionIDEA-228826ERROR when open GoLand 2020.1 with plugin that defines registry key
Core. Task ManagementFeatureIDEA-155327Improvement to automated Branch Name in the Open Task dialog
FeatureIDEA-64464Tasks plugin should also save bookmarks list in task context
BugIDEA-101254Time tracking: Suspend delay setting has effect only on project reopening
BugIDEA-222401[Task Management] some controls are hidden after the server settings window resizing
BugIDEA-138917Time Tracking broken
BugIDEA-224295Commit from local changes doesn't show task autocompletion
BugIDEA-134603When switch from task to task with branch having new files these previously opened files are not reopened
Editor. Code CompletionFeatureIDEA-55066Add Live Template macros to insert file path
BugIDEA-223091IntelliJ keeps freezing when editing story files
BugIDEA-219161Empty bottom advertisement text in non-completion lookups
BugIDEA-182741Completion works for one row only when you're in column selection mode and opened Insert Live Template dialog
BugIDEA-223713CNFE: com.intellij.codeInsight.completion.CompletionPhaseListener: Can't run 1.3.60-dev-2580-IJ2019.2-1 with IDEA Nightly IU-193.3938
BugIDEA-220191How do you customize the CompletionPopup background color?
BugIDEA-223033Different Live Templates differing by case only may shadow each other
PerformanceIDEA-198887MinusculeMatcher can be very slow on long prefix and name
UsabilityIDEA-221804Reword setting name for ML code completion
ExceptionIDEA-219655NSEE at kotlin.collections.MapsKt__MapWithDefaultKt.getOrImplicitDefaultNullable
Editor. Color SchemesExceptionIDEA-216690Exception occurs on importing a color scheme if a color scheme is incompatible
Editor. CopyrightFeatureIDEA-215615Copyright is not pasted into newly created SQL file
BugIDEA-226263EPs to make dynamic
BugIDEA-225973Copyright plugin doesn't add any copyright into plain text file
Editor. Diff and MergeFeatureIDEA-224803Possibility to diff arbitrary ZIPs
FeatureIDEA-1025223 way Merge dialog & multiple files merge dialog should show details about affected commits (at the left and at the right)
FeatureIDEA-204040Show changes per-changelist in Unified View
FeatureIDEA-218189Show scope background color in Diff window files popup
FeatureIDEA-203246Show breadcrumbs in diff window
BugIDEA-229059Blinking highlighting when editing in Unified view
BugIDEA-224804ZIP-differ does not allow to change any ZIP file, but only JARs
BugIDEA-223218Default focus on file list in 'Diff Between' window
BugIDEA-220960Compare files doesn't respect Soft wrap option
BugIDEA-224802ZIP/directory-differ does not allow to change between archive / directory
BugIDEA-220681Wrong Differences ignored label
BugIDEA-223924Shortcut for Include Lines into Commit do not work in the Unified diff
UsabilityIDEA-220861Merge dialog: Actions buttons should be disabled if file is not selected
ExceptionIDEA-220582NPE at com.intellij.diff.tools.simple.SimpleDiffModel.updateGutterActions
Editor. Editing TextFeatureIDEA-225455$SELECTION$ does not work in Live Template when part of another variable
FeatureIDEA-125325Join lines in custom file type should handle end-of-line comments
FeatureIDEA-223034Add support for for block caret-friendly braces highlighting and navigation
FeatureIDEA-218836New editor command to sort lines alphabetically
BugIDEA-215896Folded property value editing: incorrect cursor after Expand invocation in case of long property value text
BugIDEA-221610Need to click twice to unselect identifier that is being renamed
BugIDEA-221642Incorrect parameter popup highlighting range
BugIDEA-227963"Enter/Smart indent" option sets "AUTOCOMPLETE_ON_SMART_TYPE_COMPLETION" instead of "SMART_INDENT_ON_ENTER"
BugIDEA-223891TODO regex are broken
BugIDEA-221958Quickly pressing Cmd-V and then Cmd-G to jump to next search result doesn't work correctly
BugIDEA-223715Todo pattern matching not working correctly when using ö (o with two dots)
BugIDEA-217406Paste multiline text into text box should keep indents
BugIDEA-210020Search highlight color does not change when changing theme
BugIDEA-217073Burmese language literals irreversibly break the editor
BugIDEA-181263Block comment messes up auto-indentation below it
BugIDEA-224887Extending selection strange highlights text block content
BugIDEA-217353Paste inside text block should escape opening/closing quotes
BugIDEA-221995Undo removing after rename refactor glitch
BugIDEA-15855Auto-import is too pushy
BugIDEA-226412column mode is not revealed on status bar (regression)
BugIDEA-219307Chinese font BUG
BugIDEA-215899Folded property value editing: if PasteFromHistory (Ctrl-Shift-V) is invoked in value editor, Esc closes editor instead of ChooseContentToPaste dialog
BugIDEA-227271InlayHints not properly disabled
BugIDEA-227376The "File Structure" popup no longer correctly locates the function you select when dealing with collapsed areas
BugIDEA-226837Caret jumps to another line when moving using left/right arrows
BugIDEA-220417Expand Selection doesn't select text block contents correctly
BugIDEA-220956Error tooltip shown on F2 stays longer than it should, and obscures editor contents
BugIDEA-216967Folded values of properties from resource bundles are not changed on property value changing in *.properties file
PerformanceIDEA-226443Calculate method parameter hint info in non UI thread
UsabilityIDEA-223760Rendering of whitespace in editor too noticeably
UsabilityIDEA-215414Toggle Case action must preserve selection if changed text expands
UsabilityIDEA-81802Drag'n'Drop functionality in editor unexpectedly begins dragging selected text even if nothing selected is under the cursor
UsabilityIDEA-211165Line number converter function cannot set current line to zero
CosmeticsIDEA-185041Tabs rendering for show whitespaces are too intrusive, and space rendering look too much like periods.
Editor. Error HighlightingBugIDEA-217862False code inspection on methode reference on protected class for inheritence in different package
Editor. FormatterBugIDEA-223416Regression: overriding FileIndentOptionsProvider no longer works when .editorconfig is present
BugIDEA-223408Java ij_java_imports_layout setting in .editorconfig not working properly
BugIDEA-173076Unable to disable formatter using JSP comments (<%-- --%>)
BugIDEA-188412Formatter markers don't prevent formatting selection when placed after annotation
BugIDEA-218720EditorConfig: Open File to Preview Code Style OpenFileDialog opens in different project (MacOS)
BugIDEA-223939Formatter results are inconsistent. Tabs and spaces in indention appear in different runs
BugIDEA-165776VCS automatic pre-commit reformat option use a wrong default format preferences
BugIDEA-219572New | EditorConfig action should not be available when the context directory is undefined
BugIDEA-224183IDEA takes into account formatting markers with the disabled "Enable formatter markers in comments" option
PerformanceIDEA-218532Freezes in CodeStyle.getSettings
UsabilityIDEA-216088EditorConfig: consider making "Add properties as comments" off by default
CosmeticsIDEA-218180JavaScript language level is used in the Configure indents action name instead of JavaScript
ExceptionIDEA-222855'Adjust code style' on the value of variable causes an exception
ExceptionIDEA-227185AssertionError: Already disposed: Project from CodeStyleCachedValueProvider$AsyncComputation
Editor. Intention ActionsFeatureIDEA-229247Add intention Copy string to the clipboard
BugIDEA-219577Create File intention popup does not support speed search in the options popup
BugIDEA-218163CreateFileFix creates files in sources instead of resources locations in Gradle / Maven projects
BugIDEA-220487Create File Intention: in the target roots drop-down the inconsistent slashes are used (in case of missing directories)
PerformanceIDEA-227453Freeze on showing available intentions
CosmeticsIDEA-221475Incorrect spelling in the "Add on-demand static import..." context action
ExceptionIDEA-226405Java plugin is not recognized as a production of JetBrains
Editor. TextMate BundlesBugIDEA-226563Navigating to php/bin/set_error_handler after find-in-path locks up
BugIDEA-220388Disabled Insert paired brackets is ignored
Lang. JSONFeatureIDEA-223598provide context to x-intellij-language-injection in json schemas
FeatureIDEA-228220Option to add description for enum values in JSON SCHEMA
BugIDEA-228283Ability to set a custom value for a max JSON schema file size
BugIDEA-221552Unit Test fails for custom plugin when trying to load a JSON file
BugIDEA-226522Sort properties alphabetically breaks indentation in JSON
Lang. MarkdownBugIDEA-227021Reference link is not rendered properly in Markdown preview
CosmeticsIDEA-221369Make grayscale antialiasing the default in Markdown preview
ExceptionIDEA-228789Markdown changes PSI/document/model during highlighting
Lang. RegExpBugIDEA-144332False positive: Annotator: Unknown character category: \p{Block=CombiningDiacriticalMarks}+
Lang. Shell ScriptFeatureIDEA-223844Run shell scripts from context menu
BugIDEA-222424Execute shell script without ENTER confirmation
BugIDEA-219544shell script format problems with locale
BugIDEA-215936Shell Plugin :: Tab Size In Editor Doesn't Match Size Configured In Settings
BugIDEA-216493[ShellScript] 'Rename all occurrences' is available on keywords
BugIDEA-220421Java classes are suggested in completion popup
BugIDEA-215997[Shell script Run config] "Main" configuration doesn't run if Shell script config in Before Launch section
BugIDEA-218250Cant define working directory for ShConfigurationType
BugIDEA-219427Shell Script command appended to current Terminal command line
BugIDEA-224147Inject language shell creates fakes Run Line marker
BugIDEA-223938[Shell Script] working directory couldn't be changed in run configurations
BugIDEA-230061Parsing error when a function test is defined in a script
BugIDEA-222093Shellcheck instances aren't killed
BugIDEA-230393Explainshell action does not properly escape plus and ampersand
BugIDEA-221031Shell script removes '/' slash from execution command
Lang. XMLBugIDEA-229461Help Resolving XML Catalog URIs
BugIDEA-219411Settings | Languages & Frameworks | Schemas and DTDs: all paths to schema files appear in red though are properly resolved from xml
BugIDEA-210737XSD Generator crashes IDEA
BugIDEA-226310XSD validation ignores "anyAttribute"
PerformanceIDEA-212283DOM: xinclude performance problem
Lang. XPath and XSLTBugIDEA-220836Show Unique XPath is not working well
Lang. YAMLFeatureIDEA-224404Make YAML metatype engine be able to complete inside quoted values
FeatureIDEA-212876Made an option to disable (or change) key sequence paste feature
BugIDEA-223349Problems validating sequences using Metamodel engine
BugIDEA-225873Yaml completion of numeric properties by JSON schema doesn't jump to the value
BugIDEA-226689Helm. java.lang.AssertionError: Should come here only for YAMLKeyValue with no value and a following indent at adding a missing key from values.schema.json
BugIDEA-222915Invalid errors in injections into Java
BugIDEA-229869prometheus.yml -> Required: null, Actual: null
Tools. DockerFeatureIDEA-198286Support docker build target option
FeatureIDEA-194510Docker: Allow to specify custom context folder which contains separate unrelated Dockerfile
FeatureIDEA-178495compose YAML: add editor support for typed arrays (v3)
FeatureIDEA-200863Ability to inspect the image of the running Docker container.
FeatureIDEA-218063Progress handling in Docker deploy log console
BugIDEA-214766Incorrect error highlighting for function arguments used in string interpolation inside a BASH function in a RUN statement in Dockerfile
BugIDEA-226467Docker. Absent errors in case of running a container with already allocated ports
BugIDEA-163279Support logging of transport level interaction with docker daemon
BugIDEA-226401DockerCompose: Deploy log is absent at running a compose file
BugIDEA-227975Doing an docker-compose down using the Docker services panel causes named volumes to be removed/deleted (new in 2019.3)
BugIDEA-227717Packages added in remote Python interpreter are not available for code completion
BugIDEA-226434Can't parse run CLI options: Unrecognized option: --group-add
BugIDEA-224069Dockerfile highlighting breaks on multiline RUN with quotes
BugIDEA-226460Docker. FileChooser. F1 should lead to `Docker` section instead of `Services Tool Window` .
BugIDEA-223502Docker: impossible to create a new exec command for a container: "Create..." doesn't work
BugIDEA-218353False positive on external network name in docker compose
BugIDEA-230073Cannot start Docker: only error message is "Cannot connect: java.io.FileNotFoundException"
BugIDEA-227705Add *.dockerfile file type pattern for dockerfile.
BugIDEA-214932docker-compose inspection doesn't recognize "unless-stopped" as valid value
BugIDEA-224747Compose Run config: java.lang.IllegalArgumentException: Got empty dockerComposeFilePaths at expanding Services in case of absent compose file
BugIDEA-228861Docker: connection Url is not checked if contains spaces
BugIDEA-201787Docker: DockerView hangs after running tomee/tomcat
BugIDEA-227236Dockerfile, image: the deployed container doesn't have log if chosen in another project
BugIDEA-226332Docker: if docker run configuration is launched while docker is not connected, deployment node is missing
BugIDEA-203230Docker. Save container changes: all tabs display "Log" info until choosing "Attached Console"
BugIDEA-212488Docker settings do not keep path to docker executable
BugIDEA-223616Docker. Show sensible tooltip for an image
BugIDEA-222645Docker volumes are not removed on stop
BugIDEA-222447Docker: Impossible to call "Create..." a container for an image in case of existing run configurations
BugIDEA-193559DockerCompose. Run Configuration: impossible to choose services to run
BugIDEA-180157Docker Run configuration : replace JSON file with explicitly listed options in CLI format
PerformanceIDEA-218894Constant recreation of log consoles if the same container log is opened in two projects, eventually leading to OOM
UsabilityIDEA-210917Docker image run configuration. Rename "Image ID" field to "Image ID/Name"
UsabilityIDEA-215626Services. Docker. Absent easy start possibility to create a docker connection from DockerView .
UsabilityIDEA-226409Improve text when Docker is not connected
UsabilityIDEA-226469DockerCompose. Editor. Completion for keys known as arrays should insert "-"
UsabilityIDEA-218156Extra spaces are not trimmed in the API URL in Docker server settings
UsabilityIDEA-155563Docker. Provide possibility of navigation from/to containers to/from the corresponding image.
UsabilityIDEA-226393Docker. Root node it selected instead of the container, which run via image/Dockerfile
UsabilityIDEA-156211Docker. Create a container from an image. Don't show the second "Create...".
UsabilityIDEA-178719Docker: Docker run configuration. Process the case of a Dockerfile with a big context folder in a more user-friendly way.
UsabilityIDEA-226452Docker. Display no additional tabs for a container after delete and redeploy
UsabilityIDEA-217957Docker. Expand docker node after connection
CosmeticsIDEA-190344DockerCompose: Avoid green DeployLog tab by "down" of our compose node
CosmeticsIDEA-223630Docker: Make names of container tabs in the same low/upper case style
CosmeticsIDEA-218123Docker: Green pane by down the compose app
CosmeticsIDEA-178001Docker. Run Configuration. Delete "Create new" from "Server" listbox.
CosmeticsIDEA-226534Docker: Correct "Attached console" and "Container Port" tab/column names to be in the same low/upper case style
ExceptionIDEA-225084java.util.ConcurrentModificationException in Docker plugin
ExceptionIDEA-227252RuntimeExceptionWithAttachments in idea.log at docker-compose down
ExceptionIDEA-223856Docker. Mark the field red by running an empty exec on a container
ExceptionIDEA-226366IOException: Pipe broken when stop Docker container
Tools. TerminalFeatureIDEA-116253font zooming does not work in terminal tool window
BugIDEA-225759Terminal smart `diff` command execution
BugIDEA-222498Cannot move focus to next window when terminal is active
BugIDEA-220774Terminal failed to start on Windows (blocked by antivirus)
BugIDEA-180204Terminal output garbled after specific file has been printed out
BugIDEA-141263When changing Theme to Darcula Terminal view remains white
BugIDEA-223117Cannot move focus to next project using by IDEA hotkey when terminal is active
BugIDEA-219379Terminal sessions are lost on every major update
BugIDEA-230321When opening link from IDE Terminal extra characters (e.g. s, ms, 5ms) are added intermittently to the link
BugIDEA-2195992019.2 JBTerminal throws java.lang.Throwable: Directory index may not be queried for default project
BugIDEA-223264WSL paths are not clickable in terminal
BugIDEA-227054Fish terminal integration loads functions after conf.d (unlike fish itself)
UsabilityIDEA-223286`git log` in terminal switches to Version Control tab
CosmeticsIDEA-217612Terminal rename session minimizes the terminal window
ExceptionIDEA-163345"Could not set clipboard: cannot open system clipboard" (#171.584)
User Interface. AccessibilityCosmeticsIDEA-186539Rework UI text for I18nize Hardcoded Strings dialog
User Interface. Action SystemBugIDEA-225712Checkbox actions are no longer disabled. When searching editor `Words` option is enabled even if `Regex` option is checked
BugIDEA-224276"Commit" action is not searchable by "checkin" pattern
BugIDEA-228620Mouse event logged instead of Keyboard event for menu actions
BugIDEA-221936Enter Full Screen action is missing
BugIDEA-223815intellij-community latest snapshot build causes exception when displaying Generate action popup
BugIDEA-220573It takes a long time for context menu to appear when right-clicking on 1000 files in a directory
BugIDEA-217670Mnemonics for Replace -> Replace all (Alt + A) doesn't work in macro when there is an action with same shortcut is defined
PerformanceIDEA-225060First "Go to action" is too long
ExceptionIDEA-204565Throwable at com.intellij.ide.impl.DataManagerImpl$MyDataContext.getData
User Interface. Console ViewBugIDEA-184208Console horizontal scroll position lost on output
BugIDEA-70016error mixing stdout/stderr
BugIDEA-124688Console scroll to the end - jumps on the end of the line sometimes
User Interface. ControlsBugIDEA-223501Hover over Tool Window toggle button broken
BugIDEA-147414Project Area can't resize
BugIDEA-222661Drop-down list size is not adjusted to the list size
CosmeticsIDEA-214806"JRE" combobox is cut in Maven Runner Settings
User Interface. Find, Replace, UsagesFeatureIDEA-146832Add the "In selection" checkbox on the find tool equals to the replace tool
BugIDEA-172063find in path preview hides file extension if filter mask is set, even if several extensions are allowed
BugIDEA-215838Memory leak in FindPopupPanel
BugIDEA-199657RegExp: named groups don't work in Find/Replace in Path
BugIDEA-192260Toggling "Merge usages from the same line" in find references popup cycles between more than 2 different result lists???
BugIDEA-214836IDE freezes in "Find in path" while scrolling through found files
BugIDEA-225181Empty tooltip in 'Find in Path' popup for button in the corner
BugIDEA-173424Find in Path results sorting in random order
BugIDEA-191582FindInPath & ReplaceInPath: Regexp: incorrect behavior in case of malformed replacement string
BugIDEA-202674IntelliJ froze after trying to open result from find in path dialog
BugIDEA-227990Resizing preview in Find in Path doesn't always work on macOS
BugIDEA-224319Forget the previous search fragment when a new multiline fragment was selected
BugIDEA-166862Find/Replace: Do Refactor button disappears
BugIDEA-226984Search field in editor bug (when two lines are pasted in)
UsabilityIDEA-56579Find Usages dialog could preserve option values
TaskIDEA-225632EPs to make dynamic
User Interface. FocusBugIDEA-222801MacOS: Opening a recent project from fullscreen results in switching to Desktop
BugIDEA-221394Focus is lost when switching project using "Recent projects"
BugIDEA-227732Focus is not returned to Editor after closing Commit dialog
BugIDEA-223740[Debugger tool window] Focus is lost when switching tabs via "Show List of Tabs" on Linux
BugIDEA-218418IDE remains in background when invoked Jump to source (F4) from another window
BugIDEA-223548RecentLocations: focus is lost on navigating to different file
BugIDEA-214538UI freeze caused by java focus API, Ubuntu 18.04, two monitors
BugIDEA-227102Focus lost after closing tool window if editor tabs are splitted
BugIDEA-222477Unable to open/hide tool window in some cases
BugIDEA-221988Escape key does not return focus to the Editor
BugIDEA-223806After closing the Find view, keyboard focus is nowhere
BugIDEA-224810Nothing has focus after closing Version Control tool window
BugIDEA-229146Fix for JBR-2021 on IDEA-side
BugIDEA-227001Focus jumps from Tool Window to Editor on opening tool windows in a row
User Interface. Keyboard InputBugIDEA-228793Shortcut VS mnemonic collision
BugIDEA-222847Invoking Ctrl-Alt-O ("Optimise Imports") while indexing prints a character
BugIDEA-223678Deadkeys not working anymore
BugIDEA-2249082019.3 EAP build 193.4386.10 Linux: macOS keymap missing
BugIDEA-227295Unable to use arrow buttons to expand/collapse recent projects group on welcome screen
BugIDEA-220414"Jump Outside Current Bracket/Quote" does not work with Emacs Tabs
User Interface. Look and FeelFeatureIDEA-228866Preview while changing themes
BugIDEA-221356"Cannot set High contrast theme" error on attempt to set High contrast theme
BugIDEA-216556IntelliJ LaF: disabled combo background looks incorrect
BugIDEA-216753IntelliJ LaF: tool window headers have increased font size on Mac
BugIDEA-225247Incorrect tooltips for indent and GoTo line widgets
BugIDEA-201293Some colors are not changed on switching theme
BugIDEA-216658IntelliJ LaF: context menu triangle icon
BugIDEA-231105Color scheme is reset to "IntelliJ Light" in 2020.1 if a custom color scheme was set in 2019.3
UsabilityIDEA-219108Checkboxes for plugins are right next to scrollbar, leading to frequent operator error
CosmeticsIDEA-229812Blue frame of "Create new project" on Welcome screen is thin
TaskIDEA-226805Move Windows and macOS themes to plugins
TaskIDEA-230997Bundle macOS Light Theme and Windows 10 Light Theme plugins with all JetBrains IDEs
TaskIDEA-216580IntelliJ LaF: Help button on Windows and Linux
TaskIDEA-217993Rename color scheme/theme actions in Quick Switch Scheme popup
TaskIDEA-201463IntelliJ LaF: change inactive selection background color
TaskIDEA-216616Update LaF for IntelliJ / Darcula slider
User Interface. NavigationBugIDEA-226761Switch tab shortcut skips one file with Tab limit = 1
BugIDEA-229306Goto Class should prefer start matches
BugIDEA-224660Search Everywhere: start matches should be prioritized
BugIDEA-220990Configuration 'Use "CamelHumps" words' does not appear in 'Find Action...' window
BugIDEA-228670Recent Files: restoring scrolling position broken?
BugIDEA-217535Focus stays on the the latest active element in the popup action list when cursor is on disabled item
BugIDEA-223322Bookmarks with mnemonics is lost after project reopen
UsabilityIDEA-224071Switcher opens a tab in the previous split when tabs placement is set to none
UsabilityIDEA-220792"Recent Files" popup no longer remembers it's dimensions
UsabilityIDEA-222570Recent files toggles between 3 files, not 2 as it was previously
ExceptionIDEA-225233NPE on 'Show error info' after navigation to next error
User Interface. Project ViewFeatureIDEA-223834Add ability to "Copy path" relative to repository root
FeatureIDEA-227694"Go to link target" command should work for files under linked directories
BugIDEA-225460Project tool window button context menu should not show icons for checkbox items
BugIDEA-206056In Project Files, adorn symlink to folder with arrow in corner?
BugIDEA-226539Only one file is opened after drag-and-drop several files to the Editor
BugIDEA-224258Show in Dolphin doesn't work on Kubuntu
PerformanceIDEA-217348UI Freeze when deleting file (StructureTreeModel update in non-interruptible read action)
PerformanceIDEA-192253Hangup on rendering project view containing Unicode file names
UsabilityIDEA-223758Project view popup appears to the few pixels left
CosmeticsIDEA-171222Module uses wrong icon in project tree
TaskIDEA-178054Problem with understanding hierarchy in directory tree
User Interface. Services ViewBugIDEA-220472Services View: for the Compound Run Configuration Debug is disabled
BugIDEA-220601Services: text in speed search popup is red even if the tree contains matched nodes
BugIDEA-226739Services: OpenEachTypeInNewTab action is available in the empty view but doesn't affect the behavior when configurations are added
BugIDEA-226557Services: after hiding running configuration from Services it is still presented in the tree
BugIDEA-227195Unable to remove Services tool window from panel
BugIDEA-222134Kubernetes. Services view is absent after setting "kubernetes.view" registry key to true
BugIDEA-223118Application Servers run configurations appear in the default list of RC to be run in Services after restart only
BugIDEA-226737Services: RestoreHiddenConfigurations action should be available always when some configurations are hidden
UsabilityIDEA-219486Services View: make the ability to run configurations in Services discoverable
UsabilityIDEA-220113Bring Status filter back to Services
CosmeticsIDEA-226054[Services view] tabs and toolbar buttons are not aligned
Version Control. GitFeatureIDEA-81532Git: support force add for gitignored files
FeatureIDEA-208517Unified Checkout action for remote branches
FeatureIDEA-209996Show "Incoming/Outgoing commits" indicator for current branch in the status bar
FeatureIDEA-205386Add a refresh (fetch) option to Git Branches popup
FeatureIDEA-124890Feature Request: Add Colour hint to git branch menu when in Merging state
FeatureIDEA-219087Local .gitignore - An action to ignore via .git/info/exclude
FeatureIDEA-173936Smart checkout could use shelf instead of stash
BugIDEA-211338Git: incoming/outgoing changes checking always fails for the private github repositories
BugIDEA-223904After cancelling a commit, "Commit" button stays disabled
BugIDEA-207187Incoming Changes indicator in branches popup doesn't disappear after update
BugIDEA-220907Git Update Project Info doesn't share recent filters with the main Log instance
BugIDEA-224742Conflicts details: commit list is not scrollable
BugIDEA-220998Cherry-pick without dialog doesn't synchronize file system changes to the VFS
BugIDEA-230378Trying to resolve conflicts between unrelated histories fails
BugIDEA-176615Endless loop of "git rebase" on update project
BugIDEA-230806Git installation is not detected on Windows if not in the PATH
BugIDEA-220504Git | Pull is broken because missing some GitBundle properties
BugIDEA-227242Deleting directory with unversioned files (by action from Project View) does not remove corresponding unversioned files from Local Changes
BugIDEA-222091When changing themes VCS Diff empty panel stays unchanged
BugIDEA-223970Rewording git commit should not run commit hooks
BugIDEA-216931Use consistent sort order for Version Control > Shelf and Diff window
BugIDEA-222440In multi-repository project with synchronous branch control current branch is listed among Common Local Branches with all branch actions
BugIDEA-217872Changing the Update Info Filter in the Settings doesn't activate the "Apply" button
BugIDEA-190333(Git) UnStash Changes dialog does not open if there is a stash with message without colon
BugIDEA-206427IO commits: No 'update fail' message after unsuccessful attempt of authentication
BugIDEA-221660Git | Branches | Show Diff with Working Tree should be a Frame
BugIDEA-224741Conflicts details: Details are shown for the incorrect commit
BugIDEA-211334Git: incoming/outgoing changes checking is not performed after successful pull
BugIDEA-226627Git Clone Dialog: Trim the URL
PerformanceIDEA-221003Git integration should refresh only the files which actually have changed
PerformanceIDEA-220438Don't use reflection to read git config via ini4j
PerformanceIDEA-222365"Find commit by hash" takes too much time
UsabilityIDEA-171626Ability to create new branch that already exists in some repositories
UsabilityIDEA-209664Git double-dot: add 'Swap branches' action to the Compare with Current branch action
UsabilityIDEA-228776Do not propose Force Add for directories
UsabilityIDEA-199553Offer to update command line tools when getting error: invalid active developer path after MacOS update
UsabilityIDEA-224204"Add to .git/info/exclude" should add content root path, not just file name
UsabilityIDEA-223827Preselect commits in the details
UsabilityIDEA-132259Multi-repo sync setup: Checkout common remote branch as local fails if one of repositories is already on such branch
UsabilityIDEA-152791File with reverted staged changes is highlighted as changed (blue)
UsabilityIDEA-226783Extend existing "New Branch From Selected…" branches popup action to allow create a new branch without checkout
UsabilityIDEA-221787"New Branch" and "New Tag" in Git log context menu should be top-level items
UsabilityIDEA-224034Rename Reword action to Edit (Commit) Message
UsabilityIDEA-192646Option for Commit Date rather than Author Date in File History and Annotations
UsabilityIDEA-216382"Compare with Current" could produce confusing results
UsabilityIDEA-220048Add a setting to select Shelf or Stash as a preferable method to preserve local changes
UsabilityIDEA-193354Git | Branches | "Checkout as" always makes new branch track selected branch
CosmeticsIDEA-229854Git Checkout Problem dialog: change text about stashing changes
CosmeticsIDEA-221248Typo in the description of interactive rebase.
CosmeticsIDEA-224054Push dialogue elements are improperly placed / aligned
CosmeticsIDEA-221703Tag dialog: change tooltip text on Validate button
TaskIDEA-163444Remove "Branch Default" update method
ExceptionIDEA-222952Throwable: Assertion failed: Repositories have unexpectedly diverged
ExceptionIDEA-222017Throwable: Assertion failed at org.jetbrains.git4idea.ssh.GitXmlRpcHandlerService.getXmlRcpPort on Rebase action
ExceptionIDEA-221695Throwable at org.jetbrains.git4idea.ssh.GitXmlRpcHandlerService.getXmlRcpPort
Version Control. GitHubBugIDEA-223309New GitHub dialog does not respect "clone using SSH" setting
BugIDEA-224239GitHub PullRequests: content is not shown if user logged in from toolwindow
BugIDEA-224323GitHub PullRequests: Refresh notification does not appear automatically
CosmeticsIDEA-224329GitHub PullRequests: add space between file name and its path
Version Control. Local HistoryBugIDEA-229351Undo doesn't work for "copy file" action
UsabilityIDEA-73911Implement user-friendly method toString in class com.intellij.history.core.revisions.RecentChange
CosmeticsIDEA-195993Recent Changes dialog needs some spacing
CosmeticsIDEA-220623Recent Changes dialog design
Version Control. LogBugIDEA-227019Git log tab bug with a branch named with parenthesis
BugIDEA-209131If the project name contains an underscore '_', the underscore does not appear in the Log Paths combobox.
BugIDEA-225553Filter by "me" incorrectly matches email.
BugIDEA-219575memory leak
PerformanceIDEA-217125Git log component update is very slow
PerformanceIDEA-217010VcsLogManager leaks project
PerformanceIDEA-219710IntelliJ 2019.2 high cpu usage (with git) at idle.
UsabilityIDEA-164276Show progress while executing Git Log indexing
UsabilityIDEA-193806Display errors which affect displayed information in the Log
ExceptionIDEA-217847Sometimes the UI breaks after clicking "View Commits" from the Event Log
ExceptionIDEA-229187Clicking on Log tab of Git tool window generates exception (intellij-community master branch)
Version Control. MercurialBugIDEA-228035Authentication script does not work with pyhton 3
BugIDEA-220350Push commits dialog (mercurial): should enter remote URL on every push
UsabilityIDEA-73341Mercurial: allow adding ignored files
Version Control. PerforceBugIDEA-221889Exception when saving a merge result in perforce
Version Control. SubversionBugIDEA-224516Intellij IDEA never ends (or as best, is very slow) "performing VCS refresh". Se attached image. Problem appears in all 2019.3 versions. Not a problem in version 2019.2.3.
BugIDEA-226333SVN (possibly other VCS too?) version control in an infinite refresh loop
BugIDEA-223635GetFilesFromVersionControl: CheckOut from Subversion fails silently
BugIDEA-125032Stuck in endless loop of modal SVN Authentication Required Dialog
UsabilityIDEA-219245Add Subversion ignore action to Unversioned Files Dialog
No subsystemFeatureWEB-35796Vue.js: support style element src attributes with support vue-loader
FeatureWEB-25666Add option to configure injected fragment background for each language separately
FeatureWEB-41489Curly braces not autocomplete in JSX tags
FeatureWEB-43061jsconfig.json baseUrl is not supported
FeatureWEB-41530"Run anything" should offer scripts from package.json without typing "npm run"
FeatureWEB-42408[Web Types] Display new lines in quick doc description
FeatureWEB-37464vue.js missing autocompletion for v-slot
FeatureWEB-32255Vue.js - single file components with external script file not resolving
FeatureWEB-14385syntax highlighting of mime type text/ractive in scripts for Ractivejs
BugWEB-41925Cordova: exception while creating "platforms" directory
BugWEB-41971Import-types are not properly resolved in case of ambient modules
BugWEB-41421Incorrect 'narrowed to' highlighting if type is not fully expanded yet
BugWEB-25969Vue.js $event and $emit should be ignored by inspections inside template tags in vue files.
BugWEB-40288No 'Download Node.js' action if there is one (or more) invalid node
BugWEB-42167Completion is different if you move cursor before or after a statement
BugWEB-41957End-of-line LT expression is parsed as generic parameter list in some cases
BugWEB-42045"stringifies" is marked as a typo
BugWEB-37995Higher-order function generic inference should work for lambdas invoking generic functions
BugWEB-42727502 bad gateway is shown on the first request after project reopenning
BugWEB-41923Typescript: Auto complete for function parameters not working correctly for keyof readonly properties
BugWEB-41817Async generators: create a for-await loop in corresponding postfix template
BugWEB-42756Typescript: Attempt to assign to const or readonly variable, when assigning to variable with union type
BugWEB-31859Sporadic 502 when loading pages with the built-in web server
BugWEB-41746Sort properties alphabetically goes into an infinite loop on malformed JSON
BugWEB-41938Should not allow to inline destructuring rest
BugWEB-41531"Run anything" is not working if package.json is not in the root folder
BugWEB-41803Please add "screenshot" to the dictionary
BugWEB-40746Add "parallelization" to the dictionary
BugWEB-42872'Infer parameter types from usage' duplicates types
BugWEB-42511'Run anything' shows scripts from wrong package.json
BugWEB-38768React: collapsed fragment shows as 'xml'
BugWEB-41368Inlay hints are always visible in TypeScript
BugWEB-42670Invalid destructuring type evaluation for an arrow function parameter with explicit annotation
BugWEB-41789Standard code completion insert handler is not invoked for items in optional chains
BugWEB-42382JavaScript "Local variable 'X' is redundant" is not that redundant
BugWEB-41807Warning is wrapped in exclamation point (! symbol)
BugWEB-40777Run anything: yarn is not shown in the list of available commands
BugWEB-41478"Quote property names" too aggressive when working with selected properties
BugWEB-42822TS / Context Action: Change To 'absolute path src/components/etc' no longer available?
BugWEB-39386weridly behaving typos hints
BugWEB-42052"expectedly" is marked as a typo
PerformanceWEB-17638Joining Lines works extremely slow
UsabilityWEB-40818Create package.json in the project root when using Install dependency quick fix
UsabilityWEB-41215Allow editing textboxes containing list of element names, instead of requiring clunky "Add"/"Remove" diaiog
UsabilityWEB-33143closing tag should be smarter
UsabilityWEB-32948JSX onClick prop autocompletion not correct
UsabilityWEB-39664Improve in-dialog documentation for parameter hints blacklist
UsabilityWEB-40899Don't re-evaluate webpack config if there are syntax errors
CosmeticsWEB-41731The name of Handlebars/Mustache folding category is truncated
TaskWEB-41910Change "Replace with the shortened form" to "Replace with a shorter path"
TaskWEB-42926Rearrange inspections in the settings: TypeScript/JavaScript categories
ExceptionWEB-41499PluginException: Exception in plugin Java Server Pages (JSP)
ExceptionWEB-41076PluginException: Cyclic service initialization when open project
Build toolsBugWEB-42270Can't execute Gulp tasks from IDE - getting an error with com.intellij.execution.ExecutionException
BugWEB-40782'Run Anything': List scripts from package.json when typing `npm` or `yarn` regardless what tool is set in preferences
BugWEB-38986Don't debug npm before launch tasks
CSSFeatureWEB-24298Add quote style settings for CSS
FeatureWEB-31724Adding Bootstrap Autocompletion from CDN
FeatureWEB-10023Need ability to download external stylesheets
BugWEB-41795Download CSS library from CDN: disabling in Preferences - Libraries has no effect on completion
BugWEB-42973Color picker in CSS doesn't update the color of the gutter icon
BugWEB-37978Webpack aliases not resolved in URLs in CSS properties
BugWEB-8044Move statement on CSS block no working as expected
BugWEB-8045Move statement on CSS line no working as expected
BugWEB-35236Import of css files with webpack aliases is not resolved in case of '@import url()'
BugWEB-40898CSS padding property hint auto is invalid
BugWEB-43153Color Picker dialog issues: wrong traversal order on tab, not updated colors.
PerformanceWEB-42613CSS: CssColorGutterRenderer can cause freezes
UsabilityWEB-41796Download CSS library from CDN: show shorter name for the location in completion popup
TaskWEB-43231Make css.supportedFileTypesProvider extension point dynamic
TaskWEB-43006Remove information about CSS level and browser support from completion popup
CoffeeScriptBugWEB-34310CoffeeScript: "Change signature" refactoring doesn't work
DartFeatureWEB-41912Support Dart web apps debugging using 'webdev daemon'-based workflow and VM Service protocol (like Dart DevTools)
FeatureWEB-41609Dart formatter: use dartfmt tool when reformatting file parts, not only the whole file
BugWEB-42526NPE from DartServerRootsHandler.getEnclosingDartPackageDirectory()
BugWEB-41978NPE on autocompletion for Dart (SDK 2.2 or 2.3)
TaskWEB-41628Dart formatter: use dartfmt tool always, remove legacy formatting settings
DebuggerFeatureWEB-21626watch method return value not implemented in webstorm 2016.1.2?
BugWEB-42156JS debugger breakpoints not shared between symlinked files.
BugWEB-36471WebStorm Debugger variable set value error.
BugWEB-30889JavaScript Debug is not working for version 2017.3.3
BugWEB-36015Debugger attaches to "Before Launch" gulp script, application not launched
BugWEB-43008"Open Source" in Scripts view doesn't work
BugWEB-40496Node Debugger doesn't always start properly on re-running
BugWEB-41684Protractor stops on the wrong line, tooltips are not shown
BugWEB-41007Can't debug node.js - get error 'URI is not hierarchial'
BugWEB-21719NodeJS Remote Debugging Doesn't Allow Breakpoints
BugWEB-42932Debugger is not attached when debugging NPM script with explicitly specified debug options
BugWEB-12527Django/JavaScript Debugging Broken in 3.4
BugWEB-42331Breakpoints in excluded node modules don't work
BugWEB-42360Start execution on attaching to process waiting for debugger
BugWEB-42393Support debugger frames for dependencies installed with Yarn PnP
BugWEB-40694Debugger doesn't stop on a breakpoint in Kotlin/JS project
BugWEB-42661Debugging with an async hook enabled is broken
BugWEB-42536Node.js debugger doesn't stop at breakpoint if the code was live-edited
BugWEB-41834Debugger opens incorrect file (same-named instead of the file with breakpoint)
BugWEB-13411Node.js: can't set value in debugger
BugWEB-42370Breakpoints in .ts files intermittently not hit in simple project
BugWEB-41716'Hide frames from libraries' does nothing
BugWEB-41719TraceableDisposable.ObjectNotDisposedException when close IDE while debugging
BugWEB-41598Breakpoints don't work after app is reloaded by webpack
PerformanceWEB-41324Throwable: LEAK: {}.release()
PerformanceWEB-36752Large page in Elements View slows down IDE
PerformanceWEB-38989Optimize memory used for source maps
File WatchersFeatureWEB-36668Allow enabling global file watchers for all new projects
BugWEB-42549"Enable File Watcher" is suggested for files inside node_modules
BugWEB-41091Incorrect path is used if file watcher's Working Directory field is left empty
BugWEB-40982'Failed to run File Watcher' error is displayed several times in the event log
BugWEB-43079Extremely wide File Watcher dialog (if Unit File Support plugin is enabled)
BugWEB-40636Strange intention actions: just 'Yes' and 'No'
BugWEB-29424Race condition between saving file and file watcher execution
HTMLFeatureWEB-41487HTML tags including attributes in JSX blocks can't autocomplete the closing tag
BugWEB-41994Repetition of the result of intention 'Missing required attribute'
BugWEB-42723Start tag has wrong closing tag
BugWEB-378PHP code in conditional comments
BugWEB-40570JavaScript fragments weirdly converts apostrophes and quotes
BugWEB-37786JSX Emmet: wrong expand of the comment filter
BugWEB-40511Completion for `type` attribute in `input` element doesn't work in Angular templates
BugWEB-36211Custom "data-" attributes on SVG elements in HTML are reported as not allowed
BugWEB-42029Broken documentation for TS/JS library symbols in HTML files
UsabilityWEB-41780Show class name label when collapsing JSX tags
CosmeticsWEB-43036Remove tag background in IntelliJ Light theme
ExceptionWEB-42795Exception when I Reformat code
ExceptionWEB-41600Invalid file name lib/intellij-xml.jar!/resources/html5-schema/html5chars.ent
JSONFeatureWEB-41515Add editor action for "Copy JSON Pointer to clipboard"
FeatureWEB-38070Complete statement could add quotes on JSON
FeatureWEB-35787JSON: Smarter colon/comma handling before the closing quote (disabled by default)
BugWEB-40292x-intellij-language-injection doesn't function in yaml for array items
BugWEB-40927Editor is breaking JSON syntax when inserting new line after key-value pair
TaskWEB-42249Add `babel.config.json` to system schema map
JavaScriptFeatureWEB-2089Implement AMD declaration linking
FeatureWEB-39273'Make private/make public should be available for ES6 private fields
FeatureWEB-40240Suggest awaited items in code completion for promises
FeatureWEB-22664Delete ECMAScript 3 JavaScript version
FeatureWEB-43013JavaScript: provide completion for object literal properties with "this." prefix
FeatureWEB-42183Make JavaScript 1.8.5 disabled in the list of JavaScript language versions
FeatureWEB-41553Don't show unexported symbols from libraries in the Go to definition popup
FeatureWEB-43074ES6 imports navigation can work in dumb (indexing) mode
FeatureWEB-38663Add parentheses and implement the body when completing `constructor` keyword
FeatureWEB-38886IntelliJ IDEA cannot find test case when using template string with variable
FeatureWEB-41508Highlight await once the caret is on async.
FeatureWEB-42028Name suggestions: add unresolved names from the current scope to the list of suggestions
FeatureWEB-38784Support Promise.allSettled
FeatureWEB-41908Bundle language injection for paper.js
FeatureWEB-41373Support optional chaining in TypeScript and in the type system
FeatureWEB-40267Add intention: Convert to optional chaining and/or nullish coalescing
FeatureWEB-40404Extract single property from object as a shorthand property, not as spreadElements
FeatureWEB-32472Validate duplicate ES6 exports in JS
FeatureWEB-21053ES6 Template Strings Don't Collapse
BugWEB-42431JSdoc: Better coverage of @implements with external files
BugWEB-40662Intention: Incorrect replacing const with let in for-of loop
BugWEB-36893Better mapping of file names to class names in code completion based on file name
BugWEB-42109Unexpected "not assignable to type T" warning in JavaScript
BugWEB-41403WebStorm 2019.3 EAP - After a while IDE show warning "unused constant"
BugWEB-43345'Extract variable' creates duplicate code fragment when invoking the whole line
BugWEB-38392False 'unused definition' when re-defining a property initialized in constructor
BugWEB-31714Make field public QF should change all usages of this field (remove # symbol)
BugWEB-41249'Replace nested calls with pipe expressions' is incorrectly applied in Jasmine tests
BugWEB-41764Optional chain tail is not evaluated properly
BugWEB-41668False positive "Readonly<T> is not assignable to type {}" for the state inside react component constructors
BugWEB-41252'Replace nested calls with pipe expressions' looses parameters
BugWEB-36802'Safe delete parameter' should check for usages inside function and show conflicts dialog
BugWEB-41991Readonly check that shows a dialog is invoked from the availability check in ES6MoveModuleMembersHandler
BugWEB-41303JQuery.proxy warning
BugWEB-40492Unicode code points are not supported in JS identifiers
BugWEB-42106Highlight "arguments" as parameter
BugWEB-40962"Script is not in strict mode" when using "use strict" pragma with escaped quotes in injection
BugWEB-39777JSX: completion item is used instead of emmet abbreviations
BugWEB-41980Global resolve works differently inside a class and on the top level
BugWEB-40520'Split into declaration and initialization' drops type annotations or creates red code in Flow with destructuring
BugWEB-41610Javascript: Unresolved variable
BugWEB-40285'Split into declaration and initialization and move to scope start' duplicates variable initialization in for-in loop
BugWEB-42662Color methods in optional chains as normal methods
BugWEB-20955ES6: re-exported binding resolve support (ESNext proposal)
BugWEB-42888Rendering of enum members with non-identifier names is incorrect in 'specify type explicitly'/hints/other features
BugWEB-39875JS Intentions: JS: Converting arrow function to anonymous function breaks on IIFE
BugWEB-41399No completion on Express req/res parameters
BugWEB-38545Invalid highlighting for JS Classes after including via require
BugWEB-40637Replace with indexer access produces malformed code in HTML context
BugWEB-41956Can't decline name suggestion for the last parameter when using `function` live template
BugWEB-21935Wrong highlighting for 'del' word in gulpfile.js
BugWEB-42466Unwanted autocomplete on rest operator for args collecting
BugWEB-42873'Infer parameter types from usage' incorrectly infers rest parameter type
BugWEB-42125Moving destructured items via keyboard shortcuts doesn't work for function parameters
BugWEB-40538Exception when file has several default exports
BugWEB-43082Overridden is shown twice while actually it's overridden once
BugWEB-41041Wrong highlighting for braces in template literals
BugWEB-41927PhpStorm didn't show inferred parameter type in JavaScript
BugWEB-40713WebStorm don't consider super() return type as this
BugWEB-43274WebStorm shows debug information inside hover doc popup
BugWEB-40527Flow module resolution (Cannot resolve module)
BugWEB-42593Type of Map entries iterated with for..of inferred as any
BugWEB-28080Extends ES5 classes with ES6 classes is not supported
BugWEB-40393'Create Directory/File' fixes don't work with relative paths in 2019.3
BugWEB-28204'Create variable' quick-fix shown when not applicable (in variable type annotation)
BugWEB-38414Auto import in Flow adds path to the IDE bundled definitions for React instead of the project ones
BugWEB-42816JavaScript: add loop live templates with better names
BugWEB-42866'Infer parameter from usage' should not be invoke many times in JavaScript
BugWEB-24105'Surround with' doesn't work for object properties with attached JSDoc comment
BugWEB-40776Code completion doesn't work for modules imported using require function created with Node.js createRequire
BugWEB-40312"Invalid number of arguments, expected 0" when passing message to superclass Error
BugWEB-32591Autocompletion not working after importing class instance that was instantiated via factory
BugWEB-43146No completion for `function` keyword after `new Classname` without semicolon
BugWEB-41954JS support require calls with references
BugWEB-42659Import statement is marked as deprecated
BugWEB-32695The documentation tool window breaks text in wrong places
BugWEB-42196Incorrect processing of destructuring arrays in rest elements
BugWEB-42074'Flip ,' works incorrectly with rest parameters
BugWEB-41382Show 'forof' postfix template instead of 'forin' for ES6 typed arrays
BugWEB-42890JavaScript: for-of -> for-indexed conversion doesn't work for inferred types
BugWEB-40655Duplicate 'Simplify' items in Alt+Enter for conditional
BugWEB-41728Resolve default import when .d.ts has no default export
BugWEB-41958Extra # shown in completion items rendering for #-private fields
BugWEB-43014JavaScript: "insert this" quick fix doesn't work for object literals and class fields
BugWEB-43041JavaScript: make JS parser more tolerant to typos
BugWEB-36461Double `flip if-else` results in double parenthesis
BugWEB-40659Intention "Extract increment" in for loop generates invalid code
BugWEB-24720JSX parsing in flow javascript language is broken if tag contains a namespaced tag or attribute.
BugWEB-41270Incorrect JavaScript warning: 'Value assigned to primitve will be lost'
BugWEB-41410Javascript autocomplete for JsDoc @typedef {typeof import('./somefile')} not working anymore in PHPStorm 2019.2
BugWEB-30569ES6 classes: Generated code doesn't take comments at the end of the class into account
BugWEB-42672Global definitions are not resolved in strict mode
BugWEB-40023Quick fix: JS: shouldn't invoke action of converting "for-in" to "forEach" on object
BugWEB-41793Remove 'package-lock.json' from import/require completion
BugWEB-42791False positive "Method expression is not of Function type"
BugWEB-41995'Make private using #' cannot be invoked for getters in pure JS
BugWEB-42469<br>, <em>, <strong> and <u> do not work in JavaScript quick documentation
BugWEB-38794Incorrect import when copy/pasting code in javascript (only aplies to some imports)
BugWEB-31971Support TypeScript import()-types in JSDoc
PerformanceWEB-42708outOfMemory on tuple types analyzing
PerformanceWEB-11215large concatenated JS file causes hang
PerformanceWEB-42985Memory and processor consuption peaks on a node project with 4 files and 4 libs
PerformanceWEB-42509PhpStorm takes an extremely long time to run code analysis and inspections on javascript files
PerformanceWEB-41810Freeze in EDT on type evaluation
UsabilityWEB-40096Quick Fix: JS/TS: "Join Concatenated String Literals" duplicates the functionality of "Compute Constant Value "
UsabilityWEB-40964Mismatch settings with the editor for examples in dialog 'Inlay hints'
UsabilityWEB-41044Lack of clear sorting of object properties in output type hints
UsabilityWEB-41727'Method expression is not of Function type' should be 'Method expression is possibly null/undefined' where appropriate
UsabilityWEB-38439Typing semicolon doesn't move caret after statement
UsabilityWEB-41094Allow to move switch-cases with 'Move statement'
UsabilityWEB-41542Show type hints for Promise.allSettled-like repeating tuples more conveniently
CosmeticsWEB-28832Structure diagram shows right arrow buttons when there are no sub members to that item
TaskWEB-37382JS/TS suggest variable names: improve UX and enable by default where that's safe
TaskWEB-40421Support having decorators after the 'export' keyword
TaskWEB-42498Remove intention 'Swap method call arguments'
TaskWEB-40821Enable type hints by default for function parameters
TaskWEB-42591Remove old JavaScript versions from the list of languages for scratch files
TaskWEB-40895Implement JSControlFlowProcessor using CF graph
ExceptionWEB-20585com.intellij.openapi.project.IndexNotReadyException on Refactor - Move of node_modules
ExceptionWEB-41675NullPointerException when call 'Split into multiple declarations'
ExceptionWEB-34766"Convert to forEach call on array" exception on invalid code
ExceptionWEB-42867'infer parameters from usage' doesn't work with export
ExceptionWEB-42865'infer parameters from usage' inserts generics after the variable name when applied to function expressions
ExceptionWEB-42268Destructuring using the postfix template fails with "cannot be cast to class" exception
JavaScript. FormatterBugWEB-39888Formatter does not respect TypeScript code style settings for VueJS components using typescript in <script> tag.
BugWEB-38347Formatting unindents comments in braceless ifs
BugWEB-13538Wrong indent for comments in chained function calls
BugWEB-28301Formatter: support Rearrange Code action inside script tag
BugWEB-41063Quote style from javascript is not applied to postfix completion
BugWEB-38291Reformat Code (Ctrl + Alt + L) deletes empty space between curly brace and 'from' keyword
BugWEB-40900EditorConfig doesn't apply to <script></script> in .vue file
BugWEB-40497TypeScript - when 'function declaration parameters' wraps the parameters it unneccesarily wraps lambda function passed as a argument
JavaScript. FrameworksFeatureWEB-42242Angular: support Schematics with Angular CLI 9.0.0
FeatureWEB-32274Support Vue components defined using separate JavaScript, HTML and CSS files
FeatureWEB-42016Vue.js: support completion for custom modifiers from web-types
FeatureWEB-32487Vue.js. Support local and global filters
FeatureWEB-42869create-react-app 3.3: use `npx --ignore-existing` when generating a project
FeatureWEB-41476Vue.js: code completion for source components slot names
FeatureWEB-41576Slots are not resolved (slot, v-slot)
FeatureWEB-42083Vue.js: support precise documentation on directives
FeatureWEB-42868create-react-app 3.3: use `--template typescript` for generating TypeScript app
FeatureWEB-40973Vue.js : support components defined in several files via @WithRender decorator
FeatureWEB-42113Vue: Provide better type inference when using v-for with an object
FeatureWEB-42220Angular: support new representation of metadata in Angular
FeatureWEB-28442Vue.js: scoped slots support
FeatureWEB-40909Vue.js: support named slots shorthand
FeatureWEB-42315Resolve imports for .native.js and web.js file names
FeatureWEB-40545Implement quick documentation for vue symbols
FeatureWEB-27946WebStorm complains about attributes on <svg:g> elements
FeatureWEB-41320Angular 8 SVG template unsupported
FeatureWEB-40277Vue: support vuex-class decorators
BugWEB-41827Cannot resolve imported properties in Vue component
BugWEB-41541No Auto Closing Parenthesis in Vue Single File Components
BugWEB-36502Vue.js: warn about empty tag bodies instead of self-closed tags in compiled vue templates
BugWEB-41917Vue.js: 'lang' attribute isn't suggested for completion
BugWEB-41647vuejs computed values resolved as functions instead of values
BugWEB-42387Angular template: false "Unused variable" when using @ViewChildren in Component
BugWEB-41544Vue Class Components: Mixin properties are not resolved in template when using uppercase Mixins from 'vue-property-decorator'
BugWEB-40644Missing usage of private members in Vue components
BugWEB-41073Vue.js: instance properties/events from plugins not resolved in templates
BugWEB-41717Can't type closing tag in Vue file while indexing is in progress
BugWEB-37146Webstorm incorrectly complains that "data-" attribute is not allowed on Angular element
BugWEB-41713Vue: missing syntax coloring within <script type="text/x-template">
BugWEB-42824PhpStorm freezes while deleting characters from doctrine XML files
BugWEB-31785React: `props.<props_name>` not resolved unless there is explicit `propTypes` declaration
BugWEB-42112Vue: variables created by v-for are marked as unresolved
BugWEB-37854Typescript - issues with generic inference from index signatures
BugWEB-41366Vue is missed in 'File | New'
BugWEB-41564Vue Mixin Fields Glitches
BugWEB-42458WebStorm complains about abstract class not being in Angular module
BugWEB-41026Vuejs v-for index is resolved as array type instead of number
BugWEB-39230Angular i18n. Support for i18n-* attributes
BugWEB-41422Angular: inputs without brackets are reported as unknown if the property type is not explicitly specified
BugWEB-40489Invalid comment detection and syntax highlighting issue in JS (React JSX) file
BugWEB-41477Vue.js: attribute name is not in code completion on slot tag
BugWEB-41620Angular: attributes from selectors in ng-content marked as not recognized
BugWEB-23401TODO not recognized in JSX comments
BugWEB-41883"Undefined binding" inspection's severity is ignored when inspecting events.
BugWEB-31286Tabbing on live template $VAR$s in JSX is hijacked by autocomplete
BugWEB-42492Angular: stale state of Angular project detection
BugWEB-42721Meteor: incorrect warnings for some packages
BugWEB-41397Too many identical results in Add Angular Schematic popup after refreshing content
BugWEB-42758Directly exported jsx classes do not show in code completion.
BugWEB-40248Async pipe incorrectly infers the type of nested Observable in template
BugWEB-29103JSX comment out on simple arrow functions (without {...})
BugWEB-41020After 2019.2.1 update Vue + TypeScript + Decorators stopped working
BugWEB-40955Vue.js: vuetify `v-col` component is reported as unknown
BugWEB-42213No completion of custom directives in component with splited template and script
BugWEB-30600Vue.js: Component binded with v-model should not warn when the prop definition for value is defined as required
BugWEB-41409Vue component with script in another file: duplicated info in popup
BugWEB-42634Webstorm 2019.3 RC throws "XML tag has empty body" warning for Vue components
BugWEB-41349No completion and refactoring for slot props
BugWEB-41654Specify variable type explicitly doesn't produce any changes in code
BugWEB-42565Relative paths in HTML and other files are broken in WebPack projects in IDEA
BugWEB-42269Vue: Vuetify VLayout justify-center attribute reports "Wrong attribute value"
BugWEB-40929Vuex store state/getters/etc are not resolved in attribute values in templates
BugWEB-41782Completion for v-bind - attribute href is missed
BugWEB-42230Disable 'Introduce variable', 'Introduce constant' and 'Introduce field' for vue expressions
BugWEB-40926Pressing tab for autocompleting object property in TSX/JSX file creates element instead of finishing the name
BugWEB-42108Enable "copy-paste with imports" support for vue
PerformanceWEB-41427XmlTagNameSynchronizer freezes IDEA due to synchronous angular resolve
UsabilityWEB-41765Vue.js: background color for <script> tag causes usability issues
ExceptionWEB-41365NoSuchElementException: Sequence is empty. when type in .vue file
ExceptionWEB-42076IncompatibleClassChangeError when add .hbs file in vue project
ExceptionWEB-41547IllegalArgumentException: PsiElement(XML_ATTRIBUTE_VALUE).isValidHost() when resolve to file
ExceptionWEB-41704'IllegalArgumentException: Argument for @NotNull parameter' when open the certain project
ExceptionWEB-41350PsiInvalidElementAccessException when call completion in vue.js expression
JavaScript. InspectionsFeatureWEB-40394Duplicate declaration inspection for export (specifiers/aliases)
FeatureWEB-42870JavaScript: enable "Import can be shortened" inspection
FeatureWEB-26818Add inspection for converting let to const when possible
FeatureWEB-40586TS. Accessibility modifier already seen inspection
BugWEB-32647Duplicate case inspection works incorrectly for side-effect expressions
BugWEB-40911False 'missing await' for async generators
BugWEB-40666Add errors for variable count/initializers and lhs expressions in for-of and for-in loops
BugWEB-41879'Specify variable type explicitly' shouldn't specify raw literal types in Flow
BugWEB-25157"Unnecessary semicolon" inspection quickfix removes trailing line breaks
BugWEB-41362"Pointless statement or boolean expression" inspection offers incorrect suggestion
BugWEB-42478Changed Inspection Severity Level to Error for Duplication Javascript declaration doesn't work
BugWEB-41679'Duplicate case label' should work with string literals in different quotes
BugWEB-40150Unresolved variable
BugWEB-30908Use arrow functions when converting loop to forEach call
BugWEB-27499'var to let/const' produces invalid result in 'for' loop
BugWEB-43015Invalid 'Comparison of expressions having incompatible types' warning when using remainder operator with BigInt
BugWEB-25169'Flip ,' works incorrectly for destructuring arrays
BugWEB-42129Unnecessary semicolon in if/else statement (Vue, TypeScript 3.7, Prettier)
BugWEB-24660unresolved file name quickfix cannot create file inside not existed folder
BugWEB-43117Webpack schema validation incorrectly flagging cacheGroups as shorthand format
TaskWEB-39873Intention actions "Merge Parallel For Loops" and "Merge Parallel For-In Loops" - either rethink, or remove
JavaScript. RefactoringFeatureWEB-41816JS. Replace for..of with indexed intention
FeatureWEB-42979Inplace 'Introduce variable/field/parameter' when having subexpressions
FeatureWEB-39691Can't inline variable in destructuring (expected: convert to property access)
FeatureWEB-33038"move function 'myFunc' to 'myFunc.ts'" intention action
FeatureWEB-42951Inplace 'Introduce field' refactoring for JavaScript/TypeScript
FeatureWEB-14450Provide "Extract Constant" refactoring
FeatureWEB-34116Can't create/extract constant to the top level of the file
FeatureWEB-31939'Introduce variable' should add braces for arrow functions when needed
FeatureWEB-38972Quick-fix: Convert const to let. remove readonly modifier
BugWEB-30408Refactoring: Extract Superclass: static method should not be marked as abstract
BugWEB-39368'Introduce variable' is available on invalid selection and breaks code
BugWEB-40769Don't inline variables with default values in object destructuring
BugWEB-29335'Extract superclass', 'Pull members up' should move comments around members
BugWEB-39746'Extract superclass' creates invalid code when extracting from already extending class
BugWEB-42065'await new Promise' can be converted to pipe expression
BugWEB-41811Tooltip in 'Introduce constant' isn't shown at the location where the declaration is actually inserted
BugWEB-39748Extract superclass: making 'abstract' for pure JS throws and also doesn't work with TS fields
BugWEB-25137WebStorm allows to extract variable with breaking the operator precedence
BugWEB-41849"Extract Constant" from substring doesn't enforce 'const' and reuses the var type from 'Extract Variable'
BugWEB-42534'Extract superclass' creates double 'super()'
BugWEB-40042'Introduce variable' deletes the preceding comment
BugWEB-41876'Generate destructuring patterns' fails on a property of already existing pattern
BugWEB-37665Replace if-else with ?: is not working with variable initialization
BugWEB-38409'Introduce parameter' shouldn't suggest anonymous callback scope
BugWEB-7439Extract JavaScript variable fails if using multiple declarations chained in a single 'var' statement
BugWEB-41961Extract Method refactoring shouldn't suggest outer scopes when having private #-references
BugWEB-41723Extracting a variable immediately assigns an auto-generated name to the new variable
BugWEB-39798'Change signature' should handle arrow functions in class hierarchy
BugWEB-40910'Introduce parameter' shouldn't work with the yield expressions
BugWEB-40919Extracting a generator method from a field assigned to a generator breaks code due to ASI not allowed
BugWEB-42957Inlining shorthand array type erases the array part of the type if type has a generic that "extends"
BugWEB-41916'Introduce constant' shouldn't suggest global scope if having await expressions
BugWEB-40833Checking/unchecking 'Optional parameter' in the popup fails for 'Introduce parameter'
BugWEB-43087'Propagate to destructuring declaration' inconsistent availability
BugWEB-40957Invalid result of 'Introduce variable' when react function returns parenthesized HTML
BugWEB-40040TypeScript - Change method signature is wrong when passing "this"
BugWEB-42324Better validation of names for file name <-> class name matching
BugWEB-38305Implement all members doesn't respect quote style setting
BugWEB-38246'Extract method' doesn't check for member accessibility in case of static members
BugWEB-41960Introduce field should not change other classes
BugWEB-41103Extract Angular animation into a variable fails
BugWEB-37162'Introduce local variable' produces red when invoked in 'export default' with decorators
BugWEB-40959Inappropriate suggestion to replace string with template string inside flow/typescript type declaration
BugWEB-42023Extract field: don't suggest to initialize in constructor when creating directly from a field initializer
BugWEB-41845"Extract Constant" refactoring shouldn't work with ECMAScript 5.1 and earlier
BugWEB-35616Comment for typescript class last field is broken after applying intention "Create field"
BugWEB-41989Private (#) references are not updated when 'Extract superclass'
BugWEB-31704'Extract method' for generators should extract generators when possible with updating usages to 'yield * newFunc()'
UsabilityWEB-43151Problems with name suggestions when using Extract interface or type alias
UsabilityWEB-17564Refactoring: Extract variable: empty line is added on switching between radiobuttons inside popup
UsabilityWEB-28271Change signature should better handle TypeScript parameter-properties
UsabilityWEB-41258Do not show refactoring preview when renaming a new file using the "Rename file to match class name" fix
JavaScript. TemplatesBugWEB-12164