Skip to end of metadata
Go to start of metadata

RubyMine 2019.2.4 Preview (build 192.7142.18) Release Notes

No subsystemExceptionRUBY-25125Ruby plugin generates `ClassCastException`
Rails. Project ViewBugRUBY-24692Rails view in the Project Panel Constantly Closes the App Folder
SlimBugRUBY-25067cannot resolve symbol for custom html tags in slim templates
Core. IDE SettingsUsabilityIDEA-221387Configure Gutter Icons opens Settings For New Projects
Core. InstallationBugIDEA-215497jbr/bin/java Access Denied during update from IC-192.4205.45 to IC-192.4488.21
BugIDEA-223576Impossible to update Pycharm 2019.1
Core. Password ManagementBugIDEA-223257java.lang.NoSuchMethodError: 'void com.intellij.credentialStore.CredentialAttributes.<init>(java.lang.String, java.lang.String, java.lang.Class, boolean, int, kotlin.jvm.internal.DefaultConstructorMarker)'
Core. Quick DocumentationBugIDEA-222946identifier tooltip - due to scrollbar the tooltip window is not large (height) enough when there is only 1 or 2 lines in the tooltip. So the text is always obscured.
Core. SSHBugIDEA-222345Allow users to update known_hosts in a one click
BugIDEA-220958SSHJ: ConnectTimeout option is being read from config as milliseconds but should be read as seconds
CosmeticsIDEA-222955Error message cannot be fully read
Core. Task ManagementBugIDEA-222938Can't uncheck "Enable Cache" in `Settings -> Tools -> Task`
Editor. Code CompletionBugIDEA-221425Code completion broken and not configurable
Editor. Editing TextBugIDEA-221667Pressing Option-Enter on warning while info popup is displayed and previous warning hasn't been cleared causes cursor to jump in editor
User Interface. FocusBugIDEA-221730Stop services window from taking focus when opening a database table.
User Interface. GraphicsBugIDEA-220577Menu icons in Presentation mode are large
Version Control. GitBugIDEA-222125Update project notification incorrectly considers recents when calculating number of commits matching filter
BugIDEA-220499Git merge --no-commit still perfroms a commit if conflicts occur
No subsystemTaskWEB-41494Support nullish coalescing in TypeScript
JavaScript. FrameworksBugWEB-41788Code analysis failed
PerformanceWEB-41087vuejs autocomplete of tags is slow, taking 3-8 seconds to bring up results
LintersBugWEB-40937tslint.json file in subdirectory no longer recognized

RubyMine 2019.2.3 (build 192.6817.16) Release Notes

DebuggerBug RUBY-24841 ruby (2.4.6) vm crash when debug executing Addressable::URI#normalized_host (addressable gem 2.6.0)
Bug RUBY-24833 vm crash when stepping into a method with an non Object arg (BasicObject or a subclass)
Bug RUBY-24462 F7 should at least optionally remain normal step-into
Bug RUBY-24861 Debugger fails to run after latest update
InspectionsBug RUBY-24978 Missing argument other_ary2 for a number of Array methods
Rails. Code InsightBug RUBY-24209 fails to resolve symbols referring to method aliases
TestsBug RUBY-24770 RSpec formatter outputs unix color codes
Bug RUBY-24810 RSpec tests `expect` block causes the test to become not-Failed and not-Passed, but some intermediary state
Core. DebuggerBug IDEA-221348 In the evaluate window, you cannot cast a char array to an object
Core. Password ManagementFeature IDEA-163275 Allow storing passwords using KWallet
Bug IDEA-216476 Keyring returns null instead of unlock request
Exception IDEA-185926 Password storage doesn't work: secret_password_store_sync error code 32576
Core. Task ManagementBug IDEA-216363 Broken password authentication when using JIRA Cloud
Editor. Color SchemesBug IDEA-216982 Regression: usage of deprecated api is not highlighted - no strikeout from code style
Editor. TextMate BundlesBug IDEA-219004 'Install' php script files without extension are not registered as PHP files with textmate enabled
Bug IDEA-221617 TextMate freezes during Find in Path
Bug IDEA-220816 TextMateServiceImpl fires file type changed event every time on startup
Tools. DockerBug IDEA-221970 Docker plugin errors with Docker Enterprise
User Interface. Find, Replace, UsagesBug IDEA-216936 "Find in Path" called with a selected changelist does not set Scope
User Interface. FocusBug IDEA-200078 Double Shift activates wrong main window
User Interface. Keyboard InputBug IDEA-216141 Typing Alt+Letter is broken on macOS in IDEA 2019.2 because of a mnemonic related issue
User Interface. Services ViewBug IDEA-220860 Services View: when grouping by both status and type wrong configurations are run if run is invoked on status node
Version Control. SubversionPerformance IDEA-219881 Performance improvement in SVN operations
DartFeature WEB-40331 Add folding for `group` and `test` functions in Dart
Bug WEB-40938 Un-named extension methods in Dart not showing well in Structure view
Bug WEB-41017 File sync issue with the Dart Plugin
Task WEB-40831 Add support for extension methods
JavaScriptBug WEB-41393 Обновился до 2019.2 и сломался анализ кода
SASSBug WEB-40236 @import in SCSS states in can't be found in the IDE - but its there and also it compiles
Bug WEB-40457 SASS "includePaths" in angular.json is not recognized when using Angular workspaces
No subsystemBug DBE-9124 «Modify Table» dialog (⌘F6) shows several DDL commands even when a user didn't modify something
DB ConnectivityBug DBE-9052 Error: "No subject alternative DNS name matching localhost found." when connecting to Redshift with "Use SSL" enabled
Bug DBE-8968 DataGrip Login
DB ConsoleBug DBE-9068 Can't execute selected part of SQL query in .cs file
DB RefactoringBug DBE-9050 Invalid Nullable type composition for ClickHouse LowCardinality
Data Import & ExportBug DBE-9098 Can't import data from a CSV that includes IDENTITY column data to a SQL Server table
Data ViewsFeature DBE-7980 Set NULL via typing
Navigation & SearchUsability DBE-8875 Show files in "Attached Directories" by default when pressing Ctrl+Shift+N (Go to Files)
SQL GenerationFeature DBE-7893 Procedure is missed in Generate menu
SQL HighlightingBug DBE-9056 Columns referenced from PostgreSQL variables with RECORD data type result in unresolved reference error
Bug DBE-9105 SQL error when using quoted shame and a table name starting with a number on 2019.2.2
Bug DBE-9095 Syntax highlight for ASYMMETRIC KEY
Bug DBE-9084 IDE don't recognize 'VALUES (expression) table value constructor' in MariaDB 10.3 and above
SQL RefactoringBug DBE-9093 Intention 'Replace IN expression...' corrupts code

RubyMine 2019.2.3 RC (build 192.6817.10) Release Notes

InspectionsBugRUBY-24978Missing argument other_ary2 for a number of Array methods
TestsBugRUBY-24770RSpec formatter outputs unix color codes
BugRUBY-24810RSpec tests `expect` block causes the test to become not-Failed and not-Passed, but some intermediary state
ServicesBugIDEA-220860Services View: when grouping by both status and type wrong configurations are run if run is invoked on status node
Services. Password ManagementFeatureIDEA-163275Allow storing passwords using KWallet
ExceptionIDEA-185926Password storage doesn't work: secret_password_store_sync error code 32576
User InterfaceFeatureIDEA-69682Make scrollbars more visible
BugIDEA-220770Services View: when grouping by both status and type is used, the toolbar buttons are disabled for the collapsed top nodes and enabled for expanded ones
User Interface. FocusBugIDEA-200078Double Shift activates wrong main window
BugIDEA-221400Projects stop switching using Cmd+` after exiting full screen
JavaScriptBugWEB-41393Обновился до 2019.2 и сломался анализ кода
No subsystemBugDBE-9124«Modify Table» dialog (⌘F6) shows several DDL commands even when a user didn't modify something
DB ConnectivityBugDBE-9052Error: "No subject alternative DNS name matching localhost found." when connecting to Redshift with "Use SSL" enabled
DB ConsoleBugDBE-9068Can't execute selected part of SQL query in .cs file
DB RefactoringBugDBE-9050Invalid Nullable type composition for ClickHouse LowCardinality
Data Import & ExportBugDBE-9098Can't import data from a CSV that includes IDENTITY column data to a SQL Server table
Data ViewsFeatureDBE-7980Set NULL via typing
SQL GenerationFeatureDBE-7893Procedure is missed in Generate menu
SQL HighlightingBugDBE-9105SQL error when using quoted shame and a table name starting with a number on 2019.2.2
BugDBE-9095Syntax highlight for ASYMMETRIC KEY
BugDBE-9084IDE don't recognize 'VALUES (expression) table value constructor' in MariaDB 10.3 and above
BugDBE-9056Columns referenced from PostgreSQL variables with RECORD data type result in unresolved reference error
SQL RefactoringBugDBE-9093Intention 'Replace IN expression...' corrupts code

RubyMine 2019.2.3 Preview (build 192.6817.5) Release Notes

DebuggerBugRUBY-24861Debugger fails to run after latest update
BugRUBY-24833vm crash when stepping into a method with an non Object arg (BasicObject or a subclass)
BugRUBY-24462F7 should at least optionally remain normal step-into
BugRUBY-24841ruby (2.4.6) vm crash when debug executing Addressable::URI#normalized_host (addressable gem 2.6.0)
Rails. Code InsightBugRUBY-24209fails to resolve symbols referring to method aliases
TestsBugRUBY-24810RSpec tests `expect` block causes the test to become not-Failed and not-Passed, but some intermediary state
BugRUBY-24770RSpec formatter outputs unix color codes
CoreBugIDEA-220128Endless loop on file type converted from PlainText to C++
Core. DebuggerBugIDEA-221348In the evaluate window, you cannot cast a char array to an object
Editor. Color SchemesBugIDEA-216982Regression: usage of deprecated api is not highlighted - no strikeout from code style
Plugin. Task ManagementBugIDEA-216363Broken password authentication when using JIRA Cloud
Plugin. TextMate BundlesBugIDEA-219004'Install' php script files without extension are not registered as PHP files with textmate enabled
BugIDEA-221617TextMate freezes during Find in Path
BugIDEA-220816TextMateServiceImpl fires file type changed event every time on startup
Services. DockerBugIDEA-221970Docker plugin errors with Docker Enterprise
Services. Password ManagementBugIDEA-216476Keyring returns null instead of unlock request
User Interface. Find, Replace, UsagesBugIDEA-216936"Find in Path" called with a selected changelist does not set Scope
Version ControlBugIDEA-220599Import Patch into Shelf broken
PerformanceIDEA-219152IDE is freezing for 30+ seconds due to a lot of ignored files
UsabilityIDEA-216362Non-modal commit: on Git | commit invocation for some file it should ecome not only checked but also selected in the LocalChanges
UsabilityIDEA-216646Non-modal commit: confusing checkboxes on empty changelists
Version Control. SubversionPerformanceIDEA-219881Performance improvement in SVN operations
DartFeatureWEB-40331Add folding for `group` and `test` functions in Dart
BugWEB-41017File sync issue with the Dart Plugin
BugWEB-40938Un-named extension methods in Dart not showing well in Structure view
TaskWEB-40831Add support for extension methods
SASSBugWEB-40457SASS "includePaths" in angular.json is not recognized when using Angular workspaces
BugWEB-40236@import in SCSS states in can't be found in the IDE - but its there and also it compiles
Navigation & SearchUsabilityDBE-8875Show files in "Attached Directories" by default when pressing Ctrl+Shift+N (Go to Files)

RubyMine 2019.2.2 (build 192.6603.29) Release Notes

IDEBug RUBY-24867 Terminal crashes after upgrading Ruby plugin
Bug RUBY-24786 Spring hang notification is shown on Windows
InspectionsBug RUBY-22573 noinspection RubyResolve inside string
Bug RUBY-24869 Suppress for strings concatenation
Bug RUBY-24696 Suppress for statement for ClassModule name is too long
ParsingBug RUBY-24796 Pattern matching syntax highlight with dry-monads
QuickDocUsability RUBY-24625 Ellipsis are shown instead of parameter predefined value
TestsBug RUBY-24211 single test runner does not escape regex special chars in the test name filter and so fails to match and invoke the test
Code Analysis. InspectionBug IDEA-219976 False alarm "class, interface, or method should not be extended"
CorePerformance IDEA-220475 Freeze on project opening
Core. File SystemBug IDEA-219943 PsiModificationTrackerImpl.incLanguageModificationCount() does not always attribute a PSI change to the correct language
Exception IDEA-121210 "VirtualDirectoryImpl#compare: PersistentFS returned duplicate file names ..." on case-insensitive FS
Core. IDE SettingsBug IDEA-211731 Settings for New Project aren't saved
Core. Platform APIBug IDEA-220367 Deprecate and avoid usage of `UElement.getLanguagePlugin()`
Editor. Diff and MergeBug IDEA-220302 Regression in 2019.2: CacheDiffRequestChainProcessor does not honor myRequestChain.getIndex()
Editor. Editing TextBug IDEA-219192 Can't see hard wrap guide.
Bug IDEA-220351 Expandin collapsed blocks dont setup cursor to correct position
Cosmetics IDEA-208775 "Enable font ligatures" unable to click on popup
Infrastructure. Packaging and InstallationBug IDEA-219214 Patch update from 2018.3 to 2019.2 doesn't work
Plugin. Shell ScriptBug IDEA-219928 Builtin Shell Script plugin causes color syntax error after bash variable substitution using escape character as last character in replacement string
Bug IDEA-220072 Bash functions missing in the Structure view
Plugin. TerminalBug IDEA-221853 Terminal crashes
Services. DockerFeature IDEA-210768 Docker. Support --ulimit command line option
Feature IDEA-218179 --network is not a recognized docker build option
Bug IDEA-217917 Services. Docker. Two "Jump to Source" navigation items from the deployed containers/compose apps
Bug IDEA-179900 Docker exec tab does not correctly wrap
Bug IDEA-207582 Cannot use more than one terminal in container using exec `/bin/bash`.
Exception IDEA-219940 Docker: com.github.dockerjava.api.exception.NotFoundException: {"message":"no such exec"} at attempt to edit some exec tabs
Services. SSHBug IDEA-220693 SSHJ: Authentication process terminates if kerberos authentication fails
Bug IDEA-220121 SSHJ: SSH authentication fails when the only authentication method is a One-Time Password via keyboard-interactive
User InterfaceBug IDEA-192504 Enter Full Screen & Exit Full Screen does not execute when invoked via find action
Bug IDEA-219898 Double shift on modal makes it no responsible
Bug IDEA-153291 IDE opens on a last known location when external monitor is detached: outside of screen
Bug IDEA-199472 Tool windows broken when opening project
Exception IDEA-202927 Exception occurs on applying "Show F1, F2, etc. keys on the Touch Bar" option
User Interface. ControlsBug IDEA-219939 Missing scrollbars don't allow to properly edit Run Debug configurations
User Interface. Find, Replace, UsagesFeature IDEA-109899 Automatically escape special symbols for "Find" and "Find in Path" dialogs if "Regex" ("Regular Expression") is checked
Bug IDEA-219877 Shortcut for Open in Find Window in Find in Path on Mac is Ctrl+Enter although tip says Cmd+Enter
User Interface. FocusBug IDEA-221400 Projects stop switching using Cmd+` after exiting full screen
User Interface. Keyboard InputBug IDEA-219266 Navigation Bar dropdown doesn't show up on ⏎ key in 2019.2
Bug IDEA-218926 Stretch left keybinding doesn't work
User Interface. Look and FeelBug IDEA-219715 Borderless: ellipsis in window title when moving between displays with different DPI
User Interface. NavigationBug IDEA-200255 New 'Go to Class' dialog sometimes doesn't show anything
User Interface. Project ViewBug IDEA-215752 Nested sources folder not showing in Project view after updating to 2019.1
Version Control. GitUsability IDEA-219644 For multi-module project - single module branch compare shows multiple module diffs
No subsystemBug WEB-40084 Please add "checksums" to the built-in dictionary
Performance WEB-40851 Computing enum values for a huge enum doesn't reuse the cache of already computed values
CoffeeScriptBug WEB-40447 Issues with CoffeeScript editor in RubyMine 2019.2
DartFeature WEB-40542 'Go To Test' feature for Dart
Feature WEB-40471 New Dart folding: content between {...} in if and if-else statements
Feature WEB-39626 Enable 'in-place' mode for Dart local vars renaming.
Bug WEB-40465 Dart parameter info: improvements needed in case of optional parameters.
Bug WEB-40669 Dart parser handling of question mark
DebuggerBug WEB-40437 JS debug requires remote URL mapping in 2019.2
Bug WEB-30191 CORS problem when debugging because of "x-ijt" header being sent
Exception WEB-40379 Cannot add an action twice: Smart Step Into (Step into the particular method)
File WatchersBug WEB-33502 Prettier File Watcher: inconsistent behavior with Refactoring > Rename
JavaScriptBug WEB-40392 Cannot find declaration to go to in JavaScript strings
Performance WEB-40534 Implicit elements from qualifier of JSDoc-based elements cause performance problem
JavaScript. RefactoringBug WEB-40822 'Insert await' quick fix should insert await for the variable initializer if there are no valid references featuring that variable
Bug WEB-40377 "Replace if-else with ?:" in Vue SFC breaks code
Bug WEB-40600 No variable name in conflicts dialog when moving variable from tsx to tx
LintersBug WEB-40563 Code style settings not updated when 'standard' package is detected
Bug WEB-40459 Configuring 'standard' package as linter does not work with upcoming version of babel-eslint (v11) (No Babel config file detected error)
Node.jsBug WEB-40692 Can't import "kotlinx-coroutines-core" library if it is located under "node_modules"
Bug WEB-38037 working directory in run configuration for scratch file
TypeScriptBug WEB-40368 Readonly array of tuples is incorrectly parsed as readonly tuple + error
Bug WEB-40567 highlights wrong for value of enum in switch case of TypeScript
Bug WEB-40519 No completion for `export` keyword after `export {}`
Bug WEB-40714 Intellisense doesn't resolve return types in async methods
Usability WEB-40482 Properties are not suggested when using Omit
DB ConsoleFeature DBE-1878 Database console: on switching to deselected schema suggest quick fix to select it in data source properties
DB DiffFeature DBE-8977 Compare table contents
Bug DBE-8995 Database diff case unsensitive not fully working
DB IntrospectionBug DBE-9015 Server crash issue when using DataGrip with AWS Aurora
DB RefactoringBug DBE-9017 When adding a SMALLINT type column with width and UNSIGNED, the width digit ignored.
Data ViewsBug DBE-9021 Navigating to referenced and referencing rows from data grid doesn't put quotes around UUID's.
Navigation & SearchFeature DBE-8897 Full text search enhancement - result list(s) should be ordered
Bug DBE-8963 When Ctrl+clicking on a table name in SQL, the Database window doesn't quite scroll that table on the screen
SQL CompletionBug DBE-9046 Database tools: no autocomplete for table name when typing 'alter table' with postgres
Bug DBE-4713 SQL completion failing on create table
Usability DBE-8918 'VARCHAR' is completed as 'VARCHAR()'
SQL Format and StyleFeature DBE-7551 FOR XML formatting
Feature DBE-8451 Oracle: align CONSTANT keyword
Feature DBE-8321 EXPLAIN should be fromatted similar to CREATE VIEW
Bug DBE-5853 indent incorrect with ms sql server-style column aliasing
Bug DBE-8951 Stupid formatting of subqueries when they are not collapsed
Bug DBE-6170 The "Place comma" setting is ignored when "Wrap" is set to "Wrap if long"
Bug DBE-8666 Redshift: formatting SQL breaks syntax
Bug DBE-8888 Indent Missing in SQL Formatting of While Loops in Stored Procedure SQL files
Bug DBE-8841 SQL formatting: "New line after ALL, DISTINCT" doesn't work when the comma at first
Bug DBE-8452 Oracle: align CASE Expressions in pl/sql block
Bug DBE-8328 SQL code style should support RETURNING on a separate line
Bug DBE-7497 Align of data types in alter instructions of SQL formatting is broken in 2018.3.1
Bug DBE-8334 Unnecessary space before comma in ALTER TABLE when several ADD instructions
Bug DBE-8974 SQL Pre-formatter doesn't handle commas when the setting is specified in the Common section
Bug DBE-8986 Extra indent of the line after where clause
Usability DBE-8978 The combination of Code Style settings and source line breaks cause ugly result
SQL GeneralBug DBE-6538 Oracle SQL plus dialect: formatting changes and corrupts the query
Bug DBE-6474 DataGrip does not operate properly with identifiers containing CRLF
SQL GenerationBug DBE-8962 Wrong Snowflake DDL generation
SQL HighlightingBug DBE-9006 Unreachable code inspection is reported for Oracle package
Bug DBE-8940 Postgres SQL editor does not support PARTITION BY HASH
Bug DBE-8939 "unreachable code" error when viewing an SQL Server stored procedure
Bug DBE-8398 False positive "unreachable code" warning
Bug DBE-7491 Add syntax highlighting for PL/pgSQL "special commands" (#variable_conflict)
Bug DBE-3773 SQL: Inspections: Sybase: Ambiguous column reference: two different columns cannot have the same alias
Bug DBE-7455 MariaDB EXCEPT and INTERSECT support
Bug DBE-9003 Datagrip editor showing syntax error for amazon redshift query. In the attached screenshot when the isnull statement is in the same line as select clause the query gets executed but when the isnull is in second line it gives a syntax error.
SQL RefactoringBug DBE-8807 [PLUGIN] Unable to rename table variable
Bug DBE-7709 Incorrect placing for table's alias
Usability DBE-8960 'Expand column list' should be available if caret is after '*'
SQL ResolveBug DBE-5766 Unresolved savepoint
Bug DBE-5033 DataGrip does not recognize trigger logical tables DELETED/INSERTED when using ALTER TRIGGER

RubyMine 2019.2.2 RC (192.6603.20 build) Release Notes

Rails. Code InsightBugRUBY-24209fails to resolve symbols referring to method aliases
Core. File SystemBugIDEA-219943PsiModificationTrackerImpl.incLanguageModificationCount() does not always attribute a PSI change to the correct language
Core. IDE SettingsBugIDEA-211731Settings for New Project aren't saved
Plugin. TerminalBugIDEA-221853Terminal crashes
User InterfaceFeatureIDEA-218792Skip minimised and fullscreen windows in Activate Next Window action
User Interface. FocusBugIDEA-221400Projects stop switching using Cmd+` after exiting full screen
DB DiffFeatureDBE-8977Compare table contents
BugDBE-8995Database diff case unsensitive not fully working
DB IntrospectionBugDBE-9015Server crash issue when using DataGrip with AWS Aurora
DB RefactoringBugDBE-9017When adding a SMALLINT type column with width and UNSIGNED, the width digit ignored.
Data ViewsBugDBE-9021Navigating to referenced and referencing rows from data grid doesn't put quotes around UUID's.
Navigation & SearchFeatureDBE-8897Full text search enhancement - result list(s) should be ordered
BugDBE-8963When Ctrl+clicking on a table name in SQL, the Database window doesn't quite scroll that table on the screen
SQL CompletionBugDBE-9046Database tools: no autocomplete for table name when typing 'alter table' with postgres
BugDBE-4713SQL completion failing on create table
UsabilityDBE-8918'VARCHAR' is completed as 'VARCHAR()'
SQL Format and StyleBugDBE-8334Unnecessary space before comma in ALTER TABLE when several ADD instructions
SQL GeneralBugDBE-6474DataGrip does not operate properly with identifiers containing CRLF
BugDBE-6538Oracle SQL plus dialect: formatting changes and corrupts the query
SQL GenerationBugDBE-8962Wrong Snowflake DDL generation
SQL HighlightingBugDBE-8940Postgres SQL editor does not support PARTITION BY HASH
BugDBE-7491Add syntax highlighting for PL/pgSQL "special commands" (#variable_conflict)
BugDBE-9003Datagrip editor showing syntax error for amazon redshift query. In the attached screenshot when the isnull statement is in the same line as select clause the query gets executed but when the isnull is in second line it gives a syntax error.
BugDBE-9006Unreachable code inspection is reported for Oracle package
BugDBE-7455MariaDB EXCEPT and INTERSECT support
BugDBE-3773SQL: Inspections: Sybase: Ambiguous column reference: two different columns cannot have the same alias
BugDBE-8398False positive "unreachable code" warning
SQL RefactoringBugDBE-8807[PLUGIN] Unable to rename table variable
BugDBE-7709Incorrect placing for table's alias

 

 

  Rails. Code Insight

RubyMine 2019.2.2 Preview (192.6603.11 build) Release Notes

IDEBugRUBY-24867Terminal crashes after upgrading Ruby plugin
BugRUBY-24786Spring hang notification is shown on Windows
InspectionsBugRUBY-24869Suppress for strings concatenation
BugRUBY-22573noinspection RubyResolve inside string
BugRUBY-24696Suppress for statement for ClassModule name is too long
ParsingBugRUBY-24796Pattern matching syntax highlight with dry-monads
QuickDocUsabilityRUBY-24625Ellipsis are shown instead of parameter predefined value
TestsBugRUBY-24211single test runner does not escape regex special chars in the test name filter and so fails to match and invoke the test
Code Analysis. InspectionBugIDEA-219976False alarm "class, interface, or method should not be extended"
CorePerformanceIDEA-220475Freeze on project opening
Core. File SystemBugIDEA-219943PsiModificationTrackerImpl.incLanguageModificationCount() does not always attribute a PSI change to the correct language
ExceptionIDEA-121210"VirtualDirectoryImpl#compare: PersistentFS returned duplicate file names ..." on case-insensitive FS
Core. Platform APIBugIDEA-220367Deprecate and avoid usage of `UElement.getLanguagePlugin()`
Editor. Diff and MergeBugIDEA-220302Regression in 2019.2: CacheDiffRequestChainProcessor does not honor myRequestChain.getIndex()
Editor. Editing TextBugIDEA-220351Expandin collapsed blocks dont setup cursor to correct position
BugIDEA-219192Can't see hard wrap guide.
CosmeticsIDEA-208775"Enable font ligatures" unable to click on popup
Infrastructure. Packaging and InstallationBugIDEA-219214Patch update from 2018.3 to 2019.2 doesn't work
Plugin. Shell ScriptBugIDEA-219928Builtin Shell Script plugin causes color syntax error after bash variable substitution using escape character as last character in replacement string
BugIDEA-220072Bash functions missing in the Structure view
Services. DockerFeatureIDEA-218179--network is not a recognized docker build option
FeatureIDEA-210768Docker. Support --ulimit command line option
BugIDEA-179900Docker exec tab does not correctly wrap
BugIDEA-207582Cannot use more than one terminal in container using exec `/bin/bash`.
BugIDEA-217917Services. Docker. Two "Jump to Source" navigation items from the deployed containers/compose apps
ExceptionIDEA-219940Docker: com.github.dockerjava.api.exception.NotFoundException: {"message":"no such exec"} at attempt to edit some exec tabs
Services. SSHBugIDEA-220121SSHJ: SSH authentication fails when the only authentication method is a One-Time Password via keyboard-interactive
User InterfaceBugIDEA-219898Double shift on modal makes it no responsible
BugIDEA-153291IDE opens on a last known location when external monitor is detached: outside of screen
BugIDEA-192504Enter Full Screen & Exit Full Screen does not execute when invoked via find action
BugIDEA-199472Tool windows broken when opening project
ExceptionIDEA-202927Exception occurs on applying "Show F1, F2, etc. keys on the Touch Bar" option
User Interface. ControlsBugIDEA-219939Missing scrollbars don't allow to properly edit Run Debug configurations
User Interface. Find, Replace, UsagesFeatureIDEA-109899Automatically escape special symbols for "Find" and "Find in Path" dialogs if "Regex" ("Regular Expression") is checked
BugIDEA-219877Shortcut for Open in Find Window in Find in Path on Mac is Ctrl+Enter although tip says Cmd+Enter
User Interface. Keyboard InputBugIDEA-219266Navigation Bar dropdown doesn't show up on ⏎ key in 2019.2
BugIDEA-218926Stretch left keybinding doesn't work
User Interface. Look and FeelBugIDEA-219715Borderless: ellipsis in window title when moving between displays with different DPI
User Interface. NavigationBugIDEA-200255New 'Go to Class' dialog sometimes doesn't show anything
User Interface. Project ViewBugIDEA-215752Nested sources folder not showing in Project view after updating to 2019.1
Version Control. GitUsabilityIDEA-219644For multi-module project - single module branch compare shows multiple module diffs
No subsystemBugWEB-40084Please add "checksums" to the built-in dictionary
PerformanceWEB-40851Computing enum values for a huge enum doesn't reuse the cache of already computed values
CoffeeScriptBugWEB-40447Issues with CoffeeScript editor in RubyMine 2019.2
DartFeatureWEB-40471New Dart folding: content between {...} in if and if-else statements
FeatureWEB-39626Enable 'in-place' mode for Dart local vars renaming.
FeatureWEB-40542'Go To Test' feature for Dart
BugWEB-40669Dart parser handling of question mark
BugWEB-40465Dart parameter info: improvements needed in case of optional parameters.
DebuggerBugWEB-40437JS debug requires remote URL mapping in 2019.2
BugWEB-30191CORS problem when debugging because of "x-ijt" header being sent
ExceptionWEB-40379Cannot add an action twice: Smart Step Into (Step into the particular method)
File WatchersBugWEB-33502Prettier File Watcher: inconsistent behavior with Refactoring > Rename
JavaScriptPerformanceWEB-40534Implicit elements from qualifier of JSDoc-based elements cause performance problem
JavaScript. RefactoringBugWEB-40600No variable name in conflicts dialog when moving variable from tsx to tx
BugWEB-40822'Insert await' quick fix should insert await for the variable initializer if there are no valid references featuring that variable
BugWEB-40377"Replace if-else with ?:" in Vue SFC breaks code
LintersBugWEB-40563Code style settings not updated when 'standard' package is detected
BugWEB-40459Configuring 'standard' package as linter does not work with upcoming version of babel-eslint (v11) (No Babel config file detected error)
Node.jsBugWEB-38037working directory in run configuration for scratch file
BugWEB-40692Can't import "kotlinx-coroutines-core" library if it is located under "node_modules"
TypeScriptBugWEB-40368Readonly array of tuples is incorrectly parsed as readonly tuple + error
BugWEB-40567highlights wrong for value of enum in switch case of TypeScript
BugWEB-40714Intellisense doesn't resolve return types in async methods
BugWEB-40519No completion for `export` keyword after `export {}`
UsabilityWEB-40482Properties are not suggested when using Omit
DB ConsoleFeatureDBE-1878Database console: on switching to deselected schema suggest quick fix to select it in data source properties
SQL Format and StyleFeatureDBE-8451Oracle: align CONSTANT keyword
FeatureDBE-7551FOR XML formatting
FeatureDBE-8321EXPLAIN should be fromatted similar to CREATE VIEW
BugDBE-8888Indent Missing in SQL Formatting of While Loops in Stored Procedure SQL files
BugDBE-5853indent incorrect with ms sql server-style column aliasing
BugDBE-8974SQL Pre-formatter doesn't handle commas when the setting is specified in the Common section
BugDBE-8841SQL formatting: "New line after ALL, DISTINCT" doesn't work when the comma at first
BugDBE-8452Oracle: align CASE Expressions in pl/sql block
BugDBE-8951Stupid formatting of subqueries when they are not collapsed
BugDBE-8328SQL code style should support RETURNING on a separate line
BugDBE-8986Extra indent of the line after where clause
BugDBE-8666Redshift: formatting SQL breaks syntax
BugDBE-7497Align of data types in alter instructions of SQL formatting is broken in 2018.3.1
BugDBE-6170The "Place comma" setting is ignored when "Wrap" is set to "Wrap if long"
UsabilityDBE-8978The combination of Code Style settings and source line breaks cause ugly result
SQL HighlightingBugDBE-8939"unreachable code" error when viewing an SQL Server stored procedure
SQL RefactoringUsabilityDBE-8960'Expand column list' should be available if caret is after '*'
SQL ResolveBugDBE-5033DataGrip does not recognize trigger logical tables DELETED/INSERTED when using ALTER TRIGGER
BugDBE-5766Unresolved savepoint

RubyMine 2019.2.1 (192.6262.57 build) Release Notes

Code InsightBug RUBY-6751 Incorrect inferred type when tap() is used
Bug RUBY-24558 @!attribute and @!method wrong class attaching
Bug RUBY-24668 Don't try find symbols from libraries (consider use-scope of elements)
Bug RUBY-21332 'null' is too big for type interface controller method loop
Bug RUBY-24613 method returns hash literal but RubyMine thinks it's an array
Bug RUBY-21909 support assignments of qualified constants
CucumberBug RUBY-24587 Structure View uses keyword Scenario instead of Example
Bug RUBY-24586 Running Gutters and menu options for new keyword Example still use keyword Scenario
Bug RUBY-24580 Cannot create all steps with new Gherkin 6.0 syntax
Bug RUBY-24590 Cannot run feature with gherkin's 6.0 syntax with Cucumber 4.0.0.rc1
DebuggerBug RUBY-24464 F7 on `yield` does not step into the block
Bug RUBY-24829 Debugger doesn't stop in controller's code
Bug RUBY-24733 Debugger doesn't stop on breakpoints on views
Bug RUBY-24642 Debase Segmentation Fault on Ruby 2.6.3
Bug RUBY-18724 debugger inspector ui gets corrupted when inspecting objects with very large strings
Bug RUBY-24686 Ruby can't catch the debug after resume program execution
Bug RUBY-24719 vm crash or failure to break on a multi-line hash assignment
IDEBug RUBY-19490 "Copy reference" works for class/module declarations but not constants
Usability RUBY-24427 Help button is not working in 'Patch Spring config to debug application' dialog
Cosmetics RUBY-24736 Context menu Run test should display TestFramework
RailsBug RUBY-24652 Fix false-positive "unexpected parameter value" for has_rich_text
Rails. ParamdefsBug RUBY-24705 ActionMailer method is generated under not related comment
RefactoringsBug RUBY-24543 Extract method with numbered params detects extra parameters
TestsBug RUBY-24639 Logging output has lots of extra whitespace
Bug RUBY-17147 Methods named 'include' (e.g. RSpec matcher) lead to spurious unresolved reference errors
Bug RUBY-24000 Running Rspec contexts with backticks do not get escaped properly thus resulting in random shell command being run.
Code Analysis. Language InjectionCosmetics IDEA-214467 (un)Inject language or reference action text is not consistent
Core. IDE SettingsBug IDEA-215102 Services view: Run Maven Build action output appears incorrectly in case of Maven run configurations including to the list of RC templates available in services
Bug IDEA-218545 Completion for variables in Files And Code templates: no suggestions are shown until some symbols are entered
Bug IDEA-219090 IdeaVim causes IDEA to crash on startup
Bug IDEA-219398 '${DATE}' variable expansion doesn't respect system date format
Bug IDEA-212194 Windows launcher reports "MaxJavaStackTraceDepth=-1 is outside the allowed range" for any invalid VM option
Usability IDEA-217435 Rename "Custom" page in Settings | Editor | Color Scheme to "User-defined file types"
Cosmetics IDEA-217590 Redundant group headers in Settings | Editor | Code Style
Core. IndicesBug IDEA-218036 `java.lang.IllegalStateException: psiFile is null` ERROR causes editor to break in various ways
Bug IDEA-216640 cannot resolve symbol for some class.
Core. LicensingBug IDEA-218265 Floating ticket cache isn't removed on IDE shutdown.
Core. Navigation and SearchUsability IDEA-219563 "Go to Class" search results vary depending on the way you type them
Usability IDEA-219832 Emoji search doesn't work in "Find in path"
Core. Platform APIBug IDEA-217883 PsiElement.parentOfType extension function fails when called from a plugin which bundles its own version of kotlin-stdlib
Bug IDEA-218940 java.lang.NoClassDefFoundError: com/intellij/util/ui/JBScalableIcon when installing plugin built with 2019.2 in pre-2019.2 IDE
Bug IDEA-217000 Provide an API to hide editor notification from Alt-Enter
Core. Plugin ManagementBug IDEA-219030 Unable to access Custom Repository in 2019.2 Version of IntelliJ Ultimate Edition
Core. Project SettingsBug IDEA-192893 Project file encoding settings: the 'BOM for new UTF-8 files' option settings are not preserved on project reopening
EditorBug IDEA-216997 Method chain parameter hints rendering artifact
Cosmetics IDEA-218101 Rich copy configurable shows wrong scheme names
Editor. Code CompletionBug IDEA-218227 Autocomplete pulldown menu does not move with the IntelliJ IDEA main window
Editor. Editing TextBug IDEA-218424 Dialog 'Map Action' is not usable via keyboard
Editor. Formatter and Code StyleUsability IDEA-219423 'Always keep trailing space on caret line' is controlled via editorconfig in 2019.2
Exception IDEA-217454 NPE at org.editorconfig.configmanagement.editor.EditorConfigPreviewMarkerProvider.getRootDir
Infrastructure. Packaging and InstallationBug IDEA-218394 "IDE and Plugin Updates" doesn't show a warning if there is no compatible plugin with the newer IDE version
Bug IDEA-217164 Installing IntelliJIdea and Android Studio Missing Reg Entries
Usability IDEA-218032 Windows: Prevent IDEA to prepend its own PATH entries
Plugin Development (DevKit)Cosmetics IDEA-215768 where is `Machine Learning Assistant Code Completion` ?
Plugin. Shell ScriptCosmetics IDEA-215998 [Shell Script Run config] space is missing in Run Anything dialog
Plugin. TerminalBug IDEA-219391 JetBrains Runtime Path is incorrectly added to PATH in built-in terminal
Bug IDEA-208433 Terminal environment variables settings are not per project
Bug IDEA-218875 Connector-TtyConnector threads are leaked
Performance IDEA-218535 Freezes in com.jediterm.terminal.model.hyperlinks.TextProcessing
Plugin. TextMate BundlesBug IDEA-219368 IndexOutOfBoundsException when use "Replace All"
ServicesBug IDEA-218447 Services tool window shall have a quick shortcut
Bug IDEA-215458 Services View: GroupConfigurations... action results are not reflected in the Services Toolwindow UI
Usability IDEA-215692 No distinction between running Spring Boot Application in new Services Toolbar
Usability IDEA-218441 Services View: Sort By options are confusing
Services. DockerBug IDEA-205733 docker-compose: red code `scalar value is not allowed` for network's `ipam.config.subnet`
Bug IDEA-217480 Docker: Building image results in java.lang.IllegalArgumentException: Argument for @NotNull parameter 'client' of com/intellij/docker/agent/DockerAgentDeploymentImpl$BuildImageCmdWithCleanup.forConfig must not be null
Usability IDEA-217908 Docker: Service view is collapsed after container start / restart if there are more than one docker connections
User InterfaceBug IDEA-194702 moving a floating mode window from a screen to another freezes intellij
Bug IDEA-218766 Internal error when trying to open a project from Finder via "Open With"
Bug IDEA-218645 Tab scrolling with touchpad has inverse axis
Cosmetics IDEA-156617 Menu icons are blurry on Retina screen
Exception IDEA-217899 Exception occurs on accessing "Show Image Thumbnails" context menu item
User Interface. ControlsBug IDEA-215616 Pipette in Color Picker is missing
Usability IDEA-199407 No ability to call "Export File Location" dialog from export settings window
User Interface. Find, Replace, UsagesBug IDEA-205551 Memory leak: project via UsageInfo2UsageAdapter via ThreadLocal
Bug IDEA-216434 Selected Files scope is missing
User Interface. GraphicsBug IDEA-217895 DND in trees on macOS shows doubled image on HiDPI
User Interface. Keyboard InputBug IDEA-219679 Keymaps plugins don't work in AppCode and DataGrip
User Interface. Project ViewPerformance IDEA-218590 AutoScrollFromSourceHandler may lead to freezes
Version ControlBug IDEA-218141 Upsource Integration plugin do not create review after commit in IntelliJ IDEA 2019.2 beta
Bug IDEA-217487 View Files from Add Project Configuration Files notification does not list some project files.
Bug IDEA-215708 Project configuration files are treated as external files
Bug IDEA-217608 Changed File Tree are not updated on a second opening of updated
Bug IDEA-218028 Cannot change the global paths filter in the Update Info tab
Bug IDEA-217562 .gitignore completion: *. proposes weird results
Usability IDEA-217486 "Add file to .gitignore" should create .gitignore if it doesn't exist yet
Task IDEA-219688 Non-modal commit: Remove "Commit" action from "Local Changes" tab toolbar and popup
Exception IDEA-218807 UnsatisfiableDependenciesException on changing path to git executable from Welcome screen
Version Control. GitFeature IDEA-218129 Support interactive prompts from all Git commands
Bug IDEA-219276 Commit-dialog: Git options are misisng in project with mixed vcs
Bug IDEA-217208 Git | Pull hangs if pull.rebase is set to interactive
Bug IDEA-217573 Comments are not properly highlighted in .gitignore
Bug IDEA-217398 Synchronous execution on EDT: Resolve from the Notification after rebasing with conflicts
Bug IDEA-219235 Add to gitignore on a folder in Unveresioned files node adds all its children to the gitingore
Performance IDEA-218198 UI hanging due to Git filesystem access on main event queue thread (GitRootConverter.convertRoots)
Usability IDEA-83415 IDEA should "git commit" when possible instead of always calling "git commit --only" with paths
Version Control. GitHubBug IDEA-209405 Github Integration forces HTTPS
Version Control. LogUsability IDEA-219083 Commit details: soft-wrap doesn't wrap if there are long words in the text
No subsystemFeature WEB-39958 React auto import ignore "allowSyntheticDefaultImports"
Feature WEB-40006 Add 'insert await' quick fix for type assignability errors of 'Promise<T> vs T' and for property access on `Promise<T>` for a property that exists in T
Feature WEB-39817 JS. Console live templates
Bug WEB-39612 "Invalid" in suggest popup
Bug WEB-39596 Choose better overload for document.createEvent()
Bug WEB-40287 'Generate destructuring pattern' should handle computed property names properly
Bug WEB-40196 No syntax highlighting for JSP files
Bug WEB-40355 No SVG preview pane after 2019.2 update
Bug WEB-40173 Redundant default attribute in SVG changes image in preview when removed
Usability WEB-39990 Improve availability for intention action of editing object literal property values
CSSFeature WEB-36265 CSS Media Queries Level 5 support
Bug WEB-40049 postcss-simple-vars: variable reference as a part of a property name is not resolved
Bug WEB-40241 "Mismatched property value" errors when using functions in SCSS/Sass files
DartBug WEB-40544 IDE may freeze when editing a Dart file and Structure tool window is open
Bug WEB-40308 2019.2 regression: Postfix completion not working in Dart Plugin, v2019.2
Bug WEB-40354 Dart completion: selecting constructor should insert parentheses and optionally argument placeholders
DebuggerBug WEB-40409 Electron 6 App does not start up corretly in DebugMode
Bug WEB-11399 Debugger Console: variables defined in the console are not autocompleted (global context)
Bug WEB-39787 Live Edit does not work with node 10.16
Bug WEB-38656 Node.js vm lineOffset
Bug WEB-39342 Provide completion for console methods in JavaScript debugger console
Bug WEB-38541 Karma: debugger stops on breakpoints only after restart or reload
Bug WEB-29329 Lambda Kotlin breakpoints are handled incorrectly during JS debug
Usability WEB-40014 Show a meaningful error message when starting a debugger with node.js < 8.x set up as remote docker compose interpreter
File WatchersBug WEB-39703 File watcher file type reverts back to unknown when I save it (Jsonnet, Blade)
HTMLBug WEB-38718 'Deprecated HTML attribute' shouldn't be shown for attributes resolved to React component props
Bug WEB-25670 WebStorm complains that some browsers don't like empty tags
Bug WEB-40047 Invalid "deprecated HTML attribute" warning on React's onError attribute
JavaScriptFeature WEB-39619 JavaScript: additional completion for "length" and "size" methods
Bug WEB-40046 Rename doesn't update @callback name is JSDoc
Bug WEB-40432 Flow: Support explicit inexact object syntax
Bug WEB-39805 Add other properties to Dynamic usages group
Bug WEB-40273 Method chain type hints are shown with several consequent 'Promise<some_type>' for the same some_type
Bug WEB-33474 Create variable from usage: no possibility to choose keyword
Bug WEB-39982 'Сonvert to const' in for loop with usages after the loop breaks the code
Bug WEB-39938 Custom postfix templates for JavaScript and TypeScript don't work in TypeScript files
Bug WEB-39923 ES6: use directory import for index.js.flow
Bug WEB-38661 Javascript : auto-complete not working for multiple levels of Object.create() and Object.Assign()
Bug WEB-40254 Broken auto-completions for relative paths for node.js require
Bug WEB-22701 Include enclosing functions in call hierarchy
Bug WEB-40074 Gutter icon placed over documentation comment for implementations with computed property names
Bug WEB-39836 No completion for `instanceof` in conditions with NOT
Bug WEB-40280 Javascript: Code-completion for setters in closure/function-based classes is not working correctly
Bug WEB-37587 IntelliJ IDE Autocomplete for multiple extend not working in ES6 classes
Bug WEB-40055 es6: do not apply jsdoc namespace to class members
Bug WEB-39917 Operating on comments breaks indents for items around the comment
Bug WEB-40175 Flow error ranges don't update with the content
Bug WEB-37739 WebStorm doesn't understand Flow type annotation in array destructuring assignment
Bug WEB-40036 JSDoc should be inherited from super methods
Bug WEB-14774 JSDoc: Show description for function in nested class (inherit description for function from parent)
Bug WEB-38654 Imported functions mistaken for global functions
Cosmetics WEB-40170 'Replace destructuring with index access' when variable is unused shouldn't just drop the destructuring
Exception WEB-40533 Flow: exception for array destructuring with object literal
Exception WEB-39892 Throwable is thrown for the JSUnusedGlobalSymbolsPass
JavaScript. FormatterBug WEB-15618 Formatting inside JavaScript doc comments - spaces inserted instead of tabs
Bug WEB-40326 Incorrect indent for `debugger;` statement after code reformat (one less)
Bug WEB-39993 Wrong indent before computed property name in TS interface
JavaScript. FrameworksFeature WEB-40022 Angular 8: support new recommended way of importing Angular Material components
Feature WEB-31693 Vue: support details of components defined with @Component syntax
Feature WEB-40094 Unresolved symbol ReactComponent when importing svg in React
Feature WEB-40349 Vue.js: support web-types linked from the project's own package.json
Feature WEB-38539 Editor not detecting invalid Vue.js syntax for error, "v-bind expression cannot be empty"
Feature WEB-40617 Vue.js: support source resolution for web-types
Bug WEB-39829 Set JavaScript version to ECMAScript 6 when Vue.js project is created
Bug WEB-37218 Vue: Component props should be at the top of completion list in template
Bug WEB-40051 'Convert to functional component' should be available if constructor contains only super call or 'state' assignment that is not used anywhere
Bug WEB-40224 Vue.js: improve HTML and expression parsing and lexing
Bug WEB-40591 System collation causes issues with lowercase letters in code
Bug WEB-38846 JSX Incorrect inspection "value assigned is never used"
Bug WEB-40214 Missing resolve of private props in vue components
Bug WEB-40304 Angular: Improve support for multi-slots
Bug WEB-40226 Angular component definition inspections should check if it's an Angular component
Bug WEB-40515 False 'Missing required attribute' shown for Material components
Bug WEB-39680 [vue] False positive when boolean true is used in a class binding
Bug WEB-39865 IDE hangs when fixing formatting of particular vue.js code
Bug WEB-39725 JS icon is shown instead of VUE in 'File | New' pop up
Bug WEB-39381 Vue tags are not resolved in case of indirect dependency (f.e. @nuxtjs/vuetify)
Bug WEB-39967 VueJS plugin + boolean prop = Wrong attribute value
Performance WEB-40417 Angular: performance problem with NgModule cyclic dependencies check
Performance WEB-39910 Angular: migrate file type factories to new API
Performance WEB-39909 Vue.js: migrate file type factories to new API
Task WEB-33709 Add auto-completion and auto-import for styled components
Exception WEB-39906 PsiInvalidElementAccessException in Angular project
JavaScript. InspectionsFeature WEB-19878 Add an inspection to show duplicated import statements
Feature WEB-38437 Unused variables & parameters beginning with _ should be ignored
Bug WEB-40213 Simplify incorrectly assumes variable inside catch block is always null.
Bug WEB-39939 Method can be static inspection: by default use only for private methods
Bug WEB-40350 False positive 'Missing await' inspection for direct variable/expression assignments
Bug WEB-40388 Invalid 'Duplicate JavaScript declaration' warning when using unnamed 'class'
Exception WEB-39835 Quick Fix: JS : Plugin Intention Power Pack: Replacement if else with conditional caused an exception
JavaScript. RefactoringFeature WEB-29039 Typescript, also allow to move Symbols between .ts and .tsx files
Bug WEB-38241 'Extract interface'/'Extract superclass' refactoring doesn't process all generics
Bug WEB-40071 Propagate to destructing declaration works incorrectly for rest-properties, rest-array-elements and rest-parameters
Bug WEB-40263 Extract Method in typescript fails with exception in specific case
Bug WEB-40075 Self references (name of class) shouldn't be considered dynamic usages
Bug WEB-39309 Moving module member exported with `export *` in 'index.ts' adds unnecessary export
Bug WEB-39229 Don't suggest 'destruct' postfix template for arrays
Bug WEB-40005 Bug in convert promise to async with destructuring and binary expression / object literals
Bug WEB-36377 'Move module member' doesn't work in vue files
Usability WEB-39069 'Propagate to destructuring': make available to the right of the identifier
JavaScript. TemplatesBug WEB-40178 Mustache Plugin doesn't respect configured indent sizing.
LintersFeature WEB-33171 Enable support for a different tslint configuration for *.spec.ts files
Bug WEB-39071 Editing .eslintrc.js triggers save immediately (triggering file watchers) regardless of settings
Node.jsBug WEB-34628 Add completion for scoped packages in package.json
Bug WEB-39985 No completion for some packages in package.json
Bug WEB-39780 Can't select and copy link in npm tool window
Task WEB-35908 Node.js console: URLs with `file://` protocol can't be opened
SASSFeature WEB-37969 baseUrl in tsconfig.json is ignored when resolving Sass imports via ~file.scss
Performance WEB-40135 Severe lag when typing a quoted string in a large SCSS file
TypeScriptFeature WEB-40037 Enable duplicate declaration inspection in TypeScript files
Feature WEB-40157 Enable duplicate declaration inspection in TypeScript files for classes/enums
Feature WEB-40201 Enable duplicate declaration inspection in TypeScript files for TS properties
Feature WEB-37052 Support TypeScript 3.4 non-widening literal contexts ('as const')
Bug WEB-40105 TypeScript 3.3.3+: Trailing comma in tuple types is marked as an error ("type name expected")
Bug WEB-40385 Create derived class / implement interface" intention action. Wrong insert order
Bug WEB-39999 Show line markers for implemented class fields
Bug WEB-39974 False positive for unreachable switch branch in TS with const-context types
Bug WEB-40168 Save type when applying 'Replace destructuring...'
Bug WEB-39868 'Specify type explicitly' is available in for-of, breaking the code
Bug WEB-39994 color error when use `[enum.key]` in `interface`
Bug WEB-39864 auto comp with readonly string array
Bug WEB-39747 "Method can be static" should not be shown for overrides in a derived class (TypeScript)
Bug WEB-40025 typescript auto-import causes circular dependency
Bug WEB-40101 unexpected type resolution: optionality is not properly computed after applying type operations
Bug WEB-40320 typescript import from shows doesn't suggest installed packages
Bug WEB-40505 False positive Duplicate declaration for angular templates
Bug WEB-39827 TypeScript - specify types explicitly - not using aliased type in certain cases.
Bug WEB-39860 'Specify type explicitly' breaks code when specifying type for a single-parameter lambda without parentheses
Bug WEB-39818 Incorrectly inferred type in quick documentation for TypeScript for ternary operators and (some) conditionals
Bug WEB-40064 Line markers for parameter field -> parameter field + parameter field -> field
Bug WEB-39867 Typescript import mapping "Only in files outside specified paths" not working correctly
Bug WEB-39866 When I choose an item from completion as a parameter, an arrow function disappears
Bug WEB-40107 Computed property ["constructor"] is parsed as constructor
Bug WEB-38817 should not check literal initializers for readonly/const values in .d.ts
Bug WEB-39823 TypeScript - Support for specifying inferred function parameters explicitly
Bug WEB-40116 wrong Inlay Hints with nest Promise like
Bug WEB-39989 Implementation not found for property getter if class field is used
Bug WEB-39988 Gutter icon - navigate to definition (implements) not working on constructor shorthands
Bug WEB-39984 Show line markers for overriden fields in derived classes
Usability WEB-40334 Implement required members in Typescript
Usability WEB-40057 Search Everywhere - impossible to understand where external declaration is coming from
Task WEB-39897 Check for readonly assignments with dynamically inferred properties (const contexts, readonly props of object types, readonly mapped types)
Exception WEB-39916 Non-idempotent computation: it returns different results when invoked multiple times or on different threads: 7 != 4 which is length of CachedValue dependencies: [file://C:/dev/mainline/src/Pri...
Unit TestsFeature WEB-39905 Support navigating to the test files without .test. or .spec. in the name located in the test folder next to the feature
Feature WEB-35244 cucumber-js defineSupportCode is deprecated in generated code
Bug WEB-40160 `Rerun failed tests` returns incorrect result with duplicates
No subsystemBug DBE-8871 Can no longer add "external schemas" in schema list (Redshift)
Performance DBE-8694 EAP Consuming Significant Resources - Even at Idle
DB ConnectivityBug DBE-8715 Oracle: the message under the "Test Connection" button disappears
Exception DBE-8823 IAE at com.intellij.database.model.DataSourceSnapshotManager.$$$reportNull$$$0
DB ConsoleBug DBE-8827 Opening the default or connection database console does nothing when you've deleted the scratch file
Usability DBE-5983 Database Console: query result tabs are messed up
DB DiffBug DBE-8835 Schema diff comparison with DDL. Don't show differences for native and default words
Bug DBE-7401 Database Changes window shows first change in queue regardless of selection
DB IntrospectionFeature DBE-5661 Improve support for partitioned tables
Bug DBE-6300 MS SQL Server DB introspection fails with OutOfMemory for a production-size database 12872+ tables
Bug DBE-4856 Azure: db_id() doesn't work, we need a workaround
Bug DBE-8504 DB Synchronize failure
Bug DBE-8344 Viewing or editing procedures on DB2 for i (AS/400) systems fails
Bug DBE-8310 DDL data source: unknown schemas appearing in Database tool window when editing DDL script
DB RefactoringBug DBE-8889 Sqlite Constraint Check lost when table is modified
Data Import & ExportFeature DBE-2640 [Feature Request] Download query output as markdown table
Bug DBE-5165 Import File Not working correctly
Bug DBE-8732 CSV Import - please swap default LOB from Text to varchar(max) to better support modern (post 2005) versions of SQL Server
Data ViewsBug DBE-8717 Comment to name query result tab leads to "unresolved table editor"
Bug DBE-8433 Using FWD and BACK button on table views re-issues the query
Bug DBE-8557 "Limit page size to" no longer limits max query row count
Bug DBE-8817 Colors are stuck in filter
Bug DBE-8788 BLOB Record modifications in Database explorer, after automatic reload, shows a Java object reference
Bug DBE-8857 Query width gets wider and wider with each return (visual bug)
Exception DBE-8761 Artifacts in service windows when view result of SQL query
Navigation & SearchBug DBE-8448 Unable to search database table from quick search
Usability DBE-8895 Find Usages | Sort by line number
SQL CompletionFeature DBE-4499 suggest join conditions based on column / table name matching
Bug DBE-8785 Some objects are not loaded in the completion popup
Bug DBE-8686 SQL code autocomplete works incorrectly
SQL Format and StyleBug DBE-8845 Cursors need to be left-aligned
Bug DBE-8767 SQL formatter mangles blank-padded literals in Postgres
Performance DBE-8257 SQL paste stuck (in PhpStorm)
SQL GeneralUsability DBE-7315 Automatically add commas when drag'n'drop columns to the query
SQL GenerationBug DBE-8826 After editing a package, the last ; is removed during submission to database
Bug DBE-6261 Oracle: DDL script for VIEW misses column names defined in the view header
Bug DBE-7960 PG11:Exception happens when generating definition for partion table which is in different schema of its parent table.
Bug DBE-7107 MSSQL: incorrect DDL generated for char columns
SQL HighlightingFeature DBE-8330 Datagrip literals auto-injection
Feature DBE-8697 Inline parameter hint provider
Feature DBE-8597 Column name hints in INSERT
Bug DBE-8763 DataGrip says "Aggregate calls are not allowed in ORDER BY" clause of non-aggregated query
Bug DBE-8718 PostgreSQL CREATE OPERATOR using the FUNCTION keyword instead of PROCEDURE
Bug DBE-8383 Inspection: aggregate-related problems
Bug DBE-8814 Inspection of "Using CASE instead of conditional function and vice versa" shouldn't be enabled on MSSQL Server 2008
Bug DBE-8850 Exasol DROP INDEX grammar error
Bug DBE-8738 Inspection "VALUES clause cardinality" false positive when used with "OUTPUT inserted INTO"
Bug DBE-8752 SQL: PostgreSQL: VALUES clause cardinality: inspection gives false warning with select into
Bug DBE-8637 partition by join is not recognized in "Oracle SQL*Plus" Dialect
Bug DBE-8866 Allow to enter query with reluctant quantifier in MATCH_RECOGNIZE / Row pattern matching query for the databse tool
SQL ResolveBug DBE-8388 Problems with resolve when commenting a type

RubyMine 2019.2.1 RC (192.6262.39 build) Release Notes

DebuggerBugRUBY-24829Debugger doesn't stop in controller's code
BugRUBY-24686Ruby can't catch the debug after resume program execution
BugRUBY-24733Debugger doesn't stop on breakpoints on views
Core. IDE SettingsBugIDEA-215102Services view: Run Maven Build action output appears incorrectly in case of Maven run configurations including to the list of RC templates available in services
Core. Navigation and SearchUsabilityIDEA-219832Emoji search doesn't work in "Find in path"
Core. Plugin ManagementBugIDEA-219030Unable to access Custom Repository in 2019.2 Version of IntelliJ Ultimate Edition
Services. SSHBugIDEA-217026Problems with ProxyCommand (initial title: Latest EAP, ssh auth broken)
User Interface. Find, Replace, UsagesBugIDEA-205551Memory leak: project via UsageInfo2UsageAdapter via ThreadLocal
User Interface. Keyboard InputBugIDEA-219679Keymaps plugins don't work in AppCode and DataGrip
No subsystemBugWEB-40355No SVG preview pane after 2019.2 update
DartBugWEB-40544IDE may freeze when editing a Dart file and Structure tool window is open
JavaScriptExceptionWEB-40533Flow: exception for array destructuring with object literal
JavaScript. FrameworksFeatureWEB-38539Editor not detecting invalid Vue.js syntax for error, "v-bind expression cannot be empty"
FeatureWEB-40617Vue.js: support source resolution for web-types
BugWEB-40515False 'Missing required attribute' shown for Material components
BugWEB-40224Vue.js: improve HTML and expression parsing and lexing
BugWEB-40591System collation causes issues with lowercase letters in code
BugWEB-39680[vue] False positive when boolean true is used in a class binding
TypeScriptBugWEB-40320typescript import from shows doesn't suggest installed packages
No subsystemBugDBE-8871Can no longer add "external schemas" in schema list (Redshift)
DB DiffBugDBE-8835Schema diff comparison with DDL. Don't show differences for native and default words
DB IntrospectionBugDBE-8504DB Synchronize failure
BugDBE-8344Viewing or editing procedures on DB2 for i (AS/400) systems fails
BugDBE-4856Azure: db_id() doesn't work, we need a workaround
PerformanceDBE-8380Introspection takes forever and hangs datagrip
DB RefactoringBugDBE-8889Sqlite Constraint Check lost when table is modified
Data Import & ExportFeatureDBE-2640[Feature Request] Download query output as markdown table
BugDBE-5165Import File Not working correctly
BugDBE-8732CSV Import - please swap default LOB from Text to varchar(max) to better support modern (post 2005) versions of SQL Server
Data ViewsBugDBE-8788BLOB Record modifications in Database explorer, after automatic reload, shows a Java object reference
BugDBE-8857Query width gets wider and wider with each return (visual bug)
Navigation & SearchUsabilityDBE-8895Find Usages | Sort by line number
SQL CompletionFeatureDBE-4499suggest join conditions based on column / table name matching
BugDBE-8785Some objects are not loaded in the completion popup
SQL Format and StyleBugDBE-8845Cursors need to be left-aligned
SQL GeneralUsabilityDBE-7315Automatically add commas when drag'n'drop columns to the query
SQL GenerationBugDBE-8826After editing a package, the last ; is removed during submission to database
SQL HighlightingFeatureDBE-8330Datagrip literals auto-injection
BugDBE-8850Exasol DROP INDEX grammar error
BugDBE-8637partition by join is not recognized in "Oracle SQL*Plus" Dialect
BugDBE-8383Inspection: aggregate-related problems
BugDBE-8814Inspection of "Using CASE instead of conditional function and vice versa" shouldn't be enabled on MSSQL Server 2008
BugDBE-8763DataGrip says "Aggregate calls are not allowed in ORDER BY" clause of non-aggregated query
BugDBE-8866Allow to enter query with reluctant quantifier in MATCH_RECOGNIZE / Row pattern matching query for the databse tool

RubyMine 2019.2.1 Preview (192.6262.8 build) Release Notes

Code InsightBugRUBY-24668Don't try find symbols from libraries (consider use-scope of elements)
BugRUBY-24558@!attribute and @!method wrong class attaching
BugRUBY-21909support assignments of qualified constants
BugRUBY-6751Incorrect inferred type when tap() is used
BugRUBY-24613method returns hash literal but RubyMine thinks it's an array
BugRUBY-21332'null' is too big for type interface controller method loop
CucumberBugRUBY-24590Cannot run feature with gherkin's 6.0 syntax with Cucumber 4.0.0.rc1
BugRUBY-24586Running Gutters and menu options for new keyword Example still use keyword Scenario
BugRUBY-24580Cannot create all steps with new Gherkin 6.0 syntax
BugRUBY-24587Structure View uses keyword Scenario instead of Example
DebuggerBugRUBY-24642Debase Segmentation Fault on Ruby 2.6.3
BugRUBY-24464F7 on `yield` does not step into the block
BugRUBY-24719vm crash or failure to break on a multi-line hash assignment
BugRUBY-18724debugger inspector ui gets corrupted when inspecting objects with very large strings
IDEBugRUBY-19490"Copy reference" works for class/module declarations but not constants
UsabilityRUBY-24427Help button is not working in 'Patch Spring config to debug application' dialog
CosmeticsRUBY-24736Context menu Run test should display TestFramework
RailsBugRUBY-24652Fix false-positive "unexpected parameter value" for has_rich_text
Rails. ParamdefsBugRUBY-24705ActionMailer method is generated under not related comment
RefactoringsBugRUBY-24543Extract method with numbered params detects extra parameters
TestsBugRUBY-24639Logging output has lots of extra whitespace
BugRUBY-17147Methods named 'include' (e.g. RSpec matcher) lead to spurious unresolved reference errors
BugRUBY-24000Running Rspec contexts with backticks do not get escaped properly thus resulting in random shell command being run.
Code Analysis. Language InjectionCosmeticsIDEA-214467(un)Inject language or reference action text is not consistent
Core. IDE SettingsBugIDEA-219398'${DATE}' variable expansion doesn't respect system date format
BugIDEA-219090IdeaVim causes IDEA to crash on startup
BugIDEA-218545Completion for variables in Files And Code templates: no suggestions are shown until some symbols are entered
BugIDEA-212194Windows launcher reports "MaxJavaStackTraceDepth=-1 is outside the allowed range" for any invalid VM option
UsabilityIDEA-217435Rename "Custom" page in Settings | Editor | Color Scheme to "User-defined file types"
CosmeticsIDEA-217590Redundant group headers in Settings | Editor | Code Style
Core. IndicesBugIDEA-218036`java.lang.IllegalStateException: psiFile is null` ERROR causes editor to break in various ways
BugIDEA-216640cannot resolve symbol for some class.
Core. LicensingBugIDEA-218265Floating ticket cache isn't removed on IDE shutdown.
Core. Navigation and SearchUsabilityIDEA-219563"Go to Class" search results vary depending on the way you type them
Core. Platform APIBugIDEA-218940java.lang.NoClassDefFoundError: com/intellij/util/ui/JBScalableIcon when installing plugin built with 2019.2 in pre-2019.2 IDE
BugIDEA-217883PsiElement.parentOfType extension function fails when called from a plugin which bundles its own version of kotlin-stdlib
BugIDEA-217000Provide an API to hide editor notification from Alt-Enter
Core. Plugin ManagementBugIDEA-219030Unable to access Custom Repository in 2019.2 Version of IntelliJ Ultimate Edition
Core. Project SettingsBugIDEA-192893Project file encoding settings: the 'BOM for new UTF-8 files' option settings are not preserved on project reopening
EditorBugIDEA-216997Method chain parameter hints rendering artifact
CosmeticsIDEA-218101Rich copy configurable shows wrong scheme names
Editor. Code CompletionBugIDEA-218227Autocomplete pulldown menu does not move with the IntelliJ IDEA main window
Editor. Editing TextBugIDEA-218424Dialog 'Map Action' is not usable via keyboard
Editor. Formatter and Code StyleUsabilityIDEA-219423'Always keep trailing space on caret line' is controlled via editorconfig in 2019.2
ExceptionIDEA-217454NPE at org.editorconfig.configmanagement.editor.EditorConfigPreviewMarkerProvider.getRootDir
Infrastructure. Packaging and InstallationBugIDEA-217164Installing IntelliJIdea and Android Studio Missing Reg Entries
BugIDEA-218394"IDE and Plugin Updates" doesn't show a warning if there is no compatible plugin with the newer IDE version
UsabilityIDEA-218032Windows: Prevent IDEA to prepend its own PATH entries
Plugin Development (DevKit)CosmeticsIDEA-215768where is `Machine Learning Assistant Code Completion` ?
Plugin. Shell ScriptCosmeticsIDEA-215998[Shell Script Run config] space is missing in Run Anything dialog
Plugin. TerminalBugIDEA-219391JetBrains Runtime Path is incorrectly added to PATH in built-in terminal
BugIDEA-208433Terminal environment variables settings are not per project
BugIDEA-218875Connector-TtyConnector threads are leaked
PerformanceIDEA-218535Freezes in com.jediterm.terminal.model.hyperlinks.TextProcessing
Plugin. TextMate BundlesBugIDEA-219368IndexOutOfBoundsException when use "Replace All"
ServicesBugIDEA-218447Services tool window shall have a quick shortcut
BugIDEA-215458Services View: GroupConfigurations... action results are not reflected in the Services Toolwindow UI
UsabilityIDEA-215692No distinction between running Spring Boot Application in new Services Toolbar
UsabilityIDEA-218441Services View: Sort By options are confusing
Services. DockerBugIDEA-205733docker-compose: red code `scalar value is not allowed` for network's `ipam.config.subnet`
BugIDEA-217480Docker: Building image results in java.lang.IllegalArgumentException: Argument for @NotNull parameter 'client' of com/intellij/docker/agent/DockerAgentDeploymentImpl$BuildImageCmdWithCleanup.forConfig must not be null
UsabilityIDEA-217908Docker: Service view is collapsed after container start / restart if there are more than one docker connections
User InterfaceBugIDEA-218766Internal error when trying to open a project from Finder via "Open With"
BugIDEA-194702moving a floating mode window from a screen to another freezes intellij
BugIDEA-218645Tab scrolling with touchpad has inverse axis
BugIDEA-218020Project Dimension Service is broken for Structure Popup
CosmeticsIDEA-156617Menu icons are blurry on Retina screen
ExceptionIDEA-217899Exception occurs on accessing "Show Image Thumbnails" context menu item
User Interface. ControlsBugIDEA-215616Pipette in Color Picker is missing
UsabilityIDEA-199407No ability to call "Export File Location" dialog from export settings window
User Interface. Find, Replace, UsagesBugIDEA-216434Selected Files scope is missing
User Interface. GraphicsBugIDEA-217895DND in trees on macOS shows doubled image on HiDPI
User Interface. Project ViewPerformanceIDEA-218590AutoScrollFromSourceHandler may lead to freezes
Version ControlBugIDEA-217487View Files from Add Project Configuration Files notification does not list some project files.
BugIDEA-218141Upsource Integration plugin do not create review after commit in IntelliJ IDEA 2019.2 beta
BugIDEA-218028Cannot change the global paths filter in the Update Info tab
BugIDEA-217562.gitignore completion: *. proposes weird results
BugIDEA-215708Project configuration files are treated as external files
BugIDEA-217608Changed File Tree are not updated on a second opening of updated
UsabilityIDEA-217486"Add file to .gitignore" should create .gitignore if it doesn't exist yet
TaskIDEA-219688Remove "Commit" action from "Local Changes" tab toolbar and popup
ExceptionIDEA-218807UnsatisfiableDependenciesException on changing path to git executable from Welcome screen
Version Control. GitBugIDEA-219235Add to gitignore on a folder in Unveresioned files node adds all its children to the gitingore
BugIDEA-217208Git | Pull hangs if pull.rebase is set to interactive
BugIDEA-217398Synchronous execution on EDT: Resolve from the Notification after rebasing with conflicts
BugIDEA-219276Commit-dialog: Git options are misisng in project with mixed vcs
BugIDEA-217573Comments are not properly highlighted in .gitignore
PerformanceIDEA-218198UI hanging due to Git filesystem access on main event queue thread (GitRootConverter.convertRoots)
UsabilityIDEA-83415IDEA should "git commit" when possible instead of always calling "git commit --only" with paths
Version Control. GitHubBugIDEA-209405Github Integration forces HTTPS
Version Control. LogUsabilityIDEA-219083Commit details: soft-wrap doesn't wrap if there are long words in the text
No subsystemFeatureWEB-39958React auto import ignore "allowSyntheticDefaultImports"
FeatureWEB-40006Add 'insert await' quick fix for type assignability errors of 'Promise<T> vs T' and for property access on `Promise<T>` for a property that exists in T
FeatureWEB-39817JS. Console live templates
BugWEB-39612"Invalid" in suggest popup
BugWEB-40287'Generate destructuring pattern' should handle computed property names properly
BugWEB-39596Choose better overload for document.createEvent()
BugWEB-40173Redundant default attribute in SVG changes image in preview when removed
BugWEB-40196No syntax highlighting for JSP files
UsabilityWEB-39990Improve availability for intention action of editing object literal property values
CSSFeatureWEB-36265CSS Media Queries Level 5 support
BugWEB-40241"Mismatched property value" errors when using functions in SCSS/Sass files
BugWEB-40049postcss-simple-vars: variable reference as a part of a property name is not resolved
DartBugWEB-403082019.2 regression: Postfix completion not working in Dart Plugin, v2019.2
BugWEB-40544IDE may freeze when editing a Dart file and Structure tool window is open
BugWEB-40354Dart completion: selecting constructor should insert parentheses and optionally argument placeholders
DebuggerBugWEB-29329Lambda Kotlin breakpoints are handled incorrectly during JS debug
BugWEB-38656Node.js vm lineOffset
BugWEB-39787Live Edit does not work with node 10.16
BugWEB-39342Provide completion for console methods in JavaScript debugger console
BugWEB-40409Electron 6 App does not start up corretly in DebugMode
BugWEB-11399Debugger Console: variables defined in the console are not autocompleted (global context)
BugWEB-38541@angular/cli 8, Karma: debugger stops on breakpoints only after restart or reload
UsabilityWEB-40014Show a meaningful error message when starting a debugger with node.js < 8.x set up as remote docker compose interpreter
File WatchersBugWEB-39703File watcher file type reverts back to unknown when I save it (Jsonnet, Blade)
HTMLBugWEB-38718'Deprecated HTML attribute' shouldn't be shown for attributes resolved to React component props
BugWEB-25670WebStorm complains that some browsers don't like empty tags
BugWEB-40047Invalid "deprecated HTML attribute" warning on React's onError attribute
JavaScriptFeatureWEB-39619JavaScript: additional completion for "length" and "size" methods
BugWEB-40254Broken auto-completions for relative paths for node.js require
BugWEB-40046Rename doesn't update @callback name is JSDoc
BugWEB-22701Include enclosing functions in call hierarchy
BugWEB-40280Javascript: Code-completion for setters in closure/function-based classes is not working correctly
BugWEB-39938Custom postfix templates for JavaScript and TypeScript don't work in TypeScript files
BugWEB-40074Gutter icon placed over documentation comment for implementations with computed property names
BugWEB-39923ES6: use directory import for index.js.flow
BugWEB-39982'Сonvert to const' in for loop with usages after the loop breaks the code
BugWEB-33474Create variable from usage: no possibility to choose keyword
BugWEB-40036JSDoc should be inherited from super methods
BugWEB-40273Method chain type hints are shown with several consequent 'Promise<some_type>' for the same some_type
BugWEB-39805Add other properties to Dynamic usages group
BugWEB-37739WebStorm doesn't understand Flow type annotation in array destructuring assignment
BugWEB-38654Imported functions mistaken for global functions
BugWEB-40175Flow error ranges don't update with the content
BugWEB-39836No completion for `instanceof` in conditions with NOT
BugWEB-37587IntelliJ IDE Autocomplete for multiple extend not working in ES6 classes
BugWEB-40432Flow: Support explicit inexact object syntax
BugWEB-40055es6: do not apply jsdoc namespace to class members
BugWEB-38661Javascript : auto-complete not working for multiple levels of Object.create() and Object.Assign()
BugWEB-14774JSDoc: Show description for function in nested class (inherit description for function from parent)
BugWEB-39917Operating on comments breaks indents for items around the comment
CosmeticsWEB-40170'Replace destructuring with index access' when variable is unused shouldn't just drop the destructuring
ExceptionWEB-40533Flow: exception for array destructuring with object literal
ExceptionWEB-39892Throwable is thrown for the JSUnusedGlobalSymbolsPass
JavaScript. FormatterBugWEB-40326Incorrect indent for `debugger;` statement after code reformat (one less)
BugWEB-39993Wrong indent before computed property name in TS interface
BugWEB-15618Formatting inside JavaScript doc comments - spaces inserted instead of tabs
JavaScript. FrameworksFeatureWEB-31693Vue: support details of components defined with @Component syntax
FeatureWEB-40094Unresolved symbol ReactComponent when importing svg in React
FeatureWEB-40221Vue.js: try to provide web-types for not indexed dependencies
FeatureWEB-40349Vue.js: support web-types linked from the project's own package.json
FeatureWEB-40166Vue.js: improve web-types caching behaviour for local development
FeatureWEB-40022Angular 8: support new recommended way of importing Angular Material components
FeatureWEB-38539Editor not detecting invalid Vue.js syntax for error, "v-bind expression cannot be empty"
BugWEB-39865IDE hangs when fixing formatting of particular vue.js code
BugWEB-40304Angular: Improve support for multi-slots
BugWEB-40515False 'Missing required attribute' shown for Material components
BugWEB-39680[vue] False positive when boolean true is used in a class binding
BugWEB-38846JSX Incorrect inspection "value assigned is never used"
BugWEB-40224Vue.js: improve HTML and expression parsing and lexing
BugWEB-40214Missing resolve of private props in vue components
BugWEB-39381Vue tags are not resolved in case of indirect dependency (f.e. @nuxtjs/vuetify)
BugWEB-40226Angular component definition inspections should check if it's an Angular component
BugWEB-37218Vue: Component props should be at the top of completion list in template
BugWEB-40051'Convert to functional component' should be available if constructor contains only super call or 'state' assignment that is not used anywhere
BugWEB-39725JS icon is shown instead of VUE in 'File | New' pop up
BugWEB-39967VueJS plugin + boolean prop = Wrong attribute value
BugWEB-39829Set JavaScript version to ECMAScript 6 when Vue.js project is created
PerformanceWEB-40417Angular: performance problem with NgModule cyclic dependencies check
PerformanceWEB-39910Angular: migrate file type factories to new API
PerformanceWEB-39909Vue.js: migrate file type factories to new API
TaskWEB-33709Add auto-completion and auto-import for styled components
ExceptionWEB-39906PsiInvalidElementAccessException in Angular project
JavaScript. InspectionsFeatureWEB-19878Add an inspection to show duplicated import statements
FeatureWEB-38437Unused variables & parameters beginning with _ should be ignored
BugWEB-40213Simplify incorrectly assumes variable inside catch block is always null.
BugWEB-39939Method can be static inspection: by default use only for private methods
BugWEB-40350False positive 'Missing await' inspection for direct variable/expression assignments
BugWEB-40388Invalid 'Duplicate JavaScript declaration' warning when using unnamed 'class'
ExceptionWEB-39835Quick Fix: JS : Plugin Intention Power Pack: Replacement if else with conditional caused an exception
JavaScript. RefactoringFeatureWEB-29039Typescript, also allow to move Symbols between .ts and .tsx files
BugWEB-40075Self references (name of class) shouldn't be considered dynamic usages
BugWEB-40005Bug in convert promise to async with destructuring and binary expression / object literals
BugWEB-39309Moving module member exported with `export *` in 'index.ts' adds unnecessary export
BugWEB-40263Extract Method in typescript fails with exception in specific case
BugWEB-39229Don't suggest 'destruct' postfix template for arrays
BugWEB-36377'Move module member' doesn't work in vue files
BugWEB-38241'Extract interface'/'Extract superclass' refactoring doesn't process all generics
BugWEB-40071Propagate to destructing declaration works incorrectly for rest-properties, rest-array-elements and rest-parameters
UsabilityWEB-39069'Propagate to destructuring': make available to the right of the identifier
JavaScript. TemplatesBugWEB-40178Mustache Plugin doesn't respect configured indent sizing.
LintersFeatureWEB-33171Enable support for a different tslint configuration for *.spec.ts files
BugWEB-39071Editing .eslintrc.js triggers save immediately (triggering file watchers) regardless of settings
Node.jsBugWEB-39985No completion for some packages in package.json
BugWEB-39780Can't select and copy link in npm tool window
BugWEB-34628Add completion for scoped packages in package.json
TaskWEB-35908Node.js console: URLs with `file://` protocol can't be opened
SASSFeatureWEB-37969baseUrl in tsconfig.json is ignored when resolving Sass imports via ~file.scss
PerformanceWEB-40135Severe lag when typing a quoted string in a large SCSS file
TypeScriptFeatureWEB-40157Enable duplicate declaration inspection in TypeScript files for classes/enums
FeatureWEB-37052Support TypeScript 3.4 non-widening literal contexts ('as const')
FeatureWEB-40037Enable duplicate declaration inspection in TypeScript files
FeatureWEB-40201Enable duplicate declaration inspection in TypeScript files for TS properties
FeatureWEB-40270Support TS 3.6 improved type checking for generators
BugWEB-39860'Specify type explicitly' breaks code when specifying type for a single-parameter lambda without parentheses
BugWEB-39867Typescript import mapping "Only in files outside specified paths" not working correctly
BugWEB-38817should not check literal initializers for readonly/const values in .d.ts
BugWEB-40319No autocompletion for keyof when type is defined in same not-toplevel scope
BugWEB-39823TypeScript - Support for specifying inferred function parameters explicitly
BugWEB-39864auto comp with readonly string array
BugWEB-39999Show line markers for implemented class fields
BugWEB-39747"Method can be static" should not be shown for overrides in a derived class (TypeScript)
BugWEB-40101unexpected type resolution: optionality is not properly computed after applying type operations
BugWEB-40105TypeScript 3.3.3+: Trailing comma in tuple types is marked as an error ("type name expected")
BugWEB-39866When I choose an item from completion as a parameter, an arrow function disappears
BugWEB-40087auto comp fail when object already has exists member
BugWEB-40505False positive Duplicate declaration for angular templates
BugWEB-39974False positive for unreachable switch branch in TS with const-context types
BugWEB-40385Create derived class / implement interface" intention action. Wrong insert order
BugWEB-39988Gutter icon - navigate to definition (implements) not working on constructor shorthands
BugWEB-39868'Specify type explicitly' is available in for-of, breaking the code
BugWEB-40107Computed property ["constructor"] is parsed as constructor
BugWEB-39994color error when use `[enum.key]` in `interface`
BugWEB-39984Show line markers for overriden fields in derived classes
BugWEB-39827TypeScript - specify types explicitly - not using aliased type in certain cases.
BugWEB-40168Save type when applying 'Replace destructuring...'
BugWEB-40116wrong Inlay Hints with nest Promise like
BugWEB-40064Line markers for parameter field -> parameter field + parameter field -> field
BugWEB-40025typescript auto-import causes circular dependency
BugWEB-39989Implementation not found for property getter if class field is used
BugWEB-39818Incorrectly inferred type in quick documentation for TypeScript for ternary operators and (some) conditionals
UsabilityWEB-40057Search Everywhere - impossible to understand where external declaration is coming from
UsabilityWEB-40334Implement required members in Typescript
TaskWEB-39897Check for readonly assignments with dynamically inferred properties (const contexts, readonly props of object types, readonly mapped types)
ExceptionWEB-39916Non-idempotent computation: it returns different results when invoked multiple times or on different threads: 7 != 4 which is length of CachedValue dependencies: [file://C:/dev/mainline/src/Pri...
Unit TestsFeatureWEB-39905Support navigating to the test files without .test. or .spec. in the name located in the test folder next to the feature
FeatureWEB-35244cucumber-js defineSupportCode is deprecated in generated code
BugWEB-40160`Rerun failed tests` returns incorrect result with duplicates
No subsystemPerformanceDBE-8694EAP Consuming Significant Resources - Even at Idle
DB ConnectivityBugDBE-8715Oracle: the message under the "Test Connection" button disappears
ExceptionDBE-8823IAE at com.intellij.database.model.DataSourceSnapshotManager.$$$reportNull$$$0
DB ConsoleBugDBE-8827Opening the default or connection database console does nothing when you've deleted the scratch file
UsabilityDBE-5983Database Console: query result tabs are messed up
DB DiffBugDBE-7401Database Changes window shows first change in queue regardless of selection
DB IntrospectionFeatureDBE-5661Improve support for partitioned tables
BugDBE-6300MS SQL Server DB introspection fails with OutOfMemory for a production-size database 12872+ tables
BugDBE-8310DDL data source: unknown schemas appearing in Database tool window when editing DDL script
Data ViewsBugDBE-8557"Limit page size to" no longer limits max query row count
BugDBE-8433Using FWD and BACK button on table views re-issues the query
BugDBE-8717Comment to name query result tab leads to "unresolved table editor"
BugDBE-8817Colors are stuck in filter
ExceptionDBE-8761Artifacts in service windows when view result of SQL query
Navigation & SearchBugDBE-8448Unable to search database table from quick search
SQL CompletionFeatureDBE-4499suggest join conditions based on column / table name matching
BugDBE-8686SQL code autocomplete works incorrectly
SQL Format and StyleBugDBE-8767SQL formatter mangles blank-padded literals in Postgres
PerformanceDBE-8257SQL paste stuck (in PhpStorm)
SQL GeneralUsabilityDBE-7315Automatically add commas when drag'n'drop columns to the query
SQL GenerationBugDBE-7960PG11:Exception happens when generating definition for partion table which is in different schema of its parent table.
BugDBE-7107MSSQL: incorrect DDL generated for char columns
BugDBE-6261Oracle: DDL script for VIEW misses column names defined in the view header
SQL HighlightingFeatureDBE-8697Inline parameter hint provider
FeatureDBE-8597Column name hints in INSERT
BugDBE-8763DataGrip says "Aggregate calls are not allowed in ORDER BY" clause of non-aggregated query
BugDBE-8637partition by join is not recognized in "Oracle SQL*Plus" Dialect
BugDBE-8752SQL: PostgreSQL: VALUES clause cardinality: inspection gives false warning with select into
BugDBE-8718PostgreSQL CREATE OPERATOR using the FUNCTION keyword instead of PROCEDURE
BugDBE-8383Inspection: aggregate-related problems
BugDBE-8738Inspection "VALUES clause cardinality" false positive when used with "OUTPUT inserted INTO"
BugDBE-8814Inspection of "Using CASE instead of conditional function and vice versa" shouldn't be enabled on MSSQL Server 2008
SQL ResolveBugDBE-8388Problems with resolve when commenting a type

RubyMine 2019.2 (build 192.5728.104) Release Notes

No subsystemFeature RUBY-17560 Ability to choose order of [Type] and name in @param tag
Feature RUBY-24385 Add support for numbered block parameters
Feature RUBY-24495 Show usages by go-to-declaration (or ctrl+click) on numbered parameter
Bug RUBY-24303 Wrong type description in `Inspection results` tab
Bug RUBY-22728 Fix symbols from being classified as "dynamic"
Bug RUBY-23645 Wrong method generation in case of array reassignment
Bug RUBY-23933 `Boolean` string must be shown in suggestion variants in YARD tags
Bug RUBY-23916 Correct return value type recognition for `@overload` YARD tag
Bug RUBY-23986 YARD - multiple `@return` tag support
Bug RUBY-23915 Parameter info for `@overload` YARD tag
Bug RUBY-22806 Rails console truncates output and freezes
Bug RUBY-23684 Wrong completion in case of aliasing method with expression substitution
Usability RUBY-22730 Consider renaming "text occurrences" in find usages
Cosmetics RUBY-24357 Distinguish `x.send(:y)` in usages classifier
Exception RUBY-24266 Already disposed: Module: 'disapora'
Code InsightFeature RUBY-23395 Factory Bot - display factories, sequences and trait definitions in the file structure view
Feature RUBY-24403 Add find-usages and highlighting for numbered block parameters
Feature RUBY-23296 View->Expression Type does not respect @yieldparam annotation
Feature RUBY-21087 Yard @param and @return tags not inherited on overrides
Feature RUBY-23723 Support string constant inference inside delegate and alias calls
Feature RUBY-21282 Sort text-based resolve results as "user/non-user code"
Feature RUBY-24376 DFA and Resolution support for 2.7 Pattern matching
Feature RUBY-23399 Factory Bot - allow navigating from a factory field definition to its corresponding factory/sequence/trait if it doesn't have a value provided
Feature RUBY-23516 Factory Bot - add attribute reader reference for sequence calls inside a factory
Feature RUBY-23896 Factory Bot - add support for safe delete
Feature RUBY-23236 Factory Bot - ensure rename works for factories, sequences and traits
Feature RUBY-23670 Intention to convert explicit block call with `&method(:...)` idiom - provide option to turn off
Bug RUBY-23541 No type inference for yielded do-blocks parameters when multiple yields are called
Bug RUBY-17697 attr_writer/ attr_reader detection is wrong in some cases.
Bug RUBY-24302 Type inference =~ operator
Bug RUBY-24435 Weird parameter info variants for method with overloads
Bug RUBY-24434 YARD-defined overload is considered as a super method for its original method
Bug RUBY-23252 False "Found extra argument" warning for FactoryBot 'create' method in minitest.
Bug RUBY-23880 Don't include "self" in find usages for factories/sequences/traits
Bug RUBY-23908 Navigate to the factory, sequence & trait name elements from structure view
Bug RUBY-24448 Quick definition does not show assigned hashes properly
Bug RUBY-24455 Constant String Inference. Hash support. each method
Bug RUBY-23985 RubyMine wrong type inference for binary operations
Bug RUBY-24457 Array is not considered as subtype for Enumerable
Bug RUBY-24247 true negative missing argument inspection for key required argument
Bug RUBY-24260 Allow string interpolation in factorybot element names
Bug RUBY-24239 NPE in PsiStringValueVisitor
Bug RUBY-24057 Intention "For loop is better to be replaced with for.each" wrongly marks for-variable as unused
Bug RUBY-23437 Factory Bot - ensure we store away options with factory call-types to prevent unstubbing
Bug RUBY-23561 Code completion does not shows automatically when you try to add @param tag in RubyMine
Performance RUBY-23764 Find usages in big project lasts long time (~6000 usages in more than 1 hour)
Usability RUBY-23673 Update "Convert to method reference" inspection to only be info, not a warning
Task RUBY-24293 Rewrite Nil Analysis to give possibility of expression to be nil
Task RUBY-24205 Tech debt: Remove redundant code inside factory bot find usages provider
CucumberFeature RUBY-23129 Support Cucumber v 4.0.0
Bug RUBY-23901 Directory 'features' should be test root by default
Bug RUBY-17047 Gherkin: tags on Examples get reformatted to wrong indentation level
Usability RUBY-21356 Avoid Cucumber Step Suggestions in Tables
DebuggerFeature RUBY-24469 inspect a method/block/lambda return value on `end`
Feature RUBY-14112 step over should optionally step inside blocks
Bug RUBY-24513 Highlighting tooltip is shown after leaving c-method in case breakpoint 'All'
Bug RUBY-24470 F7 and F8 on a return statement in a method skips the `end` line and lines that follow the method invocation
Bug RUBY-24515 Step into could not leave method call in case of breakpoint All
Bug RUBY-24518 Not smart step into missed end of the method
Bug RUBY-24282 There is no breakpoint icons for blocks
Bug RUBY-24460 Step out in chained block calls
Bug RUBY-23905 Debugger doesn't stop on breakpoints in case there are non-english characters
Usability RUBY-22071 Provide more clear detection when remote attach to the script happens with not corresponding sdk
Usability RUBY-24073 No way to enable Spring for Debug back after disabling it
Task RUBY-24490 Create test for different stepping over (with enabled and disabled option)
DockerBug RUBY-23872 Cannot use bundle install with docker exec
Bug RUBY-24086 Stopping Rails process from RubyMine on Windows doesn't kill the process in container
Bug RUBY-24537 RubyMine can't copy gems from Docker Container on Windows
Bug RUBY-24016 DockerComposeCredentialsEditor fails to parse valid docker-compose file
Bug RUBY-24360 Can't configure Remote Ruby Interpreter for docker-compose: "Unable to read RBConfig from specified interpreter"
Task RUBY-24390 Change back default option from 'docker-compose exec' to 'docker-compose up'
DocumentationFeature RUBY-8349 YARD - add inspection for correct @return match
Bug RUBY-24452 Quick definition for lookup elements does not work for local vars
IDEFeature RUBY-13419 Feature Request For Global Configuration Variables
Feature RUBY-19095 Auto detect Spring hang
Bug RUBY-24024 SDK list in the Settings is aligned to the right
Bug RUBY-24257 Tabs and sub-tabs name are the same in some cases
Bug RUBY-24186 Accessing the find usages settings for factory aliases creates an unnecessary popup
Bug RUBY-24145 implementations of method search results are not marked invalid when the method is deleted, instead start showing the following method in the file
Bug RUBY-24208 Windows: console output is repeated
Bug RUBY-24002 Fix partial line markers for factories to not show for every factory
Bug RUBY-23750 FactoryBot - ctrl + hover with mouse over a nested trait navigates to self, rather than show usages
Usability RUBY-23788 Add additional usage types to find usages to reduce the number of "Unclassified usages" shown
Usability RUBY-23512 Factory Bot - add quick nav info
Usability RUBY-24675 Set the recommended keymap scheme as the pre-selected one for new installations
Exception RUBY-24616 EA-143764 text range out of bounds exception
InspectionsFeature RUBY-23875 YARD - add inspection for correct @param match
Feature RUBY-23260 Standard gem support
Feature RUBY-23063 Add support of useless safe navigation usages in Nil Analysis
Bug RUBY-23646 invalid inspections
Bug RUBY-24213 Nil dereference. False positive. Assignment in condition.
Bug RUBY-24373 Redundant safe navigation. False positive. Reference after reference.
Bug RUBY-23072 Running Nil dereference inspection by name will show nothing if it's disabled in inspections settings
Bug RUBY-24372 Redundant safe navigation. False positive. While loop.
Bug RUBY-23821 "super() call with no superclasses actually defined" confusing description in case of calling outside method
Bug RUBY-24228 False positive expression can be simplified expression for boolean expression
Bug RUBY-24066 Super class is not detected for overridden methods in singleton classes
Bug RUBY-24270 Redundant parentheses after method call. False Positive. super() call.
Bug RUBY-24305 Make type names in the tooltip more readable
Bug RUBY-24501 Rubocop fixes don't work if gem 'standard' is in Gemfile
Bug RUBY-24304 False positive of 'YARD return type match' inspection
Bug RUBY-24271 Super call out of method. False Positive. RSpec let and subject calls.
Bug RUBY-24374 Redundant safe navigation. False positive. Safe navigation in elsif.
Bug RUBY-24307 False positive `YARD return type match` inspection
Bug RUBY-24018 Wrong simplification of expression with boolean equality
Usability RUBY-23786 RubyMine inspection "custom .find" looks no longer useful
Task RUBY-24294 Rewrite warning of nil dereference
Task RUBY-22614 Ruby Interfunctional Nil Analysis
ParsingFeature RUBY-24319 Parse 2.7 pattern matching
Bug RUBY-24441 Parser. False positive. Symbol content expected.
RHTMLBug RUBY-24531 Can't type in scss.erb files in RM
RailsBug RUBY-24040 An error is occurred on an attempt to run the Rails console with the environment other than 'Default'
Bug RUBY-22887 Find Usages on an association looks for the class
Cosmetics RUBY-24506 Label of association key in find usages tool window is shortened
Task RUBY-22809 Deprecate support for Rails 2.3, 3.0, 3.1. Keep support for 3.2+.
Rails. Code InsightFeature RUBY-24117 Update enum support for rails 6
Feature RUBY-17685 Rails ActiveRecord Enums are not resolved or available in code completion
Feature RUBY-23954 Rails enum support add the plural enum name to the model singleton
Feature RUBY-23061 Add missing Rails magic methods for fields
Feature RUBY-23791 Add paramdef support for Rails 6 ActionMailbox
Feature RUBY-23789 Add paramdefs for new Rails 6 methods
Feature RUBY-23792 Add inspections for Rails 6 ActionMailbox
Bug RUBY-23508 Type inference for `new` on a has_many association seems wrong
Bug RUBY-22922 Find Usages on a scope looks for the `scope` method
Bug RUBY-22234 Code completion and type inference for enumerable methods on ActiveRecord::Relation's don't work
Bug RUBY-24344 Support `.freeze` calls in constant string inference
RakeBug RUBY-24254 RakeBeforeRunTaskProvider : ERROR - plication.impl.ApplicationImpl - EventQueue.isDispatchThread()=false
RefactoringsBug RUBY-24480 Fix Extract Method refactoring for blocks with numbered parameters
Bug RUBY-19223 Refactoring a variable out from an assignment should either refuse to work, or do something sensible
Bug RUBY-22209 Fix extract method from treating RBodyStatement as an expression
Bug RUBY-24429 Changing parameter names does not affect preview signature in the extract method dialog
Remote InterpretersBug RUBY-24312 Make actions "Show Gem Path", "Show Gem Description" and "Synchronize Gems and RubyMine Helpers" DumbAware
Ruby. FormatterFeature RUBY-24375 Formatting for 2.7 pattern matching
Task RUBY-20664 Enable spaces around curly braces in blocks by default
RubyGemsBug RUBY-7808 Improve yml gem spec parsing
TestsBug RUBY-23917 Test generator does not understand name spaces
Usability RUBY-24487 TESTOPTS field it too small
Cosmetics RUBY-24488 Rearrange TESTOPTS field in the Rake Run Configuration
Code Analysis. DuplicatesFeature IDEA-214460 Do not detect duplicates inside ruby test files.
Feature IDEA-214455 Skip initialization methods during duplicates analysis in ruby files.
Bug IDEA-217219 Duplicated code tool window numbers the lines from 0
Bug IDEA-212709 Hide unrelevant options in `Duplicated code fragment` inspection options.
Bug IDEA-214457 Distinguish methods calls in ruby files.
Bug IDEA-209663 Relayout duplicates configurable
Code Analysis. InspectionFeature IDEA-93333 Chained method calls inspection shall ignore methods which return the same type of enclosing class
Bug IDEA-138441 Methods named like getters are wrongly treated as pure
Bug IDEA-208728 Fix settings link on inspection toolwindow.
Bug IDEA-209420 Unable to export Inspection Results as HTML
Bug IDEA-208127 Batch inspection result preview not scrolled to warning in injected code
Bug IDEA-210888 Offline inspection result file contains incorrect path to project if run command has `..` segments in path to project
Bug IDEA-210730 The same spelling error is underlined twice
Bug IDEA-214550 Intellij shows wrong error on generic methods due to another another argument wrong type.
Usability IDEA-30715 "Split into multiple declarations" / "Split into separate declarations" confusion
Cosmetics IDEA-206994 Show more context in Inspection results preview
Exception IDEA-211319 Inspect all sometimes throws "Read access is allowed from event dispatch thread or inside read-action only"
Code Analysis. Language InjectionBug IDEA-211592 Language Injection: no comment is inserted on injecting into java constant
Bug IDEA-153979 Injected fragment editor: inserting new lines makes references unresolved
Bug IDEA-212451 Multihost language injection: injected fragment editing causes exceptions and corrupted code
Bug IDEA-211437 Language Injection: close the injected fragment editor on un-injecting
Performance IDEA-207632 PostgreSQL fragment editing slow and unusable
Usability IDEA-211593 Language Injection: 'do you want to insert annotation?' prompting message is misleading in case of missing annotations
Exception IDEA-211432 REWA at com.intellij.psi.impl.source.tree.injected.changesHandler.AbstractMarkerBasedInjectedFileChangesHand ler.getReportException
Code Analysis. Structural SearchFeature IDEA-206520 Add JavaScript/TypeScript existing templates
Feature IDEA-182437 Search Structurally dialog should have an inline preview
Feature IDEA-210188 Add type filters for JS structural search
Bug IDEA-209956 Expressions enclosed in parentheses are replaced twice during Structural Replacement
Bug IDEA-210612 Scopes dialog requires 2 OK/Cancel clicks before it goes away
Bug IDEA-215457 Allow to search Java methods and constructors in a single query
Bug IDEA-210782 Structural search in JavaScript: can't find arrow function
Bug IDEA-210460 SSR: Double-clicking a group node in the Existing Templates dialog closes the dialog
Bug IDEA-193965 Structural Search And Replace: rerun button works incorrectly
Bug IDEA-209897 Search for for loop pattern with expression list statement fails
Bug IDEA-214637 Structural search doesn't find lambda with statement body and $statement$ expression inside
Bug IDEA-211084 debugger pattern finds all identifiers in JS
Bug IDEA-215017 New pattern cannot be added to Structural Search Inspection
Bug IDEA-210464 SSR: Exporting/importing a template should not include search scope
Bug IDEA-217904 IDE fails to load script for structural search which refers to Java plugin API
Usability IDEA-193706 SSR: provide more information about how to fix "malformed pattern" error
Usability IDEA-216176 Don't show "pattern does not match anything" hint if pattern contains red code
Cosmetics IDEA-216179 SSR: Ungrammatical message "No template ... found in Project Files"
Exception IDEA-202169 IOOBE at com.intellij.structuralsearch.plugin.ui.filters.FilterPanel$2$1.getRowRendererComponent(FilterPanel. java:77)
Exception IDEA-204490 AIOOBE at com.intellij.structuralsearch.StructuralSearchProfileBase.compile
CoreException IDEA-216312 SOE on find usages in IntelliJ project
Core. DebuggerBug IDEA-212608 Make debugger colors customizable
Core. Diagrams (UML)Bug IDEA-141306 UML: new enum constant creating for enum via UML diagram creates uncompilable code if enum contains some members other than constants
Bug IDEA-124631 Opening *.uml file does nothing
Bug IDEA-186132 No default .uml extension for new class diagrams
Bug IDEA-209065 UML: classes added to diagram via AddClassToDiagram action (<Space>) or by drag'n'drop appear incorrectly in the navigation popup
Bug IDEA-60296 Modules UML diagram: listen to module and library rename
Bug IDEA-208180 Unknown and unwanted artifacts in UML diagram
Bug IDEA-124475 Save diagram: ignores changed filename and drops layout
Bug IDEA-184834 Uml Class diagram adds two entries to every diagram that can not be delete
Bug IDEA-217046 Project Modules diagram is empty if root selected in "Show Paths: Root->Selection" mode
Usability IDEA-47864 UML: Create New Method dialog: provide possibility to set static and final modifiers
Usability IDEA-182068 Java Class Diagrams window steals focus from editor
Exception IDEA-173305 IAE at com.intellij.diagram.presentation.SimpleElement.<init>
Exception IDEA-206582 IndexNotReadyException on calling UML diagram during indexing
Exception IDEA-172311 NPE at com.intellij.diagram.util.DiagramUtils.setBestPopupSizeForGraph
Exception IDEA-90136 IDE at com.intellij.diagram.presentation.SimpleElement.<init>
Exception IDEA-72445 Exception when reverting changes with diagram opened
Exception IDEA-202308 IndexNotReadyException on opening project if UML diagram is opened in the active editor
Exception IDEA-151955 'deleteFile() not supported' when trying to delete diagram from Navigation bar
Core. File SystemBug IDEA-212025 VFS refresh blocks UI while reading file system under read action
Performance IDEA-208259 JdkTable / VirtualFilePointerContainerImpl initialization / VirtualFilePointerContainerImpl.getUrls() do disk access
Performance IDEA-208128 VirtualFilePointer.getUrl() accesses disk
Performance IDEA-211046 RefreshWorker/VFS massive memory usage
Exception IDEA-208539 java.lang.Throwable: Synchronous execution on EDT: fsnotifier
Core. IDE SettingsFeature IDEA-207917 Provide a way to disable proxy detection logic on early startup
Feature IDEA-182589 Copy settings back to IDE after disable sync plugin
Bug IDEA-217364 Rider build problem connected with FUS.
Bug IDEA-198533 Template group disappeared when you drag all templates to another group
Bug IDEA-191923 Importing config of old IDE version including custom plugin URL causes incompatible plugin suggestion from this URL
Bug IDEA-215089 unable to get Update
Bug IDEA-218848 Unable to import settings ... chrome-user-data ... (No such file or directory)
Bug IDEA-210223 doesn't save re-added file type configuration
Bug IDEA-191085 Failed to sync IDE settings. Invalid credentials
Bug IDEA-207936 IDEA is 'saving application' indefinitely
Bug IDEA-214625 "Check for updates" action does nothing for me in Nightly
Bug IDEA-209785 No separator for File templates group when invoke new from Project view
Bug IDEA-207297 Settings sync doesn't work, NPE in CloudConfigManager
Bug IDEA-199518 Support trim_trailing_whitespace = false
Bug IDEA-207107 PhpStorm 2019.1 EAP build 191.4738.10, The file auto save is invalid.
Bug IDEA-216940 Add code completion for File and Code Templates
Bug IDEA-211988 Speed Search in Settings works incorrectly after not matching search criteria entering
Bug IDEA-100538 Editor: Fall back fonts are not applied on Mac OS
Bug IDEA-209982 Services view: deployment run configurations appear twice in the toolwindow
Bug IDEA-217083 SerializationException on second opening Swift PM project in CLion
Bug IDEA-214809 Users which had old Mac OS keymap get switched to new keymap silently
Performance IDEA-215475 Report settings data to FUS asynchronously
Usability IDEA-202502 "Use console font" / "Use color scheme font instead of the default" checkboxes can't be set by clicking on their text
Core. JSONBug IDEA-216061 Adding new key-value pair into single-line JSON object places comma into the next key while typing
Bug IDEA-212680 Replace with allowed value simply erase a current value instead of proposing available ones.
Bug IDEA-212880 Null is cached if schema is applied first time for already existing code
Exception IDEA-217138 AE at com.intellij.json.psi.impl.JsonPsiImplUtils.getNameElement
Exception IDEA-212654 strange behaviour when working with file name function.json
Core. Navigation and SearchBug IDEA-211449 IDEA is unable to find lambda implementations when invoked on library class source
Bug IDEA-216794 Search eveywhere does not search in libraries
Bug IDEA-215118 Change in behavior: Navigate->File using maven-backed module-name no longer brings up pom.xml for that module
Bug IDEA-215360 Ctrl-s doesn't repeat find
Performance IDEA-188959 Calculate line marker tooltip in background thread
Usability IDEA-207052 There should be a way to customize GoToDeclaration behavior
Task IDEA-209480 Remove stub hierarchy
Core. Platform APIFeature IDEA-208103 ExecUtil.sudoCommand could show a prompt on macOS 10.10+
Bug IDEA-216927 Restore UastLiteralReferenceProvider binary compatibility in 2019.2
Bug IDEA-181010 unable to use BouncyCastleProvider in plugin due com.intellij.util.lang.UrlClassLoader is not providing ProtectionDomain
Bug IDEA-209724 Smart pointer creation during project disposal leads to "Element from alien project" assertion
Bug IDEA-210479 A race condition in module structure loading
Bug IDEA-208630 Fix "Bean extension class should not have constructor with parameters" EPs
Task IDEA-204389 Tons of "Kotlin: 'psi: PsiElement?' is deprecated. ambiguous psi element, use `sourcePsi` or `javaPsi`" compiler warnings
Task IDEA-209921 Deprecate runWriteCommandAction(Runnable)
Exception IDEA-215230 "Project opening should be done in a transaction" exception appears during reopening of LearnProject via "Learn AppCode" on "Welcome to AppCode" window
Exception IDEA-214801 NPE at VirtualFilePointerImpl#toString
Core. Plugin ManagementFeature IDEA-211218 Possibility to mark a plugin as internal
Bug IDEA-197563 Plugins sync says "not installed" for installed plugins
Usability IDEA-212690 Do not show checkboxes for plugins that are not loaded
Usability IDEA-202747 Provide a link to plugin homepage along the vendor link
Usability IDEA-214551 Plugins: typed input is lost on tabs switch
Usability IDEA-212701 Place plugin home page above the plugin descripton
Usability IDEA-215108 Plugin manager UI - Include modification date
Usability IDEA-212691 Filter out invalid plugins when the problem is fixed
Cosmetics IDEA-212695 Replace "Enable plugins" with “Enable required plugins”
Cosmetics IDEA-207802 Plugins page: do not show (0) if no updates available
Cosmetics IDEA-215084 Fix error message on Plugins page
Exception IDEA-210339 AE at com.intellij.ide.plugins.newui.PluginUpdatesService.recalculateUpdates
Exception IDEA-214826 NPE at com.intellij.ide.plugins.newui.NewListPluginComponent.updateEnabledState
Core. ProfilerFeature IDEA-191888 Add support for Java Flight Recorder (JFR)
Feature IDEA-216334 Profiler: Set, or suggest to set max stack trace depth for Flight Recorder
Feature IDEA-218102 To attach JFR to already started local process
Bug IDEA-216934 To start gradle tasks and run configurations with JFR
Bug IDEA-216163 Flame graph based on JFR data not properly rendered
Bug IDEA-216560 org.openjdk.jmc.flightrecorder.internal.InvalidJfrFileException: No readable chunks in recording
Bug IDEA-215303 There should be 'Run with Profiler' in Gradle toolwindow
Bug IDEA-215305 Reset doesn't work in Java Profiler settings
Bug IDEA-216549 Wrong merged callees tree calculation
Bug IDEA-215597 Part of tree renderer overlaps table renderer
Bug IDEA-216125 profiler tree speed search freezes EDT
Bug IDEA-217299 JFR Settings page
Usability IDEA-216480 More toolbar buttons in profiler Call Tree tab
Usability IDEA-217815 Fix grammar in Profiler UI
Usability IDEA-216477 Do not use three rows of tabs in profiler UI
Task IDEA-214653 Correct presentation settings in Java profiler's call tree
Exception IDEA-217284 java.lang.ClassNotFoundException: org.jetbrains.plugins.gradle.service.project.AbstractProjectResolverExtension
Core. Project SettingsBug IDEA-218348 "Load/Unload Modules..." action isn't shown in the popup menu for unloaded module node anymore
Bug IDEA-208386 If both .idea/workspace.xml and .idea/misc.xml are modified, reload doesn't happen correctly
Bug IDEA-211346 Modules randomly do not load when opening a project
Bug IDEA-210798 Dependencies scope dropdown is switching on mouse over
Usability IDEA-41940 Provide better diagnostics when the user selects a JRE directory as JSDK home
Exception IDEA-212645 Exception on new project opening
Core. Quick DocumentationFeature IDEA-175215 Better quick JavaDoc for enums
Bug IDEA-208812 Inappropriate quick doc for array length
Bug IDEA-209629 Too small default size of quick doc popup (causing text clipping by scrollpane)
Bug IDEA-210273 Table columns missing in Javadoc Quick Documentation view for Java 12
Bug IDEA-211038 Ctrl-Shift-Arrow does not resize quick documentation popup but closes it
Performance IDEA-214615 Memory leak in DocumentationComponent through a blinking caret
Usability IDEA-208364 Don't show quick info tooltip on Ctrl-hover if a quickdoc popup is currently visible
Usability IDEA-208365 Always autosize quickdoc popup when it's displayed on hover
Cosmetics IDEA-211247 JavaDoc generated from HTML eats angle brackets in the link title
Core. RefactoringsFeature IDEA-124496 Scope Setting for Rename Refactoring
Usability IDEA-212081 Names of Copy and Move actions in the context menu should reflect what's going to be copied or moved
Usability IDEA-214702 Do not show 'Scope' setting when rename Java local variable
Core. Run | Debug. ConfigurationsBug IDEA-181448 Run dashboard: after adding RC type to runnable in RD list the existing started configuration is shown there in Cinfigured status
Bug IDEA-210262 [Environment variables] when pasting several variables with semicolon at the line end - the last entry is removed
Bug IDEA-202659 Impossible to start the Debug session for the Tomcat config with Ant/Bash configs in the Before launch section
Bug IDEA-214641 Blank area in tool window when turn off all tabs
Bug IDEA-204416 Running debug tomcat run configuration always launches "Before launch" gulp tasks in debug mode
Core. XMLBug IDEA-208504 First xi:include tag in *Plugin.xml file is highlighted as error
Bug IDEA-205629 Argument rangeInElement exception when deleting xml tag in Android Studio 3.3
Bug IDEA-210207 XML schema issue - element X is not allowed here (Web.xml)
Bug IDEA-212344 catalog.xsd in IntelliJ platform-impl.jar is outdated
Bug IDEA-212646 XML attribute value is marked as error if DTD's attribute type is enumeration containing DTD keyword as value
Bug IDEA-206666 IdeaPluginRegistrationIndex isn't file-based
Bug IDEA-183886 XML highliting and redefined schemas
Exception IDEA-212704 Invoking Find by XPath throws ClassCastException
EditorBug IDEA-216417 Clicking on icons in gutter (e.g. overrides/implements) doesn't work if caret is over the folded property value
Bug IDEA-216456 In-place editing of property values doesn't work in Kotlin files
Bug IDEA-218508 'Insert imports on paste' doesn't work anymore
Bug IDEA-217426 InlayModel.getElementAt returns wrong inlay when multiple block inlays present on single line
Editor. Code CompletionBug IDEA-215451 Misspelled keyword messes up following identifier completion
Usability IDEA-209123 Enable F2 and Shift+F2 shortcuts while code completion is active
Usability IDEA-209784 Basic/Smart completion does not offer package private methods when runtime object type is from another package
Usability IDEA-211557 Code completion dropdown stays open after Shift+Enter (Start New Line)
Usability IDEA-210660 Make "Jump outside closing bracket/quote with Tab" default behaviour
Exception IDEA-194554 AE at com.intellij.codeInsight.documentation.DocumentationManager.assertSameProject
Editor. Color SchemesFeature IDEA-212390 Ability to drag-n-Drop editor color scheme
Bug IDEA-207403 Darcula color scheme: "Custom Keyword 4" default color looks like an error
Editor. Diff and MergeFeature IDEA-137605 IDEA as external diff/merge - provide proper exit codes
Bug IDEA-217797 Diff/Merge does not show changes stripes for empty line ranges (insertions/deletions)
Bug IDEA-207667 Weird synchronised scrolling in diff view with soft wrapped lines
Bug IDEA-215972 Diff viewer uses general hard-wrap margin instead of language-specific
Bug IDEA-212625 Incorrect highlighting in diff view when last document line is soft wrapped
Bug IDEA-216171 'Throwable: Invalid file' when open external diff tool
Bug IDEA-210607 'Apply changes' in diff view does't work
Usability IDEA-155010 Suggest to unlock 'Disable editing' button in 'Commit Changes' dialog when I'm trying to type in diff view
Usability IDEA-123813 Preserve diff pane widths when switching between files
Usability IDEA-182230 VCS "visual merge" window: don't ask "Are you sure" if there was no changes
Cosmetics IDEA-211780 Escape characters in action name of "Diff \\& Merge"
Editor. Editing TextFeature IDEA-70189 Java Smart Complete Statement: Complete ternary operator if necessary
Feature IDEA-211180 Jump outside closing bracket with Tab should jump after the semicolon
Feature IDEA-207307 No horizontal scroll in editor when the width of block inlay is more than editor width
Bug IDEA-197682 Shadow action is created with the wrong lifetime spec (Disposable)
Bug IDEA-204900 Smart Enter fails to add function body if staying at annotation
Bug IDEA-211085 Current line number colour incorrectly calculated
Bug IDEA-215776 Plain text file is missing in Create scratch list
Bug IDEA-211466 Printing (at least on Linux) produces so many artifacts
Bug IDEA-211398 Not all ligatures are activated when printing a file
Bug IDEA-208973 Identifier highlighting is lost after moving line
Bug IDEA-207542 TODO highlighting affects following lines
Bug IDEA-214565 Different indents for Python in commentStart() macro
Bug IDEA-207805 Selection in editor is not reset on mouse right click outside selection
Bug IDEA-167224 Unwrap lambda should add braces if necessary
Bug IDEA-217252 Typing new text block method argument doesn't insert closing quotes
Bug IDEA-211304 IntelliJ cuts links after parens
Bug IDEA-212623 Folding comments in Java out of FileHeader/Class blocks
Bug IDEA-211246 Uncollapsing unchanged framgents should keep scroll position
Bug IDEA-207212 Editor scrolls unexpectedly on pasting collapsed method
Bug IDEA-214755 Folded Javadoc shows the 2nd line when the text starts on the line with /**
Bug IDEA-215015 Text "jitter" during typing in editor on Windows after dragging editor onto a different monitor
Bug IDEA-210470 Fira Code breaks fixed-width alignment on "[[" - double opening bracket
Bug IDEA-208782 Fallback font Italic version doesn't work on Mac
Bug IDEA-138431 Editor: Ctrl+Left / Right (arrow) does not skip over indent whitespace to prev/next token
Bug IDEA-215278 "Hand" cursor "stuck" in editor
Bug IDEA-211590 Selection highlighting background under inlay vertical when scrollbar is flipped
Bug IDEA-216359 Code vision selection doesn't cover the lines sometimes
Performance IDEA-210051 Memory leak in DocumentImpl
Performance IDEA-211201 Typing with multiple carets is slow in XML files
Usability IDEA-208930 Pressing Tab in a selection doesn't prefix first line with a tabulator
Usability IDEA-211756 "Delete to word end" is extremely inconvenient on whitespaces
Usability IDEA-212086 Tooltips for bookmarks should show keyboard shortcuts for navigating to a bookmark and toggling it
Usability IDEA-209051 Inspection popup is overlapped by quick doc
Cosmetics IDEA-215726 Cosmetics for folded property text editing
Task IDEA-209242 Increase default number of items stored by default in clipboard history
Editor. Error HighlightingBug IDEA-212556 Goto Next Error sometimes shows error tooltip and sometimes doesn't
Bug IDEA-211528 Diff change highlighting not propagated to inlay
Editor. Formatter and Code StyleBug IDEA-211444 Code Style Settings: incorrect variants in drop-down for WrapOnTyping option
Bug IDEA-217075 EditorConfig options are not properly applied to JavaScript files
Bug IDEA-202587 No possibility to configure indentations for Scala, Kotlin, etc files
Bug IDEA-215771 When new .editorconfig file is created in the versioned project using New | EditorConfigFile, the prompt to add appears as if it is 'externally added file'
Bug IDEA-147601 Javadoc Code formatting does not indent HTML tags properly
Bug IDEA-216526 Switch Code Style Scheme does not change the code style
Bug IDEA-206789 Export codestyle settings to JSON: java | wrapping and braces | visual guides option is not exported
Bug IDEA-195707 "'case' on new line" setting name is misleading; behavior should be changed and a new setting added with the old behavior
Bug IDEA-216085 New EditorConfig file: Selectively disable languages for which no properties (empty sections) are produced
Bug IDEA-212466 "Expected to be final" identifier is not always painted as such in Java editor
Usability IDEA-215787 Do not show notification about EditorConfig
Usability IDEA-216086 EditorConfig: not clear what Open Preview... means
Usability IDEA-215728 EditorConfig: preview can be opened only once, it is impossible to open different file as preview
Exception IDEA-214694 java.lang.Throwable: Control-flow exceptions (like ProcessCanceledException) should never be logged
Exception IDEA-215353 AE at com.intellij.openapi.util.text.StringUtil.assertValidSeparators
Editor. Intention ActionsBug IDEA-155352 Unwrap Statement produces broken code
Exception IDEA-211266 Throwable at com.intellij.openapi.application.impl.NoSwingUnderWriteAction.lambda$watchForEvents$0
Editor. Large FilesBug IDEA-218382 Support for large files in IDEA 2019.2 doesn't work if the plugin is installed
Bug IDEA-216257 Large file editor: Status bar widget is painted incorrectly with hidpi screen
Bug IDEA-216905 Focus is not in editor when opening large file
Bug IDEA-216267 Large file editor: no context menu
Bug IDEA-216265 Large file editor: closing and reopening tab does not preserve state
Task IDEA-209329 Integrate Large File Editor into the platform
Infrastructure. Packaging and InstallationFeature IDEA-195719 Extract Java support to a separate plugin in IntelliJ IDEA
Feature IDEA-194148 Publish 'intellij.platform.testFramework' module as a Maven artifact
Feature IDEA-164251 Include com.intellij.testFramework.vcs into some binary distribution
Bug IDEA-217984 2019.2 EAP Won't Start: "Initial heap size set to a larger value than the maximum heap size" custom Xmx is replaced with -Xmx2048m
Bug IDEA-215000 Critical Startup Error while launching IDEA from scratch
Bug IDEA-210993 IDEA with JBR 11 starts with error via idea.bat
Bug IDEA-209778 Silent install. Unable to install in the 'Program Files' folder
Bug IDEA-212759 Linux, tar.gz installation: IDEA fails to start: `Cannot find VM options file.`, `Error: Could not find or load main class com.intellij.idea.Main.`
Bug IDEA-205907 2018.3.x silent installation leaves javaw.exe process hanging
Bug IDEA-215898 After rejecting and closing EULA dialog - warning is shown "An illegal reflective access operation has occurred"
Task IDEA-217538 Bundle Kotlin 1.3.41 with IntelliJ IDEA
Task IDEA-209378 Bundle Kotlin 1.3.30 with IntelliJ IDEA
Task IDEA-214695 Provide a special variant of svg product icon for 16x16 images
Task IDEA-209379 Bundle Kotlin 1.3.40 with IntelliJ IDEA
Task IDEA-211824 Bundle Kotlin 1.3.31 with IntelliJ IDEA
Task IDEA-187832 External build systems support: extract `java` specific features into separate module
Task IDEA-199662 Get rid of additional png files which are currently packaged with IntelliJ-based IDEs
Plugin Development (DevKit)Feature IDEA-211486 Devkit EP declaration: suggest to change declaration via 'qualifiedName' to 'name' in main plugin.xml
Feature IDEA-215242 Show warning for <group> elements with class specified and ID not specified
Feature IDEA-212745 Devkit: <depends> checking
Feature IDEA-212463 Devkit: resolve "keymap" in plugin.xml
Feature IDEA-211634 IDEA UI Guidelines: verify capitalization for EP properties annotated with @Nls in plugin.xml
Feature IDEA-211630 IDEA UI Guidelines: "Action" text capitalization
Feature IDEA-199936 Code insight for Registry keys defined via EP com.intellij.registryKey
Feature IDEA-202010 Highlight services/components with identical interface and implementation classes as redundant in plugin.xml
Feature IDEA-208632 DevKit: Component/Action not registered - skip for deprecated classes
Feature IDEA-207289 plugin.xml: highlight duplicate <depends>
Bug IDEA-208482 Devkit: some references to action classes are incorrectly highlighted with "has no default constructor" error
Bug IDEA-212261 IDEA UI Guidelines: "Action" text capitalization via resource bundle
Bug IDEA-211225 Bundled plugins: highlight <idea-version>
Bug IDEA-211126 Bundled plugins: highlight vendor "email" and "url"
Bug IDEA-211131 Bundled plugins: highlight generic <idea-plugin> "url" values
Bug IDEA-209589 Missing recent API inspection must not emit warnings in tests sources
Bug IDEA-209587 Missing recent API inspection: clarify the message if return type of a method was changed
Bug IDEA-211136 Bundled plugins: highlight <change-notes> and <version>
Bug IDEA-190992 DevKit: provide "os" attribute for all EPs
Bug IDEA-209078 Devkit plugin.xml: allow multiple components with same interface-class across types
Bug IDEA-209536 plugin.xml validity inspection doesn't highlight plugin actions which refer to platform action class
Bug IDEA-209681 Devkit: do not require description for Intention not registered in plugin.xml
Bug IDEA-186526 Plugin.xml validity inspection troubles in InspectionGadgets.xml
Bug IDEA-182359 Good code red: plugin.xml
Performance IDEA-211555 Freeze on completion in XML file
Usability IDEA-204988 Plugin DevKit: Group inspections in settings
Task IDEA-214817 Remove support for <helpset> from Devkit
Plugin. FreeMarkerBug IDEA-210630 Inspections are not executed on FreeMarker/Velocity files even with "data language" selected
Bug IDEA-215153 Freemarker inspections "Type mismatch: built-in 'long' is not applicable to 'date'"
Plugin. MarkdownFeature IDEA-213112 Markdown HTML
Feature IDEA-213077 Option to enable hard/soft wrapping for markdown code
Bug IDEA-213127 Markdown EOL isn't injected
Bug IDEA-213113 Allow disabling (some) code highlighting/annotations for injected code
Bug IDEA-213108 Exception while editing go snippet in markdown file
Usability IDEA-213126 Use the latest PlantUML.jar version
Plugin. Settings RepositoryBug IDEA-181296 Incompatible plugin with new IDEA version shown as `installed in another IDE`
Bug IDEA-200123 Keymaps are not synced over Cloud Settings
Bug IDEA-204195 settings sync says "Switch Structure" plugin is missing but it isn't
Plugin. Shell ScriptFeature IDEA-215578 [Shell script] add Run Debug configuration support
Bug IDEA-215398 [IntelliJ Shell plugin] Reuse Terminal tabs when launching script
Bug IDEA-212765 Shell Script hangs on EDT a rather big file
Bug IDEA-216406 Shell Script plugin: Exception on quick documentation
Bug IDEA-215361 ShellScript plugin: correct shfmt download link for windows
Usability IDEA-215355 ShellScript plugin: if attempt to download the shfmt formatter in "Settings | Editor | Code Style | Shell Script" fails, display error in the dialog itself
Cosmetics IDEA-215367 [Shell Script] Settings | Editor | Code Style - incorrect symbol in the first option about Binary ops
Plugin. TerminalFeature IDEA-204536 Terminal: Add support for hyperlinks
Bug IDEA-214512 Re-ordering terminal tabs shows unexpected confirmation dialog to terminate running process
Bug IDEA-214782 Terminal cannot override IDE shortcuts when running with JBR 1.8.0_212 or JBR 11
Bug IDEA-217705 IntelliJ EAP: No caret in terminal if text is rendered as an URL
Bug IDEA-217587 Double shift doesn't use selected text from the terminal
Bug IDEA-151310 active tool window resize hot key dose not work
Bug IDEA-212321 Terminal focuses itself on startup
Bug IDEA-160356 Terminal isn't capturing Ctrl-E
Bug IDEA-215394 Terminal tab crashes with Ion shell
Bug IDEA-191614 Terminal should soft wrap long lines (and not break links)
Usability IDEA-153536 Support native OSX shortcuts in the terminal
Plugin. TextMate BundlesFeature IDEA-211743 Support spellchecker in textmate files
Bug IDEA-212822 Textmate Bundles: no syntax highlighting for php files
Performance IDEA-212840 Sluggish editor when TextMate bundle is installed
Performance IDEA-212841 Textmate bundles cause reindexing increase indexing time up to 2x
Plugin. YAMLFeature IDEA-210945 YAML json schema validation for multiple documents in .yaml file
Bug IDEA-212897 YAML: Don't input value to property if it already contains some value
ServicesBug IDEA-215370 Services view: SplitToNewTabs should be disabled if nothing is selected
Bug IDEA-215345 Services view: if GroupByType is true, all services splitting to new tabs leaves the empty AllServices tab with group node
Bug IDEA-215095 Services view: with 'flatten services' on the 'group by type' should work or be disabled
Bug IDEA-215088 Services view: run configuration output is shown for the incorrect RC node in case of changed RC types available in Services list
Bug IDEA-215427 Services. Database. java.io.FileNotFoundException by the remained "console" item
Exception IDEA-215161 Memory leak detected: 'com.intellij.execution.services.ServiceModel
Services. DockerFeature IDEA-184888 Docker. Support --ipc command line option
Bug IDEA-216884 Docker: `Numeric value: (2147516561) is out of range of int` for windows containers with unusual exit code
Bug IDEA-178818 Docker - Client is newer than server (client API version 1.24, server API version 1.23)
Bug IDEA-211945 Docker. Files Chooser: java.lang.AssertionError at refreshing content with some expanded folders
Bug IDEA-217101 Docker. "Port is already allocated" error at saving changes in container Name/volumes with port bindings
Bug IDEA-209817 NPE containerId was not specified when building a container without running it
Bug IDEA-215186 ServicesView. Docker. Jump to source/F4 from a container doesn't work
Bug IDEA-203226 Docker: NPE at attempt to save changes in the deleted container
Bug IDEA-215636 Docker. Docker-machine: Idea freezes at choosing Files tab
Bug IDEA-217411 Can't run windows container when volume binding is specified
Bug IDEA-210195 Attached console shows up twice
Bug IDEA-212161 Docker. Files Chooser. Open in the Editor: change the "Failed to make writable" to another description
Bug IDEA-212789 Docker. Exec doesn't work for containers which are run from Dockerfile/image
Bug IDEA-215621 Services. Docker. Impossible to split any set of parent nodes
Bug IDEA-215704 Docker. Container. Save fails if "Publish all ports" in case of port range: port is already allocated
Bug IDEA-188377 Docker Run/Debug configuration doesn't parse port range
Bug IDEA-217078 Dockerfile Syntax Error in ADD URL
Bug IDEA-215185 ServicesView. Docker. Delete from keyboard doesn’t work
Bug IDEA-215204 Services View. Docker: Impossible to save port/volume bindings for a container
Bug IDEA-215707 Docker. RunConfig. java.lang.NumberFormatException at changing ports to anything invalid in "Run options" field
Performance IDEA-217045 Docker. FileChooser: expanding folders/opening files from docker-machine containers leads to freezes or makes idea work slowly
Usability IDEA-216329 Dockerfile detection: always show the "Disable this notification" link
Usability IDEA-212607 Docker. Files Chooser tab. Provide possibility to "Collapse All"
Usability IDEA-209884 ServicesView. Docker. The corresponding item should be selected in the ServiceView after running docker run configuration
Usability IDEA-207869 DockerDebug. Compose. Auto-create a compose run configuration if it doesn't exist until remote debug
Cosmetics IDEA-212171 Docker. Files Chooser. Remove "lock" from all the files, display it before the path
Cosmetics IDEA-212174 Docker. Files Chooser. Files tab. Icon to view files is not correct
Cosmetics IDEA-212178 Docker. Files Chooser. Refresh. Display another progress icon="spinner" and in another place
Cosmetics IDEA-212173 Docker. Files Chooser. Files tab. Make a more indent after the path in the bar and the tree
Task IDEA-193122 Docker: migrate to docker-java to v3.1.0
Meta Issue IDEA-195017 Docker: Simplify the access to container file system
Exception IDEA-217088 Docker. Exceptions on disconnecting from Docker while run configuration is pulling the image
Services. SSHBug IDEA-216655 2019.2: SSH tunnel with ssh-agent no longer understands "~" in IdentifyFile spec
Bug IDEA-217026 Problems with ProxyCommand (initial title: Latest EAP, ssh auth broken)
Bug IDEA-216714 SSHJ: Failure when SSH config contains IdentityFile with encrypted key
Bug IDEA-216656 2019.2 — SSH tunneling always reports connect timeout
Bug IDEA-217092 Auth failure with "Unsupported keyboard interactive request" log message for 2FA
Bug IDEA-216800 SSH tunnel does not work
Usability IDEA-214834 Tools | Start SSH Session usability problems
User InterfaceFeature IDEA-207424 Please add uidesigner color constants to themes
Bug IDEA-208645 Text disappears in "IDE Fatal Errors" dialog box
Bug IDEA-211513 Project Structure -> Artifacts: Type ComboBox is too narrow
Bug IDEA-210978 Freeze on "Mark object" (F11) in "Inspect object" (Alt-Click) popup
Bug IDEA-214477 Invalid background color in plugin settings header's labels
Bug IDEA-218345 Deadlock while loading AllIcons' subclasses because of circular references
Bug IDEA-210873 Bad description text wrapping in "IDE Fatal Errors" dialog
Bug IDEA-131794 Tree selection changes on double-click expansion
Bug IDEA-215945 Editor notification actions can't be triggered from Alt-Enter menu
Bug IDEA-217595 Modifier icon is not visible in editor tabs
Bug IDEA-217563 Project name and file path is not shown on window title bar after reopening project if "Main menu" is switched off
Bug IDEA-212788 Messages view freezes IDE
Bug IDEA-217369 IntelliJ LaF: Selection bar on Actions tab in Search Everywhere is grey
Bug IDEA-212553 New Tabs UI: IDE no longer shows tips when no editor tabs are open
Bug IDEA-217861 Borderless UI: Path to file is not updated after toggling main menu
Bug IDEA-216860 Unnecessary empty project frame is shown together with Welcome screen when open deleted project
Bug IDEA-210827 DarculaButtonUI.isSquare(Component) uses wrong instanceof test
Bug IDEA-210532 "New HTTP request" action looks bad with new popup design
Bug IDEA-207998 Recent projects "Create new project group" dialog is hidden
Bug IDEA-204786 Touch Bar: "Toggle bookmark" button has the wrong state after enabling bookmark
Bug IDEA-217393 No longer see "Administrator" in the title bar when Rider is running as Administrator
Bug IDEA-208808 Services Tool Window is shown in projects without services
Bug IDEA-214821 Tabs: There is a double top border when database console is opened
Bug IDEA-216428 Debugger: hidden content (like Memory View) appears again after restarting of debugger session
Bug IDEA-211279 Column resizing doesn't work in TODO table
Bug IDEA-211946 Borderless UI: Path in title bar for tabel contains odd information
Bug IDEA-216203 Splash screen doesn't gets hidden after loading
Bug IDEA-196876 Fix group by popup in TODO tool window
Bug IDEA-207320 Empty system tray icon with no popup hint or right-click menu
Bug IDEA-214885 2019.2 EAP: gradle task 'buildSearchableOptions' throws exception UIDefaults.getUI() failed for MyOptionButton
Bug IDEA-208847 Memory leak in InternalDecorator
Bug IDEA-216920 The height of tabs of composite editors is too low
Bug IDEA-97714 Add "Associate With File Type" to the editor tab context menu and menu
Bug IDEA-218587 Linux native menu: Both native toolbar and idea main menu are shown on toggling View | Appearance | ShowToolbar (or NavBar...)
Bug IDEA-217016 Empty project window remains open when opening another project selecting "This window" option
Bug IDEA-215129 Borderless UI: current file path is shown with non-native slashes on Windows
Bug IDEA-210887 Notifications settings group list elements are centered
Bug IDEA-211028 Tabs panel is not scrolled to just opened tab
Bug IDEA-208339 No gap in log search field
Bug IDEA-214800 Keymap switcher on Mac shows Windows keymap at first position
Bug IDEA-216567 Borderless UI: Diff window has wrong icon in borderless mode
Bug IDEA-206619 Message from file-level notification is shown on top of Alt-Enter menu
Bug IDEA-208560 QuickDefinition popup is enlarged each time it is opened for markdown file
Bug IDEA-217146 IDEA freezes in Inspection Tool Window
Bug IDEA-212035 Editor tabs change color even when a modal dialog is hovered
Bug IDEA-217057 Visibility icons flickering in completion popup
Bug IDEA-217129 [Open Recent] when trying to open an already opened project - a new empty IDEA window is opened
Bug IDEA-168007 Non-retina triangle icons in context menu
Performance IDEA-208610 Memory leak in MouseDragHelper
Performance IDEA-215642 Many seemingly random freezes soon after one another
Performance IDEA-208611 Memory leak in IdeGlassPaneImpl
Usability IDEA-211210 Duplicated Mnemonic For Edit > Column Selection Mode and Macros actions
Usability IDEA-211957 Feedback for "Show intention actions" with no intentions
Usability IDEA-212381 If a line has a navigation icon with a keyboard shortcut, the shortcut should work anywhere in the line
Usability IDEA-212332 Next/previous error navigation should immediately show error tooltip
Usability IDEA-210028 AspectJ: unable to set ajc compiler path
Usability IDEA-215127 ide.ui.version.in.title startup option became less useful in borderless UI
Usability IDEA-210746 Rename "Move Right" and "Move Down" actions to "Split and Move Right" and "Split and Move Down"
Usability IDEA-211874 Tabs: tabs UI wastes space on left border of a tab
Cosmetics IDEA-212776 Don't show powered by for intentions provided by bundled plugins
Cosmetics IDEA-215341 Rename Search Everywhere tab heading in Tool Window
Cosmetics IDEA-205502 Main appearance font is not used in several toolwindows and notifications on macOS
Cosmetics IDEA-211770 Remove Edit icon from Run Configurations combobox
Cosmetics IDEA-206252 Ability to hide menu bar, no2
Cosmetics IDEA-211558 Wrong indent in drop-down menu
Cosmetics IDEA-216437 "Low Memory" message has the wrong text and link is broken
Cosmetics IDEA-212649 Borderless UI: Several dialogs have cropped input fields on appearance
Cosmetics IDEA-214996 New tabs UI: There is no border between database console/table editor and Toolbar/Navigation bar when tabs are hidden
Cosmetics IDEA-209075 Capitalize options in "Find in Path" dialog
Cosmetics IDEA-215990 Wrong capitalization in Settings > Editor > File Types
Cosmetics IDEA-204326 Run configuration editor should use default IDE font for all fields
Task IDEA-202744 Implement browse button inside combo boxes
Task IDEA-209398 do not create zillion of "swingworker" threads
Exception IDEA-216197 Kubernetes: com.intellij.diagnostic.PluginException: Icon cannot be found in 'KubernetesIcons.Kubernetes_Y' at calling context menu on helm template file
Exception IDEA-212642 IllegalArgumentException: Width and height cannot be <= 0
Exception IDEA-217273 Exception occurs on opening a project from Welcome screen
Exception IDEA-208223 CCE at com.intellij.ui.speedSearch.FilteringListModel.remove
Exception IDEA-211366 NPE when trying to open a project from Welcome Screen
Exception IDEA-215340 org.jetbrains.concurrency.InternalPromiseUtil$MessageError: Service not found
User Interface. Console ViewBug IDEA-214944 Small fields in Editor > General > Console
Bug IDEA-199225 Console output doesn't combine folds when the prints happen some time apart
Bug IDEA-217414 Incorrect handling of ANSI colors in terminal
Usability IDEA-205899 Allow to restart IDE scripting console
Exception IDEA-214526 isDumb should be used only under read action: ConsoleViewImpl
Exception IDEA-212586 Empty Exception Summary
User Interface. ControlsBug IDEA-209201 [JDK 11] Empty autocomplete popup in run configuration after backspacing some part of filename
Bug IDEA-216374 Can't customize touchbar anymore
Bug IDEA-214489 List drop own of Combobox with jbPopup remains when dialog is moved
Bug IDEA-215589 Disabled action in the popup should not be selectable
Bug IDEA-214991 "Replace" field has increased height
User Interface. Find, Replace, UsagesFeature IDEA-210362 Recently Edited and Recently Viewed scopes in Scope Chooser
Bug IDEA-215902 Replace icon for 'Open in Find Tool Window' in 4 popups
Bug IDEA-218573 "Directory not found" error occurs when a path to library *.jar is specified as a Directory in "Find in Path" dialog
Bug IDEA-216479 "Find in Path..." stopped working with archives (.jar, .zip) when searching in Directory
Bug IDEA-215905 Update 'Open in Find Tool Window' for Documentation pop-up
Bug IDEA-211547 Search Everywhere: Items found in "Top Hit" section are invisible
Bug IDEA-215907 Update the appearance of the pin icon in Find in Path pop-up
User Interface. FocusBug IDEA-215976 IDEA 192.5118.1 hangs after start on macOs
Bug IDEA-207611 Keymap switch leads to typeahead
Bug IDEA-216227 Show Diff with Working Tree: when action as invoked, focus stays in previous location
Bug IDEA-193333 Paste after invoking navigation popup goes to editor sometimes
Usability IDEA-200871 Tool Window should NOT transfer focus unconditionally.
Exception IDEA-189622 Some keystrokes cause 'Typeahead timeout exceeded" exception
Exception IDEA-215495 AssertionError: Already disposed: Project (Disposed) on almost every action in IDE
Exception IDEA-207600 "Typeahead timeout is exceeded" exception occurs after using shortcut when context menu is opened
User Interface. Look and FeelFeature IDEA-218113 Theming: update metadata for 2019.2 keys
Feature IDEA-216532 Theme metadata: new property "since"
Bug IDEA-215462 Can't use custom theme
Bug IDEA-215057 High contrast is selected, but IDE is in Darcula
Bug IDEA-209654 Buttons have yellow shadow in Darcula theme if IDEA is launched with clean settings
Usability IDEA-102320 The darcula scrollbar thumb is hard to see
Usability IDEA-204653 Color Scheme reverts to Darcula from *Default* light color theme after restart if IDE theme is Darcula
Cosmetics IDEA-215271 Weird line between items in Inspection settings
Cosmetics IDEA-211553 Combobox popups have no border in Darcula theme
Cosmetics IDEA-215545 Plugins settings: Tabs bar has dark purple color in High Contrast theme
User Interface. NavigationBug IDEA-208584 Not all commands are shown in the Search Everywhere dialog
Bug IDEA-206631 Show definition should be available in dumb mode for files
Bug IDEA-216744 Search Everywhere: "/appearance" command does not shown full list of options
Bug IDEA-212385 Recent files action in splitted windows
Bug IDEA-209047 Group separators are eliminated in `Related Symbol` popup on speed search filtering
Bug IDEA-211202 Settings tree: some items in the tree are not selected from from the first attempt
Bug IDEA-215299 Search Everywhere: results not filtered for command
Usability IDEA-215418 Clearing `Toggle Changed Only Files` should disable checkbox toggling behavior
Exception IDEA-208332 CCE at com.intellij.ide.actions.Switcher$SwitcherPanel$SwitcherSpeedSearch.propertyChange
User Interface. Project ViewUsability IDEA-172513 Visibility of class is not shown in project tree
Task IDEA-178054 Problem with understanding hierarchy in directory tree
Version ControlFeature IDEA-210641 Add VCS status and scope information to file quick documentation
Feature IDEA-182495 Show git file history for multiple directories in project view
Feature IDEA-207325 File sorting in Version Control: Local Changes differs from sorting in project view
Bug IDEA-215928 'View Commits' link looks active but does not open commits list, if the tab has been closed
Bug IDEA-215701 .hgignore is created under project configuration files
Bug IDEA-207822 Local Changes: multiselection is lost on refresh
Bug IDEA-210743 Subversion: incorrect working copy is detected if the project is located below the repository root and <Project> VCS mapping is used
Bug IDEA-207700 Branches Popup: add tooltips for incoming/outgoing markers
Bug IDEA-215922 Non-modal commit: Commit button is disabled in project after git repository is initiated there until reopening
Bug IDEA-209722 Annotate action behave wrong if other annotations added
Bug IDEA-211694 External files from ignored folders are suggested to be added to git
Bug IDEA-195923 Alt key does nothing on "Files Merged with Conflicts" dialog
Bug IDEA-216389 Deadlock: com.jetbrains.changeReminder.predict.PredictionService
Bug IDEA-130903 Detaching 2nd project from project window not removes its version control dir from main project settings
Bug IDEA-216506 Shelf SIlently doesn't rollback changes if partial changelists option enabled and non modal commit is used
Bug IDEA-215920 Non-modal commit: file name completion in comment doesn't work
Bug IDEA-215906 Update project counts locally modified files as updated
Bug IDEA-217202 New file is not added to VCS sometimes
Bug IDEA-115100 Maven project import sets Subversion VCS for submodules, if there is a folder or file called .svn in parent folders
Bug IDEA-216285 Missing tooltip when selecting hunks for partial commit
Bug IDEA-198792 "new changelist" disappears if a file is selected
Performance IDEA-207515 IntelliJ freezes when a lot of GIt roots are registered in the project
Performance IDEA-208591 Do not load shelve file content in EDT
Usability IDEA-205644 Can't abort whole patch apply process in case of multiple path apply conflicts
Usability IDEA-170151 Make "Set Active Changelist" button enabled if file (or several files) inside changelist is selected
Usability IDEA-136691 Don't show update info for pull if it is emprty
Usability IDEA-212624 Rename action button in Ignore files dialog
Usability IDEA-216910 New commit flow: please, allow me to revert changes from diff without checking changed files
Usability IDEA-216299 Do not show first changed file in the Diff Preview of the Local Changes view if nothing is selected
Usability IDEA-128954 Push dialog: enter invoked on the repository node should move it to edit mode
Usability IDEA-166965 Changelist name displayed in dropdown is cropped
Usability IDEA-203413 Silent Shelf should shelve in the background
Usability IDEA-204377 Shortcut for Silent Shelve conflicts with Mac OS X system shortcut
Usability IDEA-211599 Add an ability to skip "Calculating whether something should be added to this commit"
Usability IDEA-212285 Local Changes Toolbar is hard to find in toolbars customization settings
Cosmetics IDEA-216408 Non-modal commit: Commit options popup does not change color scheme properly
Cosmetics IDEA-207270 Shelf viewer: missing space after moved files
Cosmetics IDEA-217029 Use one-pixel splitter for diff preview in Local Changes and Shelf
Cosmetics IDEA-206878 'Add Files to VCS': missing window title
Task IDEA-216383 Change "Amend Commit" action shortcut not to conflict with "Group By -> Module" action
Exception IDEA-214643 NPE in VcsPushDialog
Exception IDEA-217161 ISE: "Unexpected state: Grafting" when reverting changes with conflicts was interrupted
Exception IDEA-214504 "Project opening should be done in a transaction" on checkout project from git
Exception IDEA-215307 .ignore: Read access is allowed from event dispatch thread
Version Control. GitFeature IDEA-207634 Rework the Compare Branches dialog to use a Log tab with proper filters
Feature IDEA-125239 gitignore right click?
Feature IDEA-52643 Update/Pull/Merge Info should list new commits (the newly received part of the log) instead of the files
Feature IDEA-119995 Git: provide possibility to abort merge process
Feature IDEA-208154 Show notification explaining the reason of Rejected force push
Bug IDEA-209375 NPE in GitVFSListener
Bug IDEA-216785 Vcs Log: hash range doesn't work in multi-repository projects
Bug IDEA-216602 Modification of .idea/.gitignore should not require any confirmation
Bug IDEA-217098 CLion keeps adding excluded folders to .gitignore despite turning it off in the settings
Bug IDEA-208453 Memory leak in GitXmlRpcHandlerService
Bug IDEA-216114 Related files computation fails with VcsException: bad object
Bug IDEA-216387 "Show repository at Revision" fails to load file contents
Bug IDEA-214900 Synchronous execution on EDT: VcsRootProblemNotifier
Bug IDEA-215673 Show Diff called from Annotations context menu opens wrong file
Bug IDEA-210221 Synchronous execution on EDT: git unstash
Bug IDEA-215676 Deadlock on IDE exit (GitUntrackedFilesHolder)
Bug IDEA-215904 Git Config parsing breaks if config file includes option without a value
Bug IDEA-216783 Creating new tag with existing name silently fails (git)
Bug IDEA-214543 Deadlock when checking out new project from Git
Bug IDEA-216661 Update Info Tab: don't remember the branch filter
Bug IDEA-214683 Git authentication does not work when username includes parentheses
Bug IDEA-216462 Show Diff with Working Tree: don't let focus the label at the top of the dialog
Performance IDEA-212048 Intellij freezes when opening git window with large commit message
Usability IDEA-216729 Update Info: it is confusing that the tab remembers filters for subsequent updates
Usability IDEA-208989 On project open gpg card password asked due to spawned 'git ls-remote'
Usability IDEA-122038 Abort cherry pick & view cherry-pick status should be available from UI
Usability IDEA-216137 Notification after Update Project is displayed not immediately after the progress completes
Usability IDEA-208506 Don't show commit dialog for Cherry-Pick by default
Usability IDEA-212324 Hide "Branch deleted" popup when clicking "Delete tracked branch"
Cosmetics IDEA-216439 Git pull from remote repository - "N files updated in 0 commits" message after updating to PS-192.5118.33
Cosmetics IDEA-96602 Small problem with hint on git pull dialog window when choose strategy
Exception IDEA-208359 Synchronous execution on EDT: git in merge
Exception IDEA-216463 A "couldn't parse status line" exceptions happen regularly on various Git operations
Exception IDEA-215869 Synchronous execution on EDT: "Git | Merge Changes"
Exception IDEA-207962 Synchronous execution on EDT: /usr/bin/git version exception (2019.2 master branch)
Version Control. GitHubBug IDEA-206881 GitHub pull requests: unfriendly error message on failed search validation
Bug IDEA-209158 GitHub Pull Requests: middle pane is not getting update on Refresh
Usability IDEA-203790 It is not possible to refresh the list of pull requests if there are no pull requests yet
Usability IDEA-196905 If no github account is configured attempt to push/pull to repository with 2-step authentication always fails: token is not accepted/generated
Cosmetics IDEA-205384 Github: correct displayed error message on incorrect credentials providing
Version Control. LogFeature IDEA-130845 Log: add action to go-to-parent and go-to-child
Feature IDEA-126079 Add log filter like 'git log master..branch'
Feature IDEA-116312 Ability to customise columns in the VCS log
Bug IDEA-167341 Intellij 2016.3.x builds run out of memory
Bug IDEA-216882 Diff is not available for changes in external repositories Log
Performance IDEA-178090 High memory consumption of git indexing for projects with huge merge commits
Usability IDEA-207672 `Log Indexing for "SAT" Stopped` message is confusing
Usability IDEA-207711 Show columns settings should be preserved for additional Log tab
Exception IDEA-217277 update failed for AnAction(com.intellij.vcs.log.ui.actions.CompareRevisionsFromLogAction) with ID=Vcs.Log.CompareRevisions
Exception IDEA-217847 Sometimes the UI breaks after clicking "View Commits" from the Event Log
Exception IDEA-209317 Git double-dot: VcsException: fatal: bad revision when branch name is incorrect
Version Control. MercurialBug IDEA-195145 Lots of WARN in idea.log from HgStatusCommand about 'No such file or directory'
Version Control. PerforceBug IDEA-208851 Perforce plugin cannot figure out a symlink is not "modified without checkout" when the target is reverted.
Bug IDEA-150303 Default p4 path doesn't work when running IDEA from JetBrains Toolbox on MacOS
Version Control. SubversionBug IDEA-150369 If path to client is just svn, default /user/bin/svn is used despite the PATH settings
Bug IDEA-207234 Freeze in "Hightlight Integrated" for branches with 1 commit difference
Cosmetics IDEA-207786 Duplicate in Settings -> Keymap (Subversion)
No subsystemFeature WEB-37865 TypeScript: no override/implement completion for fields
Feature WEB-38278 ES6: completion for default import bindings according to the exported name
Feature WEB-36390 Support path aliases defined in jsconfig.json
Feature WEB-39111 Install LTS Node.js from new project dialog
Feature WEB-33676 Support inline inferred type hints for Javascript and TypeScript
Feature WEB-39277 Console DOM elements presentation
Feature WEB-38231 Incorporate NodeJS and Live Edit Tools to the default IDEA installation
Feature WEB-37807 Redesign new Vue project wizard to support npx and displaying progress in terminal
Feature WEB-13732 Add "Range" http header for video.
Feature WEB-30215 SQL injected in JS string should use user parameter as placeholder
Feature WEB-39248 Method chain type hints for JS/TS
Bug WEB-38842 WebStorm shows errors on valid code
Bug WEB-38470 Unicode property escapes are available when language level is set to ECMAScript5.1
Bug WEB-38807 Please add "unsuspended" to the dictionary
Bug WEB-38546 Show package's version when create project via npx
Bug WEB-39040 'Ensure breakpoints are detected...' in JavaScript Debug configuration is not saved when URL is empty
Bug WEB-36536 JSX Emmet: custom components with names similar to HTML void elements are always expanded to empty tags
Bug WEB-39328 Suggest 'create function' for pipeline operator
Bug WEB-38172 AngularJS can not setup development environment for plugin
Bug WEB-38828 Can't choose value in 'package' field in run configurations on OSX via arrow keys
Bug WEB-39561 Update the default parameter name hints blacklist for Array.map and others
Bug WEB-39197 'Create function' fix should create an async function when invoked from an await-expression
Bug WEB-39712 'Create from usage' doesn't handle generics properly
Bug WEB-40076 Hide 'Download Node.js' feature for both Node.js project types
Bug WEB-39067 'Propagate to destructuring' shouldn't be available when declaration and usages reside in different files
Bug WEB-38260 Not able to unselect inserted variable name after live template expansion
Bug WEB-37999 Invalid highlighting on editing template string injection with nested injections
Bug WEB-35169 Reference injections don't work in JavaScript
Bug WEB-34111 Copy paste error with js template literal with a template literal inside
Bug WEB-39506 Inlay type hints - not rendering correctly for tuples
Bug WEB-37921 'Convert to field holding arrow function' incorrectly processes string-named properties
Bug WEB-38796 Intentions have doubled Before/After preview
Bug WEB-39782 'undefined' is no longer appended for an optional property
Bug WEB-38249 Autocomplete "import" places end in the wrong place
Performance WEB-39162 IDE freeze when stepping in angular cli 8 project
Usability WEB-38585 Implement method/property intention action should have an option to implement in all classes
Usability WEB-34956 Console Display has unwanted links on the right
Usability WEB-39333 Suggest enum string values inside quotes when possible
Usability WEB-38832 Can't choose task (gulp, grunt, npm) via arrow keys when field is empty (fresh RC)
Usability WEB-27539 Don't suggest 'Annotate injection with comment' intention for Jquery-CSS
Cosmetics WEB-38636 Please add "Angeles" to the dictionary
Task WEB-39642 Pipeline operator: add very basic support for topic references
Task WEB-33679 Improve 'Promise returned from ... is ignored' inspection for unit tests ('beforeEach', etc.)
Task WEB-39051 Disable Safe Write in WebStorm
Task WEB-39480 Move await-out-of-async error to a separate inspection
Task WEB-39215 Enable 'Missing await' inspection by default, and don't show 'Promise is ignored' for async functions
Build toolsBug WEB-39356 npm script names are not suggested in Run anything if npm tool window wasn't opened first
Usability WEB-38759 Add the possibility to disable system notifications from grunt task
Usability WEB-27442 Can't switch between npm and gulp tasks in Run Gulp/Grunt/npm Task window without mouse
CSSFeature WEB-24368 Support postcss-simple-vars
Feature WEB-39443 Emmet for CSS: improve how vendor prefixes are applied
Bug WEB-39217 Ignore duplicates among LESS/SASS/SCSS and CSS files generated by File Watcher.
Bug WEB-38874 postcss-simple-vars: add completion for imported variables
Bug WEB-38487 CSS: Unsafe replacement with shorthand when a variable is used
Bug WEB-39217 Ignore duplicates among LESS/SASS/SCSS and CSS files generated by File Watcher.
Usability WEB-39463 Extract CSS variable: preselect only the variable name
Usability WEB-37979 'Show CSS color preview as background' option is available when it is not applicable (e.g. in Community Edition)
CoffeeScriptBug WEB-39391 Right-click -> Run *.coffee file fails due to outdated 'Node parameters' entry
DartFeature WEB-39344 Please implement Context Info (Alt+Q) feature for Dart.
Feature WEB-39577 Dart folding- add ability to fold multi-line asserts statements
Bug WEB-18864 Dart: update import statement on moving container file
Bug WEB-39449 The "documentation" link in hovers in the Dart Problems view are not clickable
Bug WEB-39665 Dart: exception after clicking 'show help contents' in Rename dialog
Bug WEB-38930 indentation does not work with NNBD in dart
Bug WEB-39785 Dart: error in import statement after moving container file(until you type something)
Exception WEB-39761 Dart: Exception while typing assert statement
DebuggerBug WEB-39555 Debugger: Elements tab is broken
Bug WEB-39504 Memory leak from Netty during debug session
Bug WEB-39614 Broken message formatting in debug console
Bug WEB-34012 Debugger breakpoints in Meteor activated only after debugger restart (update by file editing)
Bug WEB-27630 'Hide Frames from Libraries' does nothing
Bug WEB-39399 Frames from libraries don't open and are red
Bug WEB-38564 'Smart step into' suggests only first call of the same name in a line
Bug WEB-38041 Console input cleared on arrow down key press
Bug WEB-39558 Node debugger: support mappings to file:///
Bug WEB-36168 Debugger does not respect breakpoints inside Meteor packages
Bug WEB-39161 ClassCastException when expand node in debugger console
Bug WEB-39117 Karma doesn't handle correct tab in debug mode with '--remote-debugging-port' param
Bug WEB-38597 Incorrect highlighting of methods when 'Smart step into'
Bug WEB-38535 CoffeeScript debugging doesn't work correctly in WebStorm 2019
Performance WEB-39382 Memory leak in WipNetworkManager
Performance WEB-39456 Memory consumption keeps increasing whenever meteor app is reloaded
Performance WEB-38675 Debugger: memory leak when re-building the application
Usability WEB-39670 Object properties in debugger should be shown in object order, NOT in alphabetical order
Cosmetics WEB-37645 Use new UI for smart step into in JS debugger
Exception WEB-39331 Throwable when debug 'JavaScript Debug' configuration
Exception WEB-37601 KotlinNullPointerException when suspend breakpoint
File WatchersBug WEB-38929 'File watcher problems' inspection doesn't work for Less and other compilers that produce ANSI-escaped output
HTMLFeature WEB-14791 Small tag should be listed as an inline element by default
Bug WEB-38873 Wrong WCAG suggestion
Task WEB-39763 Html/React: avoid expensive edt resolve in html typed handler if possible
Task WEB-38207 Html: disable "Image size mismatch" inspection for svg files
JSONFeature WEB-39646 Add lint-staged to package.json schema
Feature WEB-39312 Add nodemon to package.json schema
Feature WEB-39311 Add renovate to package.json schema
Feature WEB-37864 Support JSON-schema based code completion for all linters/tools we support for yaml/plain js formats
Feature WEB-39310 Add husky to package.json schema
Bug WEB-39158 JSON schema mappings: exception after removing json from file types
Bug WEB-39447 JSON-schema based completion for js inserts unquoted string as a value
Bug WEB-39403 JSON-based completion doesn't work for babel js config (when defined via a variable)
Bug WEB-38586 JSON: validating by added schema works only after schema editing
Bug WEB-38090 Don't download the latest JSON v4,6,7 schemas (Always download most recent schemas)
Bug WEB-39123 x-intellij-language-injection doesn't function in schema using anyOf
Usability WEB-39592 Semantic highlighting in package.json
Task WEB-39440 Add "x-intellij-case-insensitive" JSON Schema extension for case-insensitive enum validation
JavaScriptFeature WEB-37690 Call hierarchy action doesn't work where function literal is passed as argument
Feature WEB-38638 Inspection and quick-fix to merge trivial nested template literals
Feature WEB-38284 Parameter info and parameter hints for tagged templates
Feature WEB-39374 Add 'String usage' type to 'find usages'
Feature WEB-37930 Support ES2019 decorators proposal
Feature WEB-26561 Properties added with Object.assign() and Object.defineProperties() are not understood
Feature WEB-38974 Support destructuring declarations in Vue.js and allow 'Propagate to destructuring' to propagate there and 'Rename' to rename properly
Feature WEB-38945 Show available method signatures in the Go to definition popup
Feature WEB-33939 Suggest class method parameters when ES6 class is extended
Feature WEB-38139 'Propagate to destructuring declaration' intention
Feature WEB-35756 Autocomplete of export default
Feature WEB-38976 Support Object.fromEntries()
Feature WEB-39319 Duplicates Inspection: disable search between Javascript and TypeScript files
Feature WEB-38159 Add a quick fix to fix spelling for an unresolved reference if qualifier type has property with similar name
Bug WEB-36103 Don't suggest items from "@types" packages not directly specified in package.json in import completion
Bug WEB-39583 TypeScript: Enable typescript service completion in js files if allowJs = true
Bug WEB-39417 Keywords completion: do not suggest the same keyword after itself
Bug WEB-36595 No autocomplete for inherited static methods when class is "required" from a different file
Bug WEB-39859 Inspections broken/frozen
Bug WEB-39675 Usages in JSX attributes considered 'String usages' in 2019.2/master nightlies
Bug WEB-39068 Incorrect names are inferred for destructuring properties with non-identifier names
Bug WEB-36091 Import-completion should invoke parentheses insert handler if the item is definitely a function
Bug WEB-39058 Function is not available in completion in its body
Bug WEB-39144 JavaScript/TypeScript: add async keyword into the completion after export and export default
Bug WEB-36104 Lookup items for import-completion and globals are mixed in the list with the same priority
Bug WEB-38868 Editing injection removes fragment if template string argument is exactly at start/end of injection
Bug WEB-39390 Destructuring existing variable shows "foo is null"
Bug WEB-38056 'Flip if-else', 'Merge if-else', 'Remove braces', etc. all remove inner functions inside blocks
Bug WEB-39415 Keywords completion: do not suggest keywords inside while statement
Bug WEB-23410 Find usages of exported function
Bug WEB-38248 Autocomplete problems with properties that start with an underscore
Bug WEB-36804 Weird escape \ character multiplication and reduction on copy/paste
Bug WEB-38352 JavaScript/TypeScript completion after export default
Bug WEB-38583 Simple type hinting not working for Array.forEach()
Bug WEB-39660 Completion: "Several definitions" is shown for symbols after "console"
Bug WEB-39442 Duplicates: IndexOutOfBoundsException is thrown on processing "Show all duplicates like this"
Bug WEB-38184 Javascript spread-constructed object property tooltip does not correctly infer source
Bug WEB-38645 Unused local variable inspection works incorrectly with require statements when Node.js coding assistance is disabled
Bug WEB-39598 Rename JavaScript Module Dependency Diagram action
Bug WEB-38957 WebStorm lacks Darcula coloring for some JS-specific elements
Bug WEB-38534 JS: do not show members from unknown namespace in top-level completion
Bug WEB-39145 JavaScript/TypeScript: do not show completion after export keyword inside class
Bug WEB-38804 Find usages of `index.jsx` file yields results where property `index` of an arbitrary object is used
Bug WEB-38953 Inner class methods returning class instance not resolved when chaining
Bug WEB-38700 Bad color for new.target in some dark themes
Bug WEB-39416 Completion: JS/TS: do not suggest symbol itself after extends keyword
Bug WEB-39054 Wrong warning in constructor of a class that extends null
Bug WEB-39147 Resolve indexed properties with dot in name
Bug WEB-38544 JS: suggest exported commonjs names in completion
Bug WEB-36271 Import completion imports items that cannot be really imported
Bug WEB-39479 "Several definitions" icon is shown for unique variant
Bug WEB-39321 Annotator marks injected in string code as red in master
Bug WEB-39011 Renaming destructuring declarations in catch-block fails with exception
Bug WEB-39005 JS: incorrect rest param styling
Bug WEB-39288 neverending indexing on parsing Figlet Font definition embedded in template string
Bug WEB-33985 Cypress assertion chains autocomplete not working
Bug WEB-39024 Change the "Switch statement is redundant" inspection to a weak warning
Bug WEB-35094 Invalid 'Duplicate character inside regexp class' warning when using template string with arguments
Bug WEB-38685 Structure view for JavaScript tests doesn't work with custom regions
Bug WEB-38666 Incorrect auto import when copy/pasting code between files
Bug WEB-38743 Split declaration and initialization removes export
Bug WEB-38860 Flow: JSX syntax break when using parenthesis within a JSX tag
Bug WEB-39370 Code Inspection incorrectly recognizes type, produces incorrect warning messages
Bug WEB-38812 Inner class props not resolved in IIFE
Bug WEB-39847 Replace with block/line comment works incorrectly in case of after-the-statement comments of any kind
Bug WEB-38086 Editing injection in template string with 'Edit injection' action fails if another template string inside arguments
Bug WEB-35656 JavaScript RegExp multiple named capture groups in template literal
Bug WEB-39022 Create missing default branch for switch should not add break when there's a return statement
Bug WEB-38473 Unresolved type which isn't global
Bug WEB-33923 StackOverflowError on parsing deeply nested JSON
Bug WEB-39437 No completion for React lifecycle method when using Flow
Bug WEB-39419 Postfix completion: do not suggest any template after "this."
Bug WEB-35328 No completion for members of exported namespace
Bug WEB-28187 ES6: Unused default export
Bug WEB-34200 Fix capitalization of some Intentions/Quick Fixes
Bug WEB-39270 JavaScript: Wrong names for arguments when using fn(...spread)
Bug WEB-38833 JavaScript name suggestions: don't conflict with the global 'name' variable
Bug WEB-32758 js: spurious "Invalid number of arguments, expected 0" inspection for the default sub-class constructor
Bug WEB-39334 Don't insert parentheses when completing function in pipe expression RHS
Bug WEB-14677 Navigate/Method Hierarchy is always disabled for javascript methods
Bug WEB-38514 'Complete current statement' doesn't work for TS enums
Bug WEB-37911 "Hide parameter hints for this method" only works for last method in chain
Bug WEB-39146 Suggest correct quick-fix for async/await inside forEach
Bug WEB-38936 Remove acton 'Fix all problems in file' for 'Create class/interface' and 'Adjust spelling' quick fixes
Bug WEB-39272 Fix intentions availability for #-private and ?.-elvis access operators
Bug WEB-39418 Keywords completion: Flow: do not suggest top-level completion inside interface
Bug WEB-37294 "Unused default export" when importing module dynamically
Bug WEB-39777 JSX: completion item is used instead of emmet abbreviations
Performance WEB-39634 JS element in Search Everywhere iterates project content in EDT to calculate its presentation
Usability WEB-32058 No auto-completion popup for paths values
Usability WEB-39023 Improve completion behavior for switch and if
Usability WEB-39414 Keywords completion: reorder local and global symbols and keywords
Usability WEB-39444 Convert to React class/functional component: add link to the template configuration in description
Usability WEB-39679 Add an action to specify the explicit value/type shown in the type/value hint
Usability WEB-38830 JavaScript: move all code completion options from "JavaScript" to "Editor -> Code Completion"
Cosmetics WEB-37759 Not ideal layout of JS options page
Cosmetics WEB-39007 Postfix completion misprint
Task WEB-30685 Add new injection type: tagged template
Task WEB-38420 JavaScript completion: do not show statement-only keywords in expression context
Task WEB-38849 Node modules: exclude from indexing unnecessary files
Task WEB-37952 Support built-in decorators for es2019
Task WEB-38403 ES6: complete sibling files with relative prefix
Task WEB-38404 TypeScript / JavaScript: completion after export
Exception WEB-39801 JS: Quick fix: edit empty values of object literal properties throws when invoked on rbrace
JavaScript. FormatterFeature WEB-37855 Prettier: allow importing code style rules from .prettierrc.js/ .prettierrc.toml file
Bug WEB-38505 JavaScript setting for spaces within array brackets are not saved for IDE Global Code Style schema
Bug WEB-39796 Code formatting adds space in private-#-field syntax
Bug WEB-38992 Wrong extra indent for template string argument braces
Bug WEB-30108 Formatting JS/TS with HTML injection and 'Enforce HTML quotes on reformat' enabled breaks code
Bug WEB-39092 Formatting doesn't remove spaces in for..of / for..in loops
Bug WEB-38600 Don't remove leading semicolon on reformatting
Bug WEB-38042 Wrong indentation in tuple types (Flow, TS)
JavaScript. FrameworksFeature WEB-39759 Vue.js: provide code completion for events that could be emitted by Vue components defined in project dependencies
Feature WEB-33464 Parameter Hints in Angular Component Template
Bug WEB-35634 Angular: directives from node modules not present in package.json are not available
Bug WEB-29251 Refactor/Rename React props in propTypes does not rename the html attribute
Bug WEB-39709 IOException with @web-types
Bug WEB-38354 Angular: wrong exclusions with Angular libraries
Bug WEB-37732 Do not show Alt+Return proposal to create a v-slot namespace
Bug WEB-39743 Vue.js: directives are not present in code completion on Vue.js tags
Bug WEB-39779 Vue.js "v-for" shows error when use object destructuring
Bug WEB-39481 Can't resolve vue components in template tag (Blaze)
Bug WEB-36722 Angular template files are not recognized if "@angular/core" is not a direct dependency
Bug WEB-38028 "Wrong attribute value" with BootstrapVue v-b-modal directive
Bug WEB-29546 Refactor/Rename React props doesn't rename the prop in defaultProps
Bug WEB-37137 Some vuetify (1.4.6) components have unknown html tags
Bug WEB-39056 PyCharm, new vue project wizard: missing checkbox 'Use default project setup'
Bug WEB-34458 Do not show Unbound XML namespace prefix in Vue.js for custom directives bindings
Bug WEB-39353 ClassCastException when choose item in completion
Bug WEB-33981 Imported components marked as unknown html tags
Bug WEB-36119 Angular. Invalid items inside the completion list after the "for" word
Bug WEB-39501 New - Angular Schematic: loading after every use
Bug WEB-38082 PropTypes.shape should support warn on missing required prop inside 'shape'
Usability WEB-39455 React refactorings in Flow use TypeScript code templates
Usability WEB-39203 Parameter hints: remove "Show name for tagged template arguments" for "Angular HTML Template"
Usability WEB-8191 Add option to disable injection of CSS in jQuery selectors
Cosmetics WEB-39672 Vue.js: Add library name to tag proposals
JavaScript. InspectionsFeature WEB-39224 TypeScript / JavaScript: better simplify action. If, While, DoWhile
Feature WEB-35028 TypeScript / JavaScript: better simplify action
Feature WEB-27401 Add intention to convert independent `await` calls to `await Promise.all([])`
Feature WEB-32926 "Add 'then' clause" as a QuickFix for "Promise returned from ... is ignored"
Feature WEB-2385 Detect accidental =+ instead of += on string variable
Feature WEB-39166 TypeScript / JavaScript: better simplify action for null/undefined
Feature WEB-39165 TypeScript / JavaScript: better simplify action for equality operators
Feature WEB-37903 Inspection and quick-fix to merge variables assigned to same destructuring patterns
Feature WEB-39318 JavaScript: support if (undefined/null) conditions
Feature WEB-39213 TypeScript / JavaScript: better simplify action for typeof/instanceof
Bug WEB-38059 False positive 'Function statement not at top level of a program or function is prohibited' in TypeScript
Bug WEB-18867 Block level function declaration is not supported
Bug WEB-36869 No notification about missed await if async function call is on the right side of assignment
Bug WEB-39317 Invalid 'unused default export' when importing module as namespace
Bug WEB-38543 Cleanup fixes reported from "Missing module dependency" inspection
Bug WEB-39687 Promise used as condition should raise warning
Bug WEB-39594 False "Variable is declared and being used in different 'case' clauses" violation if same-named variable is declared in nested 'switch'
Bug WEB-31269 Inspection "Missing await for async function call inspection" false positive
Bug WEB-39249 TypeScript / JavaScript: Report only simplifiable part of the expression
Bug WEB-30455 Improve "suspicious variable/parameter name combination" inspection for JavaScript and Flex
Bug WEB-36909 "Add this qualifier" quickfix doesn't work in offline inspections results
Bug WEB-39556 'Expression statement is not assignment or call' is incorrectly reported for pipeline invocations
Bug WEB-35108 "Missing await for an async function call" is not triggered when requiring async function
Bug WEB-38952 Intentions: "Generate destructuring pattern": disable for enum literals
Bug WEB-39569 Javascript inspection "Redundant await Promise.resolve()": "return await" is GOOD (as of recently)
Bug WEB-30494 'Replace with template string' incorrectly handles non-string items at start
Bug WEB-40000 Incorrect "Redundant await".
Bug WEB-39511 "Missing await for an async function call" false positive in shorthand lambdas and conditional expressions
Bug WEB-38316 False positive (?) for "Result of assignment expression used" inspection
Bug WEB-39649 PointlessBooleanExpression. False positive
Bug WEB-39143 redundant 'return await..' is wrong when using catch decorators
Bug WEB-35745 No notification about missed await near Promise returned function
Cosmetics WEB-39707 Pointless statement or boolean expression: shorten the warning
Exception WEB-38515 PsiInvalidElementAccessException is thrown for "Create derived class" intention
Exception WEB-39806 JS : Quick fix : Replace comment style two times
JavaScript. RefactoringFeature WEB-38308 Inspection and cleanup for redundant await/return Promise.resolve() and Promise.reject()
Feature WEB-38662 'Introduce variable' can introduce spread elements when selection is over multiple array elements/properties
Feature WEB-32725 Postfix templates for destructuring
Feature WEB-38295 'Inline' should handle functions with destructuring parameters
Feature WEB-39096 Intention action to convert destructuring back to properly accesses when possible
Feature WEB-37242 Inline JS variable with template literals should avoid producing nested template literals
Feature WEB-38801 'Introduce variable' for destructuring patterns in variable declarations
Feature WEB-38307 Inspection for redundant 'return await' and 'await await' + corresponding cleanup for convert-to-async
Bug WEB-37861 Cannot inline ES6 function property
Bug WEB-39771 Rename dialog is shown instead of silent rename after invoking 'Introduce variable' for spreads, or for 'Create derived class / Implement interface'
Bug WEB-34393 Extract variable shouldn't be available on 'export default function' when corresponding function has overloads
Bug WEB-39575 'Search in comments and strings' should be off by default
Bug WEB-39343 'Replace destructuring with property and index access' ignores initializers
Bug WEB-38599 Assertion failed when drag-n-drop file in the project
Bug WEB-35443 'Create field' creates field outside object
Bug WEB-36958 Add local variable Typescript intention applies to second outermost function instead of function's return value on same line
Bug WEB-38766 'Propagate to destructuring declaration' should create a live template to update auto-generated variable names
Bug WEB-39026 Extract value does not detect duplicate values in ECMAscript / Typescript template strings
Bug WEB-39079 'Propagate to destructuring' breaks code when propagation target and source are in the same variable list
Bug WEB-38590 'Iterate with for..of' intention action should suggest to iterate with 'for await..of' in case of asynchronous iterable
Bug WEB-39290 'Replace destructuring with property and index access' doesn't respect shorthand properties
Bug WEB-38208 Invalid code is generated when splitting destructuring object
Bug WEB-38194 Converting string concatenation to template string drops comments
Bug WEB-16954 JavaScript. Error when extracting method from object property
Bug WEB-39520 Rename doesn't show preview if only string references are found
Bug WEB-39483 Refactoring: Rename: avoid showing "Not Found" in the preview for dynamic references
Bug WEB-39358 'Replace destructuring with property/index access' invokes dialog rename for JS global variables
Bug WEB-39372 'Refactor | Inline' on methods from .d.ts removes statements
Bug WEB-39335 'Change signature' for pipe expressions - should replace with lambda on adding parameters, collapse lambda when having a single parameter
Bug WEB-39768 Refactoring: JS (ES5): Extract variable: extracting new variable in object causes creating spread operator
Bug WEB-39235 'Replace destructuring with property and index access' causes name conflict
Bug WEB-39062 'Propagate to destructuring declaration': breaks code in case of arrow functions without parens
Bug WEB-39470 'Replace destructuring with property/index access' poorly handles non-identifier names
Bug WEB-39446 React class to functional component not available for class with 'displayName' static field
Bug WEB-39337 Incorrect comment placement when moving multiple module members with comments
Usability WEB-38742 'Generate destructuring pattern'/'propagate to destructuring' should be available on the variable
Cosmetics WEB-35457 Duplicated description parts in refactoring preview - 'class class', 'file file', etc.
Cosmetics WEB-38244 'Can not' typo
Exception WEB-39752 Refactoring: JS: Inline refactoring: Exception in plugins Js and TS
Exception WEB-39749 JS: Reference element is not the same element for which references were queried
Exception WEB-39557 Postfix 'var'/'destruct' and 'introduce obj/array destructuring' fail if inplace refactorings are off
LESSFeature WEB-11539 Support align values code style setting
Bug WEB-38322 Less: nested @supports at-rule causes syntax errors
LintersBug WEB-39615 Prettier plugin - editor scroll position jumps abruptly on reformat
Bug WEB-37547 'Suppress all ESLint rules for current file' adds 'null' if 'eslint-disable' already exists at top of file
Bug WEB-39189 .eslintignore in nested package not picked up inside lerna project
Bug WEB-38881 "Reformat with Prettier" should be available for files with shebang
Bug WEB-39398 When importing code style settings from ESLint, consider "SwitchCase" option of "indent" rule
Bug WEB-36096 ESLint Ignores Nested React Project
Bug WEB-36803 Errors reported by linters should show better tooltip if error message is multiline
Bug WEB-39118 ESLint fails with error if @typescript-eslint with 'project' option is configured in monorepo
Bug WEB-38737 Importing 'indent' rule from ESLint configuration should disable conflicting settings.
Task WEB-38083 Remove action to reset changes to code style on importing from TSLint
Node.jsFeature WEB-23906 per-project nvm support via nvmrc
Feature WEB-39055 Add `ci` to the list of commands in NPM run configuration
Feature WEB-39006 Node Interpreter on WSL (Arch Linux): No distribution available
Bug WEB-39704 Can't download node core if yarn is not installed
Bug WEB-39528 Run/Debug Node.js app from Run Anything popup
Bug WEB-39510 NPM Install Dependencies notification: package.json link broken
Bug WEB-35916 npm not detected if node installed via snap
Bug WEB-39927 Can't call completion for 'react' in package.json
Bug WEB-38634 The built-in Node module 'module' flagged as not listed in dependencies
SASSFeature WEB-9211 SCSS align $variable on colon as in CSS
Bug WEB-38149 Sass mixin content arguments not recognised
Bug WEB-7524 SCSS cannot find mixin which is declared later in the file
Bug WEB-39261 Duplicates should not be set between source and generated file
StylusBug WEB-39535 "Reformat code" behave wrong on stylus (@media query with negative property value)
TypeScriptFeature WEB-39194 Enable esnext private-#-field syntax for TypeScript
Feature WEB-14945 Parameter hints / parameter info / documentation support for rest-tuples with --strictBindCallApply
Feature WEB-39685 [request] should show error when can't found file form tsconfig extends
Feature WEB-37201 Introduce smartcast highlighting similar to that we have in Kotlin
Feature WEB-38589 Intention action to add explicit enum values for TypeScript enums
Feature WEB-39196 Update bundled TypeScript to 3.5
Feature WEB-39285 Typescript - Support for actions on literals in discriminated unions
Bug WEB-38637 Type guards: weaken narrowing of '==' to not narrow in case of references on both sides
Bug WEB-38555 Auto-import doesn't allow to erase import statement - inserts it again
Bug WEB-38954 idea auto complete with unsafe key index
Bug WEB-32282 TypeScript: Type of variable from destructured assignment is incorrectly considered as just `boolean` instead of `boolean | undefined`
Bug WEB-39689 typescript Variable narrowed type guard not as expected
Bug WEB-39107 Potentially invalid 'this' when using OnChange decorator with Angular
Bug WEB-39188 TS: type guards are not applied to property-accessors
Bug WEB-38500 Typescript find usages fails for object/interface keys containing dot
Bug WEB-39316 Redundant 'typeof' check warning on typescript when deconstructing
Bug WEB-38271 Implementing methods for object literal doesn't properly substitute generics
Bug WEB-38857 Show inferred types in parameter help.
Bug WEB-39409 Line markers don't work for intersection types
Bug WEB-37511 Mutual discriminants are not supported via 'switch' for type guards
Bug WEB-39809 TypeScript generics should be inferred to 'unknown', not 'any', if no constraint
Bug WEB-38165 Typescript autocompletion for objects with enum as key doesn't work with computed properties
Bug WEB-35855 Incorrect property rename/find usages
Bug WEB-39127 TypeScript - parameter info (CTRL+P) fails on rest parameters
Bug WEB-39027 Switch case items should not be shown when completion is invoked for qualified references
Bug WEB-38410 Consider improving line markers/navigation from contextually typed literals to super
Bug WEB-37512 '== true' and '== false' and 'if(x)' guards should narrow boolean to the literal type
Bug WEB-39122 Wrong autocomplete list for `typeof` expression inside type definition in TypeScript
Bug WEB-39644 'Specify type explicitly' should work for inferred types
Bug WEB-38296 introducing interface doesn't work if parameter selected with the type
Bug WEB-39159 TypeScript - add abstract keyword suggestion after export
Bug WEB-39355 Incorrect comparison of literal types with escape sequences
Bug WEB-39588 TypeScript: type guard doesn't work if the second re-declaration contains assignment
Bug WEB-39640 Specify type explicitly action incorrect with template string and Observable
Bug WEB-38865 False positive 'rest parameter should be of array type' on rest-parameter with infer-type
Bug WEB-38990 TypeScript: correctly show parameter info for literals
Bug WEB-32363 Support improved handling of 'instanceof' in type guards
Bug WEB-39563 Autocomplete doesn't work properly when type is from a private or protected class property
Bug WEB-39081 'Create function' breaks code when tries to create new function with spread parameters in typescript
Bug WEB-36619 Typescript class implementing an interface method as a lambda incorrectly reports method as unused/can't find usages
Bug WEB-39499 Support unknown type for switch expression
Bug WEB-38682 Wrong indent after `=` in the TypeScript type definition
Bug WEB-38167 "<anonymous> in null" in the usage view
Bug WEB-27160 TypeScript: Rename field does rename more than just the field
Bug WEB-38092 In TypeScript, renaming a class function (via Refactor) causes wrong changes
Bug WEB-37922 Type guard is incorrectly applied for a nested function
Bug WEB-38238 'Extract type alias' / 'Convert parameters to object' should properly handle infer-types
Bug WEB-39662 Inlay hints: TypeScript: show enum literal hint in the exact format
Bug WEB-34824 Support TS 3.1 change in type guards for 'function'
Performance WEB-37988 Code analysis never completes, high CPU usage on evaluating types
Performance WEB-39633 TypeScript project references cause IntelliJ to hang
Usability WEB-38733 Support parameter info/hints for inferred higher-order functions
Usability WEB-37883 Update default color for TypeScript Type Parameters
Task WEB-39774 TypeScript: avoid edt resolve while rendering import hint
Unit TestsFeature WEB-34938 Support running Mocha tests with Vue CLI
Feature WEB-38630 Jest: improve "todo" test support when using jest-circus as test runner
Bug WEB-39735 Cucumber.js: tests are marked as passed when they actually aren't
Bug WEB-36413 Cucumber.js: wrong symbols in the console output on Windows
Bug WEB-39245 Jest "update snapshot" link no longer displayed for inline snapshots
Bug WEB-39902 Cannot run actions from gutters
Bug WEB-36777 Show test status in the gutter for both compiled and original file when using Jest
Bug WEB-37886 Mocha suites not recognized inside setTimeout
Bug WEB-32987 Mocha test not marked as test when timeout is set
Bug WEB-39201 'Unrecognized option "runTestsByPath"' when running Jest with jest-cli < 21.x
Bug WEB-11505 Cucumber: can't run cucumber is step definitions are located in non-default directory
Bug WEB-39593 Suggest mocha-webpack in the 'mocha package' field
Bug WEB-36769 Running RC from folder containing cucumber tests fails with error
Bug WEB-37274 Cucumber.js: TS: comments at the end of the target file are moved to the top
Bug WEB-39800 'it' live template is available inside v-for
Cosmetics WEB-39698 Cucumber.js: increase width of the File type field in the Create New Step Definition File dialog
Exception WEB-39572 CucumberJS: exception is thrown on typing regular expression
No subsystemBug DBE-8610 Cannot change severity of inspection 'Delete or update statement without where clause'
DB ConsoleFeature DBE-447 Naming on database console result tabs
Bug DBE-8525 Vertica: Explain Plan Diagram Fail
Bug DBE-7388 Name database console files so they can be sorted
Bug DBE-7458 Redshift decode - improper autocomplete/hint(?) and improper warning
Bug DBE-8316 Changes to SQL Script on shortcut in Database view aren't detected. PyCharm seems to cache the SQL Script.
Usability DBE-8145 Inconsistency in read-only mode
Usability DBE-989 Caret shouldn't move when an error occurs in database console
DB DiffBug DBE-8376 Diff marks difference on tables without changes
DB IntrospectionBug DBE-8503 MariaDB Schema error with disabled event scheduler
Bug DBE-8115 Can not synchronize Azure database, getting error "SQLServerException: Reference to database and/or server name in 'master.sys.schemas' is not supported in this version of SQL Server"
Bug DBE-8405 Database schemas not updating
Bug DBE-7342 AWS Aurora MySQL: procedures sync fails with `PROCEDURE lambda does not exist`
Bug DBE-7588 Cannot Connect to PostgreSQL instance. ERROR: column n.xmin does not exist
Bug DBE-8648 Special character in MySQL database prevented PhpStorm from retrieving table contents (rows)
DB RefactoringBug DBE-8303 MySQL create index: Column ordering is always defaulted to ASC
DB Schema ViewsFeature DBE-4807 Show table/column comments in database tool window (tree) for all elements at once
Feature DBE-4336 Show database column default value in database tool window
Bug DBE-8463 Create new schema by right clicking on schemas for MySQL
Usability DBE-8483 MySQL: Database Connections tree shows character sets instead of databases
Usability DBE-1476 Change shortcut for Refresh action in Database Tool Window
Data Import & ExportBug DBE-8323 Cassandra: incorrect blob data export as sql inserts
Data ViewsFeature DBE-5971 Easily show all rows of the result ignoring page-size setting
Feature DBE-5804 Preview BLOB content in table documentation
Feature DBE-3251 Easily change number of result rows
Feature DBE-87 Full text search in database
Bug DBE-8531 Different SQL code color in DataGrip (sql editor and filter)
Bug DBE-7911 Cannot insert new row into table with identity column in postgresql 10 and 11
Bug DBE-8058 Can't edit table in data editor in Apache Cassandra using DataGrip
Bug DBE-8470 Db2: can't edit `decfloat(16)` grid value
Bug DBE-8511 Database Tool - Go To Related Data queries entire table
Navigation & SearchFeature DBE-5592 Filtering in Go-to-table navigation
Feature DBE-6452 Option to restrict Navigate to Table/Routine/Class to connected Data Sources
Feature DBE-8080 Introduce All Data Sources and per-Data Source search scopes
SQL CompletionFeature DBE-8410 IS NULL and IS NOT NULL as combined completion items
Bug DBE-8552 Problem with cast postfix
SQL GeneralBug DBE-8314 Endless inspection
Bug DBE-7941 Todo-comments in the text of database server stored objects
SQL GenerationFeature DBE-8466 Db2: support xml index specification generation
Feature DBE-8467 Db2: support index key expression generation
Bug DBE-8404 Db2: support SQL Generator 'CREATE OR REPLACE' option
Bug DBE-8468 Db2: support type hierarchy
Bug DBE-8527 afrom generates wrong code with reserved column name
Bug DBE-8401 Db2: support SQL Generation for table's distribution clause
Bug DBE-8400 Db2: support SQL Generation for generated columns with identity options
Usability DBE-8430 Add pre-selection when creating new objects
SQL HighlightingFeature DBE-1197 Highlight values in insert statement with select clause
Feature DBE-8598 Inspection: Check for TOP/OFFSET
Feature DBE-8593 Intention: Convert multiple equal with OR to IN and vice versa
Feature DBE-8514 Missing support for IP types in ClickHouse
Feature DBE-8630 Folding long numbers
Feature DBE-8513 Missing support for UPDATE mutation syntax in ClickHouse
Feature DBE-8570 Add inspection for using LIMIT (or similar clause) inside EXISTS call
Bug DBE-8690 Materialized CTE break formatting
Bug DBE-8281 Inspection: Adding not null column without default value
Bug DBE-8299 PostgreSQL: No error if RENAME COLUMN is used together with other ALTER TABLE action.
Bug DBE-8482 Snowflake Recursive CTE Parsing Error
Bug DBE-6327 TODO colors doesn't work in console
Bug DBE-8277 Inspection: Table variable is never used
Bug DBE-8397 Editor incorrectly reports "JSON standard does not allow such tokens" and other errors for postgres sql file
Bug DBE-3890 create tablespace db2 fail
Bug DBE-8399 Unused subquery item inspection isn't triggered
Bug DBE-8294 Oracle false positive sql inspection: Nested aggregate calls are not allowed
Bug DBE-8396 Redundant alias inspection
Bug DBE-8394 Inspection for implicit string truncation
Bug DBE-8607 CREATE SERVER AUDIT
Bug DBE-8416 Postgres inspector does not recognize grouping() function
Bug DBE-8289 MariaDB syntax error - ADD COLUMN IF NOT EXISTS
Bug DBE-8306 Inspection: Unable to resolve variable
SQL RefactoringFeature DBE-8207 Suggest to refactor several INSERTs into one INSERT
Feature DBE-8559 Intention to replace GROUP BY with DISTINCT and vice versa
Bug DBE-8652 Disable the Extract Routine refactoring for GoLand as it doesn't seem to do anything
Usability DBE-8325 SQL: add refactoring: introduce table alias

RubyMine 2019.2 Release Candidate (build 192.5728.104) Release Notes

IDEUsabilityRUBY-24675Set the recommended keymap scheme as the pre-selected one for new installations
Core. IDE SettingsBugIDEA-218848Unable to import settings ... chrome-user-data ... (No such file or directory)
BugIDEA-217364Rider build problem connected with FUS.
Core. Navigation and SearchBugIDEA-215118Change in behavior: Navigate->File using maven-backed module-name no longer brings up pom.xml for that module
EditorBugIDEA-218508'Insert imports on paste' doesn't work anymore
Editor. Large FilesBugIDEA-218382Support for large files in IDEA 2019.2 doesn't work if the plugin is installed
Infrastructure. Packaging and InstallationBugIDEA-2179842019.2 EAP Won't Start: "Initial heap size set to a larger value than the maximum heap size" custom Xmx is replaced with -Xmx2048m
User InterfaceBugIDEA-218587Linux native menu: Both native toolbar and idea main menu are shown on toggling View | Appearance | ShowToolbar (or NavBar...)
BugIDEA-218345Deadlock while loading AllIcons' subclasses because of circular references
User Interface. Find, Replace, UsagesBugIDEA-216479"Find in Path..." stopped working with archives (.jar, .zip) when searching in Directory
BugIDEA-218573"Directory not found" error occurs when a path to library *.jar is specified as a Directory in "Find in Path" dialog
No subsystemBugWEB-40076Hide 'Download Node.js' feature for both Node.js project types
JavaScript. InspectionsBugWEB-40000Incorrect "Redundant await".

RubyMine 2019.2 BETA2 (build 192.5728.47) Release Notes

IDEFeatureRUBY-19095Auto detect Spring hang
ExceptionRUBY-24616EA-143764 text range out of bounds exception
TestsUsabilityRUBY-24487TESTOPTS field it too small
CosmeticsRUBY-24488Rearrange TESTOPTS field in the Rake Run Configuration
Code Analysis. Structural SearchBugIDEA-217904IDE fails to load script for structural search which refers to Java plugin API
Core. IDE SettingsBugIDEA-217364Rider build problem connected with FUS.
BugIDEA-216940Add code completion for File and Code Templates
Core. ProfilerFeatureIDEA-216334Profiler: Set, or suggest to set max stack trace depth for Flight Recorder
FeatureIDEA-218102To attach JFR to already started local process
BugIDEA-215305Reset doesn't work in Java Profiler settings
BugIDEA-217299JFR Settings page
UsabilityIDEA-217815Fix grammar in Profiler UI
Core. Project SettingsBugIDEA-218348"Load/Unload Modules..." action isn't shown in the popup menu for unloaded module node anymore
EditorBugIDEA-218508'Insert imports on paste' doesn't work anymore
Editor. Diff and MergeBugIDEA-217797Diff/Merge does not show changes stripes for empty line ranges (insertions/deletions)
Editor. Editing TextCosmeticsIDEA-218125Select all occurrences doesn't release highlight on blur
Editor. Large FilesBugIDEA-218382Support for large files in IDEA 2019.2 doesn't work if the plugin is installed
Plugin. MarkdownFeatureIDEA-213077Option to enable hard/soft wrapping for markdown code
Plugin. TerminalBugIDEA-217705IntelliJ EAP: No caret in terminal if text is rendered as an URL
Services. DockerBugIDEA-212789Docker. Exec doesn't work for containers which are run from Dockerfile/image
User InterfaceBugIDEA-217393No longer see "Administrator" in the title bar when Rider is running as Administrator
BugIDEA-218345Deadlock while loading AllIcons' subclasses because of circular references
BugIDEA-217861Borderless UI: Path to file is not updated after toggling main menu
BugIDEA-217563Project name and file path is not shown on window title bar after reopening project if "Main menu" is switched off
User Interface. ControlsBugIDEA-216374Can't customize touchbar anymore
User Interface. Find, Replace, UsagesBugIDEA-216479"Find in Path..." stopped working with archives (.jar, .zip) when searching in Directory
User Interface. Look and FeelFeatureIDEA-218113Theming: update metadata for 2019.2 keys
User Interface. NavigationBugIDEA-208584Not all commands are shown in the Search Everywhere dialog
No subsystemBugWEB-38842WebStorm shows errors on valid code
JavaScriptBugWEB-39859Inspections broken/frozen
BugWEB-39847Replace with block/line comment works incorrectly in case of after-the-statement comments of any kind
PerformanceWEB-39634JS element in Search Everywhere iterates project content in EDT to calculate its presentation
JavaScript. FrameworksBugWEB-39501New - Angular Schematic: loading after every use
JavaScript. InspectionsBugWEB-40000Incorrect "Redundant await".
BugWEB-39569Javascript inspection "Redundant await Promise.resolve()": "return await" is GOOD (as of recently)
ExceptionWEB-39806JS : Quick fix : Replace comment style two times
Node.jsBugWEB-39927Can't call completion for 'react' in package.json
Unit TestsBugWEB-37274Cucumber.js: TS: comments at the end of the target file are moved to the top
BugWEB-39902Cannot run actions from gutters
DB DiffBugDBE-8376Diff marks difference on tables without changes
DB IntrospectionBugDBE-8648Special character in MySQL database prevented PhpStorm from retrieving table contents (rows)
BugDBE-8115Can not synchronize Azure database, getting error "SQLServerException: Reference to database and/or server name in 'master.sys.schemas' is not supported in this version of SQL Server"
Data ViewsBugDBE-8511Database Tool - Go To Related Data queries entire table
BugDBE-7911Cannot insert new row into table with identity column in postgresql 10 and 11
SQL HighlightingFeatureDBE-8593Intention: Convert multiple equal with OR to IN and vice versa
BugDBE-8690Materialized CTE break formatting
BugDBE-3890create tablespace db2 fail
SQL RefactoringBugDBE-8652Disable the Extract Routine refactoring for GoLand as it doesn't seem to do anything

RubyMine 2019.2 BETA1 (build 192.5827.8) Release Notes

No subsystemBugRUBY-22806Rails console truncates output and freezes
BugRUBY-22728Fix symbols from being classified as "dynamic"
Code InsightBugRUBY-24434YARD-defined overload is considered as a super method for its original method
InspectionsBugRUBY-23646invalid inspections
RHTMLBugRUBY-24531Can't type in scss.erb files in RM
RailsCosmeticsRUBY-24506Label of association key in find usages tool window is shortened
RefactoringsBugRUBY-22209Fix extract method from treating RBodyStatement as an expression
Code Analysis. Structural SearchBugIDEA-217904IDE fails to load script for structural search which refers to Java plugin API
UsabilityIDEA-216176Don't show "pattern does not match anything" hint if pattern contains red code
CosmeticsIDEA-216179SSR: Ungrammatical message "No template ... found in Project Files"
Core. ProfilerBugIDEA-216934To start gradle tasks and run configurations with JFR
BugIDEA-216560org.openjdk.jmc.flightrecorder.internal.InvalidJfrFileException: No readable chunks in recording
ExceptionIDEA-217284java.lang.ClassNotFoundException: org.jetbrains.plugins.gradle.service.project.AbstractProjectResolverExtension
Core. Run | Debug. ConfigurationsBugIDEA-210897Not possible to paste the value containing equals sign in the environment variables
EditorBugIDEA-217426InlayModel.getElementAt returns wrong inlay when multiple block inlays present on single line
Editor. Diff and MergeBugIDEA-217797Diff/Merge does not show changes stripes for empty line ranges (insertions/deletions)
Editor. Editing TextBugIDEA-217252Typing new text block method argument doesn't insert closing quotes
PerformanceIDEA-216728IDE freezes when editing files
Infrastructure. Packaging and InstallationBugIDEA-215898After rejecting and closing EULA dialog - warning is shown "An illegal reflective access operation has occurred"
TaskIDEA-217538Bundle Kotlin 1.3.41 with IntelliJ IDEA
Plugin. TerminalBugIDEA-217587Double shift doesn't use selected text from the terminal
BugIDEA-160356Terminal isn't capturing Ctrl-E
Services. DockerBugIDEA-217101Docker. "Port is already allocated" error at saving changes in container Name/volumes with port bindings
BugIDEA-217411Can't run windows container when volume binding is specified
PerformanceIDEA-217045Docker. FileChooser: expanding folders/opening files from docker-machine containers leads to freezes or makes idea work slowly
ExceptionIDEA-217088Docker. Exceptions on disconnecting from Docker while run configuration is pulling the image
Services. SSHBugIDEA-217026Problems with ProxyCommand (initial title: Latest EAP, ssh auth broken)
User InterfaceBugIDEA-217595Modifier icon is not visible in editor tabs
BugIDEA-217393No longer see "Administrator" in the title bar when Rider is running as Administrator
BugIDEA-217861Borderless UI: Path to file is not updated after toggling main menu
BugIDEA-211946Borderless UI: Path in title bar for tabel contains odd information
BugIDEA-215129Borderless UI: current file path is shown with non-native slashes on Windows
BugIDEA-217369IntelliJ LaF: Selection bar on Actions tab in Search Everywhere is grey
BugIDEA-217563Project name and file path is not shown on window title bar after reopening project if "Main menu" is switched off
UsabilityIDEA-215127ide.ui.version.in.title startup option became less useful in borderless UI
ExceptionIDEA-216911NullPointerException on project closing all projects
User Interface. Console ViewBugIDEA-214944Small fields in Editor > General > Console
BugIDEA-217414Incorrect handling of ANSI colors in terminal
User Interface. ControlsBugIDEA-125108Alphabetical sorting in File Structure doesn't persist after closing
User Interface. FocusBugIDEA-215107The cursor is gone after "Find in Path..." dialog
User Interface. Keyboard InputBugIDEA-203286Paste From History appends paste history number to pasted content.
User Interface. NavigationBugIDEA-216744Search Everywhere: "/appearance" command does not shown full list of options
BugIDEA-211202Settings tree: some items in the tree are not selected from from the first attempt
Version ControlUsabilityIDEA-136691Don't show update info for pull if it is emprty
Version Control. GitBugIDEA-216602Modification of .idea/.gitignore should not require any confirmation
BugIDEA-217098CLion keeps adding excluded folders to .gitignore despite turning it off in the settings
PerformanceIDEA-212048Intellij freezes when opening git window with large commit message
UsabilityIDEA-216729Update Info: it is confusing that the tab remembers filters for subsequent updates
CosmeticsIDEA-216439Git pull from remote repository - "N files updated in 0 commits" message after updating to PS-192.5118.33
Version Control. LogExceptionIDEA-217847Sometimes the UI breaks after clicking "View Commits" from the Event Log
No subsystemBugWEB-39782'undefined' is no longer appended for an optional property
BugWEB-39712'Create from usage' doesn't handle generics properly
Build toolsBugWEB-39808Freezes in JsbtFileManager$MyVirtualFileListener.beforeFileDeletion
DartBugWEB-39785Dart: error in import statement after moving container file(until you type something)
ExceptionWEB-39761Dart: Exception while typing assert statement
DebuggerExceptionWEB-37601KotlinNullPointerException when suspend breakpoint
HTMLTaskWEB-39763Html/React: avoid expensive edt resolve in html typed handler if possible
JavaScriptBugWEB-39598Rename JavaScript Module Dependency Diagram action
BugWEB-39660Completion: "Several definitions" is shown for symbols after "console"
BugWEB-39847Replace with block/line comment works incorrectly in case of after-the-statement comments of any kind
BugWEB-39859Inspections broken/frozen
BugWEB-35328No completion for members of exported namespace
BugWEB-39583TypeScript: Enable typescript service completion in js files if allowJs = true
PerformanceWEB-39634JS element in Search Everywhere iterates project content in EDT to calculate its presentation
UsabilityWEB-39679Add an action to specify the explicit value/type shown in the type/value hint
ExceptionWEB-39801JS: Quick fix: edit empty values of object literal properties throws when invoked on rbrace
JavaScript. FormatterBugWEB-39796Code formatting adds space in private-#-field syntax
JavaScript. FrameworksFeatureWEB-39759Vue.js: provide code completion for events that could be emitted by Vue components defined in project dependencies
BugWEB-39779Vue.js "v-for" shows error when use object destructuring
BugWEB-38028"Wrong attribute value" with BootstrapVue v-b-modal directive
BugWEB-39743Vue.js: directives are not present in code completion on Vue.js tags
BugWEB-39722Unrecognized Ionic/Angular attributes
BugWEB-34458Do not show Unbound XML namespace prefix in Vue.js for custom directives bindings
JavaScript. InspectionsBugWEB-39687Promise used as condition should raise warning
ExceptionWEB-39806JS : Quick fix : Replace comment style two times
JavaScript. RefactoringBugWEB-39771Rename dialog is shown instead of silent rename after invoking 'Introduce variable' for spreads, or for 'Create derived class / Implement interface'
BugWEB-38599Assertion failed when drag-n-drop file in the project
BugWEB-39768Refactoring: JS (ES5): Extract variable: extracting new variable in object causes creating spread operator
ExceptionWEB-39752Refactoring: JS: Inline refactoring: Exception in plugins Js and TS
ExceptionWEB-39749JS: Reference element is not the same element for which references were queried
Node.jsBugWEB-39704Can't download node core if yarn is not installed
TypeScriptFeatureWEB-39685[request] should show error when can't found file form tsconfig extends
FeatureWEB-39196Update bundled TypeScript to 3.5
BugWEB-39662Inlay hints: TypeScript: show enum literal hint in the exact format
BugWEB-39689typescript Variable narrowed type guard not as expected
BugWEB-39640Specify type explicitly action incorrect with template string and Observable
BugWEB-39644'Specify type explicitly' should work for inferred types
BugWEB-39809TypeScript generics should be inferred to 'unknown', not 'any', if no constraint
TaskWEB-39774TypeScript: avoid edt resolve while rendering import hint
Unit TestsBugWEB-39735Cucumber.js: tests are marked as passed when they actually aren't
BugWEB-37274Cucumber.js: TS: comments at the end of the target file are moved to the top
BugWEB-36413Cucumber.js: wrong symbols in the console output on Windows
BugWEB-36769Running RC from folder containing cucumber tests fails with error
BugWEB-39800'it' live template is available inside v-for
DB ConsoleFeatureDBE-447Naming on database console result tabs
UsabilityDBE-989Caret shouldn't move when an error occurs in database console
DB IntrospectionBugDBE-8115Can not synchronize Azure database, getting error "SQLServerException: Reference to database and/or server name in 'master.sys.schemas' is not supported in this version of SQL Server"
Data ViewsFeatureDBE-3251Easily change number of result rows
FeatureDBE-5971Easily show all rows of the result ignoring page-size setting
BugDBE-7911Cannot insert new row into table with identity column in postgresql 10 and 11
BugDBE-8531Different SQL code color in DataGrip (sql editor and filter)
SQL HighlightingFeatureDBE-8630Folding long numbers

RubyMine 2019.2 EAP6 (build 192.5587.22) Release Notes

No subsystemFeatureRUBY-24495Show usages by go-to-declaration (or ctrl+click) on numbered parameter
Code InsightBugRUBY-24435Weird parameter info variants for method with overloads
BugRUBY-24457Array is not considered as subtype for Enumerable
BugRUBY-24455Constant String Inference. Hash support. each method
DebuggerFeatureRUBY-24469inspect a method/block/lambda return value on `end`
BugRUBY-24515Step into could not leave method call in case of breakpoint All
BugRUBY-24513Highlighting tooltip is shown after leaving c-method in case breakpoint 'All'
BugRUBY-24518Not smart step into missed end of the method
BugRUBY-24470F7 and F8 on a return statement in a method skips the `end` line and lines that follow the method invocation
TaskRUBY-24490Create test for different stepping over (with enabled and disabled option)
DockerBugRUBY-24360Can't configure Remote Ruby Interpreter for docker-compose: "Unable to read RBConfig from specified interpreter"
BugRUBY-24537RubyMine can't copy gems from Docker Container on Windows
InspectionsBugRUBY-24501Rubocop fixes don't work if gem 'standard' is in Gemfile
RefactoringsBugRUBY-24480Fix Extract Method refactoring for blocks with numbered parameters
Code Analysis. DuplicatesBugIDEA-217219Duplicated code tool window numbers the lines from 0
Code Analysis. Structural SearchExceptionIDEA-204490AIOOBE at com.intellij.structuralsearch.StructuralSearchProfileBase.compile
Core. Diagrams (UML)BugIDEA-217046Project Modules diagram is empty if root selected in "Show Paths: Root->Selection" mode
Core. File SystemPerformanceIDEA-216453UI freeze after branch switch caused by file type detection from content (via TemplateDataLanguagePusher)
Core. IDE SettingsBugIDEA-217083SerializationException on second opening Swift PM project in CLion
Core. JSONBugIDEA-212880Null is cached if schema is applied first time for already existing code
BugIDEA-216061Adding new key-value pair into single-line JSON object places comma into the next key while typing
ExceptionIDEA-217138AE at com.intellij.json.psi.impl.JsonPsiImplUtils.getNameElement
Core. Navigation and SearchBugIDEA-216794Search eveywhere does not search in libraries
Core. Platform APIBugIDEA-216927Restore UastLiteralReferenceProvider binary compatibility in 2019.2
Core. ProfilerBugIDEA-215303There should be 'Run with Profiler' in Gradle toolwindow
BugIDEA-216549Wrong merged callees tree calculation
UsabilityIDEA-216480More toolbar buttons in profiler Call Tree tab
Core. Run | Debug. ConfigurationsBugIDEA-181448Run dashboard: after adding RC type to runnable in RD list the existing started configuration is shown there in Cinfigured status
Editor. Diff and MergeFeatureIDEA-137605IDEA as external diff/merge - provide proper exit codes
BugIDEA-216171'Throwable: Invalid file' when open external diff tool
Editor. Formatter and Code StyleBugIDEA-217075EditorConfig options are not properly applied to JavaScript files
BugIDEA-216526Switch Code Style Scheme does not change the code style
Editor. Large FilesBugIDEA-216905Focus is not in editor when opening large file
BugIDEA-216265Large file editor: closing and reopening tab does not preserve state
Infrastructure. Packaging and InstallationBugIDEA-200887"Failed to load JVM DLL" on a fresh copy of Windows 10
Plugin. MarkdownBugIDEA-213128UI not responding after opening markdown file
Plugin. TerminalBugIDEA-191614Terminal should soft wrap long lines (and not break links)
Services. DockerFeatureIDEA-184888Docker. Support --ipc command line option
BugIDEA-217078Dockerfile Syntax Error in ADD URL
BugIDEA-216884Docker: `Numeric value: (2147516561) is out of range of int` for windows containers with unusual exit code
BugIDEA-203226Docker: NPE at attempt to save changes in the deleted container
BugIDEA-210195Attached console shows up twice
BugIDEA-209817NPE containerId was not specified when building a container without running it
UsabilityIDEA-216329Dockerfile detection: always show the "Disable this notification" link
Services. SSHBugIDEA-217092Auth failure with "Unsupported keyboard interactive request" log message for 2FA
BugIDEA-2166562019.2 — SSH tunneling always reports connect timeout
User InterfaceBugIDEA-216920The height of tabs of composite editors is too low
BugIDEA-217146IDEA freezes in Inspection Tool Window
BugIDEA-217057Visibility icons flickering in completion popup
BugIDEA-207320Empty system tray icon with no popup hint or right-click menu
BugIDEA-217129[Open Recent] when trying to open an already opened project - a new empty IDEA window is opened
BugIDEA-216428Debugger: hidden content (like Memory View) appears again after restarting of debugger session
BugIDEA-216860Unnecessary empty project frame is shown together with Welcome screen when open deleted project
BugIDEA-217016Empty project window remains open when opening another project selecting "This window" option
BugIDEA-216567Borderless UI: Diff window has wrong icon in borderless mode
CosmeticsIDEA-204326Run configuration editor should use default IDE font for all fields
ExceptionIDEA-217273Exception occurs on opening a project from Welcome screen
User Interface. Keyboard InputBugIDEA-187355µ, when extracting method
User Interface. Look and FeelFeatureIDEA-216532Theme metadata: new property "since"
Version ControlBugIDEA-216389Deadlock: com.jetbrains.changeReminder.predict.PredictionService
BugIDEA-217202New file is not added to VCS sometimes
BugIDEA-215928'View Commits' link looks active but does not open commits list, if the tab has been closed
PerformanceIDEA-207515IntelliJ freezes when a lot of GIt roots are registered in the project
CosmeticsIDEA-216408Non-modal commit: Commit options popup does not change color scheme properly
CosmeticsIDEA-217029Use one-pixel splitter for diff preview in Local Changes and Shelf
ExceptionIDEA-217161ISE: "Unexpected state: Grafting" when reverting changes with conflicts was interrupted
Version Control. GitBugIDEA-215676Deadlock on IDE exit (GitUntrackedFilesHolder)
UsabilityIDEA-216137Notification after Update Project is displayed not immediately after the progress completes
ExceptionIDEA-216463A "couldn't parse status line" exceptions happen regularly on various Git operations
Version Control. LogBugIDEA-216882Diff is not available for changes in external repositories Log
ExceptionIDEA-217277update failed for AnAction(com.intellij.vcs.log.ui.actions.CompareRevisionsFromLogAction) with ID=Vcs.Log.CompareRevisions
No subsystemBugWEB-39561Update the default parameter name hints blacklist for Array.map and others
UsabilityWEB-39664Improve in-dialog documentation for parameter hints blacklist
TaskWEB-39642Pipeline operator: add very basic support for topic references
DartFeatureWEB-39577Dart folding- add ability to fold asserts statements
BugWEB-39665Dart: exception after clicking 'show help contents' in Rename dialog
DebuggerBugWEB-39558Node debugger: support mappings to file:///
BugWEB-38597Incorrect highlighting of methods when 'Smart step into'
BugWEB-38535CoffeeScript debugging doesn't work correctly in WebStorm 2019
UsabilityWEB-39670Object properties in debugger should be shown in object order, NOT in alphabetical order
JSONFeatureWEB-39646Add lint-staged to package.json schema
BugWEB-38586JSON: validating by added schema works only after schema editing
UsabilityWEB-39592Semantic highlighting in package.json
JavaScriptBugWEB-39416Completion: JS/TS: do not suggest symbol itself after extends keyword
BugWEB-38804Find usages of `index.jsx` file yields results where property `index` of an arbitrary object is used
BugWEB-14677Navigate/Method Hierarchy is always disabled for javascript methods
BugWEB-39675Usages in JSX attributes considered 'String usages' in 2019.2/master nightlies
BugWEB-39419Postfix completion: do not suggest any template after "this."
JavaScript. FrameworksFeatureWEB-39351Add support for ngNonBindable directive
BugWEB-39709IOException with @web-types
BugWEB-39587Angular - failed to load schematics exception
BugWEB-39501New - Angular Schematic: loading after every use
BugWEB-33981Imported components marked as unknown html tags
BugWEB-29546Refactor/Rename React props doesn't rename the prop in defaultProps
BugWEB-29251Refactor/Rename React props in propTypes does not rename the html attribute
BugWEB-39460Angular: loading angular.json is broken if there are `input` sections in it
CosmeticsWEB-39672Vue.js: Add library name to tag proposals
JavaScript. InspectionsBugWEB-39569Javascript inspection "Redundant await Promise.resolve()": "return await" is GOOD (as of recently)
BugWEB-39594False "Variable is declared and being used in different 'case' clauses" violation if same-named variable is declared in nested 'switch'
BugWEB-39649PointlessBooleanExpression. False positive
CosmeticsWEB-39707Pointless statement or boolean expression: shorten the warning
JavaScript. RefactoringBugWEB-39520Rename doesn't show preview if only string references are found
BugWEB-39575'Search in comments and strings' should be off by default
ExceptionWEB-39557Postfix 'var'/'destruct' and 'introduce obj/array destructuring' fail if inplace refactorings are off
LintersBugWEB-39615Prettier plugin - editor scroll position jumps abruptly on reformat
Node.jsBugWEB-39528Run/Debug Node.js app from Run Anything popup
BugWEB-35916npm not detected if node installed via snap
StylusBugWEB-39535"Reformat code" behave wrong on stylus (@media query with negative property value)
TypeScriptBugWEB-39588TypeScript: type guard doesn't work if the second re-declaration contains assignment
BugWEB-32282TypeScript: Type of variable from destructured assignment is incorrectly considered as just `boolean` instead of `boolean | undefined`
BugWEB-39316Redundant 'typeof' check warning on typescript when deconstructing
BugWEB-39538Webstorm 2019.01 Fails to provide type hints with complex generics, conditional generics and wrappers in Angular Templates
BugWEB-39563Autocomplete doesn't work properly when type is from a private or protected class property
BugWEB-34824Support TS 3.1 change in type guards for 'function'
PerformanceWEB-39633TypeScript project references cause IntelliJ to hang
Unit TestsBugWEB-39593Suggest mocha-webpack in the 'mocha package' field
CosmeticsWEB-39698Cucumber.js: increase width of the File type field in the Create New Step Definition File dialog
ExceptionWEB-39572CucumberJS: exception is thrown on typing regular expression
No subsystemBugDBE-8610Cannot change severity of inspection 'Delete or update statement without where clause'
DB ConsoleBugDBE-7388Name database console files so they can be sorted
DB IntrospectionExceptionDBE-8577MS SQL: attempts to introspect inaccessible database causes exceptions like[S0001][916] The server principal… is not able to access the database… under the current security context
Data ViewsBugDBE-8453Can not open table editor for Apache Ignite database: Failed to parse query. Table "UCP" not found
SQL CompletionBugDBE-8552Problem with cast postfix
SQL HighlightingFeatureDBE-8570Add inspection for using LIMIT (or similar clause) inside EXISTS call
FeatureDBE-8598Inspection: Check for TOP/OFFSET
BugDBE-8607CREATE SERVER AUDIT
BugDBE-8299PostgreSQL: No error if RENAME COLUMN is used together with other ALTER TABLE action.
SQL RefactoringFeatureDBE-8559Intention to replace GROUP BY with DISTINCT and vice versa

RubyMine 2019.2 EAP5 (build 192.5438.21) Release Notes

No subsystemBugRUBY-23645Wrong method generation in case of array reassignment
Code InsightFeatureRUBY-24403Add find-usages and highlighting for numbered block parameters
DebuggerFeatureRUBY-14112step over should optionally step inside blocks
BugRUBY-24460Step out in chained block calls
ParsingBugRUBY-24441Parser. False positive. Symbol content expected.
RailsBugRUBY-22887Find Usages on an association looks for the class
Rails. Code InsightBugRUBY-22922Find Usages on a scope looks for the `scope` method
RefactoringsBugRUBY-24429Changing parameter names does not affect preview signature in the extract method dialog
IDEBugRUBY-24461Spring support is broken in 2019.2 EAP
Core. DebuggerBugIDEA-212608Make debugger colors customizable
Core. JSONExceptionIDEA-212654strange behaviour when working with file name function.json
Core. Navigation and SearchPerformanceIDEA-188959Calculate line marker tooltip in background thread
Core. ProfilerBugIDEA-216125profiler tree speed search freezes EDT
UsabilityIDEA-216477Do not use three rows of tabs in profiler UI
EditorBugIDEA-211720Make brace highlighting consistent with move to matching brace action behavior
BugIDEA-216417Clicking on icons in gutter (e.g. overrides/implements) doesn't work if caret is over the folded property value
BugIDEA-216456In-place editing of property values doesn't work in Kotlin files
Editor. Diff and MergeBugIDEA-215972Diff viewer uses general hard-wrap margin instead of language-specific
Editor. Editing TextBugIDEA-216359Code vision selection doesn't cover the lines sometimes
UsabilityIDEA-212086Tooltips for bookmarks should show keyboard shortcuts for navigating to a bookmark and toggling it
Editor. Formatter and Code StyleBugIDEA-202587No possibility to configure indentations for Scala, Kotlin, etc files
BugIDEA-215771When new .editorconfig file is created in the versioned project using New | EditorConfigFile, the prompt to add appears as if it is 'externally added file'
BugIDEA-216085New EditorConfig file: Selectively disable languages for which no properties (empty sections) are produced
UsabilityIDEA-216086EditorConfig: not clear what Open Preview... means
UsabilityIDEA-215728EditorConfig: preview can be opened only once, it is impossible to open different file as preview
Editor. Large FilesBugIDEA-216257Large file editor: Status bar widget is painted incorrectly with hidpi screen
BugIDEA-216267Large file editor: no context menu
Infrastructure. Packaging and InstallationTaskIDEA-209379Bundle Kotlin 1.3.40 with IntelliJ IDEA
Services. DockerBugIDEA-178818Docker - Client is newer than server (client API version 1.24, server API version 1.23)
Services. SSHBugIDEA-216714SSHJ: Failure when SSH config contains IdentityFile with encrypted key
BugIDEA-216800SSH tunnel does not work
BugIDEA-2166552019.2: SSH tunnel with ssh-agent no longer understands "~" in IdentifyFile spec
User InterfaceBugIDEA-216203Splash screen doesn't gets hidden after loading
PerformanceIDEA-216525Do not request Windows ReleaseId for every window
CosmeticsIDEA-216437"Low Memory" message has the wrong text and link is broken
CosmeticsIDEA-215341Rename Search Everywhere tab heading in Tool Window
CosmeticsIDEA-212649Borderless UI: Several dialogs have cropped input fields on appearance
User Interface. Find, Replace, UsagesBugIDEA-215905Update 'Open in Find Tool Window' for Documentation pop-up
BugIDEA-215902Replace icon for 'Open in Find Tool Window' in 4 popups
BugIDEA-215907Update the appearance of the pin icon in Find in Path pop-up
User Interface. Look and FeelUsabilityIDEA-102320The darcula scrollbar thumb is hard to see
Version ControlBugIDEA-216506Shelf SIlently doesn't rollback changes if partial changelists option enabled and non modal commit is used
BugIDEA-216285Missing tooltip when selecting hunks for partial commit
BugIDEA-215906Update project counts locally modified files as updated
UsabilityIDEA-216910New commit flow: please, allow me to revert changes from diff without checking changed files
Version Control. GitBugIDEA-216114Related files computation fails with VcsException: bad object
BugIDEA-216785Vcs Log: hash range doesn't work in multi-repository projects
BugIDEA-216783Creating new tag with existing name silently fails (git)
BugIDEA-216462Show Diff with Working Tree: don't let focus the label at the top of the dialog
BugIDEA-216661Update Info Tab: don't remember the branch filter
No subsystemBugWEB-39506Inlay type hints - not rendering correctly for tuples
TaskWEB-39480Move await-out-of-async error to a separate inspection
CSSFeatureWEB-39443Emmet for CSS: improve how vendor prefixes are applied
UsabilityWEB-39463Extract CSS variable: preselect only the variable name
CoffeeScriptBugWEB-39391Right-click -> Run *.coffee file fails due to outdated 'Node parameters' entry
DartBugWEB-39449The "documentation" link in hovers in the Dart Problems view are not clickable
BugWEB-38930indentation does not work with NNBD in dart
DebuggerBugWEB-39555Debugger: Elements tab is broken
BugWEB-39614Broken message formatting in debug console
BugWEB-39504Memory leak from Netty during debug session
PerformanceWEB-39456Memory consumption keeps increasing whenever meteor app is reloaded
PerformanceWEB-39382Memory leak in WipNetworkManager
JSONBugWEB-39403JSON-based completion doesn't work for babel js config (when defined via a variable)
BugWEB-39158JSON schema mappings: exception after removing json from file types
BugWEB-39447JSON-schema based completion for js inserts unquoted string as a value
JavaScriptFeatureWEB-37690Call hierarchy action doesn't work where function literal is passed as argument
BugWEB-39437No completion for React lifecycle method when using Flow
BugWEB-39442Duplicates: IndexOutOfBoundsException is thrown on processing "Show all duplicates like this"
BugWEB-39479"Several definitions" icon is shown for unique variant
BugWEB-39415Keywords completion: do not suggest keywords inside while statement
BugWEB-39417Keywords completion: do not suggest the same keyword after itself
BugWEB-39418Keywords completion: Flow: do not suggest top-level completion inside interface
BugWEB-39390Destructuring existing variable shows "foo is null"
UsabilityWEB-39444Convert to React class/functional component: add link to the template configuration in description
UsabilityWEB-39414Keywords completion: reorder local and global symbols and keywords
JavaScript. FrameworksBugWEB-37732Do not show Alt+Return proposal to create a v-slot namespace
BugWEB-39481Can't resolve vue components in template tag (Blaze)
UsabilityWEB-39455React refactorings in Flow use TypeScript code templates
JavaScript. InspectionsBugWEB-39556'Expression statement is not assignment or call' is incorrectly reported for pipeline invocations
BugWEB-39511"Missing await for an async function call" false positive in shorthand lambdas and conditional expressions
JavaScript. RefactoringBugWEB-39483Refactoring: Rename: avoid showing "Not Found" in the preview for dynamic references
BugWEB-39446React class to functional component not available for class with 'displayName' static field
BugWEB-39470'Replace destructuring with property/index access' poorly handles non-identifier names
CosmeticsWEB-35457Duplicated description parts in refactoring preview - 'class class', 'file file', etc.
LintersBugWEB-39189.eslintignore in nested package not picked up inside lerna project
BugWEB-36096ESLint Ignores Nested React Project
Node.jsBugWEB-39510NPM Install Dependencies notification: package.json link broken
TypeScriptBugWEB-27160TypeScript: Rename field does rename more than just the field
BugWEB-37511Mutual discriminants are not supported via 'switch' for type guards
BugWEB-38637Type guards: weaken narrowing of '==' to not narrow in case of references on both sides
BugWEB-37512'== true' and '== false' and 'if(x)' guards should narrow boolean to the literal type
BugWEB-37922Type guard is incorrectly applied for a nested function
BugWEB-32363Support improved handling of 'instanceof' in type guards
BugWEB-38410Consider improving line markers/navigation from contextually typed literals to super
BugWEB-39499Support unknown type for switch expression
BugWEB-38167"<anonymous> in null" in the usage view
Unit TestsBugWEB-37886Mocha suites not recognized inside setTimeout
BugWEB-32987Mocha test not marked as test when timeout is set
DB ConsoleUsabilityDBE-8145Inconsistency in read-only mode
DB Schema ViewsUsabilityDBE-1476Change shortcut for Refresh action in Database Tool Window
Data ViewsBugDBE-7701While creating a new row, any boolean column with a default value set cannot be editted before the row is comitted to the database
SQL GeneralBugDBE-7941Todo-comments in the text of database server stored objects
BugDBE-8499DataGrip UI hangs when (or right after) introspecting Oracle DB.
SQL GenerationFeatureDBE-8467Db2: support index key expression generation