Skip to end of metadata
Go to start of metadata

RubyMine 2018.3.4 Preview (build 183.5429.15) Release Notes

IDEBugRUBY-23206No preview of the block's first line when the cursor is on its end
InspectionsFeatureRUBY-23335Please support the new feature in Ruby 2.6: "else without rescue now causes a syntax error."
ParsingFeatureRUBY-23334Please support the new feature in Ruby 2.6: "Constant names may start with a non-ASCII capital letter"
BugRUBY-23214Parsing error during indexing of an ERB file
Code Analysis. InspectionBugIDEA-204984Inspect Code hangs for single java file
Code Formatting and Code StyleBugIDEA-204185Code Generation settings are not being saved
ConsoleBugIDEA-203105Colours messed up in npm output
PerformanceIDEA-205347Asynchonous highlighting of a lot of console content leads to Out Of Memory
PerformanceIDEA-205448Intellij hangs on "Save Test Results"
Cucumber JVMBugIDEA-202964Cucumber step definitions are being marked as valid regardless of the casing
DebuggerBugIDEA-204462Debugger does not propose to evaluate File.toString with disabled toString renderer
Find, Replace, Find UsagesBugIDEA-193236Open In Find Window does a Replace All
IDE ConfigurationPerformanceIDEA-2026612018.3 slowness
Image ViewerBugIDEA-203942SVGLoader incorrectly interprets svg document size
Java. InspectionsBugIDEA-204135Replacing if with switch suggested but not possible
Language InjectionBugIDEA-202431Postgres SQL injected language formater
Platform APIBugIDEA-203169Handle ProcessCanceledException during extension point listeners
Task ManagementBugIDEA-205214Task Server setting Gitlab Token lost after closing WebStorm
Unit Testing. JUnitBugIDEA-203036JUnit tests launched in fork mode doesn't list all the tests, teamcity messages leaked in the console.
User Interface. AccessibilityBugIDEA-204449[a11y] instant rename refactor popup items are not selectable
User Interface. FocusBugIDEA-198612can't tab out a pane once breakpoint is hit
Version Control. LogBugIDEA-204247VCS Log repository root filter doesn't show tagged commits
DebuggerBugWEB-36714Debugger not attached, exits with -1073741510 when using `js.debugger.use.node.options` + `nodejs.console.use.terminal`
JavaScript. FrameworksBugWEB-36312Angular support conflicts with other templating languages
BugWEB-35128Web browsers panel is not shown in the angular project
BugWEB-28364Validation for location field new new Angular CLI project dialog doesn't work in PyCharm
Unit TestsBugWEB-36456Cucumber.js 5.x: not colored output in the Console
DB DiffBugDBE-7604Schema compare compares non-selected schemas
DB IntrospectionBugDBE-7561MySQL: incorrect column default value introspection after update
BugDBE-6070PhpStorm Database PostgreSQL doesn't show new added columns
BugDBE-7580Trigger definer is not shown in DDL
DB RefactoringBugDBE-7503Not able to rename a StoredProc, if I am just changing the casing.
Data ViewsBugDBE-6499First time commit is issued it needs to be issued twice
IDE GeneralFeatureDBE-7640DefaultProjectDirectory is not working as expected
ExceptionDBE-7613NPE at com.intellij.database.psi.DbPsiFacadeImpl.lambda$clearCachesImpl$1
PL & DDL EditorBugDBE-5908plpgsql valid assignment is red
SQL CompletionFeatureDBE-7256Auto complit for "create table", "create function" and etc by "ct".
FeatureDBE-2774Smart Complete of enum types
BugDBE-7333Extract Subquery as CTE appends CTE in wrong position
BugDBE-7332Extract Subquery as CTE produces unsupported inner CTEs
BugDBE-7387MSSQL: Unable to resolve symbol
BugDBE-2567Quoted table name completion: a dot is added inside quotes
SQL Format and StyleBugDBE-7522Reformat code: MSSQL table hint
SQL GeneralBugDBE-6887MSSQL: CREATE SECURITY POLICY
BugDBE-6941ClickHouse syntax does not allow parameters
SQL GenerationBugDBE-7526Can not edit trigger
BugDBE-7487Schema cannot be created from UI in DB2
SQL HighlightingFeatureDBE-7572MariaDB Dialect: Support "CREATE OR REPLACE EVENT"
BugDBE-7601PostgreSQL function code following RETURN QUERY reported as unreachable
BugDBE-7386Exasol: Division Operator mistaken for query terminator
BugDBE-7382SQL Server file starting with IF shows error when cursor on IF keyword
BugDBE-7563Oracle: support triggering event / statement more precise recovery syntax
BugDBE-7586Unresolved reference using functions with xml data type
BugDBE-7587Bug in postgresql dialect

RubyMine 2018.3.3 (build 183.5153.41) Release Notes

MarkdownBugRUBY-23174Markdown Plugin Problem: blank preview when switch Editor Only and Editor and Preview options
RailsBugRUBY-23316Rails could not be installed from 'create project' wizard on 2.6
RubyGemsBugRUBY-23318Do not use `--no-rdoc` option for rubygems >= 3.0
IDEBugRUBY-23348Color schema Darcula 2018.2 is absent
BugRUBY-23280Can't run tests in RVM Sdk with "bundled" bundler
No subsystemBugIDEA-202374Cannot open files after import setting from previous release
Compiling ProjectBugIDEA-203265AccessDeniedException when copying resources that are read-only
BugIDEA-200052@NotNull exception thrown for parameter marked @Nullable
DockerBugIDEA-201807Docker: Start/stop for a service node should work for compose files from one folder
BugIDEA-201749DockerCompose: after "restart" only the Log from the previous container is shown
BugIDEA-203879Creating runConfigs for multiple docker-compose files results in wrong commands being generated
Editor. Editing TextBugIDEA-204058Enter doesn't work in line comment if an invalid todo pattern is configured
Find, Replace, Find UsagesBugIDEA-203563Can't change "Find in Path" scope during indexing
 BugIDEA-203767Groovy CompileDynamic annotation is not recognised
IDE ConfigurationTaskIDEA-201087Do not log performance statistics to the console
Packaging and InstallationTaskIDEA-203997Bundle Kotlin 1.3.11 with IntelliJ IDEA
Project ConfigurationBugIDEA-203651Kotlin MPP (Common and JS) test source roots are not detected as source roots
Structural Search and ReplaceBugIDEA-202958try-finally without catch blocks pattern finds try-catch-finally statements
BugIDEA-203274Syntax highlighting does not change when changing file type
Task ManagementBugIDEA-173186Commit message lost after cancelling commit dialog with Add commit message from Task server enabled
BugIDEA-203337Duplicate shortcuts in "Open Task" window
UsabilityIDEA-203090Context List displays only the 10 most recent contexts
TerminalBugIDEA-201459Terminal doesn't source ".bash_profile" anymore in PyCharm
BugIDEA-203647Terminal settings (Environment Variables) forgotten after app restart
BugIDEA-204683No login shell if "Python Terminal" plugin enabled
BugIDEA-202881Failed to start cmd.exe
User InterfaceBugIDEA-197444Run Anything. Shortcut cannot be changed or disabled
UsabilityIDEA-203869Confusing description of language level 12-preview [Java 12 good code red - switch expressions]
UsabilityIDEA-179591'Couldn't checkout. Rollback changes to not let branches diverge' message extends past screen on Mac OS X
ExceptionIDEA-203174ShortcutSet of global AnActions should not be changed outside of KeymapManager
Version ControlPerformanceIDEA-203998Do not use RemoteRevisionsCache for Git
UsabilityIDEA-201491Default key binding for VCS/Git/Branches conflicts with MacOS binding
Version Control. GitBugIDEA-169020Exception from the VcsLogRefresher, if a Git root is unregistered in the Settings
BugIDEA-202796Git Remote operations do not work with Native SSH
BugIDEA-200096New parallel multi-root fetch not working with store credential helper
BugIDEA-204480Git: all remote operations fail with "execvp: No such file or directory" error
BugIDEA-201193Git Fetch is fetching only the current remote
BugIDEA-198143On Linux, remote git operations over SSH hang if IDEA started via terminal (has tty assigned)
Version Control. LogExceptionIDEA-202461java.lang.Throwable: Skipping invalid VCS root: VcsRoot{vcs=svn, path=null}
Version Control. SubversionBugIDEA-202942SVN Commit dialog hangs for a long time before showing up (since 2018.3)
No subsystemBugWEB-36333Go To menu from within Angular component template could be more functional
BugWEB-36109Angular template: template reference variable incorrectly reported as unused
TaskWEB-35225Invalid built-in server certificate when using https
DartBugWEB-36326Dart "assert" support
BugWEB-28443"Open issue submission form?" link in Event log broken
BugWEB-35878Problem creating new Dart Analysis Server issue on github from Dart plugin
BugWEB-35257Preference dialog filtering doesn't work for the 'Show closing labels in Dart source code' option in Community Edition
UsabilityWEB-14771Custom code folding regions do not work in Dart code in some cases.
UsabilityWEB-35885No need in 'Undo Reformat Code' confirmation when editing a Dart file
TaskWEB-36102Support new Dart syntax: Set literals
DebuggerBugWEB-36185Node.js: debugger is not attached if 'Allow taking heap snapshots' is ON unless 'js.debugger.use.node.options' is disabled
BugWEB-36132Regression: Debugger doesn't attach to forked process
BugWEB-36230Node.js debugger breaks on the first line when using Node.js 7.x
BugWEB-36266Nullpointer Electron / Node.js Debugging
BugWEB-36457Electron: render process debugging hangs after reloading app
PerformanceWEB-20253IDEA hangs when debugging TypeScript
JSONBugWEB-36189JSON Schemas: Validates to more than one variant gitlab extends script
JavaScriptBugWEB-36110JS import path setting "Use relative path to root" is broken since 2018.3
BugWEB-36268JS code completion fails for object literal property expected types
BugWEB-23326ES7: Decorating class expressions is treated as a syntax error
JavaScript. FormatterBugWEB-36263Wrong indentation in jsx & tsx files after self closing tags
JavaScript. FrameworksBugWEB-36591WebStorm gives an error for string interpolation inside Angular template strings
BugWEB-36506Extra & symbol on 'New project wizard | React'
BugWEB-36437Angular directive with selectors that are also listed as inputs do not resolve attribute form from metadata
BugWEB-29489Cant 'yarn start' in create-react-app project created via IDEA new project dialog
JavaScript. InspectionsBugWEB-31084Node Module exporting a symbol named Promise breaks native symbol resolution
JavaScript. RefactoringBugWEB-36238'Change signature' fails with TS arrow functions
BugWEB-35940Don't suggest to rename file when renaming fields
LintersBugWEB-36127Some TSLint rules are not imported if config extends 'tslint:latest'
Node.jsBugWEB-33257WSL: can't create create-react-app
BugWEB-36178Cannot auto-detect installed and hoisted package declared in a sub-project package.json
TypeScriptBugWEB-36244Typescript method is unresolved when used in lambda property
BugWEB-36373HTML errors in angular application
BugWEB-36226Bundled Typescript causes errors in HTML (Angular Language Service related?)
BugWEB-36262typescript enum member didn't show jsdoc desc
Unit TestsFeatureWEB-30241Support Cucumber.js version: 3.0.0+
BugWEB-35919CucumberJS output is blank - if you are not using scroll
BugWEB-36362Cucumber3+. Escape quotes in the Feature/scenario/step/file name
BugWEB-36376Karma: the browser is not captured automatically
BugWEB-33787Cucumber.js 4.x: wrong binary is used
ExceptionWEB-30618ParseException when run cucumber 2 examples
PL & DDL EditorBugDBE-7481Updating foreign key column name crashes

RubyMine 2018.3.2 (build 183.4886.48) Release Notes

Code InsightBugRUBY-23122Completion shows unexpected elements for `for` parameter completion
BugRUBY-22297Unused variable inspection. False Positive. Declaration before Retry
BugRUBY-23248RDoc Lexer has O(N^2) complexity which suddenly leads to RubyMine freezes
BugRUBY-23123YARD @return tag is ignored if @overload tag is present
DebuggerBugRUBY-21976Cannot start debug session with Ruby 1.8.7, ruby-debug-ide issue
EditingFeatureRUBY-23030Provide "File" as an option in new "Ruby Class"
BugRUBY-23203Move Caret to Matching Brace doesn't work for do/end blocks
BugRUBY-23042Replace Test-Spec template with a Minitest template
InspectionsBugRUBY-22990False positive inspection "Local variable value after assignment is not used" on parallel assignment
BugRUBY-22595Typo inspection reacts twice on symbols
BugRUBY-23244Nil dereference after nil colon method
BugRUBY-23225No assert that value is not nil after it was colon dereferenced
BugRUBY-23190False positive nil analysis for ||= operator
ParsingFeatureRUBY-23222Support Ruby 2.6 endless ranges
RailsFeatureRUBY-5014Factory_Girl gem code insight support
Rails. Code InsightBugRUBY-16945go to declaration for (render 'partial.js') can't resolve "_partial.js.erb" in app/views/application
BugRUBY-23050Support table_name_prefix in parent modules
BugRUBY-20385"cannot find declaration" of active record joins association symbols
Rails. Project ViewBugRUBY-23034Rails Project View - create a "jobs" top level folder
BugRUBY-23067Rails Project View - create a "concepts" top level folder
No subsystemFeatureIDEA-192898I want to provide searchable options from plugin to allow searching plugin settings in the settings dialogue.
BugIDEA-149084Spring Boot: completion in .yml files: incorrect results on inserting property if one with same prefix exists
BugIDEA-202374Cannot open files after import setting from previous release
BugIDEA-204044move clashes with resize in custom decorated mode
Code Analysis. InspectionBugIDEA-204111Run inspection by name produces empty view
BugIDEA-86833web.xml inspection for assignable to javax.servlet.Servlet is wrong
BugIDEA-203922Ctrl+Alt+Up in inspection results moves to the next result, rather than previous
ExceptionIDEA-203498com.intellij.analysis.AnalysisScope$2.visitFileEx(AnalysisScope.java:248): Read access is allowed from event dispatch thread or inside read-action only
Code Formatting and Code StyleBugIDEA-203775NPE on opening unified diff view when Upsource Integration plugin is enabled
Code. GenerateBugIDEA-203737Introduced method has wrong context
Cucumber JVMBugIDEA-203555Cucumber sentences does not evaluate {n} regular expressions
BugIDEA-171766Cucumber-java plugin does not support java8 step definitions with dynamic regexp
PerformanceIDEA-187983Long code analysis - Cucumber with java8
TaskIDEA-202545Java8 step definition in languages other than English
DebuggerBugIDEA-203825Deadlock in debugger
UsabilityIDEA-172140Suspend only current thread during evaluation of breakpoint's condition
DockerBugIDEA-202973Docker: RunConfiguration: "..." instead of the error about the wrong path to the Dockerfile
BugIDEA-203879Creating runConfigs for multiple docker-compose files results in wrong commands being generated
DroolsPerformanceIDEA-203046Intellij lags when editing drl (Drools rules) files.
Editor. Editing TextBugIDEA-201210Expanding selection within method's generic type parameter expands to beginning of file
BugIDEA-204058Enter doesn't work in line comment if an invalid todo pattern is configured
BugIDEA-203902Text drag'n'drop in editor is not canceled by Esc key
IDE ConfigurationPerformanceIDEA-2026612018.3 slowness
TaskIDEA-201087Do not log performance statistics to the console
Image ViewerBugIDEA-203942SVGLoader incorrectly interprets svg document size
Java. InspectionsFeatureIDEA-203878Auto(un)boxing inspection needs update for switch expressions
FeatureIDEA-203462Update "Unnecessary 'default' for enum 'switch' statement" inspection for switch expressions
FeatureIDEA-192251Infer purity of constructors from sources
FeatureIDEA-203974"Local variable used and declared in different 'switch' branches" inspection needs update for switch expressions
BugIDEA-203845com.intellij.util.IncorrectOperationException: Incorrect statement 'else
BugIDEA-203946Update "Text label in 'switch' statement" inspection for switch expressions
BugIDEA-203984"Remove unreachable branches" quickfix breaks code on switch expression
BugIDEA-203719"Result of object allocation ignored" inspection false positive in new switch
BugIDEA-203289Javadoc <code>/{@code ...} inspection: might yield invalid/corrupted syntax
BugIDEA-203698Value of ++ or -- is used: false-negative on switch expression
BugIDEA-203625Inspection 'assertEquals() between objects of inconvertible types' doesn't show warning when comparing collection of inconvertable type
BugIDEA-204014"I/O resource opened and not safely closed" should be updated to support switch expressions
BugIDEA-204013"Redundant local variable" should be switch break-aware
BugIDEA-174522No deannotate intention action for library classes annotated as deprecated via external annotations
BugIDEA-203693"Move assignment to field declaration" produces erroneous code when assignment is inside Java 12 switch
BugIDEA-203798Inspection "Default method not implemented" has too big range when implemented anonymously
BugIDEA-203708"Unnecessary boxing" false-negative with Java 12 switch expressions
BugIDEA-204138Exception in "statement with empty body" inspection with switch expression
BugIDEA-203793Inspection for Unnecessary nullability check ignores String::equals called on literal
ExceptionIDEA-204106Auto-unboxing with switch expressions produces exceptions
Java. Intention ActionsBugIDEA-203741I cannot prevent IntelliJ from adding annotatations
BugIDEA-203897"Import class" popup behaves weirdly in case of package local class
CosmeticsIDEA-202990Intellij suggests adding new parameter as '21th' parameter to method
JavaEE. Deployment and RunBugIDEA-203047Rerun for JavaEE server run configuration does not lead to `Update` action
KubernetesUsabilityIDEA-202462Noisy Kubernetes menu
Packaging and InstallationBugIDEA-141900Installer: Uninstall old version has weird word wrapping
BugIDEA-203550Windows Installer: 'Uninstall old versions' shows only several installations from only one disk with a weird gap
UsabilityIDEA-202806There are too few rows in Uninstall Old Versions tab
TaskIDEA-203997Bundle Kotlin 1.3.11 with IntelliJ IDEA
Platform APIFeatureIDEA-177378make the registry entries extendible by plugins
Plugin ManagementBugIDEA-202957New Plugins dialog: 503 server error causes two error dialogs - one after settings dialog is closed
Project ConfigurationBugIDEA-203651Kotlin MPP (Common and JS) test source roots are not detected as source roots
Quick DocumentationBugIDEA-201393QuickDoc popup hides after selecting "Show Toolbar" option if QucikDoc is shown on mouse move
BugIDEA-189815Quick doc popup shown on mouse hover closes when clicking on a reference to a different class inside
BugIDEA-201449Documentation tab name is not updated on following links in documentation
BugIDEA-201280QuickDoc popup appears at the cursor position after closing the documentation tab in Tool Window
BugIDEA-203713QuickDoc shown on mouse move changes position or disappears after clicking on link it contains
BugIDEA-198297Quick Documentation popup is sometimes placed off screen
BugIDEA-201036Autocomplete list moves up when opening/closing QuickDoc Tool Window
Run | Debug configurationUsabilityIDEA-201215JVM launcher cannot process @argfiles produced by IDEA
Task ManagementUsabilityIDEA-203090Context List displays only the 10 most recent contexts
TerminalBugIDEA-203647Terminal settings (Environment Variables) forgotten after app restart
Unit Testing. JUnitBugIDEA-203036JUnit tests launched in fork mode doesn't list all the tests, teamcity messages leaked in the console.
BugIDEA-178882Fork doesn't work properly when run tests from package with mix of Junit4 and Junit5 tests
BugIDEA-203609IDE won't run JUnit tests classes with same name
BugIDEA-199945Idea 2018 and Junit 5 duplicates test executions when running tests from the IDE
PerformanceIDEA-203173JUnit 5 Platform Integration calls TestEngine.discover twice
User InterfaceBugIDEA-197444Run Anything. Shortcut cannot be changed or disabled
UsabilityIDEA-179591'Couldn't checkout. Rollback changes to not let branches diverge' message extends past screen on Mac OS X
UsabilityIDEA-203571Disabled icons on status bar should support LAF changes
UsabilityIDEA-203577Update tool window modes menu
CosmeticsIDEA-200555Icons in the Apply Patch dialog are not updated
CosmeticsIDEA-203829Analyze actions shows "Include test sources" option even if there are no tests in the project
ExceptionIDEA-203612NullPointerException occurs on opening a second/new project in the same window
User Interface. Look and FeelBugIDEA-203934Icons become of a Darcula theme after restarting IDEA with "High Contrast" theme set
BugIDEA-202248Color Scheme reverts to Darcula from light color theme after restart if IDE theme is Darcula
BugIDEA-159315Black text on dark background in 'Rename File' dialog box. (Dracula theme)
Version ControlFeatureIDEA-203130Allow to apply shelved changes without removing them from shelf by dragging corresponding changelist to 'Local Changes' tab while holding Ctrl
BugIDEA-179602Workspace should not be restored is a branch is not checked out
PerformanceIDEA-203998Do not use RemoteRevisionsCache for Git
UsabilityIDEA-192682Can't drag&drop several files from 'Shelf' tool window to the 'Local Change" tool window
CosmeticsIDEA-203839Change 'Unshelve changes' dialog button rename
Version Control. GitFeatureIDEA-116425Ignored files and folders should indicate that they are ignored
FeatureIDEA-139940Force push could be made a bit safer with --force-with-lease option
BugIDEA-198143On Linux, remote git operations over SSH hang if IDEA started via terminal (has tty assigned)
BugIDEA-201193Git Fetch is fetching only the current remote
BugIDEA-202796Git Remote operations do not work with Native SSH
BugIDEA-200096New parallel multi-root fetch not working with store credential helper
PerformanceIDEA-201588GitUtil.isGitRoot is expensive on windows and called too many times
UsabilityIDEA-201596Don't add unrelated entries to automatically created .gitignore file
Version Control. LogUsabilityIDEA-160441Better name for Log tabs & tooltips
UsabilityIDEA-130970Git Log: search for filter string both in hashes and in strings
ExceptionIDEA-202461java.lang.Throwable: Skipping invalid VCS root: VcsRoot{vcs=svn, path=null}
No subsystemBugWEB-36280<noscript> Content gets incorrectly highlighted
TaskWEB-35225Invalid built-in server certificate when using https
DartUsabilityWEB-14771Custom code folding regions do not work in Dart code in some cases.
DebuggerBugWEB-36230Node.js debugger breaks on the first line when using Node.js 7.x
BugWEB-35630node debug connector isn't listening to debug port
BugWEB-36132Regression: Debugger doesn't attach to forked process
BugWEB-36266Nullpointer Electron / Node.js Debugging
BugWEB-36185Node.js: debugger is not attached if 'Allow taking heap snapshots' is ON unless 'js.debugger.use.node.options' is disabled
PerformanceWEB-35886Out of memory after debugging my Angular app for awhile
HTMLBugWEB-35193HTML5 Outline shows <td> elements
JSONBugWEB-36189JSON Schemas: Validates to more than one variant gitlab extends script
JavaScriptFeatureWEB-33449Intention actions and refactoring to replace code by destructuring
FeatureWEB-30826TS 'Type mismatch' errors should show quickfix to update type when available
BugWEB-36241'Remove unused local variable' behaves incorrectly with array destructuring
BugWEB-23326ES7: Decorating class expressions is treated as a syntax error
BugWEB-36193Destructuring is not fully supported in control-flow analysis
BugWEB-36268JS code completion fails for object literal property expected types
BugWEB-35767TypeScript/ES6: support autoimports for re-export as default of default symbols
CosmeticsWEB-36186"Must be lvalue" instead of "ReferenceError: invalid assignment left-hand side"
JavaScript. FormatterBugWEB-36263Wrong indentation in jsx & tsx files after self closing tags
JavaScript. InspectionsBugWEB-36304False positive: 'arguments' not allowed
BugWEB-36236Suppressing several inspections for one line adds comments in several lines
JavaScript. RefactoringBugWEB-36238'Change signature' fails with TS arrow functions
LintersBugWEB-36164'Fix all TSLint problems' should be available in context menu
BugWEB-35856'Fix current file with ESLint' doesn't replace line endings when linebreak-style configured in .eslintrc
Node.jsBugWEB-36178Cannot auto-detect installed and hoisted package declared in a sub-project package.json
SASSFeatureWEB-6015Add color preview box in the left gutter for variable (containing some color value) reference (as it done at its definition)
TypeScriptBugWEB-36244Typescript method is unresolved when used in lambda property
BugWEB-36226Bundled Typescript causes errors in HTML (Angular Language Service related?)
BugWEB-36262typescript enum member didn't show jsdoc desc
PerformanceWEB-34580TypeScript: performance problem with mobx-state-tree package
TaskWEB-36160TypeScript: optimize TypeScriptGeneratedFilesStartupActivity#addFileToExclude
TaskWEB-36269TypeScript: overload support for tag functions
Unit TestsFeatureWEB-30241Support Cucumber.js version: 3.0.0+
BugWEB-33601Show jest.config.file in the Jest RC when running tests
BugWEB-33787Cucumber.js 4.x: wrong binary is used
BugWEB-35919CucumberJS output is blank - if you are not using scroll
UsabilityWEB-36272Add gutter icon for 'jest' in package.json
DB IntrospectionBugDBE-7459Error connecting to Redshift
UsabilityDBE-1996Database: "Unsupported format version" message gives no hint what data sources are in question
IDE GeneralBugDBE-7477Wrong thread for DumbAware startup activity
PL & DDL EditorBugDBE-7481Updating foreign key column name crashes
SQL CompletionBugDBE-2567Quoted table name completion: a dot is added inside quotes
SQL GeneralBugDBE-7264Unquote identifier does not work for SQL Server T-SQL
SQL HighlightingUsabilityDBE-7314A better highlighting for 'column aliases required' inspection
User InterfaceBugDBE-6558Color settings in datagrid different to database panel
BugDBE-7470Two PostgreSQL dialects in injection intention

RubyMine 2018.3.2 RC (build 183.4886.48) Release Notes

Code InsightBugRUBY-23258RTI Plugin causes exception in goto popup
InspectionsBugRUBY-23190False positive nil analysis for ||= operator
BugRUBY-22990False positive inspection "Local variable value after assignment is not used" on parallel assignment
ParsingFeatureRUBY-23222Support Ruby 2.6 endless ranges

RubyMine 2018.3.2 EAP (build 183.4886.25) Release Notes

Code InsightBugRUBY-23122Completion shows unexpected elements for `for` parameter completion
BugRUBY-23123YARD @return tag is ignored if @overload tag is present
DebuggerBugRUBY-21976Cannot start debug session with Ruby 1.8.7, ruby-debug-ide issue
EditingBugRUBY-23042Replace Test-Spec template with a Minitest template
InspectionsBugRUBY-23190False positive nil analysis for ||= operator
Rails. Code InsightBugRUBY-16945go to declaration for (render 'partial.js') can't resolve "_partial.js.erb" in app/views/application
BugRUBY-23050Support table_name_prefix in parent modules
BugRUBY-20385"cannot find declaration" of active record joins association symbols
No subsystemFeatureIDEA-192898I want to provide searchable options from plugin to allow searching plugin settings in the settings dialogue.
BugIDEA-149084Spring Boot: completion in .yml files: incorrect results on inserting property if one with same prefix exists
BugIDEA-202374Cannot open files after import setting from previous release
BugIDEA-204044move clashes with resize in custom decorated mode
Code Analysis. InspectionBugIDEA-204111Run inspection by name produces empty view
BugIDEA-86833web.xml inspection for assignable to javax.servlet.Servlet is wrong
BugIDEA-203922Ctrl+Alt+Up in inspection results moves to the next result, rather than previous
ExceptionIDEA-203498com.intellij.analysis.AnalysisScope$2.visitFileEx(AnalysisScope.java:248): Read access is allowed from event dispatch thread or inside read-action only
Code Formatting and Code StyleBugIDEA-203775NPE on opening unified diff view when Upsource Integration plugin is enabled
Code. GenerateBugIDEA-203737Introduced method has wrong context
DebuggerBugIDEA-203825Deadlock in debugger
UsabilityIDEA-172140Suspend only current thread during evaluation of breakpoint's condition
DockerBugIDEA-202973Docker: RunConfiguration: "..." instead of the error about the wrong path to the Dockerfile
BugIDEA-203879Creating runConfigs for multiple docker-compose files results in wrong commands being generated
DroolsPerformanceIDEA-203046Intellij lags when editing drl (Drools rules) files.
Editor. Editing TextBugIDEA-201210Expanding selection within method's generic type parameter expands to beginning of file
BugIDEA-204058Enter doesn't work in line comment if an invalid todo pattern is configured
BugIDEA-203902Text drag'n'drop in editor is not canceled by Esc key
IDE ConfigurationTaskIDEA-201087Do not log performance statistics to the console
Image ViewerBugIDEA-203942SVGLoader incorrectly interprets svg document size
Java. InspectionsFeatureIDEA-203878Auto(un)boxing inspection needs update for switch expressions
FeatureIDEA-203462Update "Unnecessary 'default' for enum 'switch' statement" inspection for switch expressions
FeatureIDEA-192251Infer purity of constructors from sources
FeatureIDEA-203974"Local variable used and declared in different 'switch' branches" inspection needs update for switch expressions
BugIDEA-203845com.intellij.util.IncorrectOperationException: Incorrect statement 'else
BugIDEA-203946Update "Text label in 'switch' statement" inspection for switch expressions
BugIDEA-203984"Remove unreachable branches" quickfix breaks code on switch expression
BugIDEA-203719"Result of object allocation ignored" inspection false positive in new switch
BugIDEA-203289Javadoc <code>/{@code ...} inspection: might yield invalid/corrupted syntax
BugIDEA-203698Value of ++ or -- is used: false-negative on switch expression
BugIDEA-203625Inspection 'assertEquals() between objects of inconvertible types' doesn't show warning when comparing collection of inconvertable type
BugIDEA-204014"I/O resource opened and not safely closed" should be updated to support switch expressions
BugIDEA-204013"Redundant local variable" should be switch break-aware
BugIDEA-174522No deannotate intention action for library classes annotated as deprecated via external annotations
BugIDEA-203693"Move assignment to field declaration" produces erroneous code when assignment is inside Java 12 switch
BugIDEA-203798Inspection "Default method not implemented" has too big range when implemented anonymously
BugIDEA-203708"Unnecessary boxing" false-negative with Java 12 switch expressions
BugIDEA-204138Exception in "statement with empty body" inspection with switch expression
BugIDEA-203793Inspection for Unnecessary nullability check ignores String::equals called on literal
Java. Intention ActionsBugIDEA-203741I cannot prevent IntelliJ from adding annotatations
BugIDEA-203897"Import class" popup behaves weirdly in case of package local class
CosmeticsIDEA-202990Intellij suggests adding new parameter as '21th' parameter to method
JavaEE. Deployment and RunBugIDEA-203047Rerun for JavaEE server run configuration does not lead to `Update` action
KubernetesUsabilityIDEA-202462Noisy Kubernetes menu
Packaging and InstallationBugIDEA-141900Installer: Uninstall old version has weird word wrapping
BugIDEA-203550Windows Installer: 'Uninstall old versions' shows only several installations from only one disk with a weird gap
UsabilityIDEA-202806There are too few rows in Uninstall Old Versions tab
TaskIDEA-203997Bundle Kotlin 1.3.11 with IntelliJ IDEA
Platform APIFeatureIDEA-177378make the registry entries extendible by plugins
Plugin ManagementBugIDEA-202957New Plugins dialog: 503 server error causes two error dialogs - one after settings dialog is closed
Project ConfigurationBugIDEA-203651Kotlin MPP (Common and JS) test source roots are not detected as source roots
Quick DocumentationBugIDEA-201393QuickDoc popup hides after selecting "Show Toolbar" option if QucikDoc is shown on mouse move
BugIDEA-189815Quick doc popup shown on mouse hover closes when clicking on a reference to a different class inside
BugIDEA-201280QuickDoc popup appears at the cursor position after closing the documentation tab in Tool Window
BugIDEA-203713QuickDoc shown on mouse move changes position or disappears after clicking on link it contains
BugIDEA-198297Quick Documentation popup is sometimes placed off screen
BugIDEA-201036Autocomplete list moves up when opening/closing QuickDoc Tool Window
Run | Debug configurationUsabilityIDEA-201215JVM launcher cannot process @argfiles produced by IDEA
TerminalBugIDEA-203647Terminal settings (Environment Variables) forgotten after app restart
Unit Testing. JUnitBugIDEA-203036JUnit tests launched in fork mode doesn't list all the tests, teamcity messages leaked in the console.
BugIDEA-178882Fork doesn't work properly when run tests from package with mix of Junit4 and Junit5 tests
BugIDEA-203609IDE won't run JUnit tests classes with same name
BugIDEA-199945Idea 2018 and Junit 5 duplicates test executions when running tests from the IDE
PerformanceIDEA-203173JUnit 5 Platform Integration calls TestEngine.discover twice
User InterfaceBugIDEA-197444Run Anything. Shortcut cannot be changed or disabled
UsabilityIDEA-179591'Couldn't checkout. Rollback changes to not let branches diverge' message extends past screen on Mac OS X
UsabilityIDEA-203571Disabled icons on status bar should support LAF changes
UsabilityIDEA-203577Update tool window modes menu
CosmeticsIDEA-200555Icons in the Apply Patch dialog are not updated
CosmeticsIDEA-203829Analyze actions shows "Include test sources" option even if there are no tests in the project
ExceptionIDEA-203612NullPointerException occurs on opening a second/new project in the same window
User Interface. Look and FeelBugIDEA-203934Icons become of a Darcula theme after restarting IDEA with "High Contrast" theme set
BugIDEA-202248Color Scheme reverts to Darcula from light color theme after restart if IDE theme is Darcula
BugIDEA-159315Black text on dark background in 'Rename File' dialog box. (Dracula theme)
Version ControlFeatureIDEA-203130Allow to apply shelved changes without removing them from shelf by dragging corresponding changelist to 'Local Changes' tab while holding Ctrl
BugIDEA-179602Workspace should not be restored is a branch is not checked out
PerformanceIDEA-203998Do not use RemoteRevisionsCache for Git
UsabilityIDEA-192682Can't drag&drop several files from 'Shelf' tool window to the 'Local Change" tool window
CosmeticsIDEA-203839Change 'Unshelve changes' dialog button rename
Version Control. GitFeatureIDEA-139940Force push could be made a bit safer with --force-with-lease option
BugIDEA-198143When IDEA process has tty assigned, git ssh operations prompt for passphrase in the terminal ignoring SSH_ASKPASS
BugIDEA-201193Git Fetch is fetching only the current remote
BugIDEA-202796Git Remote operations do not work with Native SSH
BugIDEA-200096New parallel multi-root fetch not working with store credential helper
UsabilityIDEA-201596Don't add unrelated entries to automatically created .gitignore file
Version Control. LogUsabilityIDEA-130970Git Log: search for filter string both in hashes and in strings
ExceptionIDEA-202461java.lang.Throwable: Skipping invalid VCS root: VcsRoot{vcs=svn, path=null}
No subsystemBugWEB-36280<noscript> Content gets incorrectly highlighted
TaskWEB-35225Invalid built-in server certificate when using https
DartUsabilityWEB-14771Custom code folding regions do not work in Dart code in some cases.
DebuggerBugWEB-36230Node.js debugger breaks on the first line when using Node.js 7.x
BugWEB-35630node debug connector isn't listening to debug port
BugWEB-36132Regression: Debugger doesn't attach to forked process
BugWEB-36266Nullpointer Electron / Node.js Debugging
BugWEB-36185Node.js: debugger is not attached if 'Allow taking heap snapshots' is ON unless 'js.debugger.use.node.options' is disabled
HTMLBugWEB-35193HTML5 Outline shows <td> elements
JSONBugWEB-36189JSON Schemas: Validates to more than one variant gitlab extends script
JavaScriptBugWEB-36241'Remove unused local variable' behaves incorrectly with array destructuring
BugWEB-23326ES7: Decorating class expressions is treated as a syntax error
BugWEB-36193Destructuring is not fully supported in control-flow analysis
BugWEB-36268JS code completion fails for object literal property expected types
CosmeticsWEB-36186"Must be lvalue" instead of "ReferenceError: invalid assignment left-hand side"
JavaScript. FormatterBugWEB-36263Wrong indentation in jsx & tsx files after self closing tags
JavaScript. InspectionsBugWEB-36304False positive: 'arguments' not allowed
BugWEB-36236Suppressing several inspections for one line adds comments in several lines
JavaScript. RefactoringBugWEB-36238'Change signature' fails with TS arrow functions
LintersBugWEB-36164'Fix all TSLint problems' should be available in context menu
BugWEB-35856'Fix current file with ESLint' doesn't replace line endings when linebreak-style configured in .eslintrc
Node.jsBugWEB-36178Cannot auto-detect installed and hoisted package declared in a sub-project package.json
SASSFeatureWEB-6015Add color preview box in the left gutter for variable (containing some color value) reference (as it done at its definition)
TypeScriptBugWEB-36244Typescript method is unresolved when used in lambda property
BugWEB-36262typescript enum member didn't show jsdoc desc
PerformanceWEB-34580TypeScript: performance problem with mobx-state-tree package
TaskWEB-36160TypeScript: optimize TypeScriptGeneratedFilesStartupActivity#addFileToExclude
TaskWEB-36269TypeScript: overload support for tag functions
Unit TestsFeatureWEB-30241Support Cucumber.js version: 3.0.0+
BugWEB-33601Show jest.config.file in the Jest RC when running tests
BugWEB-33787Cucumber.js 4.x: wrong binary is used
BugWEB-35919CucumberJS output is blank - if you are not using scroll
UsabilityWEB-36272Add gutter icon for 'jest' in package.json
DB IntrospectionUsabilityDBE-1996Database: "Unsupported format version" message gives no hint what data sources are in question
IDE GeneralBugDBE-7477Wrong thread for DumbAware startup activity
SQL CompletionBugDBE-2567Quoted table name completion: a dot is added inside quotes
SQL GeneralBugDBE-7264Unquote identifier does not work for SQL Server T-SQL
SQL HighlightingUsabilityDBE-7314A better highlighting for 'column aliases required' inspection
User InterfaceBugDBE-6558Color settings in datagrid different to database panel
BugDBE-7470Two PostgreSQL dialects in injection intention

RubyMine 2018.3.1 (build 183.4588.71) Release Notes

No subsystemCosmeticsRUBY-22079rails console prompt regression
Code InsightFeatureRUBY-23003Completion for @option YARD tag
BugRUBY-23025RubyModuleAsSuperclassInspection: support resolving constants and not fully qualified names
BugRUBY-23053RubyModuleAsSuperclassInspection should be located in Ruby inspection group
BugRUBY-23093Incorrect resolve to `initialize` inside Ruby test directories
DebuggerBugRUBY-23091Cannot install debug gems to remote RVM sdk with gemset
HAMLBugRUBY-22896Heredocs in ruby filter in haml lead to parser error
IDEBugRUBY-22697Update parameter colour for Ruby in several colour schemes
InspectionsBugRUBY-23077Boundaries of the range are not flipped
BugRUBY-22818invalid "nil reference may occur" inspection after conditional reassignment
BugRUBY-23062Add colon reference support for Nil Analysis
MarkdownBugRUBY-17333Сolumns in the table stretched across the width of the browser
BugRUBY-23022Unable to navigate to project links in Markdown Preview
BugRUBY-23104Path to local pictures is always counted from the root
Product DocumentationTaskRUBY-23002Update RubyMine 'Tips of the Day' according changes made in the JetBrains/IntelliJTips repository
RailsUsabilityRUBY-22940I18n - improve the suggested locale file when creating a property or adding translations to an existing one
RefactoringsBugRUBY-12326'Extract Field' refactoring doesn't work properly
BugRUBY-22910Inline method doesn't rename name clashes
UsabilityRUBY-23033Extract parameter: "replace all occurrences" by default
Remote InterpretersBugRUBY-23085RM hangs after add new docker-compose sdk in the settings
TestsFeatureRUBY-22919Add an option to rerun failed tests in debug mode
BugRUBY-23014Linkified file based urls no longer work when clicked on from output of a test run (but will from stack trace)
YAMLBugRUBY-22576Key started with dot is pasted without hierarchy
No subsystemBugIDEA-202979intellij idea 2018.3 does not finish scanning files to index
BugIDEA-202396IDE switches to wrong tab when dragging tab to different window
DebuggerBugIDEA-202380Can't assign non-array value to an array in Expression Evaluation window
DockerBugIDEA-202514Docker: Dockerfile fails to run from the Editor with automatically created run config
Find, Replace, Find UsagesCosmeticsIDEA-202206Search everywhere: Type / to see commands
Java. InspectionsUsabilityIDEA-146217IDEA doesn't propose to modify 'throws' for method in scratch files
Java. Intention ActionsFeatureIDEA-197852Java Scratch: Missing intentions (1) Create local variable (2) Create parameter and (3) Rename reference
BugIDEA-201903Scratch files: Missing quick fix "change type" for class fields
Packaging and InstallationBugIDEA-202935Regression: cannot install IntelliJ IDEA in silent mode if intermediate directory is missing
BugIDEA-201878Uninstall previous installations: There is bin folder with uninstall.exe after uninstalling
Platform APIPerformanceIDEA-202315UAST TreeBasedEvaluator consumes a lot of CPU
Plugin DevelopmentBugIDEA-202885DevKit: constant assertion when using xi:include with <depends> in plugin descriptors
Quick DocumentationBugIDEA-200855SVG displayed in Quick Documentation popup ignore any size hint and are too large
Template Languages. FreeMarkerBugIDEA-202190Freemarker Inspection About Date type
TerminalBugIDEA-202523Opening Embedded Terminal starts with: "cp: overwrite '/home/<username>/.WebStorm2018.3/config/terminal/history/history-'? " since updating to WebStorm 2018.3
BugIDEA-202821Blank terminal
BugIDEA-200854Regression: "Close session" and "Select Next/Previous Tab" no longer works in terminal since latest build
ExceptionIDEA-203045Start ssh session is broken in 183.3795.24
User InterfaceBugIDEA-183544Artifacts Application icon setting missing
No subsystemFeatureWEB-35815Improve syntax highlighting for Angular templates
BugWEB-35807The gutter icon for "Implemented" is shifted to the left when it merges multiple icons
BugWEB-36065Sometimes editor shows Angular 2+ attributes as not allowed. This is the message. "Attribute (click) is not allowed here less... (Ctrl+F1) Inspection info: This inspection highlights unknown HTML tag attributes as invalid, and lets mark such attributes as Custom to avoid highlighting them as invalid. "
BugWEB-35931Auto-inserted brace breaks the code in JS object with braceless lambdas
JSONBugWEB-35514Comma is inserted in an incorrect place when pasting value with a trailing newline symbol
JavaScriptBugWEB-36073ES6: import from node core modules are broken
BugWEB-35584Intellisense breaks for classes with methods
JavaScript. FormatterBugWEB-22494Wrong indentation after breaking line in React JSX code
JavaScript. FrameworksFeatureWEB-35983Improve code completion for Angular bindings
BugWEB-33446`@ViewChild()` decorator. Support find usages/rename
BugWEB-29774AngularJS: don't inject AngularJS in `@` component binding value
BugWEB-35941Angular 2 HTML binding auto-suggest doesn't treat custom components Input() and Output() as relevant
BugWEB-358182018.3 RC - Angular template not recognizing 'undefined' keyword
BugWEB-31760Code completion is broken for variable bindings ("as") in Angular templates
BugWEB-35868Type information on template reference variable looks bad
BugWEB-35313Angular - support templates referenced through import statement.
BugWEB-35848Component's properties/methods are not resolved in pug templates
BugWEB-35842Find angular component by selector not working
BugWEB-36111Angular - malformed code causes issues
Node.jsBugWEB-36082Having // in package json refreshes indices forever
UsabilityWEB-35680node_modules folder is marked as library root after unexcluding
TypeScriptBugWEB-35743Typescript - Implement constructor dialog does not respond to ALT+N (Select none)
BugWEB-35803Error while import date-fns functions in vue-component
BugWEB-35761Typescript: "Create method" incorrectly computes insertion anchor for aliased type literals
DB DiffBugDBE-7320Comparing two schemas fails
Data ViewsUsabilityDBE-7224Data view "Compare with" underscore in tab name is transformed to accelerator in dropdown
Navigation & SearchBugDBE-7303Oracle: navigate to package procedure: DG navigates to the first line instead of the line with procedure declaration
SQL Format and StyleFeatureDBE-2837align create table comments
SQL GeneralFeatureDBE-7268Support Decimal type
SQL HighlightingBugDBE-7282Just alone field is treated as a function
PerformanceDBE-7335Suppression calculation could be faster
User InterfaceFeatureDBE-7214Ability to choose color in data source settings

RubyMine 2018.3.1 RC (build 183.4588.71) Release Notes

MarkdownBugRUBY-23104Path to local pictures is always counted from the root
Remote InterpretersBugRUBY-23085RM hangs after add new docker-compose sdk in the settings
Packaging and InstallationBugIDEA-201878Uninstall previous installations: There is bin folder with uninstall.exe after uninstalling
Plugin DevelopmentBugIDEA-202885DevKit: constant assertion when using xi:include with <depends> in plugin descriptors
TerminalExceptionIDEA-203045Start ssh session is broken in 183.3795.24
No subsystemBugWEB-36065Sometimes editor shows Angular 2+ attributes as not allowed. This is the message. "Attribute (click) is not allowed here less... (Ctrl+F1) Inspection info: This inspection highlights unknown HTML tag attributes as invalid, and lets mark such attributes as Custom to avoid highlighting them as invalid. "
JavaScript. FrameworksBugWEB-36111Angular - malformed code causes issues
Node.jsBugWEB-36082Having // in package json refreshes indices forever

RubyMine 2018.3.1 EAP (build 183.4588.30) Release Notes

No subsystemCosmeticsRUBY-22079rails console prompt regression
Code InsightFeatureRUBY-23003Completion for @option YARD tag
BugRUBY-23025RubyModuleAsSuperclassInspection: support resolving constants and not fully qualified names
BugRUBY-22906Сlass of class variable shown in completion as $$SINGLETON$$
BugRUBY-23053RubyModuleAsSuperclassInspection should be located in Ruby inspection group
BugRUBY-23093Incorrect resolve to `initialize` inside Ruby test directories
DebuggerBugRUBY-23091Cannot install debug gems to remote RVM sdk with gemset
HAMLBugRUBY-22896Heredocs in ruby filter in haml lead to parser error
IDEBugRUBY-22697Update parameter colour for Ruby in several colour schemes
InspectionsBugRUBY-23077Boundaries of the range are not flipped
BugRUBY-22818invalid "nil reference may occur" inspection after conditional reassignment
BugRUBY-23062Add colon reference support for Nil Analysis
MarkdownBugRUBY-23022Unable to navigate to project links in Markdown Preview
BugRUBY-17333Сolumns in the table stretched across the width of the browser
Product DocumentationTaskRUBY-23002Update RubyMine 'Tips of the Day' according changes made in the JetBrains/IntelliJTips repository
RailsUsabilityRUBY-22940I18n - improve the suggested locale file when creating a property or adding translations to an existing one
RefactoringsBugRUBY-12326'Extract Field' refactoring doesn't work properly
BugRUBY-22910Inline method doesn't rename name clashes
UsabilityRUBY-23033Extract parameter: "replace all occurrences" by default
TestsBugRUBY-23014Linkified file based urls no longer work when clicked on from output of a test run (but will from stack trace)
YAMLBugRUBY-22576Key started with dot is pasted without hierarchy
No subsystemBugIDEA-202396IDE switches to wrong tab when dragging tab to different window
DebuggerBugIDEA-202380Can't assign non-array value to an array in Expression Evaluation window
DockerBugIDEA-202514Docker: Dockerfile fails to run from the Editor with automatically created run config
Find, Replace, Find UsagesCosmeticsIDEA-202206Search everywhere: Type / to see commands
Java. InspectionsUsabilityIDEA-146217IDEA doesn't propose to modify 'throws' for method in scratch files
Java. Intention ActionsFeatureIDEA-197852Java Scratch: Missing intentions (1) Create local variable (2) Create parameter and (3) Rename reference
BugIDEA-201903Scratch files: Missing quick fix "change type" for class fields
Packaging and InstallationBugIDEA-202935Regression: cannot install IntelliJ IDEA in silent mode if intermediate directory is missing
Platform APIPerformanceIDEA-202315UAST TreeBasedEvaluator consumes a lot of CPU
Quick DocumentationBugIDEA-200855SVG displayed in Quick Documentation popup ignore any size hint and are too large
Template Languages. FreeMarkerBugIDEA-202190Freemarker Inspection About Date type
TerminalBugIDEA-202523Opening Embedded Terminal starts with: "cp: overwrite '/home/<username>/.WebStorm2018.3/config/terminal/history/history-'? " since updating to WebStorm 2018.3
BugIDEA-202821Blank terminal
BugIDEA-200854Regression: "Close session" and "Select Next/Previous Tab" no longer works in terminal since latest build
User InterfaceBugIDEA-183544Artifacts Application icon setting missing
No subsystemFeatureWEB-35815Improve syntax highlighting for Angular templates
BugWEB-35807The gutter icon for "Implemented" is shifted to the left when it merges multiple icons
BugWEB-35931Auto-inserted brace breaks the code in JS object with braceless lambdas
JSONBugWEB-35514Comma is inserted in an incorrect place when pasting value with a trailing newline symbol
JavaScriptBugWEB-36073ES6: import from node core modules are broken
BugWEB-35584Intellisense breaks for classes with methods
JavaScript. FormatterBugWEB-22494Wrong indentation after breaking line in React JSX code
JavaScript. FrameworksFeatureWEB-35983Improve code completion for Angular bindings
BugWEB-33446`@ViewChild()` decorator. Support find usages/rename
BugWEB-35941Angular 2 HTML binding auto-suggest doesn't treat custom components Input() and Output() as relevant
BugWEB-35313Angular - support templates referenced through import statement.
BugWEB-358182018.3 RC - Angular template not recognizing 'undefined' keyword
BugWEB-31760Code completion is broken for variable bindings ("as") in Angular templates
BugWEB-29774AngularJS: don't inject AngularJS in `@` component binding value
BugWEB-35868Type information on template reference variable looks bad
BugWEB-35848Component's properties/methods are not resolved in pug templates
BugWEB-35842Find angular component by selector not working
Node.jsUsabilityWEB-35680node_modules folder is marked as library root after unexcluding
TypeScriptBugWEB-35743Typescript - Implement constructor dialog does not respond to ALT+N (Select none)
BugWEB-35803Error while import date-fns functions in vue-component
BugWEB-35761Typescript: "Create method" incorrectly computes insertion anchor for aliased type literals
DB DiffBugDBE-7320Comparing two schemas fails
Data ViewsUsabilityDBE-7224Data view "Compare with" underscore in tab name is transformed to accelerator in dropdown
Navigation & SearchBugDBE-7303Oracle: navigate to package procedure: DG navigates to the first line instead of the line with procedure declaration
SQL Format and StyleFeatureDBE-2837align create table comments
SQL GeneralFeatureDBE-7268Support Decimal type
SQL HighlightingBugDBE-7282Just alone field is treated as a function
PerformanceDBE-7335Suppression calculation could be faster
User InterfaceFeatureDBE-7214Ability to choose color in data source settings

RubyMine 2018.3 (build 183.4284.145) Release Notes

No subsystemFeatureRUBY-22702Type inference for key parameters
BugRUBY-22783Rubocop doesn't work if installed system-wide
BugRUBY-17628Incorrect processing of method `fail`
BugRUBY-20632inlining: do not remove assignments in method call arguments
BugRUBY-22895Cannot create property for other locales if it's already exist in one locale file
BugRUBY-22873Inline method with assignments ignores values
Code InsightBugRUBY-22760Show class variables in instance method in completion
BugRUBY-22761Show class variables when completing with single `@`
BugRUBY-22944Documentation: fix presentation of anonymous symbol in return values
BugRUBY-22945Documentation: show anonymous superclass correctly
BugRUBY-22738Completion for qualified colon references doesn't include methods
BugRUBY-22734Bolded completion doesn't work in RubyMine
BugRUBY-22917Fix presentation for anonymous Struct/Class/Module
BugRUBY-22853Instance variable completion should show parent name and handle Object and Kernel methods in similar way
BugRUBY-22921Ruby help doesn't handle anonymous symbols properly
BugRUBY-22841cannot complete class variables which start with a capital latter
BugRUBY-22840show completion for instance variables in singleton class methods
BugRUBY-22862Attribute accessor does not highlight
BugRUBY-22803skipBodyAndCompoundStatements StackOverflowError
BugRUBY-22759Don't show locally defined class and instance variables twice
BugRUBY-21995Data flow analysis doesn't seem to consider exit
BugRUBY-22874Irrelevant element name in find usage result for fields
BugRUBY-22883Find usages doesn't work for Struct.new("MyClass")
BugRUBY-22882Cannot rename struct name defined by Struct.new("MyClass")
BugRUBY-22905Instance variables are not shown in completion after @
BugRUBY-22906Сlass of class variable shown in completion as $$SINGLETON$$
CosmeticsRUBY-21319Darcula colour scheme for ruby is inconsistent with other languages
TaskRUBY-20941Refactor ControlFlow for Ruby
DockerBugRUBY-22683IRB Console doesn't work in Docker SDK
EditingFeatureRUBY-22766Add `<% %>` template to erb
BugRUBY-22630Invalid replacement in RSpec's change {}
BugRUBY-22436Unneeded end will be added after Enter when do was retyped
IDEFeatureRUBY-22735Highlight rescue/ensure in begin/end block
FeatureRUBY-22706Add an ability to import the old Darcula color scheme with custom configurations to RubyMine v2018.3
BugRUBY-22976Message that old Darcula was uploaded is not shown
BugRUBY-22727if/Case surrounded with method could be not highlighted
CosmeticsRUBY-22758Set up a different colour for hash keys
InspectionsFeatureRUBY-21437"unnecessary return statement" inspection should be suppressed for a return with multiple values
BugRUBY-22307False positive inspection for ActiveRecord::QueryMethods.where if array is passed
BugRUBY-22822'No such file to load' inspection shows as times as items in not found path
BugRUBY-22694False-positive unreachable code inspection for ||= operator
BugRUBY-23060RubyMine hangs during inspect code analysis
UsabilityRUBY-22763RubyMine highlights entire file with warning underline for a suffixing "."
JRubyBugRUBY-22508JRuby 9.2.0.0 is treated as language version 2.4 instead of 2.5
MarkdownFeatureRUBY-16813Surrounding text with inline markers
FeatureRUBY-22398Header level up/down actions
FeatureRUBY-22116Detach PlantUML library from Markdown plugin distribution and download it on demand
BugRUBY-22982remote images don't work anymore in markdown
BugRUBY-20105Markdown scrolling exception
BugRUBY-22292Markdown editor should better support creating [ links
UsabilityRUBY-22929Rename 'introduce link from text' action
RHTMLBugRUBY-22708False error message "processing instruction not terminated" for php.erb file.
RailsBugRUBY-22858Unknown is shown as title if locale file have not standard abbreviation
BugRUBY-22852Displaying "RUBY_PARAMDEF_CALL" and "RUBY_SPECIFIC_CALL" when highlighting important rails methods
BugRUBY-22854java.lang.AssertionError: Stub count doesn't match stubbed node length
BugRUBY-22965Exception when messing with I18n - this occurred while playing with intention actions around `I18n.t('<caret>foo')`
BugRUBY-22904I18n: Wrong property name when trying to create a property key contains a /
BugRUBY-22626Multilne strings extracted will multiline keys with random indentation
BugRUBY-22911Don't allow extracting strings to i18n in test sources
BugRUBY-22660I18n improve quick documentation - don't show `null`s, empty translations or `internal error`
BugRUBY-22864Rails has many associations do not resolve when the model class is defined multiple times
BugRUBY-22476I18n cannot find usages for keys in a Ruby locale file
PerformanceRUBY-22791Performance issues with I18n (very noticable in large projects, e.g., diaspora, gitlab)
Rails. Code InsightBugRUBY-19385Code completion in AR Migrations doesn't work with Rails 5 (and 4)
BugRUBY-22751Unrelated completion from Active::Records::Persistent::Class Methods is shown for rails association
BugRUBY-22832scope resolution is not working
BugRUBY-22833rails association resolution is failing
RefactoringsBugRUBY-22566AttrAccessors: rename operation affects all declarations with the same name
BugRUBY-22131Inlining not handling keyword parameters defaults correctly
BugRUBY-22314Multi-line comments for block to method extraction
ExceptionRUBY-22635Introduce variable in html.haml throws exception
Ruby Version ManagersBugRUBY-22731RVM sdk is not detected if there is a multi-line environment variable
BugRUBY-22619RubyMine-183.2940.7 critical error
RubyGemsBugRUBY-22709Gem including other gems aren't available for search
TaskRUBY-22831Add usage info statistics on gem versions used
RubyMotionBugRUBY-22794RubyMotion support throws exception on the start of IDE
TestsFeatureRUBY-3161Add gutters for running tests
BugRUBY-22868Oneliner spec tests are not suggested to run in gutter
BugRUBY-22771Gutters are not changed if test was failed
BugRUBY-22839Rerun Failed Tests leads to "Test framework quit unexpectedly"
TaskRUBY-22744Gutters for cucumber tests
TaskRUBY-22725Gutters for minitest tests
YAMLBugRUBY-22915Indexing never stops
BugRUBY-22724After rename i18n property with conflict IDE hangs
No subsystemBugIDEA-201312Recompilation of several modules: compiler caches and output files are out-of-sync if compilation does not complete normally
BugIDEA-201729IntelliJ EAP keeps indexing the same files over and over
BugIDEA-201580Infinite logging loop on IDEA shutdown if there's an exception during IDE close
BugIDEA-200822Opening any Markdown file freezes recent IntelliJ Ultimate EAP 183.3795.13
BugIDEA-200840Exception appears for opened comment after TODO
BugIDEA-200619Maximized window state is not preserved
BugIDEA-202080UI components are not shown in some RC
BugIDEA-201279ctrl-p ctrl-n not working as expected in Webstorm 2018.3 EAP OSX
BugIDEA-201286Linux Native Menu bar: the order of actions in menu can change unexpectedly
BugIDEA-202374Cannot open files after import setting from previous release
BugIDEA-200322Project explorer empty
UsabilityIDEA-200263[Run anything] Window can be resized too small
UsabilityIDEA-179037Last Edit Location List: edits performed in the diff window are not appended to the list
ExceptionIDEA-200374Throwable at com.intellij.openapi.wm.impl.GlobalMenuLinux.lambda$handleEvent$4
Code CoverageExceptionIDEA-199696Code coverage not working in IntelliJ 2018 running on JDK11
Code Formatting and Code StyleBugIDEA-200800Configure indents action from the status bar should open JS code style for JS/JSX files
PerformanceIDEA-200803AWT EventQueue uses 100% CPU in idle when using EditorConfig
Code NavigationFeatureIDEA-200584Goto symbol should allow to navigate to method overrides
BugIDEA-200567Recent edited files popup shows files from another project
BugIDEA-200312UI freeze during Search Everywhere
BugIDEA-200980Navigate / Last Edit Location opens Editor Pane in wrong IDEA instance window
ConsoleBugIDEA-86669Console: support ASCII backspace symbol in console view
Cucumber JVMBugIDEA-201033Unable to run any cucumber file/feature/scenario in ultimate project
BugIDEA-200295StringIndexOutOfBoundsException: Can't extract (9,12) range from '"]"'
DebuggerBugIDEA-201267Color icon is not correct for JBColor objects
BugIDEA-198388Dragging breakpoint clones it instead of moving
BugIDEA-201227Unclear error reporting for sa-jdwp
UsabilityIDEA-121159Pause Program improvement
UsabilityIDEA-200959Speed search in debugger Variables view expands nodes
DockerBugIDEA-178932Docker: "dockerfile detection" description in event log/balloon: the link doesn't work
BugIDEA-188077DockerCompose: Stop doesn't work if node contains any container not from the deployed compose file
BugIDEA-201513Docker-compose: call `restart` instead of `up` when already running service is relaunched from the gutter
BugIDEA-200116Docker: it should be possible to run compose after "down" all the conflict apps with the same names.
BugIDEA-202435Adding Docker requires email that has nowhere to enter
BugIDEA-200763DockerCompose: "Run" by click on service gutter doesn't work if there is no "docker" server
BugIDEA-200684Docker: "Path to compose file required" at running services without established docker connection.
Editor. Editing TextBugIDEA-198767Caret returns to wrong position at the end of the block in java code
BugIDEA-202087Broken indentation (scaling 250% or higher)
BugIDEA-201625Text jitter in editor when tabs are used for indentation (on a fractional-scale monitor on Windows)
BugIDEA-198595Last edit location does not remember changes made in Find in Path
BugIDEA-171789"Last edit location" does not honor changes been made on "Commit changes" window
File SystemPerformanceIDEA-201455Less calls to File.isDirectory in CoreLocalVirtualFile
Find, Replace, Find UsagesFeatureIDEA-69435Search for Multi-line fragment
BugIDEA-199986Find/Replace in Path closes immediately
UsabilityIDEA-180366Find in Path from VCS | Local Changes shall pre-select the selected change list or directory
UsabilityIDEA-167955Find: `Ctrl+F` on selected word doesn't pre-select text in search field if Find bar is open
IDE ConfigurationBugIDEA-200626File and Code Templates preferences section loads infinitely
BugIDEA-200848SDK: Don't add the same SDK some times
JavaBugIDEA-199406Intellij IDEA fails to add JVM 9 or 10 if _JAVA_OPTIONS is set
Java. InspectionsFeatureIDEA-198991Export results of the new duplicates inspection
BugIDEA-200218Lambda can be converted to a method reference
BugIDEA-201636Collection<A>.retainAll(Collection<B>) does not warn about incompatible types
BugIDEA-200685False positive 'Redundant suppression' on 'unchecked'
BugIDEA-201501"Magic Constant" inspection is not triggered for `new GregorianCalendar(int, int, int)` constructor call
JavaEE. Deployment and RunExceptionIDEA-199371NPE by removing/adding artifacts at Deployment tab of run configuration
JavaEE.WebLogicBugIDEA-199911Password Showing in Plain Text in Weblogic Run/Debug Configuration
KubernetesBugIDEA-200606Web view: useless "Kubernetes" item in the context menu
ExceptionIDEA-199970Helm. java.lang.Throwable by calling "Helm template"/ "Helm Dependency update" via keyboard shortcut
Packaging and InstallationBugIDEA-200369Silent Installation: mode=user: if you have no permission to install in the specified folder, installation is finished in the different folder
BugIDEA-200274Silent installation: installation to the wrong folder
BugIDEA-200776Remove dependency from 'extensions' module to 'XStream' library
BugIDEA-200784Uninstall.exe couldn't be launched in some cases.
BugIDEA-200781Sometimes there is no message that this version already installed during the installation
BugIDEA-200342Silent installation: There is no checking if the current version was already installed
BugIDEA-201292Several installations of one version IDE: Problems with Uninstall in Users folders
BugIDEA-182484IntelliJ IDEA restart fails on Windows because of company restrictions
BugIDEA-200843PATH can not be updated. The size is very big.
UsabilityIDEA-182601Silent install could provide some error feedback
UsabilityIDEA-200235No option to disable "Open Folder as <IDE> Project" context menu.
CosmeticsIDEA-200363Silent Installation: It is better to mention in log what was wrong in installation by specific words
TaskIDEA-196699Bundle Kotlin 1.3 with IntelliJ IDEA
TaskIDEA-200752Remove dependency from java.psi.impl to java.resources.en
Password SafeFeatureIDEA-200611Protect master key file using PGP key
BugIDEA-187790Passwords Inaccessible (in Settings->Appearance&Behavior->System Settings-> Passwords )
BugIDEA-200401Auth error on open DB file with [...] button
BugIDEA-200188Password Safe: Set/ChangeMasterPassword actions cause significant delays on Ubuntu
BugIDEA-200375Idea doesn't save password in KeePass database
BugIDEA-174581KeePass storage is wiped if password token does not match.
BugIDEA-200735Password Safe: IDE freezes on opening Settings dialog on Ubuntu
BugIDEA-164296Unable to load library 'secret-1'
BugIDEA-200404Idea change Password Safe option silently on "cancel" in case selected DB is unaccessible
BugIDEA-200849Password Safe: incorrect reaction on custom location setting for the (not existing) KeePass database
Platform APIBugIDEA-200807NPE caused by NonClasspathClassFinder constructor leaking "this"
TaskIDEA-191331Migrate to ASM 6.2
TaskIDEA-158421Document requirements for mac-builder agent
Plugin ManagementBugIDEA-202017Can't install plugin if it contains necessary dependence on another plugin
BugIDEA-202018Old plugin dialog is shown when click on the notification popup
Project ConfigurationBugIDEA-200525ProjectRootManagerComponent does not react properly on roots update
BugIDEA-192893Project file encoding settings: the 'BOM for new UTF-8 files' option settings are not preserved on project reopening
BugIDEA-199667Maven lib versions updated daily
Quick DocumentationFeatureIDEA-199882Support JDK 11 external javadoc folders structure
BugIDEA-202420Opening offline external documentation for JDK 11 does not work
BugIDEA-200711View | External Documentation doesn't work for Java11 classes if documentation url is provided
Run | Debug configurationBugIDEA-197466JDK 11 doesn't have jaxb causing JShell not to load
Task ManagementBugIDEA-168220IDEA freeze up to 1 minute after open "open task" dialog
Template Languages. FreeMarkerBugIDEA-200676Wrong error message for Freemarker <#items> in <#list>
TerminalFeatureIDEA-191464Add environment variable to terminal detect if running in IntelliJ IDES
BugIDEA-155071TERM variable should not be set for windows (cmd) terminals
BugIDEA-201601Sometimes terminal shows broken prompt on IDE startup
BugIDEA-200880Terminal: resize mouse pointer when hovering over "New session" button
BugIDEA-200839Can no longer open specific directory in Terminal
ThymeleafBugIDEA-196788Expression ${user?.name} is not supported in version 2017.3.5
Unit Testing. JUnitBugIDEA-162481Create Test dialog: Fix button disappears when Cancel adding Library
BugIDEA-2006412018.3 EAP + JUnit3: treeview and run order incorrect when TestSuites have same name
BugIDEA-200644"Create Test" dialogue hides non-inherited methods when displaying inherited methods
BugIDEA-198189JUnit tests with the same parent suite, executed out of order, break the tree view
User InterfaceBugIDEA-197106DesktopLayout ConcurrentModificationException on startup
BugIDEA-198135Version control toolwindow is not displayed after Enabling VCS integration
BugIDEA-201446NullPointerException during using 'FindUsages'
BugIDEA-200724IntelliJ IDEA does not fully start after update, ends with window with menubar and nothing else
BugIDEA-151200Ubuntu: Unity menu bar is not available for detached editor tabs and floating tool windows
BugIDEA-201276Linux Native menu: shortcuts disappeared from main menu panel
BugIDEA-200654Search Everywhere not opening file on Linux
BugIDEA-200379Native menu bar on Ubuntu Linux: the View menu actions have incorrect state
UsabilityIDEA-197044Run configuration doesn't fit the screen
ExceptionIDEA-200273Exceptions: GlobalMenuLinux - Unable to register window and AppMenu-service can't register xid
ExceptionIDEA-200919ClassCastException: java.base/jdk.internal.misc.Unsafe cannot be cast to jdk.unsupported/sun.misc.Unsafe
User Interface. AccessibilityBugIDEA-201843NavBar popups are closed on up/down/speed search
BugIDEA-201273Problem with User Agreement Accessibility
BugIDEA-182960Screen Reader Accessibility: Autocomplete
User Interface. ControlsBugIDEA-201124Linux native menu: main menu appears on a toolwindow in windowed mode
User Interface. Look and FeelBugIDEA-200171High Contrast Theme: Editor color scheme remains "High Contrast" after changing theme from "High Contrast" to "Darcula"
User Interface. NavigationBugIDEA-200462New SE: Add statistics
BugIDEA-201937Search Everywhere shortcuts: Ctrl/Shift+Tab shortcuts set for tabs switching do not work if Tab shortcut is set for "Select item" action
BugIDEA-201051New SE: Use "Tab" key for command autocomplete
BugIDEA-201308New SE: Actions descriptions is not shown in status bar
PerformanceIDEA-200920Goto File is slow
Version ControlUsabilityIDEA-199656Changelists should be expanded by default, and should retain the state
Version Control. GitBugIDEA-199761File names with trailing spaces break git diff
BugIDEA-198271Git: Native SSH: if password authentication is used, the password can't be remembered
BugIDEA-200864Update Project doesn't fetch submodules
BugIDEA-192771Git commit partially causes change CRLF to LF.
BugIDEA-201054Git: native SSH: confusing dialog on attempt to connect to (yet) unknown host
UsabilityIDEA-199926Scanning for Git roots in a project should skip known third-party libs locations
UsabilityIDEA-190367Shortcut for git branch by default
Version Control. LogBugIDEA-193814com.intellij.openapi.vcs.VcsException: Index: 1, Size: 1
BugIDEA-198803VCS log shows garbage in "author" field, looks like a corrupted index
CosmeticsIDEA-195976Fix progress bar in VCS Log in darcula
No subsystemFeatureWEB-29005Add support of -webkit-image-set in CSS
FeatureWEB-31391Go to Angular component's HTML template from usage
BugWEB-35223Deadlock on indexing
BugWEB-32711Prettier: support .prettierignore
BugWEB-35425"ActionScript/Flex" diagram is suggested for TypeScript file
ExceptionWEB-35364File processor exception on project close
ExceptionWEB-35460IndexNotReadyException when trying to get qualified name while indexing
CoffeeScriptBugWEB-31789Coffeescript highlight OR= operator error
BugWEB-14981Existential Operator `?` on newline marked as invalid syntax, while invalid `?` usage is not marked
DartBugWEB-35068Dart completion prevents from typing a number literal
UsabilityWEB-28503Possibility to specify Dart Dev Server port for a Web app to facilitate using local storage such as indexeddb
DebuggerBugWEB-35448JS debug is broken (183.3975.9)
BugWEB-35449Debugger stops on first line in a file when debug with js.debugger.use.node.options turned on
BugWEB-35084@angular/cli: duplicated AppComponent in variables | local | this
BugWEB-35613Can't run Node debug session if there mappings for 127.0.0.1 in /etc/hosts
BugWEB-34990Debugger doesn't update breakpoints positions
File WatchersBugWEB-35498Prettier file watcher: opening and closing file chooser changes Program path
HTMLFeatureWEB-34944Add inspection: an HTML element has no title attribute
JSONFeatureWEB-35463Add a checkbox to prefer remote JSON schemas over bundled schemas
FeatureWEB-35323Add "Surround with > quotes / array literal" for JSON
FeatureWEB-35148Add comma when pasting lines into JSON
BugWEB-35493JSON schema validation validates itself
BugWEB-35358JSON: "Surround with > quotes / array literal" doesn't surround several items inside array
BugWEB-35318JSON pointers do not follow proper URL encoding
UsabilityWEB-35385JSON: merge the user whitespace with whitespace auto-inserted by typed handler
JavaScriptBugWEB-34315Error in Javascript inspection and code completion
BugWEB-35419'Copy qualified name' doesn't work for tags in Flow & React projects
BugWEB-35141Flow: CMD-hover type lookup does not work across files
BugWEB-35384Flow: class generic arguments are not supported properly
BugWEB-35565Code completion not working until type definition file is touched
BugWEB-32933Can't resolve sortBy import from lodash
BugWEB-34702"Contents of collection are queried, but never updated" when using ternary operator
BugWEB-35356JavaScript: enable base "navigate to source" for global @types libraries
BugWEB-32337Resolve for property assigned in other scope
BugWEB-35468Support at least explicit substitutions for Flow generics in class constructors
BugWEB-35327Invalid code check warning (false positive): Type boolean is not assignable to type boolean
BugWEB-35550Wrong links to MDN in documentation popup for React APIs
PerformanceWEB-30360Code Analysis, Strange Lagging Bug
PerformanceWEB-353902018.3 EAP6 crash
UsabilityWEB-33854Generate 'switch' cases action improvements
TaskWEB-35079Infer primitive type facts from initializer for javascript
ExceptionWEB-35416IllegalStateException: Calling invokeAndWait from read-action leads to possible deadlock
ExceptionWEB-35658IllegalArgumentException: Argument for @NotNull parameter 'element'
JavaScript. FormatterBugWEB-35220Wrong alignment of html attributes when [] are used
BugWEB-35501No indent on a new line after if after line without semicolon
JavaScript. FrameworksFeatureWEB-35435Improve handling of Angular entities
FeatureWEB-32549Highlight unresolved references in JSX
FeatureWEB-26862Add single step import for ES6 and TypeScript scripts in .vue files
BugWEB-34857Angular: support type evaluation of template references which bind to directives
BugWEB-23647React: provide autocomplete for standard methods
BugWEB-32129Angular: `ng-zorro-antd` directives not resolved
BugWEB-32886Vuetify 1.1 typescript components not resolved
BugWEB-35716Fix Vuetify 1.3.4 components
BugWEB-29827Angular Material: material table structural directives are not recognized when using asterisk notation
BugWEB-35317Space is removed before some attributes in Angular template
BugWEB-35361vue and blade conflict
BugWEB-31647Angular: no completion/resolving for custom directive bindings
BugWEB-35670@vue/cli project creation can't be finished
BugWEB-35672Angular Material - Attribute dataSource is not allowed here
ExceptionWEB-35485Throwable: Invalid file name 'package.json' - unsupported extension: json
JavaScript. InspectionsBugWEB-35399Incorrect inspection "Consecutive commas in array literal" in destructuring assignment
BugWEB-35461Inspections: "Missing required 'alt' attribute" gives false positive in the Vue.js files
BugWEB-35426< > are escaped in Flow when apply inspection
JavaScript. RefactoringFeatureWEB-35341'Convert to named function' intention should work for arrow functions assigned to class fields
BugWEB-35503Typescript arrow function signature refactor loose types
BugWEB-32734Rename for class and file together should always search for the file references
Live EditBugWEB-35736'Elements' tab is empty when debug HTML
Node.jsFeatureWEB-35143Allow to use @types/node for Node.js coding assistance
BugWEB-35413Stepping resumes execution after pause on first breakpoint
BugWEB-35528Can't run vue-cli-service scripts from @vue/cli project
BugWEB-35594Can't enable Code assistance for Node.js if there mappings for 127.0.0.1 in /etc/hosts
BugWEB-35496Cannot enable Node.js coding assistance with IPv6 enabled
BugWEB-34413Detect all node_modules as libraries on startup
BugWEB-35462Folder node_modules is not marked as library root if Data Source configured
PerformanceWEB-34416Do not index symlinks inside node_modules targeting files inside project
UsabilityWEB-35568WSL: ExecutionException when try to debug with incorrect interpreter
TypeScriptFeatureWEB-35377Support non-unit types in union discriminants (TS 3.2)
BugWEB-35459Typescript exports not resolved for imports completion
BugWEB-25990TypeScript: Contents of collection are updated but never queried (destructuring case)
BugWEB-35410"Make private/protected" intention should not be available for the parameters in the arrow functions
BugWEB-35329Improve suggestion Typescript Extract, Exclude types
BugWEB-35345TypeScript getter and setter generation should honor the "Use 'public' modifier" setting
BugWEB-34663Typescript: convert parameters to use object initializer - removes the optionals
BugWEB-35400Incorrect behaviour of "pull member up" refactoring on a method with a decorator
BugWEB-35278Convert to field holding arrow function generates redundant access modifier
BugWEB-35474StackOverflowError on types resolving
BugWEB-34587False positive "Abstract class constructor can be made protected"
BugWEB-31543vue-mixin-decorator doesn't work in Vue files with TypeScript
BugWEB-35505Typescript "arrow to named function" prepend "public" modifier inside module
BugWEB-34100False positive JSMismatchedCollectionQueryUpdate for object literal
BugWEB-35551Import are marked as error when overriding baseUrl in child config
BugWEB-30796path completion in import doesn't work when using path mappings
UsabilityWEB-34564Parameter hints: not clear how to configure for TypeScript
ExceptionWEB-35567Exception while disposing TypeScript service
Unit TestsBugWEB-35512Running Jest tests broken with Jest 24 alpha
BugWEB-35484Navigate to source at failure fails on 'test'
BugWEB-35553Jest RC: set working directory to the closest directory with jest.config.js or package.json
UsabilityWEB-35273When changing run configuration for Jest tests, don't clear out file choice
DB ConsoleBugDBE-7298IndexOutOfBoundsException occurs on opening "Parameters" dialog if there are no parameters in query
DB IntrospectionFeatureDBE-7198DataGrip Should Provide Pattern to functionNamePattern in DatabaseMetaData.getFunctions() call.
BugDBE-7234Unknown system variable 'storage_engine' when trying to connect to MySQL 5.7
BugDBE-7201Uninformative "Project Data Sources: re-sync required"
DB RefactoringBugDBE-7205Default SQL value wrongfully becomes string in "modify table" dialog
IDE GeneralCosmeticsDBE-4250Inconsistent Invalidate Cache / Restart location
SQL CompletionFeatureDBE-2854Automatic alias
FeatureDBE-6989Customisable aliases for tables when auto-completing SQL queries
FeatureDBE-5940don't suggest aliases for table names
BugDBE-5981suggested alias should not have hash sign for temp tables on sql server
BugDBE-2852Setting to select table order in ON-clause
BugDBE-4656Bad completion for window functions
UsabilityDBE-7032Improve completion for joins
Configuration ProblemDBE-5511Can't disable MySQL JOIN alias autocomplete
SQL Format and StyleFeatureDBE-6819Indent-only no-alignment code style (also C-like style)
FeatureDBE-6678Align JOIN under FROM
FeatureDBE-6801Allow to specify elements place separately for each clause in query
FeatureDBE-6798Egypt style for INSERT and subqueries
BugDBE-7236MSSQL: Query hint formatting
BugDBE-7167SQL code style format - Comment
BugDBE-1376SQL Formatting: line break before closing ")"
BugDBE-7220Indent everything between BEGIN TRANSACTION and COMMIT statement MSSQL
SQL GeneralBugDBE-6314limit 1 is not recognized as valid sytax in PL/PgSQL
SQL GenerationBugDBE-7180Several PostgreSQL rule issues with the Source Editor
BugDBE-7195In "Database Changes" window, right-clicking on a single function/view and clicking on "revert" reverts all changed objects!
SQL HighlightingFeatureDBE-3109Please add an inspection for unused field of subquery
SQL RefactoringFeatureDBE-636SQL Intention: Introduce/inline table alias
BugDBE-7178Alias renaming in a view source editor fails to apply changes to all references

RubyMine 2018.3 RC2 (build 183.4284.98) Release Notes

MarkdownBugRUBY-22982remote images don't work anymore in markdown
RailsBugRUBY-22858Unknown is shown as title if locale file have not standard abbreviation
BugRUBY-22965Exception when messing with I18n - this occurred while playing with intention actions around `I18n.t('<caret>foo')`
Ruby Version ManagersBugRUBY-22619RubyMine-183.2940.7 critical error
No subsystemBugIDEA-202080UI components are not shown in some RC
UsabilityIDEA-179037Last Edit Location List: edits performed in the diff window are not appended to the list
Code NavigationBugIDEA-200980Navigate / Last Edit Location opens Editor Pane in wrong IDEA instance window
BugIDEA-200567Recent edited files popup shows files from another project
Editor. Editing TextBugIDEA-198595Last edit location does not remember changes made in Find in Path
BugIDEA-171789"Last edit location" does not honor changes been made on "Commit changes" window
IDE ConfigurationBugIDEA-200848SDK: Don't add the same SDK some times
Plugin ManagementBugIDEA-202017Can't install plugin if it contains necessary dependence on another plugin
BugIDEA-202018Old plugin dialog is shown when click on the notification popup
TerminalBugIDEA-155071TERM variable should not be set for windows (cmd) terminals
User InterfaceUsabilityIDEA-197044Run configuration doesn't fit the screen
User Interface. AccessibilityBugIDEA-201273Problem with User Agreement Accessibility
User Interface. NavigationBugIDEA-201937Search Everywhere shortcuts: Ctrl/Shift+Tab shortcuts set for tabs switching do not work if Tab shortcut is set for "Select item" action
DebuggerBugWEB-35613Can't run Node debug session if there mappings for 127.0.0.1 in /etc/hosts
JavaScript. FrameworksBugWEB-35716Fix Vuetify 1.3.4 components
Live EditBugWEB-35736'Elements' tab is empty when debug HTML
DB ConsoleBugDBE-7298IndexOutOfBoundsException occurs on opening "Parameters" dialog if there are no parameters in query

RubyMine 2018.3 RC1 (build 183.4284.57) Release Notes

No subsystemBugRUBY-22783Rubocop doesn't work if installed system-wide
BugRUBY-22895Cannot create property for other locales if it's already exist in one locale file
Code InsightBugRUBY-22917Fix presentation for anonymous Struct/Class/Module
BugRUBY-22944Documentation: fix presentation of anonymous symbol in return values
BugRUBY-22945Documentation: show anonymous superclass correctly
BugRUBY-22921Ruby help doesn't handle anonymous symbols properly
BugRUBY-22905Instance variables are not shown in completion after @
BugRUBY-22906Сlass of class variable shown in completion as $$SINGLETON$$
DockerBugRUBY-22683IRB Console doesn't work in Docker SDK
EditingBugRUBY-22630Invalid replacement in RSpec's change {}
IDEBugRUBY-22976Message that old Darcula was uploaded is not shown
MarkdownBugRUBY-22292Markdown editor should better support creating [ links
UsabilityRUBY-22929Rename 'introduce link from text' action
RailsBugRUBY-22911Don't allow extracting strings to i18n in test sources
BugRUBY-22864Rails has many associations do not resolve when the model class is defined multiple times
BugRUBY-22904I18n: Wrong property name when trying to create a property key contains a /
Rails. Code InsightBugRUBY-22832scope resolution is not working
BugRUBY-22833rails association resolution is failing
TestsBugRUBY-22839Rerun Failed Tests leads to "Test framework quit unexpectedly"
TaskRUBY-22725Gutters for minitest tests
YAMLBugRUBY-22915Indexing never stops
No subsystemBugIDEA-201279ctrl-p ctrl-n not working as expected in Webstorm 2018.3 EAP OSX
BugIDEA-201312Recompilation of several modules: compiler caches and output files are out-of-sync if compilation does not complete normally
BugIDEA-201729IntelliJ EAP keeps indexing the same files over and over
UsabilityIDEA-200263[Run anything] Window can be resized too small
Code Formatting and Code StyleBugIDEA-200800Configure indents action from the status bar should open JS code style for JS/JSX files
ConsoleBugIDEA-86669Console: support ASCII backspace symbol in console view
DebuggerUsabilityIDEA-200959Speed search in debugger Variables view expands nodes
DockerBugIDEA-201513Docker-compose: call `restart` instead of `up` when already running service is relaunched from the gutter
Editor. Editing TextBugIDEA-201625Text jitter in editor when tabs are used for indentation (on a fractional-scale monitor on Windows)
File SystemPerformanceIDEA-201455Less calls to File.isDirectory in CoreLocalVirtualFile
Java. InspectionsBugIDEA-201501"Magic Constant" inspection is not triggered for `new GregorianCalendar(int, int, int)` constructor call
BugIDEA-201636Collection<A>.retainAll(Collection<B>) does not warn about incompatible types
Packaging and InstallationBugIDEA-201292Several installations of one version IDE: Problems with Uninstall in Users folders
TerminalFeatureIDEA-191464Add environment variable to terminal detect if running in IntelliJ IDES
BugIDEA-201601Sometimes terminal shows broken prompt on IDE startup
User InterfaceBugIDEA-201446NullPointerException during using 'FindUsages'
User Interface. AccessibilityBugIDEA-201843NavBar popups are closed on up/down/speed search
BugIDEA-182960Screen Reader Accessibility: Autocomplete
Version Control. GitBugIDEA-201054Git: native SSH: confusing dialog on attempt to connect to (yet) unknown host
UsabilityIDEA-190367Shortcut for git branch by default
Version Control. LogBugIDEA-198803VCS log shows garbage in "author" field, looks like a corrupted index
CosmeticsIDEA-195976Fix progress bar in VCS Log in darcula
JavaScriptBugWEB-35550Wrong links to MDN in documentation popup for React APIs
BugWEB-32337Resolve for property assigned in other scope
BugWEB-35565Code completion not working until type definition file is touched
PerformanceWEB-30360Code Analysis, Strange Lagging Bug
TaskWEB-35079Infer primitive type facts from initializer for javascript
ExceptionWEB-35658IllegalArgumentException: Argument for @NotNull parameter 'element'
JavaScript. FrameworksFeatureWEB-26862Add single step import for ES6 and TypeScript scripts in .vue files
BugWEB-29827Angular Material: material table structural directives are not recognized when using asterisk notation
BugWEB-32129Angular: `ng-zorro-antd` directives not resolved
BugWEB-35672Angular Material - Attribute dataSource is not allowed here
BugWEB-35670@vue/cli project creation can't be finished
JavaScript. InspectionsBugWEB-35461Inspections: "Missing required 'alt' attribute" gives false positive in the Vue.js files
Node.jsBugWEB-35594Can't enable Code assistance for Node.js if there mappings for 127.0.0.1 in /etc/hosts
PerformanceWEB-34416Do not index symlinks inside node_modules targeting files inside project
UsabilityWEB-35568WSL: ExecutionException when try to debug with incorrect interpreter
TypeScriptFeatureWEB-35377Support non-unit types in union discriminants (TS 3.2)
BugWEB-35505Typescript "arrow to named function" prepend "public" modifier inside module
BugWEB-35551Import are marked as error when overriding baseUrl in child config
ExceptionWEB-35567Exception while disposing TypeScript service
Unit TestsBugWEB-35553Jest RC: set working directory to the closest directory with jest.config.js or package.json
DB IntrospectionFeatureDBE-7198DataGrip Should Provide Pattern to functionNamePattern in DatabaseMetaData.getFunctions() call.
IDE GeneralCosmeticsDBE-4250Inconsistent Invalidate Cache / Restart location
SQL Format and StyleFeatureDBE-6819Indent-only no-alignment code style (also C-like style)
BugDBE-1376SQL Formatting: line break before closing ")"
BugDBE-7220Indent everything between BEGIN TRANSACTION and COMMIT statement MSSQL

RubyMine 2018.3 BETA (build 183.4139.32) Release Notes

No subsystemBugRUBY-22873Inline method with assignments ignores values
BugRUBY-20632inlining: do not remove assignments in method call arguments
Code InsightBugRUBY-22759Don't show locally defined class and instance variables twice
BugRUBY-22853Instance variable completion should show parent name and handle Object and Kernel methods in similar way
BugRUBY-22760Show class variables in instance method in completion
BugRUBY-22761Show class variables when completing with single `@`
BugRUBY-22762Show bolded members in case of fields completion
BugRUBY-22841cannot complete class variables which start with a capital latter
BugRUBY-22840show completion for instance variables in singleton class methods
BugRUBY-22874Irrelevant element name in find usage result for fields
BugRUBY-22862Attribute accessor does not highlight
BugRUBY-22883Find usages doesn't work for Struct.new("MyClass")
BugRUBY-22882Cannot rename struct name defined by Struct.new("MyClass")
InspectionsFeatureRUBY-21437"unnecessary return statement" inspection should be suppressed for a return with multiple values
BugRUBY-22307False positive inspection for ActiveRecord::QueryMethods.where if array is passed
BugRUBY-22822'No such file to load' inspection shows as times as items in not found path
UsabilityRUBY-22763RubyMine highlights entire file with warning underline for a suffixing "."
MarkdownFeatureRUBY-16813Surrounding text with inline markers
FeatureRUBY-22116Detach PlantUML library from Markdown plugin distribution and download it on demand
BugRUBY-20105Markdown scrolling exception
RailsBugRUBY-22852Displaying "RUBY_PARAMDEF_CALL" and "RUBY_SPECIFIC_CALL" when highlighting important rails methods
BugRUBY-22854java.lang.AssertionError: Stub count doesn't match stubbed node length
BugRUBY-22476I18n cannot find usages for keys in a Ruby locale file
PerformanceRUBY-22791Performance issues with I18n (very noticable in large projects, e.g., diaspora, gitlab)
RefactoringsBugRUBY-22566AttrAccessors: rename operation affects all declarations with the same name
BugRUBY-22314Multi-line comments for block to method extraction
BugRUBY-22131Inlining not handling keyword parameters defaults correctly
RubyGemsTaskRUBY-22831Add usage info statistics on gem versions used
TestsBugRUBY-22771Gutters are not changed if test was failed
BugRUBY-22868Oneliner spec tests are not suggested to run in gutter
No subsystemBugIDEA-200322Project explorer empty
Code NavigationFeatureIDEA-200584Goto symbol should allow to navigate to method overrides
DebuggerBugIDEA-201267Color icon is not correct for JBColor objects
BugIDEA-201227Unclear error reporting for sa-jdwp
Editor. Editing TextBugIDEA-198767Caret returns to wrong position at the end of the block in java code
Find, Replace, Find UsagesFeatureIDEA-69435Search for Multi-line fragment
JavaBugIDEA-199406Intellij IDEA fails to add JVM 9 or 10 if _JAVA_OPTIONS is set
Java. InspectionsBugIDEA-200218Lambda can be converted to a method reference
KubernetesExceptionIDEA-199970Helm. java.lang.Throwable by calling "Helm template"/ "Helm Dependency update" via keyboard shortcut
Project ConfigurationBugIDEA-199667Maven lib versions updated daily
Run | Debug configurationBugIDEA-197466JDK 11 doesn't have jaxb causing JShell not to load
Task ManagementBugIDEA-168220IDEA freeze up to 1 minute after open "open task" dialog
TerminalBugIDEA-200880Terminal: resize mouse pointer when hovering over "New session" button
BugIDEA-200839Can no longer open specific directory in Terminal
ThymeleafBugIDEA-196788Expression ${user?.name} is not supported in version 2017.3.5
Unit Testing. JUnitBugIDEA-198189JUnit tests with the same parent suite, executed out of order, break the tree view
BugIDEA-162481Create Test dialog: Fix button disappears when Cancel adding Library
BugIDEA-2006412018.3 EAP + JUnit3: treeview and run order incorrect when TestSuites have same name
User InterfaceBugIDEA-198135Version control toolwindow is not displayed after Enabling VCS integration
User Interface. NavigationBugIDEA-201051New SE: Use "Tab" key for command autocomplete
BugIDEA-201308New SE: Actions descriptions is not shown in status bar
PerformanceIDEA-200920Goto File is slow
Version Control. GitBugIDEA-200864Update Project doesn't fetch submodules
BugIDEA-192771Git commit partially causes change CRLF to LF.
No subsystemFeatureWEB-31391Go to Angular component's HTML template from usage
BugWEB-35425"ActionScript/Flex" diagram is suggested for TypeScript file
BugWEB-32711Prettier: support .prettierignore
ExceptionWEB-35460IndexNotReadyException when trying to get qualified name while indexing
CoffeeScriptBugWEB-14981Existential Operator `?` on newline marked as invalid syntax, while invalid `?` usage is not marked
BugWEB-31789Coffeescript highlight OR= operator error
DebuggerBugWEB-35448JS debug is broken (183.3975.9)
BugWEB-35449Debugger stops on first line in a file when debug with js.debugger.use.node.options turned on
BugWEB-35084@angular/cli: duplicated AppComponent in variables | local | this
File WatchersBugWEB-35498Prettier file watcher: opening and closing file chooser changes Program path
JSONFeatureWEB-35463Add a checkbox to prefer remote JSON schemas over bundled schemas
BugWEB-35493JSON schema validation validates itself
JavaScriptBugWEB-35468Support at least explicit substitutions for Flow generics in class constructors
BugWEB-353902018.3 EAP6 crash
ExceptionWEB-35416IllegalStateException: Calling invokeAndWait from read-action leads to possible deadlock
JavaScript. FormatterBugWEB-35501No indent on a new line after if after line without semicolon
BugWEB-35220Wrong alignment of html attributes when [] are used
JavaScript. FrameworksFeatureWEB-35435Improve handling of Angular entities
FeatureWEB-32549Highlight unresolved references in JSX
BugWEB-31647Angular: no completion/resolving for custom directive bindings
BugWEB-34857Angular: support type evaluation of template references which bind to directives
BugWEB-23647React: provide autocomplete for standard methods
BugWEB-35317Space is removed before some attributes in Angular template
ExceptionWEB-35485Throwable: Invalid file name 'package.json' - unsupported extension: json
JavaScript. InspectionsBugWEB-35426< > are escaped in Flow when apply inspection
BugWEB-35399Incorrect inspection "Consecutive commas in array literal" in destructuring assignment
JavaScript. RefactoringBugWEB-35503Typescript arrow function signature refactor loose types
Node.jsFeatureWEB-35143Allow to use @types/node for Node.js coding assistance
BugWEB-35462Folder node_modules is not marked as library root if Data Source configured
BugWEB-34413Detect all node_modules as libraries on startup
BugWEB-35528Can't run vue-cli-service scripts from @vue/cli project
BugWEB-35496Cannot enable Node.js coding assistance with IPv6 enabled
TypeScriptBugWEB-35459Typescript exports not resolved for imports completion
BugWEB-34663Typescript: convert parameters to use object initializer - removes the optionals
BugWEB-35474StackOverflowError on types resolving
BugWEB-35410"Make private/protected" intention should not be available for the parameters in the arrow functions
BugWEB-35400Incorrect behaviour of "pull member up" refactoring on a method with a decorator
BugWEB-30796path completion in import doesn't work when using path mappings
BugWEB-31543vue-mixin-decorator doesn't work in Vue files with TypeScript
UsabilityWEB-34564Parameter hints: not clear how to configure for TypeScript
Unit TestsBugWEB-35484Navigate to source at failure fails on 'test'
BugWEB-35512Running Jest tests broken with Jest 24 alpha
DB IntrospectionBugDBE-7234Unknown system variable 'storage_engine' when trying to connect to MySQL 5.7
BugDBE-7201Uninformative "Project Data Sources: re-sync required"
DB RefactoringBugDBE-7205Default SQL value wrongfully becomes string in "modify table" dialog
SQL CompletionFeatureDBE-5940don't suggest aliases for table names
UsabilityDBE-7032Improve completion for joins
SQL Format and StyleBugDBE-7236MSSQL: Query hint formatting
BugDBE-7167SQL code style format - Comment
SQL GeneralBugDBE-6314limit 1 is not recognized as valid sytax in PL/PgSQL
SQL HighlightingFeatureDBE-3109Please add an inspection for unused field of subquery
SQL RefactoringFeatureDBE-636SQL Intention: Introduce/inline table alias

RubyMine 2018.3 EAP8 (build 183.3975.22) Release Notes

No subsystemFeatureRUBY-22702Type inference for key parameters
FeatureRUBY-22398Header level up/down actions
BugRUBY-17628Incorrect processing of method `fail`
Code InsightBugRUBY-21995Data flow analysis doesn't seem to consider exit
BugRUBY-22803skipBodyAndCompoundStatements StackOverflowError
BugRUBY-22738Completion for qualified colon references doesn't include methods
BugRUBY-22734Bolded completion doesn't work in RubyMine
TaskRUBY-20941Refactor ControlFlow for Ruby
EditingFeatureRUBY-22766Add `<% %>` template to erb
BugRUBY-22436Unneeded end will be added after Enter when do was retyped
IDEFeatureRUBY-22735Highlight rescue/ensure in begin/end block
BugRUBY-22727if/Case surrounded with method could be not highlighted
InspectionsBugRUBY-22694False-positive unreachable code inspection for ||= operator
RailsBugRUBY-22660I18n improve quick documentation - don't show `null`s, empty translations or `internal error`
BugRUBY-22626Multilne strings extracted will multiline keys with random indentation
Rails. Code InsightBugRUBY-22751Unrelated completion from Active::Records::Persistent::Class Methods is shown for rails association
BugRUBY-19385Code completion in AR Migrations doesn't work with Rails 5 (and 4)
Ruby Version ManagersBugRUBY-22731RVM sdk is not detected if there is a multi-line environment variable
RubyGemsBugRUBY-22709Gem including other gems aren't available for search
RubyMotionBugRUBY-22794RubyMotion support throws exception on the start of IDE
YAMLBugRUBY-22724After rename i18n property with conflict IDE hangs
No subsystemBugIDEA-200822Opening any Markdown file freezes recent IntelliJ Ultimate EAP 183.3795.13
BugIDEA-200840Exception appears for opened comment after TODO
BugIDEA-200619Maximized window state is not preserved
ExceptionIDEA-200374Throwable at com.intellij.openapi.wm.impl.GlobalMenuLinux.lambda$handleEvent$4
Code CoverageExceptionIDEA-199696Code coverage not working in IntelliJ 2018 running on JDK11
Code Formatting and Code StylePerformanceIDEA-200803AWT EventQueue uses 100% CPU in idle when using EditorConfig
Code NavigationBugIDEA-200312UI freeze during Search Everywhere
DebuggerBugIDEA-198388Dragging breakpoint clones it instead of moving
UsabilityIDEA-121159Pause Program improvement
DockerBugIDEA-178932Docker: "dockerfile detection" description in event log/balloon: the link doesn't work
BugIDEA-188077DockerCompose: Stop doesn't work if node contains any container not from the deployed compose file
BugIDEA-200763DockerCompose: "Run" by click on service gutter doesn't work if there is no "docker" server
BugIDEA-200116Docker: it should be possible to run compose after "down" all the conflict apps with the same names.
BugIDEA-200684Docker: "Path to compose file required" at running services without established docker connection.
Find, Replace, Find UsagesBugIDEA-199986Find/Replace in Path closes immediately
UsabilityIDEA-180366Find in Path from VCS | Local Changes shall pre-select the selected change list or directory
UsabilityIDEA-167955Find: `Ctrl+F` on selected word doesn't pre-select text in search field if Find bar is open
Java. InspectionsFeatureIDEA-198991Export results of the new duplicates inspection
BugIDEA-200685False positive 'Redundant suppression' on 'unchecked'
JavaEE. Deployment and RunExceptionIDEA-199371NPE by removing/adding artifacts at Deployment tab of run configuration
JavaEE.WebLogicBugIDEA-199911Password Showing in Plain Text in Weblogic Run/Debug Configuration
KubernetesBugIDEA-200606Web view: useless "Kubernetes" item in the context menu
Packaging and InstallationBugIDEA-200274Silent installation: installation to the wrong folder
BugIDEA-200342Silent installation: There is no checking if the current version was already installed
BugIDEA-200776Remove dependency from 'extensions' module to 'XStream' library
BugIDEA-182484IntelliJ IDEA restart fails on Windows because of company restrictions
BugIDEA-200369Silent Installation: mode=user: if you have no permission to install in the specified folder, installation is finished in the different folder
BugIDEA-200843PATH can not be updated. The size is very big.
UsabilityIDEA-182601Silent install could provide some error feedback
UsabilityIDEA-200235No option to disable "Open Folder as <IDE> Project" context menu.
CosmeticsIDEA-200363Silent Installation: It is better to mention in log what was wrong in installation by specific words
TaskIDEA-200752Remove dependency from java.psi.impl to java.resources.en
Password SafeFeatureIDEA-200611Protect master key file using PGP key
BugIDEA-200188Password Safe: Set/ChangeMasterPassword actions cause significant delays on Ubuntu
BugIDEA-164296Unable to load library 'secret-1'
BugIDEA-187790Passwords Inaccessible (in Settings->Appearance&Behavior->System Settings-> Passwords )
BugIDEA-200375Idea doesn't save password in KeePass database
BugIDEA-174581KeePass storage is wiped if password token does not match.
BugIDEA-200404Idea change Password Safe option silently on "cancel" in case selected DB is unaccessible
BugIDEA-200401Auth error on open DB file with [...] button
BugIDEA-200735Password Safe: IDE freezes on opening Settings dialog on Ubuntu
BugIDEA-200849Password Safe: incorrect reaction on custom location setting for the (not existing) KeePass database
Platform APITaskIDEA-158421Document requirements for mac-builder agent
Project ConfigurationBugIDEA-192893Project file encoding settings: the 'BOM for new UTF-8 files' option settings are not preserved on project reopening
BugIDEA-200525ProjectRootManagerComponent does not react properly on roots update
Unit Testing. JUnitBugIDEA-200644"Create Test" dialogue hides non-inherited methods when displaying inherited methods
User InterfaceBugIDEA-197106DesktopLayout ConcurrentModificationException on startup
BugIDEA-200379Native menu bar on Ubuntu Linux: the View menu actions have incorrect state
BugIDEA-200654Search Everywhere not opening file on Linux
BugIDEA-200724IntelliJ IDEA does not fully start after update, ends with window with menubar and nothing else
ExceptionIDEA-200919ClassCastException: java.base/jdk.internal.misc.Unsafe cannot be cast to jdk.unsupported/sun.misc.Unsafe
User Interface. NavigationBugIDEA-200462New SE: Add statistics
Version ControlUsabilityIDEA-199656Changelists should be expanded by default, and should retain the state
Version Control. GitBugIDEA-199761File names with trailing spaces break git diff
BugIDEA-198271Git: Native SSH: if password authentication is used, the password can't be remembered
UsabilityIDEA-199926Scanning for Git roots in a project should skip known third-party libs locations
Version Control. LogBugIDEA-193814com.intellij.openapi.vcs.VcsException: Index: 1, Size: 1
No subsystemFeatureWEB-29005Add support of -webkit-image-set in CSS
BugWEB-35223Deadlock on indexing
DartBugWEB-35068Dart completion prevents from typing a number literal
UsabilityWEB-28503Possibility to specify Dart Dev Server port for a Web app to facilitate using local storage such as indexeddb
DebuggerBugWEB-34990Debugger doesn't update breakpoints positions
HTMLFeatureWEB-34944Add inspection: an HTML element has no title attribute
JSONFeatureWEB-35323Add "Surround with > quotes / array literal" for JSON
BugWEB-35358JSON: "Surround with > quotes / array literal" doesn't surround several items inside array
BugWEB-35318JSON pointers do not follow proper URL encoding
UsabilityWEB-35385JSON: merge the user whitespace with whitespace auto-inserted by typed handler
JavaScriptBugWEB-34315Error in Javascript inspection and code completion
BugWEB-32933Can't resolve sortBy import from lodash
BugWEB-34702"Contents of collection are queried, but never updated" when using ternary operator
BugWEB-35356JavaScript: enable base "navigate to source" for global @types libraries
BugWEB-35327Invalid code check warning (false positive): Type boolean is not assignable to type boolean
BugWEB-35384Flow: class generic arguments are not supported properly
UsabilityWEB-33854Generate 'switch' cases action improvements
JavaScript. FrameworksBugWEB-32886Vuetify 1.1 typescript components not resolved
BugWEB-35361vue and blade conflict
JavaScript. RefactoringFeatureWEB-35341'Convert to named function' intention should work for arrow functions assigned to class fields
BugWEB-32734Rename for class and file together should always search for the file references
Node.jsBugWEB-35413Stepping resumes execution after pause on first breakpoint
TypeScriptBugWEB-35345TypeScript getter and setter generation should honor the "Use 'public' modifier" setting
BugWEB-25990TypeScript: Contents of collection are updated but never queried (destructuring case)
BugWEB-34100False positive JSMismatchedCollectionQueryUpdate for object literal
BugWEB-35329Improve suggestion Typescript Extract, Exclude types
BugWEB-34587False positive "Abstract class constructor can be made protected"
BugWEB-35278Convert to field holding arrow function generates redundant access modifier
SQL CompletionFeatureDBE-2854Automatic alias
FeatureDBE-6989Customisable aliases for tables when auto-completing SQL queries
BugDBE-5981suggested alias should not have hash sign for temp tables on sql server
BugDBE-2852Setting to select table order in ON-clause
BugDBE-4656Bad completion for window functions
Configuration ProblemDBE-5511Can't disable MySQL JOIN alias autocomplete
SQL GenerationBugDBE-7180Several PostgreSQL rule issues with the Source Editor
BugDBE-7195In "Database Changes" window, right-clicking on a single function/view and clicking on "revert" reverts all changed objects!
SQL RefactoringBugDBE-7178Alias renaming in a view source editor fails to apply changes to all references

RubyMine 2018.3 EAP7 (build 183.3795.22) Release Notes

No subsystemTaskRUBY-22432Add tests for changing folding state on key change
Code InsightCosmeticsRUBY-21319Darcula colour scheme for ruby is inconsistent with other languages
IDECosmeticsRUBY-22758Set up a different colour for hash keys
JRubyBugRUBY-22508JRuby 9.2.0.0 is treated as language version 2.4 instead of 2.5
ParsingTaskRUBY-22136Wrong building of ASTree in case of many rescues
Rails. Code InsightBugRUBY-22570Inferred types of methods after rails scopes are not shown in completion
RefactoringsFeatureRUBY-22427Introduce substring for heredoc
TestsTaskRUBY-22725Gutters for minitest tests
TaskRUBY-22744Gutters for cucumber tests
No subsystemBugIDEA-200366No way to configure Run Configuration Templates for a new projects in non-IDEA IDEs
Code Analysis. InspectionBugIDEA-200236False positive: 'Redundant Suppression' warns for foreign suppressions
BugIDEA-200142Deadlock in Inspection tree view
BugIDEA-200207InconsistentLineSeparators false positives on regexp values that have line-end values
Cucumber JVMBugIDEA-200295StringIndexOutOfBoundsException: Can't extract (9,12) range from '"]"'
BugIDEA-196365Don't suggest to run "All Features" on a Java package in Java module
DebuggerFeatureIDEA-139757Shortcut for removing all breakpoints
DockerBugIDEA-187414DockerCompose: The parent docker-compose node has "container" icon in case of some deploys from one folder
BugIDEA-199274DockerView: NPE at choosing a service without published ports
PerformanceIDEA-189747Docker loads YAML file AST when computing icon
Editor. Editing TextBugIDEA-196929Cannot copy text while IntelliJ is indexing
BugIDEA-198539"underscored" and "strikeout" effects not rendering
UsabilityIDEA-199375Parameter info (Ctrl+P) does not recognize array parameter as a vararg
Find, Replace, Find UsagesExceptionIDEA-198437NPE at com.intellij.structuralsearch.plugin.ui.filters.FilterPanel.initFilters
JSONUsabilityIDEA-195016Kubernetes: Json. Completion for "integer" types should be with space before comma
JavaTaskIDEA-200277Get rid of access to package-private members in platform modules from java support modules
Java. InspectionsFeatureIDEA-200232Support numeric casts in dataflow
FeatureIDEA-200056Redundant semicolon: Add an option to ignore trailing semicolons in enums
BugIDEA-200018"Overly broad 'catch' block" inspection incorrectly highlights Exception/Throwable when "Ignore exceptions which hide others..." is ticked.
BugIDEA-200364Checking equality between int and double confuses "Constant condition and exception" inspection
BugIDEA-200233Wrong inspection with compire two objects
BugIDEA-200137"Replace with 'try' with resources" produces uncompilable source
BugIDEA-195991"Collapse catch blocks" loses comment
UsabilityIDEA-200178Double negation should not warn on invalid code
ExceptionIDEA-200194`UastPatterns.isPropertyAssignCall` is recursive for `PsiLiteralExpression` leading to the StackOverflowError
Java. Intention ActionsBugIDEA-200209"Replace with findFirst" produces incompilable code
JavaEE.GlassfishFeatureIDEA-194916Unable to choose deploy order for glassfish
BugIDEA-196097'Use custom context root' does not work for deployment EAR application to GlassFish in IntelliJ IDEA Server Run Configuration
Packaging and InstallationBugIDEA-200274Silent installation: installation to the wrong folder
UsabilityIDEA-182601Silent install could provide some error feedback
TaskIDEA-200437Use correct product code when IDE is started from sources
Plugin DevelopmentFeatureIDEA-197972DevKit: add checks from PluginVerifier (plugins.jetbrains.com) to plugin.xml inspection
Plugin ManagementUsabilityIDEA-126874Settings | Plugins have poor keyboard navigation
Quick DocumentationFeatureIDEA-199882Support JDK 11 external javadoc folders structure
BugIDEA-199409UI freezes: Documentation popup loads images from network on UI thread
ExceptionIDEA-199780Quick Doc: Throwable on 'Edit source' in read-only files
ExceptionIDEA-199046NPE at pressing edit in the quick documentation
Run | Debug configurationBugIDEA-198525[Run Anything] when running saved configuration via run anything, it becomes unsaved
SQLBugIDEA-112933Criminal autoindentation on SQL code
Structural Search and ReplaceBugIDEA-200398Structural search doesn't find all constructor calls
TerminalBugIDEA-200294Context actions on terminal tabs not working consistently
User InterfacePerformanceIDEA-199779Make generated icons lazy
UsabilityIDEA-200298Show the first unsubmitted error when clicking on the "Fatal Error" icon in the status bar
UsabilityIDEA-153071Settings > Version Control > Confirmation window resize issues
TaskIDEA-188160Make terminal tabs the same as other tool window tabs
ExceptionIDEA-200273Exceptions: GlobalMenuLinux - Unable to register window and AppMenu-service can't register xid
User Interface. AccessibilityBugIDEA-200351can't escape diff dialog when screen reader is enabled
User Interface. Look and FeelBugIDEA-183573printing a PHP source always encases the text in a background color (Darcula)
BugIDEA-200278Background in editor doesn't change according to color scheme
BugIDEA-200171High Contrast Theme: Editor color scheme remains "High Contrast" after changing theme from "High Contrast" to "Darcula"
Version Control. GitBugIDEA-200448VCS Git "Fetch" does not refresh the VCS "Log" view
CSSBugWEB-35230CSS formatting: 'Keep single-lines blocks' option affects blank lines
BugWEB-10143Code readability in css color preview
BugWEB-35249'Rearrange Code' action messes up CSS file if it contains import
UsabilityWEB-35013Sort CSS properties: restore default custom order
JSONFeatureWEB-34618Duplicate JSON keys inspection should provide navigate to duplicate as a quick fix
FeatureWEB-35148Add comma when pasting lines into JSON
BugWEB-35303'rulesDirectory' in tslint has two possible type variants, but we suggest only array in code completion
BugWEB-35302Incorrect type detection for TSLint 'rules' in JSON code completion
JavaScriptFeatureWEB-35103Completion for overrides with full bodies should work in object literals
BugWEB-30363JQuery + RequireJS $.each() and $.ele.children() unresolved
BugWEB-30290Some JS intentions break code formatting when invoked
BugWEB-35115invalid "variable might not have been initialized" inspection for destructuring assignment, should be a syntax error
BugWEB-35191"Type mismatch" inspection: false positive when using `return;`
BugWEB-34212JS/ES6: Inspection issue: Contents of collection are updated, but never queried
BugWEB-30683Add patterns to allow configuring language injection in JSX tags
BugWEB-35141Flow: CMD-hover type lookup does not work across files
BugWEB-35253Generating overrides doesn't respect generator methods
BugWEB-25867Resolve webpack built-in plugins
BugWEB-35017Autocomplete for class properties of templated data structures does not work if defined above 'class' declaration
BugWEB-35243Completion for overrides: place caret inside the method body
BugWEB-34936False "Method expression is not of Function type" type mismatch
BugWEB-35274Provide quick documentation for arrow function parameters, where referenced within the function
PerformanceWEB-35280High memory usage while working with JS
UsabilityWEB-35200Unclosed comment ending with a new line is not highlighted with underwave
ExceptionWEB-35047periodic PsiInvalidElementAccessException when editing js
JavaScript. FrameworksBugWEB-35297Project template dropdown should be disabled when creating vue application via @vue/cli3
JavaScript. InspectionsBugWEB-35179Rider suggests broken code fix.
Node.jsUsabilityWEB-35031Do not auto-exclude `dist` within node module folder if there are `module` or `esnext` keys referencing files from `dist`
TypeScriptBugWEB-35178Typescript: generate constructor omits optional parameter specifier when used with React
BugWEB-35263Typescript. Go to declaration broken for the field of union type.
BugWEB-35181Unneeded 'Invalid instanceof check' warning when strictNullChecks enabled
BugWEB-35125StackOverflowError at JSTypeEvaluator.addTypeFromElementResolveResult()
BugWEB-35252Code completion for overrides shouldn't insert 'super.' when base type is an interface
BugWEB-35240Add Import statement: missing "from" keyword when import path is already there
BugWEB-35277Private methods should not be in the completion list for inherited classes
BugWEB-35254Code completion for overrides should properly handle access modifiers
Unit TestsFeatureWEB-24245Ability to specify suite name when running protractor tests
BugWEB-35242running tests assumes Jest supports --runTestsByPath
DB IntrospectionBugDBE-7150Triggers not showing for MariaDB ver. 10.1.34
SQL CompletionBugDBE-6536Inapplicable autocomplete suggestions - table ailas after table alias
BugDBE-5654Duplicates in completion
UsabilityDBE-6450Remove SELF argument from autocomplete prarmeter list of PLSQL Object type method
SQL GeneralFeatureDBE-3275Fold multiple values in IN operator
BugDBE-7143Auto-created folding regions are un-folded on file re-open
BugDBE-5325Code Folding > Expand All requires repeating the action two times

RubyMine 2018.3 EAP6 (build 183.3647.23) Release Notes

No subsystemTaskRUBY-20876Support remote sdks
Code InsightFeatureRUBY-8880YARD @option tag support
BugRUBY-22593An exception is thrown on an attempt to create an accessor method for an instance variable
BugRUBY-22677Don't accept invalid results by default when resolving symbols
IDEFeatureRUBY-17627Highlight else/when keywords in if/case clauses
MarkdownBugRUBY-22552MarkDown Preview is Blank
RailsBugRUBY-22250Rails associations in file structure popup are missing names
BugRUBY-22650I18n "Undo Undefined" for undoing a "Create proprety" action
BugRUBY-19351File Structure Popup for Active Record Should Show Named Scopes
BugRUBY-22623Counter is started from 1 instead of 0
UsabilityRUBY-22389Update the I18n String Value action name
Rails. Code InsightBugRUBY-22688Improve presentation of scopes&associations in case of empty/variable name
BugRUBY-22636Reduce memory consumption for RubyMine I18n subsystem
Rails. Project ViewBugRUBY-22634Run actions generating new files throws exception
RefactoringsBugRUBY-22617Wrong "arguments to a parameter" extraction
SlimBugRUBY-22510Rubymine 2018.2.2 Hung up after opening a project
No subsystemFeatureIDEA-198897Parameter hints: Smart argument completion should insert comma if selected signature has more arguments
BugIDEA-199785CloudSettings plugin doesn't work with fresh versions of IDE
BugIDEA-199869"Scope" dialog's "path" section cannot be made any smaller
UsabilityIDEA-179037Last Edit Location List: edits performed in the diff window are not appended to the list
ExceptionIDEA-149660IAE at com.intellij.configurationStore.StateStorageManagerImpl.expandMacro
ExceptionIDEA-199921com.intellij.util.Alarm - Assertion failed: Already disposed
ExceptionIDEA-199679AE at com.intellij.ide.plugins.newui.RestartButton.lambda$null$0
ArquillianBugIDEA-143282JBoss Arquillian + IPR project format: IAE at StateStorageManagerImpl.expandMacros()
Code Analysis. InspectionBugIDEA-89120AccessToStaticFieldLockedOnInstance inspection incorrectly fires on final threadsafe fields
Code. GenerateBugIDEA-200057IntelliJ IDEA Ultimate 2018.2 toString() code generation uses super class private fields instead of getters
Cucumber JVMBugIDEA-199217Cucumber expression doesn't match step def with additional JVM parameter type
BugIDEA-199218IDEA doesn't find step definition when Optional or Alternative text or Escaping used in step definition
BugIDEA-199325Navigate from Parameter Type usage to its definition
BugIDEA-199326Complete Parameter Type with Template
DebuggerFeatureIDEA-199822Create extension point to provide captured stack frames by e.g. evaluation expression in debugged jvm
DockerBugIDEA-199410NPE while selecting "pull image" from docker tool window
Editor. Code CompletionFeatureIDEA-199722Can I make the live template appear at the top of the code completion list?
Editor. Editing TextBugIDEA-200103Overload switching doesn't work for vararg methods
BugIDEA-198595Last edit location does not remember changes made in Find in Path
BugIDEA-198893Parameter info hints: exception on undo
BugIDEA-171789"Last edit location" does not honor changes been made on "Commit changes" window
BugIDEA-199909'Jump outside closing bracket/quote with Tab' not working for method call closing parenthesis when parameter info tooltip is displayed
UsabilityIDEA-198598"Split line" does not work for multiline TODOs
Find, Replace, Find UsagesUsabilityIDEA-173010Rerun is greyed out in Find Occurrences, results are collapsed by default
JSPBugIDEA-199851Double "<" when editing a JSP
JavaFeatureIDEA-199888Make Postfix Template "not" more smart, replace "Optional.isPresent" with Java 11 "isEmpty"
Java. Code FormattingFeatureIDEA-119282Remove blank line between header and package declaration
Java. InspectionsFeatureIDEA-199799Inspection 'Objects.equals() can be replaced with equals()' should be aware of primitives too
FeatureIDEA-200005Suggest to use Files.readString/writeString since Java11
FeatureIDEA-199811Ability to extract statements from while condition and if condition/return/lambda with &&-chain
FeatureIDEA-199810Add a intention that highlights use of `this:method` in a loop as a performance risk
FeatureIDEA-200143Support compound assignment in dataflow
BugIDEA-198626"Inner class may be static" false positive on nested inner classes
BugIDEA-194678Good code is yellow : unchecked method invocation
BugIDEA-146785'Replace tail recursion with iteration' action leaves empty 'else' -block
BugIDEA-200021Red code after applying 'Fix all 'Constant conditions and exception' problems in the file' with multiple case labels
BugIDEA-200094Data flow analysis inspection ("collection always empty") produces different code when applied
BugIDEA-200030Quick-fix to remove unreachable should remove body only if previous branch has 'break' at the end
BugIDEA-200045"Condition is always false" cannot into comparisons
Java. Intention ActionsFeatureIDEA-177132Expand the refactoring "Join declaration and assignment"
UsabilityIDEA-199910'Expand static import' is missing at the end of import
Packaging and InstallationFeatureIDEA-184006Add log for win installations.
Password SafeBugIDEA-165257KeePass OVERWRITES existing database instead of appending or prompting!?
Platform APIBugIDEA-199978Support several find-usages-providers
BugIDEA-199797ProgressDialog#myDisableCancelAlarm won't fire for a modal progress bar
Plugin ManagementBugIDEA-195202Plugins: delete action
UsabilityIDEA-197334Completion is not aligned with word start in plugin dialog
Project ConfigurationPerformanceIDEA-199732Icons for downloadable library types are synchronously loaded on start
Quick DocumentationBugIDEA-198297Quick Documentation popup is sometimes placed off screen
CosmeticsIDEA-163805documentation jumps with ctrl down
Run | Debug configurationBugIDEA-155610ModuleBasedConfiguration.createInstance() may produce wrong custom 'cloning'
BugIDEA-195693Context help shows 404 page when invoked for a run configuration which don't have special help page
SQLFeatureIDEA-115461SQL code style: Improve formatting for ON DUPLICATE KEY UPDATE
User InterfaceBugIDEA-197106DesktopLayout ConcurrentModificationException on startup
BugIDEA-94851Icons: Griffon icons missing
BugIDEA-178171intention settings: description editor is too small
UsabilityIDEA-199392Incorrect menu spacing on macOS
TaskIDEA-196095Update icons for Build tool window statuses
TaskIDEA-197166Increase click and hover zones for the close button for Manage Recent Projects popup and Welcome Screen
User Interface. AccessibilityBugIDEA-199219tables in dialogs not accessible
TaskIDEA-195260UI element with line numbers and debugging graphic not accessible to screen readers
User Interface. NavigationFeatureIDEA-184492"File..." action is suggesting folders
BugIDEA-199862No selection until search is not finished
BugIDEA-199757Fuzzy search works with folders only if slash filled in
BugIDEA-199664[Run config in the new SE] hints to run or to debug configuration are mixed with each other and should be vice versa
UsabilityIDEA-198002New SE: part of the popup is outside the screen
CosmeticsIDEA-199666[Run config in the new SE] run config name and hints doesn't change a font color to white when is selected
Version ControlBugIDEA-198676TODO appears in list several times on 'Review TODO' with selected 'Check TODO'
PerformanceIDEA-199583Files affected by revision is slow when invoked from annotation markers
ExceptionIDEA-200051IllegalStateException: Cannot find content provider for vcs hg4idea
Version Control. GitBugIDEA-200107Exception when invoke Default Settings from Welcome screen
BugIDEA-199969Git: .gitignore is created in the project root on git repository creating in one of its subfolders
BugIDEA-199966Git: .gitignore created on enabling git in project should not contain absolute paths
Version Control. LogFeatureIDEA-199867Support Back and Forward navigation in VCS Log
FeatureIDEA-130845Log: add action to go-to-parent and go-to-child
XMLFeatureIDEA-199839Support deprecation in xsd schemas
No subsystemFeatureWEB-25165Provide ability to pass command line args to protractor
CSSFeatureWEB-35114Stylesheet languages code style: add an option to control blank lines around nested selectors.
BugWEB-34825Emmet in stylesheet comments
UsabilityWEB-35153Group code style pages for style sheet languages in Settings
TaskWEB-35196No reason to have different code style settings for CSS and PostCSS
DartBugWEB-35159'itar' live template works wrong in Dart if var i is already used
DebuggerBugWEB-35218Can't debug Node.js: path no program files is considered as incorrect
HTMLBugWEB-35129Add inspection. A table without summary attribute
JSONFeatureWEB-35058JSON: Support $id property properly (resolve $ref-s with id, navigate, etc.)
BugWEB-35121JSON Schema: incorrect oneOf branch selection - at least one should be always selected
JavaScriptFeatureWEB-30855No autocomplete for flow's $ReadOnly types
BugWEB-35113'Generate' creates body with return in pure JS if implementing TS method with 'void' return type
BugWEB-34768forEach to for...of intention bugs
BugWEB-35136Trailing comma in dynamic import gives spurious syntax error
BugWEB-32396Flow core library global type definitions are not exposed to the IDE
JavaScript. FormatterFeatureWEB-28679Add an option to treat lambda fields as methods when rearranging code
BugWEB-35074JSX state object misaligned
JavaScript. FrameworksFeatureWEB-35156Language completion for script and style tags in Vue templates
BugWEB-26886Support controller variable for Angular 1.5 components
BugWEB-34471Optionally add `.vue` extension when auto-importing Vue components
BugWEB-20676AngularJS: 'controllerAs' reference is not resolved in templates
JavaScript. InspectionsCosmeticsWEB-34829Missing module inspection: show npm install quick fix first
JavaScript. RefactoringBugWEB-35149'Convert function to variable holding arrow/ function expression' should check and declare 'const' var if possible
ExceptionWEB-34218Changing signature of method in agular templates produces the exception
LintersFeatureWEB-25697ESLint / TSLint does not respect Editor Inspection severity level color formatting
BugWEB-22548ESLint: use the severity specified in .eslintrc for offline inspections
Node.jsFeatureWEB-35204TypeScript: enable "navigate to source" for node core libraries
FeatureWEB-34226Use NODE_OPTIONS for Node.js debugging
SASSFeatureWEB-6006Would like formatting options for SCSS
FeatureWEB-20279Better code style for .scss .sass files
BugWEB-35182File Watchers: update default sass command
TypeScriptBugWEB-33285Spread of 'any'/'unknown' should result in 'any'/'unknown'
BugWEB-34463"Cannot read property 'CommandTypes' of undefined" when starting angular service with non-bundled typescript 3.0.1
BugWEB-34878Red icon is shown on the TypeScript tool window name when there's no errors
TaskWEB-35105TypeScript: check limit for completion result (for avoiding processing extra-elements)
Unit TestsFeatureWEB-35177Single suite / test run with Protractor
FeatureWEB-33201Rerun failed protractor tests
FeatureWEB-35142Single test file run with Protractor
BugWEB-34073Mark tests in 'e2e' folder as protractor tests

RubyMine 2018.3 EAP5 (build 183.3283.7) Release Notes

No subsystemBugRUBY-22615StackOverflowError in RubyDeadCodeInspection
BugRUBY-22613Incorrect type inference in if mod statements if condition changes variable
InspectionsBugRUBY-22565Named struct: cannot find reference inspection
BugRUBY-22505Incorrect inspection of ->(x) {} parameters
JRubyBugRUBY-22492Incorrect ruby level passing to the shims-based gem scripts
MarkdownFeatureRUBY-22594Allow disabling automatic injection in markdown completely
ParsingBugRUBY-22406Incorrect parsing of if modifier
RailsBugRUBY-22375I18n add support for multiple possible keys
BugRUBY-22538I18n rename key - possible to rename to existing key
Rails. Code InsightBugRUBY-22501Add missing magic method stubs for associations
RefactoringsFeatureRUBY-4811Safe delete in i18n
BugRUBY-22410Introduce substring with integer operation causes invalid code
BugRUBY-22409Possible to extract substring from single quoted string if replace occurrences indirectly
ExceptionRUBY-22563Extract parameter throws exception 'Refactorings should be invoked inside transaction'
Ruby Version ManagersBugRUBY-22619RubyMine-183.2940.7 critical error
No subsystemFeatureIDEA-132487External annotations for java third party libraries
FeatureIDEA-98563Run Configurations: provide a default option for 'Single instance only' setting under Defaults node.
BugIDEA-130726Configure global external annotations
BugIDEA-199646Input dialog should be displayed only when there is $Prompt$ in run configuration arguments
ExceptionIDEA-199439ISE at com.intellij.ide.hierarchy.HierarchyBrowserBaseEx.$$$reportNull$$$0
Clouds.OpenShiftBugIDEA-199187OpenShift: Project dropdown is empty, so it is not possible to save run config
BugIDEA-199186OpenShift: Parameters area is too small
Code Analysis. DependenciesBugIDEA-199212ArrayIndexOutOfBoundsException during Dependency Matrix Analysis
Code Analysis. InspectionFeatureIDEA-142026Add inspection for Math.min(a, a) and Math.max(a,a)
BugIDEA-194226Reset inspection options in Settings isn't saved
BugIDEA-157566NPE at applying quickfix 'Comment out' to unused class
UsabilityIDEA-97605Serializable/Deserializable/Cloneable class in secure context inspections shall have an option to ignore some class hierarchies
Code CoverageBugIDEA-199411Update JaCoCo to support Java 11
DebuggerBugIDEA-199545Cannot re-attach to restarted process
BugIDEA-199513Attach to process (read only) does not work if it requires administrator privileges
Editor. Color SchemesBugIDEA-197528Color scheme editor ConcurrentModificationException
Editor. Editing TextUsabilityIDEA-197915Unable to set unix line separator for iml file
Editor. Error HighlightingBugIDEA-199466Editor: Error highlighting isn't change on color scheme switch
Find, Replace, Find UsagesBugIDEA-177766Find In Path: regex search finds irrelevant matches if "In commets" selected in filter
JSONFeatureIDEA-185069Kubernetes: Json. QuickHelp. Provide quick help for completion list items
BugIDEA-195340bad JSON kills IntelliJ
UsabilityIDEA-195016Kubernetes: Json. Completion for "integer" types should be with space before comma
Java. InspectionsFeatureIDEA-199499Improve "Replace 'switch' with 'if'" action and make it a quick-fix for "Switch has too few branches"
FeatureIDEA-194133Highlight usages of API marked with `@ScheduledForRemoval` as errors
FeatureIDEA-199625Support of Java11 Optional#isEmpty method
FeatureIDEA-199626Suggest Java 11 Pattern.asMatchPredicate() instead of x -> pattern.matcher(x).matches()
FeatureIDEA-199692Quickfix to delete unreachable switch branch reported by "constant conditions & exceptions"
FeatureIDEA-178919Pls add inspection to find places where "join declaration and assignment" can be applied
BugIDEA-199400"Unused declaration" reports type parameter class as unused
BugIDEA-198547'Remove modifier' quickfix deletes the containing file when applied to injected code in batch mode
BugIDEA-199532"Redundant suppression" falsely marks "Unused declaration" suppression as not required
BugIDEA-199401"Unused declaration" doesn't warn about "never used" field
BugIDEA-199613Use of variable whose value is known to be constant - false positive
BugIDEA-199615Warning highlight not shown in java editor for unchecked conversion.
BugIDEA-199617Warning about Object comparison with '==' not 'equals()' complains about enum compared to Object
BugIDEA-199693Unreachable switch statements are not highlighted
BugIDEA-199568False positive: "'Iterator.next()' which can't throw 'NoSuchElementException'"
UsabilityIDEA-192179if replaceable with switch "minimum branch count" should not count "else", it should count "minimum conditions"
Java. Intention ActionsBugIDEA-141261'Replace 'switch' with 'if'' intention produces incorrect code if some 'case' clause contains 'break' statement inside 'if'
JavaEE.App Servers.GenericExceptionIDEA-199736Cannot create new application server
Packaging and InstallationFeatureIDEA-199523Listing of Error/Exit codes
BugIDEA-199522Silent installation: There is no check if the installation folder already exists.
BugIDEA-199519Uninstall: The IDE installation folder is not deleted after uninstallation
BugIDEA-166445Add SVG icon file to IDE distribution
TaskIDEA-192663Provide special svg icons for EAP distributions
Password SafeBugIDEA-164786ISE at com.intellij.credentialStore.kdbx.KdbxSerializerKt.a
BugIDEA-196508On select custom location of keepass file, master password file should be checked also
UsabilityIDEA-163353Not obvious when master password is set up
Platform APIBugIDEA-199458NPE in UnionScope creation
Plugin ManagementBugIDEA-193930New Plugins dialog: visual garbage on the upper panel after clicking on different tabs
UsabilityIDEA-199622Updated plugins UI -- grey "Install" button for already installed plugins hard to read
UsabilityIDEA-199435Search field is focused when returning to plugins list
UsabilityIDEA-199434Non-standard hotkey for uninstalling a plugin
UsabilityIDEA-199205New Plugin manager: add hint for gear icon
CosmeticsIDEA-199197Poor rendering of completion list in Search field on Plugins settings page
Task ManagementBugIDEA-195862[projectname].tasks.zip is not truncated
ExceptionIDEA-199388Throwable at com.intellij.util.io.HttpRequests.process
Template Languages. FreeMarkerBugIDEA-123038FreeMarker reformatting doesn't work well
Unit Testing. JUnitFeatureIDEA-198881Regression: JUnit 5 "Jump to Source" always jumps to first line of file
FeatureIDEA-198076Run tests from search results
FeatureIDEA-198762Support running tests from root project with submodules
BugIDEA-199719Warning in JUnit Jupiter @MethodSource pointing to inner class: OuterClassName$InnerClassName#methodName
BugIDEA-115542"Empty test suite" printed after "Process finished with..."
UsabilityIDEA-193823IDEA gives incorrect warning if a JUnit 3/4 class is in a dependent jar
UsabilityIDEA-199449Submenu to show selected for running Tests is too narrow
User InterfaceFeatureIDEA-192585Use special icons for EAP builds at runtime
BugIDEA-198135Version control toolwindow is not displayed after Enabling VCS integration
BugIDEA-199585Svg product icon isn't used when IDE is started from sources
BugIDEA-199619'Use dark window headers' doesn't affect the Welcome window
BugIDEA-199447Can't select multiple files with [command]-click from Navigate files dialog (regression)
User Interface. NavigationBugIDEA-199403New SE: skip other contributors results when search with command
BugIDEA-199768New SE: remove duplicates on "All" tab
BugIDEA-199517Add Run Configurations to new SE
Version ControlUsabilityIDEA-186415Clear metadata associated with changelist after first successful commit
UsabilityIDEA-199471Add Shortcut to open Diff from annotations without invoking contex menu
UsabilityIDEA-131325VCS Commit Message box is using the caret foreground from "Generic" but background color is not inherited from "Generic"
UsabilityIDEA-171261Cannot delete last changlist
Version Control. GitFeatureIDEA-160208Git Fetch multiple roots in parallel
BugIDEA-199226Git "Browse Repository at Revision" panel is not available in dumb mode
CosmeticsIDEA-198989Broken html in remotes dialog
CosmeticsIDEA-198247Use smoother scaling for avatars in GitHub accounts panel
Version Control. LogFeatureIDEA-170988Add Diff Preview to File history view
BugIDEA-199655Unable to see git diff from file history for renamed file for commits made before rename
Version Control. MercurialCosmeticsIDEA-187924Mercurial: Project update - Cropped text
No subsystemFeatureWEB-29322Webstorm doesn't support pluralization rules syntax in angular templates
FeatureWEB-31391Go to Angular component's HTML template from usage
BugWEB-35054Add words to default dictionary: monorepo, denormalize
CSSFeatureWEB-19525Add "Keep Maximum Blank Lines" to Settings -> Code Style -> CSS
CoffeeScriptBugWEB-15683CoffeeScript: Red code: incorrectly parsed slash symbol
DebuggerBugWEB-35037Variables from outer function appear in shorthand arrow function scope
BugWEB-34822'this' is wrongly evaluated with sourcemaps in Variables view
HTMLFeatureWEB-34959Add inspection: an HTML tag should have a lang attribute
FeatureWEB-35006Add inspection: A head tag should contain a title tag with content
BugWEB-35033HTML: "Unknown HTML tag attribute" inspection: allow "alt" attribute for the "applet" tag
ExceptionWEB-17902NullPointerException when applying 'Form input without an associated label' quickfix
JSONFeatureWEB-35067Auto-insert whitespace after typing ":" in JSON after property name
FeatureWEB-24726JSON Schema: highlight unresolved $ref references
FeatureWEB-34898Typing assist to insert quotes automatically when typing ":" after property name
BugWEB-31876JSON inspection tab character in strings
JavaScriptFeatureWEB-29456Completion for overrides should behave same as 'generate overrides' - insert parameters
FeatureWEB-32425IDE is unaware of Flow utility types
BugWEB-34996Enable completion for object properties as keys inside square brackets in JavaScript
BugWEB-30290Some JS intentions break code formatting when invoked
CosmeticsWEB-35075Change merged gutter icons (they were replaced recently, and now the merged option doesn't look nice)
JavaScript. FormatterBugWEB-34954No alignment for Angular HTML attribute
JavaScript. FrameworksBugWEB-35055NPE in Angular2LangUtil.isAngular2ContextDir
BugWEB-27731parsing html in angular 2 template
JavaScript. RefactoringFeatureWEB-12768Convert function to method(variable holding function expression or arrow function) and vice versa
BugWEB-29572JavaScript "Convert to named function" intentions drops JSDoc comment
LintersFeatureWEB-29829Add ability to use ESLint in TypeScript files without eslint-plugin-typescript
TaskWEB-34986Update JavaScript Standard Code Style rules according to Standard 12
TypeScriptFeatureWEB-35052Support TS 3.2 callable/bindable functions
BugWEB-35078Wrong typeof check if the original type of value is 'any'
BugWEB-35030Wrong Redundant typeof check for nullable variables
TaskWEB-35080Update bundled TypeScript to 3.1
Unit TestsBugWEB-34908Jump to source for failed tests does NOT take me to the failure line
BugWEB-35083@angular/cli: Karma tests are wrongly run by jest
DB RefactoringBugDBE-6663MYSQL: Drop table command does not encapsulate table name
BugDBE-6616Cannot delete database
SQL CompletionFeatureDBE-2282'Create table definition' suggest bad type
FeatureDBE-850Expand column list improvements
BugDBE-5163create index column autocomplete defaults to all columns
BugDBE-7128Duplicate "INTERVAL" completion suggestion
UsabilityDBE-5660Better completion in Modify Table for SQLite
SQL GenerationBugDBE-7129Query plan visualizer doesn't work

RubyMine 2018.3 EAP4 (build 183.2940.7) Release Notes

No subsystemBugRUBY-21270Goto definition doesn't find the method name in same module if same name method is present in another module
Code InsightBugRUBY-22557Anonymous classes detect context symbols incorrectly
BugRUBY-22556Struct members have wrong self type
BugRUBY-22535Text-based code resolution broken in Struct
HAMLBugRUBY-22464Incorrect autocomplete of each do loops in haml
IDEBugRUBY-20622Rails Menu keeps closing all open sub-trees at random moments when I click on an open editor window or terminal window
ParsingBugRUBY-22545Variables colours don't reflect the context
Plugin ReportsBugRUBY-22481Wrong integration is detected for minitest
PuppetBugRUBY-22517Can't open epp files in Rubymine 2018.2.2
RailsFeatureRUBY-22388I18n add support for extracting translations from SLIM templates
FeatureRUBY-7055Allow i18n refactoring for strings with interpolation
Rails. Project ViewBugRUBY-22056Null node in the Rails View
RefactoringsBugRUBY-22456Introduce refactoring in HAML template throws exception
BugRUBY-22455Introduce substring from erb template suggests empty variable name
No subsystemFeatureIDEA-124703Internal "task manager" to see how plugins/features are consuming memory/cpu
BugIDEA-161033Navigate to Type Declaration -- Opens a new window
BugIDEA-199063"Remove BOM" will destroy file, which has a "UTF-32 LE" encoding (where the BOM is mandatory)
BugIDEA-130368Stop flashing the window
Code Analysis. InspectionFeatureIDEA-151197Apply (partial) "Redundant suppression" in the editor
Code NavigationBugIDEA-199006Export Type Hierarchy to text file doesn't work
UsabilityIDEA-198811Quick search for classes (Ctrl-N) should prefer classes from the same module over classes in another module.
DebuggerFeatureIDEA-197886Support attach to process for java 9+
BugIDEA-199236JDWP: some debugger features incorrectly disabled when debugging android.
BugIDEA-198704Debugger frames don't navigate to sources if they were added after session start
UsabilityIDEA-184725edit breakpoint paste from history issue
CosmeticsIDEA-198903[Floating debug tool window] when debugging run configuration, dropdown list with threads in Frame view is not shown at first step
DockerFeatureIDEA-174228Docker: Add Run and Build actions into the Editor Context menu for dockerfiles
FeatureIDEA-194585DockerCompose: Editor. Provide possibility to run service/services by keyboard actions and from the context menu
UsabilityIDEA-180791Docker: improve UI for Run/Build actions from Dockerfiles
Find, Replace, Find UsagesFeatureIDEA-69435Search for Multi-line fragment
BugIDEA-195122Find / Replace: when the size of the search field is small, it is not autoscrolled on typing or on Right arrow key pressing; cursor just goes to the invisible area
IDE ConfigurationBugIDEA-198818'Annotations to copy' setting is not persistent
Internal build scriptsTaskIDEA-198661Bundle product information file with a product distribution
JavaBugIDEA-198674Wildcard Static Imports are Expanded Despite Required Static Import Name Count Set to 0
Java. InspectionsFeatureIDEA-199012add inspection for reference comparison of Temporal instances
FeatureIDEA-192870Execute light dataflow on "too complex" methods
FeatureIDEA-199167Make CreateEnumSwitchBranchesIntention a fix action for EnumSwitchStatementWhichMissesCasesInspection
FeatureIDEA-197892Explicitly negated Predicate::test can be simplified with Predicate::negate
BugIDEA-199108False positive: "Collection empty" when initialized statically inside abstract class implementation
BugIDEA-199123Unexpected highlighting due to 'Magic Constant' inspection
BugIDEA-199078Bogus "Optional get without isPresent check" for primitive optionals
BugIDEA-198469Inspection: "Constant conditions & exceptions" interferes with "Enum switch statement that misses case"
BugIDEA-199293"Unused declaration" fails to recognize usage of Enum constructor
UsabilityIDEA-197545Simplify condition to false completely removes if
UsabilityIDEA-197924"Java | Inheritance issues | Method does not call super method" triggers for interface default methods
Java. Intention ActionsBugIDEA-199042'Create method' quick fix creates a method with wrong return type
JavaScript. DebuggerBugIDEA-187460Nashorn debugger no longer works with Java 9
ExceptionIDEA-198791IAE at com.intellij.javascript.debugger.nashorn.NashornObject.createValue
Packaging and InstallationFeatureIDEA-199192Add "Open with Rider" action for files and folders to Windows context menu
BugIDEA-199339Incorrect installation folder.
BugIDEA-190079Installer doesnt close with finish button and nothing happens
Platform APIFeatureIDEA-183815Capability to add a content between code lines in the editor
Plugin ManagementBugIDEA-197950It's confusing that one has to install new plugins using Trending section
BugIDEA-198219New plugins page: stars are cropped
BugIDEA-198191New plugins page takes 6-7 seconds to Show All plugins
CosmeticsIDEA-193887IDEA refreshes plugin description page when hovering a link
Quick DocumentationBugIDEA-189315QuickDocumentation popup flicker for some libs
RefactoringBugIDEA-199345Change Signature is available from Structure view though not yet implemented for Go
RegExpBugIDEA-199135Bad error recovery in regular expression parsing
Structural Search and ReplaceBugIDEA-199278Can't search for default method
Task ManagementFeatureIDEA-199282Pre-Select branch by task name in "Open Task" dialog
BugIDEA-189251Task management: name of newly created local task is not displayed in the toolbar and in the open task dialog
UsabilityIDEA-85270Tasks: don't allow empty changelist name format
CosmeticsIDEA-199265'Switch task' menu item is almost invisible when invoked from main pane
Unit Testing. JUnitFeatureIDEA-167855Cannot run unit tests in specified order
BugIDEA-198964JUnit: External tool tests in-line
BugIDEA-199026Multiline values for `org.junit.ComparisonFailure` are only rendered if the additional lines are empty
BugIDEA-198059JUnit not found in module for JUnit5
BugIDEA-199202Tests in run configuration are executed in wrong order
BugIDEA-198165"Test Results" shows green check mark when JUnit 5 parameterized test hits exception in parameters method
PerformanceIDEA-193091Intellij hangs when executing a large number of JUnit tests
UsabilityIDEA-193770JUnit Dynamic Test re-running uses UniqueID for the Run/Debug Configuration Name which is way too cumbersome for the UI to handle
User InterfaceBugIDEA-199024GUI stack overflow with "Find in Path" action
CosmeticsIDEA-198742Markdown "Auto-Scroll Preview" Button Looks Like "Download"
ExceptionIDEA-191859Using this EAP caused my Mac to hang twice today. I had to restart. It looks this version is completely broken.
ExceptionIDEA-199072java.util.ConcurrentModificationException
User Interface. FocusBugIDEA-199344The "Find In Path" action throws TypeAheadTimeoutException
User Interface. NavigationBugIDEA-198579Freeze while searching files by name during indexing
Version ControlBugIDEA-188052Tasks create branches with quotes
CosmeticsIDEA-195248Dialog Add File to Git, change Yes/No buttons to Cancel/Add File to Git
Version Control. GitBugIDEA-199263Confusing "Add file to Git" dialog choice
BugIDEA-198727Git Submodules: Annotate is enabled in the Diff view for the submodule entry but returns 'fatal: bad object'
Version Control. LogUsabilityIDEA-194808Branch filter should take repository filter into account
XMLBugIDEA-142045XML attribute is highlighted with red but validation succedes (using xml schema with restriction xs:list > xs:enumeration)
CSSFeatureWEB-24381Extract Ruleset intention action
PerformanceWEB-34434"Unused CSS selector" inspection overloads CPU
CoffeeScriptBugWEB-29109CoffeeScript formatting of 'export default'
BugWEB-34889wrong autoformatting in coffeescript with exports
BugWEB-34887support coffeescript re-export statement
DebuggerBugWEB-34783Docker on Windows: ports are not bound automatically
BugWEB-34895Can' debug react native app with react-native@0.57.0
ExceptionWEB-32925Throwable: No last annotation when 'Run with coverage'
HTMLFeatureWEB-34944Add inspection: an HTML element has no title attribute
FeatureWEB-34949Add inspection: an HTML element has no alt attribute
BugWEB-34950Add inspection: use <em> and <strong> for emphasized or special text
JSONFeatureWEB-33746Add completion/navigation for $schema property
BugWEB-33758"Reformat Code" inserts an extra newline when the predecing element overlaps the right margin
BugWEB-34915LineWrapPositionStrategy is not implemented for JSON, leading to invalid splitting of string literals, etc.
BugWEB-34888Validation of 'allOf' condition is too weak
BugWEB-34897'anyOf'/'oneOf' with identical schemas leads to no or partial errors
BugWEB-34928JSON Schema reference breaks other references to JSON properties
JavaScriptFeatureWEB-34932Enable "Unsound 'typeof' type guard check" inspection for JS
BugWEB-34922'worker_threads' isn't resolved in require statement
BugWEB-34745Don't show 'forin' postfix template on array/iterable type
UsabilityWEB-34937Very hard to type spread operator (...)
TaskWEB-34965Merge "Unsound" inspections for typescript and javascript
JavaScript. FormatterFeatureWEB-34976Add option to align Typescript union/intersection Types
BugWEB-33625Formatting for TSX tag generics
JavaScript. FrameworksFeatureWEB-34798Find usages doesn't work for Angular pipes
FeatureWEB-34828Rename the pipe in the template
FeatureWEB-33489Vuejs rename component name
BugWEB-34911Angular. Go to definition is broken in template when intermediate folder contains package.json
BugWEB-34958assert: JSTypeSerializer$NULLABLE_TYPE_SERIALIZER$.write
BugWEB-34899Exclude build folder for CRA projects
JavaScript. InspectionsFeatureWEB-34980TypeScript and JavaScript: base nullability control flow analysis
BugWEB-33833False warning about type coercion with `!=` and `typeof`
Live EditBugWEB-22518LiveEdit ignores some changes in html
BugWEB-34876New content is shown only after moving to the new line after the tag
TypeScriptFeatureWEB-34476Merge multiple gutter icons for implementations into one
BugWEB-34912"Complete Current Statement" on "for .. of" loop breaks code
BugWEB-34945Typescript: Invalid guard result for Map.
Unit TestsFeatureWEB-34826Support running Jest with angular-cli
UsabilityWEB-34429Jest test ran as file should be invoked directly
No subsystemBugDBE-4449SQLite dialect does not understand vector valued updates
IDE GeneralBugDBE-7116Publish GitHub Integration plugin along with Git Integration
SQL CompletionFeatureDBE-6411MS SQL: INSERT INTO [TABLE] ([ALL COLUMNS SUGGESTION])
FeatureDBE-4770GROUP BY completion should offer non-aggregated columns from SELECT clause
FeatureDBE-2242Completion for sql select should show "all columns" as for insert into
UsabilityDBE-3518Autocomplite default inside values
SQL GeneralBugDBE-7098"ROWS FROM" join from_item is not recognized
BugDBE-5750TEXT datatype not in Code Completion
BugDBE-6859MSSQL: Table hint for MERGE breaks down
SQL HighlightingBugDBE-7112Incorrect error highlighting in HSQLDB mode
BugDBE-7065Support schema qualification syntax in CREATE OPERATOR FAMILY
SQL ResolveBugDBE-6641User table not properly parsed

RubyMine 2018.3 EAP3 (build 183.2635.5) Release Notes

No subsystemBugRUBY-22531Chruby does not catches rubies from /opt/rubies
Code InsightBugRUBY-20614No autocomplete on attr_reader variables
BugRUBY-22502Double completion for field
IDEUsabilityRUBY-22527Notification that Run Anything doesn't work while project is indexing
RHTMLBugRUBY-22454Reformatting adds an extra space before %> bracket
Rails. Code InsightBugRUBY-20385"cannot find declaration" of active record joins association symbols
BugRUBY-22339Help provide types for Rails associations (has_many, belongs_to, etc.)
Ruby Version ManagersBugRUBY-22305RubyMine cannot detect the Rubinius Ruby interpreter installed using RVM
YAMLFeatureRUBY-21790YAML Shift backward after first item marker '-' typed
BugRUBY-22423Code folding issue in PyCharm 2018.2.2
No subsystemFeatureIDEA-68324Add Cmd+1,2,3,4 for selecting tabs like in Chrome, Safari, Firefox
BugIDEA-198785When Plugins dialog is opened using FindAction, attempt to search in it returns empty result always
BugIDEA-198409Seems AsyncTreeModel delays showing node until its children are found
BugIDEA-198794"2 consecutive spaces in RegExp" when one is in brackets
PerformanceIDEA-198819"Show affected tests" shouldn't traverse PSI in EDT
DebuggerUsabilityIDEA-198985In Debugger view, the Filter button doesn't allow toggling multiple times
Editor. Code CompletionBugIDEA-198968Idea smart completion suggests non-accessible constructor
IndicesPerformanceIDEA-1852399 seconds freeze caused by non-interruptable Readlock
UsabilityIDEA-196058endless indexing :)
JSPBugIDEA-198618SOE in com.intellij.psi.impl.source.jsp.el.impl.ELResolveUtil.getContextType
Java. InspectionsFeatureIDEA-198983Support explicit boxing in DFA
FeatureIDEA-198956Track equality by equals for boxed values instead of equality by reference
Java. Intention ActionsBugIDEA-197778Can't type parameter `Class<Something>` when using "create method" quickfix, angle bracket switches to param name placeholder instead
Packaging and InstallationCosmeticsIDEA-198708IDEA Community Edition should probably have its own icon on the Welcome screen - not the same as IDEA Ultimate has
TaskIDEA-193948Publish modules which allows to read IDEA project configuration as Maven artifacts
Run | Debug configurationBugIDEA-198940Dark font color on dark background in 'run anything'
Unit Testing. JUnitBugIDEA-169444UI freeze after stopping a JUnit test
ExceptionIDEA-198966Access is allowed from event dispatch thread only when manipulating the AppIcon from tests
User InterfaceBugIDEA-198135Version control toolwindow is not displayed after Enabling VCS integration
User Interface. FocusBugIDEA-196542Exceptions from intentions are logged as info, not error
Version ControlFeatureIDEA-63893Show current branch on Commit Dialog
UsabilityIDEA-198769Provide better progress indication for the Show Affected Paths dialog
Version Control. GitBugIDEA-199003git commit failed with "the following paths are ignored by one of your .gitignore files"
BugIDEA-198951Pushing main repo with submodule with reject leads to "not on branch" AssertionError
BugIDEA-198952Rejected push in a submodule fails if "Update non-rejected repositories as well" is not selected
BugIDEA-198723Git Submodules: project update doesn't update submodule project if the submodule is on branch
Version Control. SubversionBugIDEA-198691Version Control: Error updating changes: For input string: "UNDEFINED"
XMLBugIDEA-78840generate xml from xsd fails
Build toolsFeatureWEB-34701Run Anything: add npm tasks
CSSFeatureWEB-6176Add refactoring: "Extract selection into file..."
JSONBugWEB-26702Add/remove commas when moving statement in JSON
JavaScript. FrameworksBugWEB-33446`@ViewChild()` decorator. Support find usages/rename
BugWEB-34081Highlight usages in file for Angular template reference variables
BugWEB-34080Rename for Angular template reference variables
BugWEB-22168Angular2: no completion for component properties in non-inline templates if file names are different
BugWEB-34862Angular: exception if ngFor contains duplicated keys
BugWEB-34522WebStorm Angular "unused property myVar" on setter function even if its used for binding in template
BugWEB-34079Find usages for Angular template reference variables
ExceptionWEB-34842@NotNull method com/intellij/lang/javascript/frameworks/react/ReactXmlExtension.getElementForResolve must not return null
Live EditBugWEB-34789Live edit ignores changes in .html
Node.jsBugWEB-34814Detect npm package for Debian and Ubuntu based Linux distributions from the official repo
TypeScriptBugWEB-33572Support ES2018 regexp features in TypeScript
DB ConsoleFeatureDBE-4949Possibility to set default Isolation Level
DB DiffBugDBE-7066Migrate left right shouldn't synch both
DB IntrospectionFeatureDBE-4366Support for EXTENSIONS in PostgreSQL
SQL CompletionBugDBE-5591Autocomplete for the FILTER (WHERE ...) clause of an aggregate function is not correct
BugDBE-6895Autocomplete and changing join type
BugDBE-5948sql completion does not suggest distinct in count() on sql server
SQL GenerationFeatureDBE-7025Support SQL Generator `IF NOT EXISTS` option
BugDBE-6992Reshift Generic: invalid SQL generation for routines

RubyMine 2018.3 EAP2 (build 183.2407.12) Release Notes

No subsystemFeatureRUBY-219802018.2 will break run configurations that have "use parent env vars" unchecked
FeatureRUBY-22379YAML Schema Validation should support anchors and references
BugRUBY-22295No shadow variable warning on the implicitly defined variable
BugRUBY-14154Long i18n texts cause Rubymine to confuse the length of file
BugRUBY-22266Suggestions drop down inserts not pre-selected values on Enter
BugRUBY-21476Indexer says variable not used after ActiveRecord rollback
BugRUBY-21910Incorrect working directory detection for opened a library file
BugRUBY-22095Wrong checker for shadowing variables
BugRUBY-22134Wrong type of variable in stabby lambda with parameters
BugRUBY-22167Not recognizing parameter of do block after first usage
BugRUBY-22303Unused variable inspection doesn't work in loops when variable is defined after loop
BugRUBY-22301Default WSL distribution is shown as "Ubuntu (Legacy)" in UI
BugRUBY-22143Freeze when using rails console/irb and wsl
BugRUBY-22089Wrong type of variable in for statement
BugRUBY-22088Wrong type of variable in completion
TaskRUBY-22247Make bundle exec works explicitly, not using RUBYOPT
TaskRUBY-22107Unobvious scope of variables
Code InsightFeatureRUBY-21057Guard method 'watch' resolve is incorrect
FeatureRUBY-20232Nullability analysis for ruby
FeatureRUBY-22094Add support for specifying desired argument type.
BugRUBY-21690add interprocedrual support for indexing operator
BugRUBY-22444Struct type inference doesn't work for `struct.new` calls with parameters
BugRUBY-22041Fix bombed test from block to proc invocation inspection
BugRUBY-22280Add support for RTopConstReference in type inference
BugRUBY-22460Fix mocking support for RSpec
BugRUBY-19879RubyMine Rails i18n property dialog and inspections do not respect scope
BugRUBY-22075Extract parameter tries to fix invocation points instead of adding a parameter with default value
BugRUBY-21285fails to find all method implementations
BugRUBY-22242Ruby singleton class methods (def self.foo) have incorrect types inferred
BugRUBY-22248Incorrect type inferred for method call in a class definition
BugRUBY-22230$$SINGLETON$$ in find usages results
BugRUBY-22225Cannot resolve Errno system error types
BugRUBY-22268Don't create types from singleton classes
BugRUBY-22030in OpenSSL::Digest::SHA256 Digest is interpreted as a method instead of a constant
BugRUBY-18032Lazy evaluation of i18n keys not working in controller with locale files in multiple folders
PerformanceRUBY-21740Performance issue on quick fixes gathering
PerformanceRUBY-22472RContainerUtil.isInherior should use caching
PerformanceRUBY-22474Use cached value manager for caching global search scopes of psi elements.
CosmeticsRUBY-21319Darcula colour scheme for ruby is inconsistent with other languages
TaskRUBY-22461Use ResolveScopeProvider for getting a search scope from an invocation point
TaskRUBY-22260improve constant resolving
TaskRUBY-22023Don't include bodies of block calls to a callee control flow graph
TaskRUBY-21806Create extension point for symbolic type inference
TaskRUBY-21991Intention for replacing && with || and vice versa
CucumberBugRUBY-22203Can't run cucumber scenario after upgrade 2018.1 -> 2018.2
DebuggerBugRUBY-22120Attach to remote process doesn't filter remote sdks for remote host
BugRUBY-22025Attach to local process doesn't show output until stop
DockerBugRUBY-22271docker.io/rubymine_helpers not found
BugRUBY-22064It's impossible to load list of generators or rake task in Docker SDK
EditingBugRUBY-21721How to turn off block conversion (not sure if bug or feature)
BugRUBY-21581Array.each_index block template inserts extra parameter
BugRUBY-22111Ruby brace matcher does not pass through closing pipe (|) in block variables
TaskRUBY-22367Reimplement autocompletion for 'do' keyword
HAMLBugRUBY-18073Rescue block is unexpected in if/else
IDEBugRUBY-22299Colorize gem has no effect in the console on Windows
BugRUBY-22293Provide notification 'Execution with Parent Environment Disabled' for debug mode
BugRUBY-22047Run anything doesn't work with rbenv
InspectionsBugRUBY-21067False positive inspection: local variable can be used in next iteration because of redo
BugRUBY-9822Inspection false positive: local variable name is too long.
BugRUBY-22253False positive inspection: "Local variable is not used after assignment"
BugRUBY-15799Rails I18n properties inspection with mailer templates and relative I18n path
BugRUBY-19848Rubocop error when editing scratch files
BugRUBY-13603i18n key not recognized when used with the :scope option
BugRUBY-22426Convert to method reference inspection does not work for 0-parameter blocks
ParsingFeatureRUBY-22315Make bracket error easier to spot
BugRUBY-22347Syntax error. False positive with not expression
PuppetUsabilityRUBY-22132Top level functions directory is not honored as a functions holder
RailsFeatureRUBY-6758I18N create property dialog doesn't accept "lazy" lookup keys
FeatureRUBY-22063Improve internationalisation display
BugRUBY-12884self.table_name breaks intellij/rubymines ability to recognize table attributes
BugRUBY-22290Rails console: logs aren't colored anymore on Windows
BugRUBY-22416Change preview option applies only after refresh preview
BugRUBY-22417Current preview language setting should be highlighted in the list of available
BugRUBY-22421Extracting a string to use a lazy key adds an I18n. prefix in controllers
UsabilityRUBY-9331Exclude logs from indexing by default
Rails. Code InsightFeatureRUBY-16423Rails Scopes support
BugRUBY-22471Stack overflow during ActiveRecordType creation
BugRUBY-20525Review "Extra call argument" inspection in Rails
Rails. ParamdefsBugRUBY-18430can't find declaration for callback if: condition symbols
Rails. Project ViewFeatureRUBY-15810structure panel should take db fields from the schema, not migration
RefactoringsFeatureRUBY-22040Intention to extract block to method
FeatureRUBY-15958Add i18n keys from the html.erb
FeatureRUBY-20665Intention to convert explicit block call with `&:method` idiom and vice versa
FeatureRUBY-14869extract parameter from a part of a string
BugRUBY-18812Rename instance variable error in ruby plugin
BugRUBY-8197"Introduce parameter" can't be performed in case of one-symbol parameter and caret on the tails
BugRUBY-20707Error extracting variable inside a heredoc
BugRUBY-22251Extract parameter shouldn't change non-project method declarations and callsites
BugRUBY-22396Replace '&&' with '||' changes semantics
BugRUBY-22124Wrong extraction when selection breaks the expression
BugRUBY-22304Extract constant won't work with a symbol
BugRUBY-21371Extracting constant from private method makes the method public
BugRUBY-7552Introduce parameter - no option to extract from assignment
UsabilityRUBY-21670Repetition in intention original statement made it too long
TaskRUBY-22403Inline variable with string interpolation
TaskRUBY-22269Extract parameter better preview
Ruby Version ManagersBugRUBY-22270asdf Sdk cannot be used with a project when option use explicit bundler is on
BugRUBY-22125RubyScriptExecutionContext should distinct shims scripts from regular ones for proper patching with version managers
BugRUBY-22008rbenv gemset gem list is not shown in the Settings
BugRUBY-22218[2018.2] is not reading GEM_PATH
BugRUBY-21816Ruby Arguments parameter in the Run Configuration created with old template will be not empty
RubyGemsBugRUBY-22372No JS completion because node modules for gems are excluded
Run ConfigurationsBugRUBY-22220Pty console does not handle missing TERM and PAGER=less in some cases
SlimBugRUBY-20523Editor color highlights broken on conditioned lines on Slim templates
TestsFeatureRUBY-21752There is no button re-run failed tests for cucumber features
FeatureRUBY-1631Tests Runner : rerun failed tests action
BugRUBY-22399Cannot turn off Rake for tests with Spring preloader in RubyMine 2018.2+
BugRUBY-21906No test were found error for cucumber features on Windows
BugRUBY-22017Running a single test in Test::Unit runs all the tests in the file
BugRUBY-22156[Regression] References to files in test console output are not linked
YAMLFeatureRUBY-21674Highlight unused anchors
FeatureRUBY-19094YAML: Validate duplicate keys
FeatureRUBY-21814Copy path to clipboard from breadcrumbs for YAML
FeatureRUBY-21518"Paste Key" for YAML files
BugRUBY-21937Paste keywords indents the last line to the left
BugRUBY-22102YAML by json schema completion doesn't suggest properties before other properties
BugRUBY-22215Copy Relative Path - not available for some files
BugRUBY-22361yaml auto formatting very wrong, cannot be disabled
BugRUBY-22363Completion of object insert wrong indent after the key
BugRUBY-21803New line is unexpectedly indented after empty line
BugRUBY-21787YAML Incorrect parsing of shifted map
TaskRUBY-21693Create automatic regression test for anchor type name in 'Find-usages' view
No subsystemFeatureIDEA-127245Open all files from favorites list
FeatureIDEA-196706Multithread model for new SE
BugIDEA-197661Tooltip appears on a collapsed code block
BugIDEA-193747Clicking Help | Register does nothing in a Toolbox-installed PhpStorm
BugIDEA-197994Yaml: unnecessary indentation inserted after completion of mapping node key value
BugIDEA-197960No completion for Yaml file if caret behind ':'
BugIDEA-197011Sibling Inherited Methods Provider should have an option in File | Settings | Editor | General | Gutter Icons
BugIDEA-59397When caret is outside visible editor area, on Alt-Enter pressing intention bulb appears outside the editor frame
BugIDEA-181678Fix colors on tip of the day welcome screen
BugIDEA-177327AltGr special characters don't work under Windows 10, instead hotkeys for Ctrl+Alt are initiated
BugIDEA-196173Recent files + Navigate to file interaction broken
BugIDEA-123363Default project language level is ignored if project is created from template
BugIDEA-198043NoClassDefFoundError: Could not initialize class com.intellij.profiler.ultimate.async.UtilsKt exception on project creating
BugIDEA-197869[Copyright Profiles] The hour24 property for the $file.lastModified object isn't interpreted in comments
BugIDEA-197863JSON scheme: yaml completion - always insert ": " after completing property name
BugIDEA-188262Elements with the same content are underlined when only one of them is selected by mouse
BugIDEA-84220CTRL-F5 shortcut doesn't work in Hierarchy view
BugIDEA-197458IDEA UI complete freeze: "GotoActionModel" creates Swing components on pooled thread and causes deadlock with EDT
BugIDEA-147781ColorChooser: Opacity changing doesn't affect the results
BugIDEA-198611Failed to save setting when install CLion from scratch
PerformanceIDEA-196408Idea 2018.2 freezes while typing if bookmark is set in library (decompiled) class
PerformanceIDEA-195495Slow external project configuration changes tracking
UsabilityIDEA-108586Launcher: can't open a project by relative path
CosmeticsIDEA-194896MacBook touch bar: use close icon instead of close button
CosmeticsIDEA-194893MacBook touch bar: improve Configurations popover
TaskIDEA-197845Increment year in license file
TaskIDEA-186044Rework validation error popup from lightweight to heavyweight
TaskIDEA-195193Plugins: implement search
TaskIDEA-196883Run anything: allow to provide completions variants based on the user input
TaskIDEA-180939Allow read-only mode for ExpandableTextField
Auto-reported ExceptionIDEA-191293NPE in TrackingPathMacroSubstitutorImpl.invalidateUnknownMacros
ExceptionIDEA-195973NPE at com.github.markusbernhardt.proxy.selector.pac.PacProxySelector.findProxy
ExceptionIDEA-141213IllegalStateException: This function should be called while holding treeLock at java.awt.Component.checkTreeLock
ExceptionIDEA-193478cannot share data context between Swing events; initial event count = 4939619; current event count = 4943502
ExceptionIDEA-195827AssertionError caused by ReadAction on already disposed project
ExceptionIDEA-195911NPE: SearchEverywhereManagerImpl
Code Analysis. DuplicatesFeatureIDEA-198256Show diff preview in inspection results for duplicate code inspection
Code Analysis. InspectionFeatureIDEA-197174Nullable inspection control flow with Objects.toString check enhancement
FeatureIDEA-173248Thread-blocking (I/O) calls detection
BugIDEA-196200"Generate 'clone()' method which always throws exception" throws exception
BugIDEA-197029Cannot delete `javax.validation.constraints.NotNull` from list of constraints to consider
BugIDEA-27535Inspection, erroneous field "can be final"
BugIDEA-99444IDEA condisers class used when it's not
BugIDEA-181933Single regex pattern replace to illegal and not equivalent to character class
CosmeticsIDEA-139756Grammar error in inspection "Managed Bean Inconsistency errors"
Code CoverageBugIDEA-197615Test with coverage suddenly reports "No coverage in 'all classes in scope'"
Code Formatting and Code StyleBugIDEA-127949"Names count to use static import with '*'" setting off by one
BugIDEA-197964Line shifting by partly reformat action
BugIDEA-163103Wrong static imports order
BugIDEA-152798Names count to use static import with '*' doesn't work as expected
BugIDEA-183296Wildcard import for specific packages
Code NavigationBugIDEA-196545New "Go to" popup GUI: calling "Go to Class" while indexing silently shows empty list
BugIDEA-165452Recent files should preselect first item if no editor is open in tabless mode
BugIDEA-197278New SE: Increase search field font
Code. GenerateBugIDEA-198090Changes to velocity macro for generating equals/hashcode take effect only after restarting IDE
BugIDEA-196896No code generation using 'implement methods' or 'override methods'
ConsoleBugIDEA-195938Unable to type TAB character in console
DebuggerFeatureIDEA-186962Allow user defined Async annotations
FeatureIDEA-194862Support project-specific async stack traces in remote configuration
FeatureIDEA-196669Allow to automatically restart remote debug server configuration
FeatureIDEA-197758Attach to this process action
FeatureIDEA-168185Allow to attach to java processes started without debug agent (SAPIDAttachingConnector)
BugIDEA-196012Compiling evaluator does not rename variables
BugIDEA-195335Incorrect rendering of partially visible lines in Debugger Variables window
BugIDEA-144955Add Field Watchpoint context menu is missing
BugIDEA-1966462018.2 Unable to debug application server with async stacktrace instrumentating enabled
BugIDEA-156500Debugger does not stop at breakpoint in test with JMockit
Debugger. Memory ViewBugIDEA-179172Strange behavior in memory view search field on mac
DecompilerCosmeticsIDEA-196314Decompiler produces extra semicolon in empty catch block
Diff_MergeFeatureIDEA-101663Allow option to ignore whitespace in three way merge
BugIDEA-197927VCS: Diff: Unified-viewer renders empty line in the wrong place if 'ignore imports and formatting' is enabled
BugIDEA-195754Wrong hint in diff window for function params
UsabilityIDEA-46059Version control: the clickable area of "Deleted" editor mark is shifted
UsabilityIDEA-197588Text in Comparison/files view does not wrap in narrow window ("Difference between current working tree ...")
UsabilityIDEA-195517'Yours' and 'Theirs' columns are not resizable - could not see full branch name
UsabilityIDEA-110057Can't change keymap shortcut for "Compare Next File" in diff view
DockerFeatureIDEA-192030DockerCompose. Display auto-assigned ports for docker containers
BugIDEA-196690Volume mounting doesn't work on Windows using Linux containers
BugIDEA-196083docker-compose: wrong inspection at mem_limit option value in case of the string form instead of the integer
TaskIDEA-193122Docker: migrate to docker-java to v3.1.0
TaskIDEA-195394Docker plugin API: provide support for debugging non-Java applications
Editor. Code CompletionBugIDEA-180723Parameter name hints completion: incorrect hints are shown in case of nested call (i.e. method call using as argument value)
Editor. Editing TextFeatureIDEA-196006Link for files in JavaDoc generation output
FeatureIDEA-195733Show parameter hints for enum constructor
BugIDEA-198066RegEx. Wrong selection with double click.
BugIDEA-193695Quick Definition (Option+Space) writes a space character if it does not work
BugIDEA-195416Join lines over arithmetic operations should preserve order
BugIDEA-196967External annotations not updated when I edit the file manually
BugIDEA-196224Parameter Info bubble (CTRL-P) disappears immediately if invoked after first dot
BugIDEA-196505Cannot open JavaScript files
BugIDEA-198113File | Export to HTML: line numbers are displayed incorrectly when enabled
BugIDEA-186110Esc doesn't close in-editor search during indexing
BugIDEA-196674Escape doesn't delete all carets in string literal with injected language
BugIDEA-197878AssertionError when inserting several lines insted of the one in multiline TODO
BugIDEA-197276Adding external annotation into .class file breaks syntax highlighting
UsabilityIDEA-193635Parameter hints react in a crazy way on incomplete expression
ExceptionIDEA-193406TraceableDisposable$DisposalException: Editor is already disposed
Editor. Error HighlightingBugIDEA-195971Library source soes not match the bytecode for java.util.regex.Pattern
BugIDEA-197802Editor: highlighting for soft-wraps delimiter not always inherits background color from surrounding code
Editor. Intention ActionsBugIDEA-144708add static import adds import to inaccessible class
Find, Replace, Find UsagesBugIDEA-196638Rows in usage view sometimes get cropped
BugIDEA-193329New SE: SearchEverywhere | Action (FindAction): OpenInFindWindow button should be disabled
BugIDEA-195542Inconsistent and partial results in "Occurrences of" Find tool window tab after opening from "Find in Path"
BugIDEA-193455Cannot go from Find to Replace if shortcut was changed to Ctrl+H
BugIDEA-189354"Find in path" (old style) requires 2 "ESC" pressing to close
BugIDEA-82930Ctrl+R (Replace) doesn't always copy the text selected to "From" box
BugIDEA-184743Button in "Replace in path" old dialog is called "Find" instead of "Replace"
BugIDEA-197216Regex search for \b locks up the IDE
PerformanceIDEA-19836989-second decompiler UI freeze
UsabilityIDEA-190270After clearing search, the cursor jump back
GWTUsabilityIDEA-198527GWT: unnecessary 'public' modifier in generated sample project
HibernateBugIDEA-198104Cant change file type of *.hql in IntelliJ 2018.2
IDE ConfigurationFeatureIDEA-146459Provide a more convenient way of editing custom file type keywords
FeatureIDEA-99671Export Settings: plugin repositories settings are not exported
BugIDEA-138366Default file types configuration (extensions) is not preserved if custom plugin registers conflicting extension
BugIDEA-192064"Remove from Sidebar" is not persisted across project re-opening
BugIDEA-197838Project leak via animated icon in PluginsGroupComponentWithProgress
BugIDEA-196469NPE error on startup with initial wizard
TaskIDEA-196480New SE file types filters are not saved on IDE close
Configuration ProblemIDEA-195913Version Control Sidebar GUI behaviour
IndicesBugIDEA-198452Exception on Welcome screen -> Preferences -> Quit
PerformanceIDEA-159590File-based index stamp changes when the index returns equal results for modified file
JSPBugIDEA-169295When merging, if page has jsp/html the tiny popup of browser icons can cover the "accept/decline" arrow icons
JavaFeatureIDEA-135092Allow more control on how the nested classes are imported
BugIDEA-195975Optimize imports doesn't remove import which is recognized as redundant
BugIDEA-127947"Packages to Use Import with '*'" setting doesn't work for static imports
BugIDEA-83277Add unambiguous imports on the fly doesn't seem to work
BugIDEA-94125Optimize imports on the fly option stops working when using specific inspections profile
BugIDEA-196649Shorten qualified class names deletes the comments
BugIDEA-161989Optimize Imports can produce ambiguous code (part 2)
BugIDEA-193394Manually provided JDK 10 not accepted in JShell: "JDK version is 8"
UsabilityIDEA-195730IDEA shows jetbrains annotations as inferred annotation instead of default
Java. Code FormattingBugIDEA-192024Java formatter breaks do ... while onto a new line if it exceeds the hard limit
Java. InspectionsFeatureIDEA-196019Inspection: string.startsWith("")
FeatureIDEA-195573'collectingAndThen' prevents from replacing stream with loop
FeatureIDEA-196751Capitalization inspection: support ternary and parentheses
FeatureIDEA-186759"assert matcher.matches()" should produce a warning about potential side effect
FeatureIDEA-194861Suggest to replace Objects.equals with direct equals call for non-null object
FeatureIDEA-195506Treat Void variables as always null
FeatureIDEA-117109Warn missing 'break' or mark on sideline all breaks of cases in a switch
FeatureIDEA-194676Report "will produce NPE" separately from "may produce NPE"
FeatureIDEA-194394Suggest simplification for String.join with Stream as argument
FeatureIDEA-195819Add AssertJ's WithAssertions to inspection "Junit test method without any assertions"
FeatureIDEA-197026"Redundant null-check" inspection: make a quick-fix to replace "foo != null" with "foo"
FeatureIDEA-167328Add check that MethodHandles for abstract methods are illegal
FeatureIDEA-197241Track content equality instead of reference equality for Strings in DFA
FeatureIDEA-195068Map.entrySet().stream().map(Entry::getKey) can be simplified
FeatureIDEA-187212Suggest to use Java 10 List/Set/Map.copyOf where possible
BugIDEA-193822Replacing anonymous Void Callable with Lambda incorrectly shows error
BugIDEA-196624Value flow analysis reaches incorrect conclusion if it encounters large enough values
BugIDEA-193830"While can be foreach" could produce invalid code when Java 10 'var' is used to declare iterator and
BugIDEA-195369incorrect suggestions when dealing with floating point arithmetic in Java (equality of +0 and -0)
BugIDEA-195597"Public inner class" inspection reports all nested classes
BugIDEA-154035TryWithIdenticalCatches treats comments as equal and fixing it loses the comment
BugIDEA-197547False positive 'assertEquals()' between objects of inconvertible types for Set types
BugIDEA-195562"Transform into final one element array" quick fix generates red code for typed Map
BugIDEA-195560'List.copyOf' not suggested when Set passed to 'new ArrayList<>()'
BugIDEA-197195Code Inspection shows wrong results when comparing same String but with different references, one from string pool and one from heap
BugIDEA-114183"while can be foreach" inspection fix produces code that does not compile
BugIDEA-196540TrivialFunctionalExpressionUsageInspection produces code with variable redefinitions
BugIDEA-198431Jump to Source (F4) doesn't work in the duplicates inspection's tool window
BugIDEA-196563Wrong “Contract issue” inspection stating a method always fails
BugIDEA-198132Condition is always 'false' false positive
BugIDEA-195886Incorrect Inspection warning 'Optional.get() without isPresent()' in finally block
BugIDEA-195882Inspect code ignores SupressWarning WeakerAccess for all fields when multiple fields are combined in one statement
BugIDEA-197341Missing @Override inspection should ignore case when method overrides method from higher language level
BugIDEA-143882Class unused declaration false positive if class member statically imported and accessed without class prefix
BugIDEA-185009'Ingore subclasses of' doesn't work for 'Non-serializable field in a Serializable class' inspection
BugIDEA-195855Incorrect NPE warning in reversed indexed for loop
BugIDEA-195621"Expression can be folded into Stream chain" produces red code when delimiter is char type
BugIDEA-196415False positive on code inspection with Map.isEmpty always 'true' when computeIfAbsent is used to add mapping
BugIDEA-145389Anonymous class may be a named 'static' inner class inspection warns where it shall not
BugIDEA-177150"For loop could be replaced with foreach" shouldn't report when loop variable is not used inside the loop
BugIDEA-198580"for/while can be foreach" inspection quickfixes can break code
BugIDEA-193618Invalid code generated after "Can be replaced with 'collect' call"
BugIDEA-198487Unreasonable duplicate code warning
BugIDEA-165900"Identical 'catch' branches in 'try' statement" inspection incorrectly works in batch mode
BugIDEA-197701Assignment to another variable on the same object is not taken into assert
BugIDEA-198547'Remove modifier' quickfix deletes the containing file when applied to injected code in batch mode
BugIDEA-195700Incorrect NPE warning when conditional expression is used in switch
BugIDEA-195382"Remove serialVersionUID" action makes code incompilable if the field is used
BugIDEA-193703Inspection "Identical 'catch' branches in 'try' statement" depends on exception order
BugIDEA-198638Last switch case label is not reported as unreachable for enum
BugIDEA-197509"Convert to enum" breaks code
BugIDEA-197501"Collapse if statement" quick fix breaks code
BugIDEA-196601"Call to simple getter from within class" inspection fix produces invalid code in enum constant initializers
BugIDEA-195310Wrap varargs with explicit array creation is available on non-vararg call
BugIDEA-197262Infer nullity marks fields as @Nullable even if they are final and were initialized at the declaration site
BugIDEA-141554'Replace with direct class object access' creates uncompilable code in case of nested local classes
BugIDEA-197983"Simplifiable TestNG assertion" inspection produces wrong argument order of assertEquals
PerformanceIDEA-182226Inspection to detect ineffective boolean conjunction
UsabilityIDEA-193647"Method can be void" Java inspection should be able to ignore methods with certain annotations
UsabilityIDEA-193932Inspection 'Non-serializable field in a Serializable class' shouldn't show warning for classes with writeReplace
CosmeticsIDEA-195759Quick fix for inspection 'Iteration over keySet() -> entrySet()' puts unnecessary parenthesis
CosmeticsIDEA-196640Typo in "Class with multiple loggers" inspection description
CosmeticsIDEA-193810Inspection 'Standard Charset object can be used' doesn't show warning for ASCII
TaskIDEA-198629Add setting to infinite loop inspection to suppress warning of usage inside Thread.run
ExceptionIDEA-196543ExtractParameterAsLocalVariableFix exception
Java. Intention ActionsFeatureIDEA-193858Suggesting Initializing a string variable with ""
FeatureIDEA-175105Add "Replace with single symbol imports" intention for static imports with *
FeatureIDEA-175102Provide intention to replace static *-import with qualified access
BugIDEA-111048Highlighting "stuck" after adding on demand static import
BugIDEA-198267"Sort content" incorrectly joins comments
BugIDEA-195114Initialize variable: First quote simply accepts default choice `null` instead of replacing it with what I typed (quote)
BugIDEA-195832Create type parameter intention can generate wrong code
BugIDEA-196541"Create missing switch branches" available and fails when there's a non-constant field of enum type
BugIDEA-196151"Wrap using 'String.valueOf()'" quick fix makes no sense
BugIDEA-197491"Merge if's" fix loses comment
BugIDEA-197813Quick fix: Make method static on default interface method produces invalid code
BugIDEA-189592"Replace if with switch" Java intention gone
BugIDEA-196560Split if deletes part of conditions in the chained if statements and produces non-equivalent code
BugIDEA-198229Unwrap doesn't support type to search
BugIDEA-154080Alt+Enter not working to autocomplete cast after ";"
BugIDEA-198105Create constructor quickfix should not suggest interfaces as target class
BugIDEA-190718IDEA Ultimate 2018.1.2.RC: not showing java compile errors in editor due to locale related tooling error
BugIDEA-197635Stream operation cause
BugIDEA-192953Replace 'switch' with 'if' with Primitive-wrapper class uses equals
BugIDEA-195380"Extract to method reference" finds incorrect duplicate and throws
BugIDEA-196022"Add on demand static import" available but does nothing
BugIDEA-197511"Simplify" if-else loses comment
BugIDEA-197517"Replace with while" breaks compilation
BugIDEA-197988Invert if duplicates comment when if is followed by return
BugIDEA-197986Invert if produces invalid code when if is followed by continue
UsabilityIDEA-175107Do not show "Create Test" intention for import statements.
UsabilityIDEA-198039Unable to create module-info.java
CosmeticsIDEA-190281“Create constant field” is the default suggestion for missing imports
TaskIDEA-195001Remove intention "StringToCharIntention"
ExceptionIDEA-195383"Replace switch with if" intention glues line comment with the next line resulting in exception
JavaEE. Deployment and RunUsabilityIDEA-197038JavaEE Deployment tab: Move artifact deployment settings below artifacts list
JavaEE.JBossBugIDEA-183287Unable to deploy to WildFly 11.0+ running in Docker (WFLYPRT0053)
JavaEE.JettyFeatureIDEA-184532Support Jetty 9.4.x
JavaEE.WebLogicFeatureIDEA-142272WebLogic: deploy artifact as a library
FeatureIDEA-118198WebLogic: Support Deployment Plans
JavaEE.WebSphereBugIDEA-196570Error:Loose application in 2018.2
JavaScriptExceptionIDEA-196599JSUndeclaredVariableInspection quick fix AIOOBE on invalid code
Language InjectionBugIDEA-196222HTTP Requests editor: collapse stops working after expand
BugIDEA-196513java.lang.AssertionError at "undo" language injection
BugIDEA-153981Injected fragment editor: multiple instances can be opened for the same fragment, but their contents is not in sync
Local HistoryBugIDEA-197060Local history reverts file timestamps
BugIDEA-197446IntelliJ 2018.2.1 freezes after a short time
BugIDEA-194992IntelliJ freezes when using local history
Packaging and InstallationFeatureIDEA-114307'Create command line launcher' on Windows
FeatureIDEA-170297"Batch mode" for IDE updates
FeatureIDEA-198292Bundle WSL plugin for Windows distribs of Idea Ultimate
BugIDEA-138195Uninstall progress bar animation doesn't represent the actual process state
BugIDEA-170921Can't uninstall IntelliJ IDEA Community Edition
BugIDEA-168582Windows setup stacks on 'Select Directory' wizard step for several seconds
BugIDEA-165190Uninstaller should not remove the files it didn't create
BugIDEA-197938Windows installer: incorrect "64-bit launcher" label layout
UsabilityIDEA-197129Kotlin compiler binaries miss executable permissions
TaskIDEA-189415Bundle Kotlin 1.2.60 with IntelliJ IDEA
TaskIDEA-189413Bundle Kotlin 1.2.50 with IntelliJ IDEA
TaskIDEA-191884Extract platform classes to separate JARs in IDEs distributions
Platform APIFeatureIDEA-169107Create an API to add custom text in place of OuterLanguageElement-s to aid template data language lexer
BugIDEA-195319`PsiSearchScopeUtil#isInScope(GlobalSearchScope, PsiElement)` returns true for every non-physical element
PerformanceIDEA-197722Instantiate stubs lazily within file
TaskIDEA-195486Expose JBTabs instance used by EditorComposite in its public API
Plugin DevelopmentFeatureIDEA-197972DevKit: add checks from PluginVerifier (plugins.jetbrains.com) to plugin.xml inspection
FeatureIDEA-197617Extension point for inferred annotations
FeatureIDEA-196383DevKit: support <group> "use-shortcut-of"
ExceptionIDEA-183233Exception during offline inspections
Plugin ManagementBugIDEA-198136New plugins page shows nothing after pressing Enter for empty search line
BugIDEA-196430New Plugins dialog: do not allow to install plugin from disk when it is already installed
Project ConfigurationFeatureIDEA-130730Support per-project custom plugin repositories
FeatureIDEA-193045Repository libraries: add option to exclude only some of transitive dependencies
BugIDEA-195433Errors on updating sdk
BugIDEA-145808Default File Encodings settings are ignored if project created from template
UsabilityIDEA-147807Project Structure: Project language level is reverted from "SDK default" to lowest value, if SDK path does not exist anymore
Quick DocumentationBugIDEA-195622QuickDoc is not accessible from Search Everywhere popup
RegExpBugIDEA-195762Single character alternation generates wrong replacement
BugIDEA-195628Tab in "Check RegExp" should switch focus between lines
Run | Debug configurationFeatureIDEA-197239Report warning when test pattern name does not occur in project
FeatureIDEA-196611redirect file to stdin for Java-based run configurations
BugIDEA-188962"Before Launch" tasks are shared between Run Configuration and its copy
BugIDEA-197127Restart tests opens a new tab instead of reusing current tab
BugIDEA-195937Disable classpath file shortener for java 9+
BugIDEA-186505"Ungroup Configurations" doesn't work in the Run Dashboard
BugIDEA-195693Context help shows 404 page when invoked for a run configuration which don't have special help page
UsabilityIDEA-128651Keep duplicate in same folder when duplicating a run configuration
UsabilityIDEA-181444Run dashboard: toolbar buttons like ShowConfigutations, Restorelayout, Help should be available when some group or deleted RC is selected
Structural Search and ReplaceBugIDEA-194520SSR: search template finds nothing if symbol with qualifier is used
BugIDEA-195278Replacing an unqualified method call fails
Task ManagementFeatureIDEA-190710Tasks plugin does not support time tracking for GitLab
BugIDEA-197824Cannot type in "Switch to task" dialog
BugIDEA-184079Switching context by tasks is competing with Restore branch workspace when changing tasks
TerminalBugIDEA-197019Splitting tabs that are console tabs does not work as expected.
BugIDEA-191852Show typed user input in terminal console
Unit Testing. JUnitFeatureIDEA-196608Ignore conditions when executing single disabled JUnit Jupiter test
FeatureIDEA-188590JUnit5 - False positive 'Access can be private' on '@RegisterExtension' field in test
BugIDEA-197680Running unit tests in two or more packages from the same module generates "search in whole project" pattern instead of "single module"
BugIDEA-198317No autocomplete in JUnit Jupiter @MethodSource for non static methods with TestInstance.Lifecycle.PER_CLASS
BugIDEA-175662Junit 5 doesn't work with 'Directory' Test Kind
BugIDEA-196672JUnit5 run in directory configuration runs all in package
ExceptionIDEA-196881Running tests 'All in directory' when there is no such directory causes exception
Unit Testing. TestNGFeatureIDEA-94400Cannot define TestNG using YAML file
UsabilityIDEA-196264TestNG hijacks JUnit Run Configuration?
User InterfaceFeatureIDEA-90507Need tab actions close all to the right/ to the left
FeatureIDEA-158158Love the new img you can set on the IDE however (.. flip and mirror)
FeatureIDEA-168887Themes: Ability to customize "speedsearch matching results" color
BugIDEA-195751New SE: Dialog doesn't fit screen on HiDPI displays
BugIDEA-196488Live Templates -> Change Context: keyboard navigation is impossible.
BugIDEA-186262Default icons for editor actions are not default for that actions
BugIDEA-195177Intermittent tests failure on MacBook with Touch bar in IntelliJ project
BugIDEA-194229New SE: layouting of "actions" results
BugIDEA-196366Add ability to customize changes browser toolbar in VCS log
BugIDEA-198321Unable to create exception breakpoint
BugIDEA-193872New Plugins dialog: search field in "Updates" allows to select plugin that doesn't require update
BugIDEA-193493"Tip of the day" pixelated but correct size with 125% DPI scaling
BugIDEA-197803ContextHelpLabel becomes too wide in project type settings
BugIDEA-197801ContextHelpLabel loses its tooltip after switching to another project type pane
BugIDEA-195558'Use dark header' setting is saved immediately
BugIDEA-193862Hard crash macOS
BugIDEA-198594Input text box selection does not select to beginning of field if mouse pointer moves left of text box edge
BugIDEA-178692AppServers View: splitter position is not persisted between sessions
BugIDEA-197862No AA in a list (jre 9)
BugIDEA-197937JDK9 - Wrong debugger toolwindow tab label rendering on HiDPI Linux
BugIDEA-197287Holding shift makes it look like you can click on code you can't
BugIDEA-195603IDE crashes on startup
BugIDEA-197708New SE: Include non-project items has no accelerator in "All" tab
BugIDEA-198521Preview diff in local changes Tab not always shown
BugIDEA-23606application Run/Debug Configuration main class chooser issue
BugIDEA-196109New Installed Plugin page's context menu actions are not DumbAware
BugIDEA-198051Remove button in Recent project is overlapping the project path
BugIDEA-197853CaptureConfigurable table has wrong cell/row height
BugIDEA-195589Structure popup has weird initial size
BugIDEA-169693No Help Available In Cannot Save file dialog
PerformanceIDEA-198160Non-disposed HelpTooltip leaks disposed project
PerformanceIDEA-178384Too many events from ProgressDialog update (via FileTreeModelBuilder)
UsabilityIDEA-195300"Copy relative path" should exist in the keymap, or somehow lead to "Copy reference"
UsabilityIDEA-195309Support Ctrl+Backspace in SpeedSearch
UsabilityIDEA-57019Add support for drag-and-drop files in welcome screen.
UsabilityIDEA-198129Mac: impossible to switch to Diff Window with a shortcut after switching to the project
UsabilityIDEA-166944Reopen project: a way to save half a click
UsabilityIDEA-193841New "Search classes" does not show outer class for inner classes
UsabilityIDEA-196288Icons for "Commit" and "Set Active Changelist" are almost identical
UsabilityIDEA-198538Search Everywhere / Find Action: on finding an entry in Plugins page the plugins list is not filtered and not scrolled
UsabilityIDEA-191113Don't show "Background tasks running" if we know the tasks can be safely resumed
CosmeticsIDEA-194379Auto-hide scrollbar on OS X similar to how default scrollbars work
CosmeticsIDEA-196183TODO view: trim the ending spaces in the changelist name when displaying it in TODO view tab
CosmeticsIDEA-134373File type icon on windows title bar doesn't reload for non-physical files
CosmeticsIDEA-193385New SE: cursor keeps improper shape
CosmeticsIDEA-118069Untidy one-pixel gap between border and toolbar buttons
TaskIDEA-197166Increase click and hover zones for the close button for Manage Recent Projects popup and Welcome Screen
TaskIDEA-194353Change focus border for field and combo in table cell
TaskIDEA-195244Merge two 'Version' comboboxes in repository library settings dialog
ExceptionIDEA-195533NPE in RequestFocusInToolWindowCmd
User Interface. AccessibilityBugIDEA-193617Accessibility issue with ComboBox and the Win10 LAF
UsabilityIDEA-192637NVDA: Debugger
User Interface. Action SystemBugIDEA-197877Throwable is thrown when switching files while Current File TODO Toolbar is opened
User Interface. ControlsBugIDEA-197998Multiline TODOs: multiline values are not displayed in toolbar on macOS
BugIDEA-196307Stripe buttons layout is broken after 'move to top/left/bottom/right'
BugIDEA-197936New SE: unable to use Ctrl/Cmd to expand selection
BugIDEA-195717Clicking directly on the arrow in the intention's menu has no effect unless it's done more to the right
User Interface. FocusBugIDEA-196291IntelliJ is sometimes not persisting files to file system
User Interface. GraphicsBugIDEA-193488Tool windows blur text when slide in/out
BugIDEA-195624wave underscore is partially bold
BugIDEA-195981Validation errors: bugs
BugIDEA-195614IAE in EffectPainter2D
CosmeticsIDEA-197371Add down arrow in "Go To Changed Files" in diff dialog
User Interface. Look and FeelBugIDEA-195856IDEA fails to start on Java 10
CosmeticsIDEA-191671Mac menu icons don't handle Darcula well
User Interface. NavigationFeatureIDEA-198407Add nullness annotations to base SearchEverywhereContributor class
BugIDEA-195792No file name completion in File Choosers
BugIDEA-196250It is impossible to invoke "Recent files" action from the "find action" popup.
BugIDEA-196401Don't show "no classes / files /symbols found" when files are found
BugIDEA-195557Cannot close splitted editor part after switching original editor
User Interface. Project ViewBugIDEA-195578New files do not show on package view
UsabilityIDEA-194516Issue when changing error color
Version ControlFeatureIDEA-160857Unversioned Files in Commit Changes dialog: support delete shortcut (DEL)
BugIDEA-190095File Mismatch When Unshelving Changes
BugIDEA-183551Copy As Patch to Clipboard enabled only on files
BugIDEA-106293VCS gets confused if you revert changes quickly
BugIDEA-191782No tooltip for new button containing "ignore" actions in Changes view
BugIDEA-197154Exception when highlighting a VCS file version opened via Browse Repository at Revision
BugIDEA-196914Compare with local is disabled for directories in Mercurial History
PerformanceIDEA-195871VcsRootScanner adds everything under a symlinked directory into the VFS
UsabilityIDEA-196963Unclear dialog options in abort/rollback
UsabilityIDEA-140866Conflict in button's keyboard shortcuts in the Code analysis failed dialog
UsabilityIDEA-195922Local changes: Focusing an empty changelist doesn't remove the preview diff
UsabilityIDEA-184616'Reword commit" do not add/alter item in commit message history
CosmeticsIDEA-195273Default Changelist Changelist
CosmeticsIDEA-82955Windows-specific setting name
Version Control. GitFeatureIDEA-95494Copy some files from one branch to another branch
BugIDEA-172234Git Branches Popup Menu does not pop up at all
BugIDEA-198264Git: Native or built-in SSH: correctly process the invalid (empty) passphrase
BugIDEA-169002Git submodules: Diff invoked for submodule entry shows 'fatal:bad revision...' message
BugIDEA-149060Modified files in one of repositories are often moved to the active change list
BugIDEA-193239Incorrect branch names shown for "checkout with rebase" and for interactive rebase operations
BugIDEA-196503Git: Partial Commits: when ShowDiff is invoked for file in specific changelist should display changes from this changelist
BugIDEA-170013Git Native SSH with passphrase fails with Permission denied
BugIDEA-198360Git: built-in SSH: if the saved password doesn't match, allow to enter the new one
BugIDEA-193134Multiple Github accounts: clone doesn't suggest github repositories if you are not logged in to all accounts
BugIDEA-195466Status of new files is not parsed if `git add -N` was used
BugIDEA-196072Git Rebase dialog - Onto branch not persistent
BugIDEA-196286Git Reword Commit sometimes throws an exception when trying to find a commit to reword
BugIDEA-197249Builtin-SSH: fails when git protocol.version 2 is enabled
BugIDEA-196449IntelliJ tries to set git username and email for non-git vcs roots.
BugIDEA-187116IDEA doesn't recognize Idea project on checkout project from Git
BugIDEA-197506Git clone operations are not listed in log
BugIDEA-100075Git submodule commit should make parent repository re-request Git status to show updates to the submodule folder itself
BugIDEA-192531Clone from github: incorrect behavior in case of github accounts configured but w/o saved credentials
BugIDEA-196117Have not understood this message, there is a grammatical mistake
PerformanceIDEA-1965352018.2 constant java processes
PerformanceIDEA-197868Branch listings extremely slow with many remote branches
UsabilityIDEA-167671No simple shortcut for Force push
UsabilityIDEA-197543Native SSH doesn't allow to save the passphrase or the password
UsabilityIDEA-155587Git action "Checkout with Rebase" has counter-intuitive name
UsabilityIDEA-195155Rebase Branch - Onto box should default to refs/heads/master if there is no tracked branch
UsabilityIDEA-83415IDEA should "git commit" when possible instead of always calling "git commit --only" with paths
ExceptionIDEA-197947ISE at git4idea.commands.GitNativeSshGuiAuthenticator.askKeyPassphraseInpu
Version Control. MercurialFeatureIDEA-187194Add compare action to the branch popup menu for Mercurial
BugIDEA-193378Merurial push/pull not working - hg4ideapromptextension returns AttributeError: 'module' object has no attribute 'Abort'
Version Control. SubversionFeatureIDEA-75033Add option to immediatly switch to a new branch when branching from repository location
TaskIDEA-197126Remove "Update administrative information only in changed subtrees" option
ExceptionIDEA-198536After upgrading to IDEA 2018.3 EAP - Subversion History fails with error
XMLBugIDEA-197050IntelliJ doesn't find my namespaces when using autocompletion in an XML Schema file
BugIDEA-195872IntelliJ marks "Element is not allowed here" an Element which is allowed to configure
i18nBugIDEA-179826Refactor|Rename is unavailable for Resource Bundle in Project Tree
No subsystemFeatureWEB-34686XML intention to create tag from attribute value
FeatureWEB-33334Run spell check on the description property in package.json files
FeatureWEB-34619Associate WebStorm with JSON files
FeatureWEB-33928Add intention to wrap xml value in cdata block
FeatureWEB-33249Typing quotes/backticks over selected text should wrap that text, not delete
FeatureWEB-33932Bundle markdown plugin
FeatureWEB-19564Web Browsers: support Microsoft Edge browser
BugWEB-31037Do not report spelling errors for values from bundled JSON schemas
BugWEB-33150Yarn workspaces: support “nohoist” option
BugWEB-34375Live templates: surround with tag inserts superfluous line break
BugWEB-34085Mac OS X keymap is selected if you skip the IDE configuration
BugWEB-33543Remove Web Starter Kit from the project wizard
BugWEB-20634Highlighting problems with bundled WebStorm color schemes
BugWEB-34578Spelling 'mistakes' in variable names
BugWEB-34597Don't treat XML files in Vue.js projects as Vue templates
BugWEB-10491Add standard framework keywords to dictionary
BugWEB-34624Argument for @NotNull parameter 'jestPackage' must not be null
BugWEB-34250TSCONFIG custom inspections should traverse config hierarchy, not just check the parent object
BugWEB-34299Closing tag is not changed when selecting an autocomplete option by mouse (not keyboard)
BugWEB-34740Using new element action on navigation bar is broken
BugWEB-33756WebStorm ignoring hostname for 127.0.0.1 IP address
BugWEB-33786Add "realtime" to the default dictionaries
BugWEB-31040Add to the dictionary
UsabilityWEB-34438Typing dot or space in import path results in applying selected variant from completion list if module name is selected there
UsabilityWEB-33877Cannot shrink Name column in JavaScript Libraries
UsabilityWEB-33927Cannot locally suppress typescript "unused export" inspection
Build toolsExceptionWEB-34650InvocationTargetException when debugging npm script with node 6.x
CSSFeatureWEB-34312Add intention action: replace CSS var() function invocation with its fallback value
FeatureWEB-22Code cleanup - sort CSS properties by name inside declaration
BugWEB-34155CSS frames() function is marked as unknown
BugWEB-34177Value of css attribute stroke-width can be a number
BugWEB-34176stroke-linejoin. Add available values
BugWEB-34017Unknown CSS property 'row-gap'
CoffeeScriptBugWEB-32860Local class properties/methods not being properly indexed
BugWEB-32486Coffeescript: splat operator in object definitions marked as error
BugWEB-22252Existential Operator Not Properly Parsed With Assignment to Function Result After Valid Space
BugWEB-33731CoffeeScript: JSX: correctly highlight XML tags
BugWEB-33733CoffeeScript: JSX: export default should be highlighted as unused when it is unused
BugWEB-33736CoffeeScript: JSX: React import should not be highlighted as unused for stateless components
BugWEB-32981[CoffeeScript] Uncorrect highlight "not" keyword
BugWEB-24288Coffeescript - regex with whitespace considered bad code
DebuggerFeatureWEB-33127JS Coverage: Show correct coverage for css
BugWEB-33328Node.js remote debugger ignores breakpoints in .ts file inside Docker container
BugWEB-34537Cannot attach to remote nodejs after upgrade to 2018.2
BugWEB-34407Debugger controls do not work when debugging code executed within a VM
BugWEB-34520Support BigInt type in Debugger
BugWEB-14424IntelliJ can't debug into node_module entries that are created by NPM Link
BugWEB-33128JS Coverage: Rename in Coverage toolwindow
BugWEB-34132Exception on JS debugging on a local node server
BugWEB-32763Debugging hangs on Facebook API
BugWEB-34483Run/Debug Configurations: .NET Project : Browser/Live Edit. Confusing button in the web address field
BugWEB-34667Debugger ignores breakpoints when debug grunt task
BugWEB-34206Webstorm 2018.2: "Debugger Console" view missing from Debug window with Node 6.x
UsabilityWEB-33956Auto expanded object properties values make variables view noisy of there is too many object entries
UsabilityWEB-13852Debugger: "Add to Watches" for multiple variables selected in Variables view adds the first variable only
UsabilityWEB-33303Node script fails to debug due to run configuration typo
CosmeticsWEB-33294Attach to Node.js configuration: add separator
ExceptionWEB-33729InvalidPathException when debug creare-react-app
ExceptionWEB-34648IllegalArgumentException: BIGINT when debug via node 6.X
File WatchersTaskWEB-34630Update file watcher template for Babel 7
HTMLFeatureWEB-33951Make rearrange tag attributes available as an intention
FeatureWEB-5082HTML: completion could suggest all valid closing tags
FeatureWEB-8885Reformat code after an "Unwrap/remove" in HTML
FeatureWEB-33921Convert named entity to numbered one and vice versa intention
FeatureWEB-20608Unwrap tag should be available via Alt+Enter as a context action
BugWEB-34737Html tags are not resolved in angular project
BugWEB-34573Remove Surround with CDATA intention
BugWEB-34754Wrong unescaped characters inspection in html script section
BugWEB-34566Support 'Jump outside closing bracket/quote with Tab' feature for HTML files
BugWEB-34363Surround with CDATA item should only be available in XML
BugWEB-34361Convert text to CDATA should not be available in JSX
BugWEB-34356Generate xml tag items displayed multiple times
BugWEB-34358Unwrap html tag works wrong
BugWEB-13095Element names are not spelling mistakes
BugWEB-29360Emmet preview is not working in JS injections
BugWEB-342Surround with tag not indenting properly
BugWEB-33949Complete HTML tag when there's only one variant: closing tag is not updated
JSONFeatureWEB-24731JSON Schema: implement completion for the contents of $ref reference
FeatureWEB-24696Paste into JSON could help with escaping quotes
FeatureWEB-31891Unescape when copying content of JSON string
FeatureWEB-34368Add completion for "required" properties in json schemes
FeatureWEB-31879Insert comma automatically with closing bracket / quote
FeatureWEB-33308JSON Schema inspections: smarter error selection and better targeted quick fixes
BugWEB-33880JSON Schemas: false positive 'Validates to more than one variant' warning
BugWEB-32453JSON schema: #ref links are resolved incorrectly in several cases
BugWEB-33858Json Schema Validation string enum case insensitive
BugWEB-34538Duplicating items in code completion
BugWEB-33845File type detection on EDT via JsonSchemaVfsListener
BugWEB-34092JSON Schemas without file associations are not available in the list of schemas
BugWEB-34178JSON Schema: Caret is out of the brackets after adding missing property
BugWEB-33852JSON Schema: Caret is out of the quotes after adding missing property
BugWEB-34369Title from json schema is not used in documentation popup
BugWEB-31894Escaping backslash inside a string in JSON causes spellcheck underlines to appear at random
BugWEB-34103JSON schema validation for enums of arrays/objects giving incorrect warning
BugWEB-34354"type": "object" is not always correctly handled by "add missing properties" fix
BugWEB-34643JSON: Validates against 'not' schema warning in package.json files
BugWEB-33913JSON Schemas: Warning message shows information about PSI loading
BugWEB-34477JSON Schema: enum validation is skipped in presence of 'pattern', that's not spec-conformant
PerformanceWEB-34304Azure deployment JSON schemas are not properly evaluated and cause laggy code analysis
PerformanceWEB-34294Specific repository/JSON file is freezing RubyMine on every action.
UsabilityWEB-33453Collect all one-of branches / any-of when none is applicable and show smarter inspections / suggest smarter fixes
UsabilityWEB-34093JSON Schema: improve the status for not yet downloaded schemas
UsabilityWEB-33265JSON Schema widget is always visible when index is being updated
UsabilityWEB-33908JSON Schema completion: show types in completion item descriptions when no description is avaiable
JavaScriptFeatureWEB-34683Multiline TODOs for JavaScript/TypeScript
FeatureWEB-33892Check RegExp should support lookbehind
FeatureWEB-33884Prefer package imports when auto-importing modules in Yarn workspaces
FeatureWEB-10122Add SQL auto injection for Javascript
FeatureWEB-32660Support nullish coalescing syntax
BugWEB-34314Unresolved function or method hasOwnProperty() on JSON object
BugWEB-34687Opening parenthesis immediately within a JSX tag cause parse error in flow js files
BugWEB-32522JS: wrong function param styling
BugWEB-32940[Flow] Call generic function with specified type parameters
BugWEB-34046Flow JS 'Specify type explicitly' intention and 'Show expression Type' throw exception
BugWEB-34425provide completion for object shorthand properties in function arguments
BugWEB-33420Javascript code completion doesn't work in webpack configuration file
BugWEB-34337index.js is added to the imports when moving files
BugWEB-24606Intellisense taking the wrong JS file and not the one imported in require('./...) using NodeJS
BugWEB-32458Renaming variable changes same-named object property
BugWEB-33984Unable to disable "cannot resolve symbol" error in JSX
BugWEB-32584Unresolved function or method error
BugWEB-32911JSDoc: Type info lost on optional parameters for methods defined with @name
BugWEB-34082Flow JS results of 'Get expression type', navigation to definition is unreliable on unsaved files
BugWEB-34154Enabling 'Method bodies' in Code Folding | Collapse by default shouldn't affect nested code blocks
BugWEB-34230Support referencing non-existent files in JavaScript libraries
BugWEB-33290Iterate intention: template should skip the last variable
BugWEB-34394Show introduce variable intention only for the `class`/`function` keyword in `export default class/function`
BugWEB-33280Can't finish template for switch/while by pressing Enter once
BugWEB-34377go to declaration for a imported (from a node module) function should take you to the function definition in the exporting module
BugWEB-34282Used parameter/variable/function shows unused in language injection (heredoc)
BugWEB-34595JavaScript: Duplicated options in Surround With action menu
BugWEB-34257Flow: quick documentation doesn't show callback params
BugWEB-34101`for await` not shown as wrong when used outside `async`
BugWEB-34641ES6: enable autoimports from node_modules if it contains ES6 modules
BugWEB-34347JSdoc: named @typedef with type specified via @type not accepted
BugWEB-34341Default export is marked as unused when using directory imports
BugWEB-21480Referenced JS Library shows "OK" state after Library is Deleted (or name changed)
BugWEB-34658Do not show parameter hints for JSX expressions
BugWEB-34125No import quick-fixes in 2018.2
BugWEB-34468Make method static generates extra point in multiline class object
BugWEB-24709Move 'suppress for statement' into nested menu if error with quick fix is reported from JSAnnotator
BugWEB-32140Better availability for 'Introduce variable' action
UsabilityWEB-34273Changed colors of Monokai scheme in 2018
UsabilityWEB-34719Autocomplete for `function` not working in some cases
JavaScript. FormatterFeatureWEB-7308reformating JS else statment not in right position
FeatureWEB-13488JavaScript code style settings: Spaces within array literal
FeatureWEB-32566Formatting should adjust spaces in template string arguments
BugWEB-34052Exception when rearranging code
BugWEB-34726No option to set code style (JavaScript) for unary word operators
BugWEB-34535The short React fragment syntax is reformatted differently than the longer one
BugWEB-33844TypeScript auto import corrupts existing imports when ES6 import/export 'Align "from" clauses' option also reformats code
BugWEB-17899Braces for JavaScript Switch statement ignore "Brace Placement -> Other -> Next Line Shifted" setting
JavaScript. FrameworksFeatureWEB-30064Make 'Unwrap/Remove' work for JSX tags
FeatureWEB-30661Angular. Provide resolve for # labels
FeatureWEB-34596Vuetify v-icon. add completion for icon names
FeatureWEB-33912Suggest webpack.config.ts files in settings
BugWEB-34269Type hierarchy not working for Google Closure classes in different namespaces
BugWEB-34053React props resolved from wrong file when using named props types
BugWEB-34733IDE refuses to render the file after some typings
BugWEB-34732"Invalid" word in the completion list in the angular template
BugWEB-34703Closing brackets are not colored in orange
BugWEB-34159React extract component: better handling of unresolved/multi-resolved expressions
BugWEB-34157'Extract react component' fails with shorthand object properties
BugWEB-27337Webpack: Not existing config file is chosen in settings
BugWEB-34555Typo in some React Live Template variable expressions (using filenameWithoutExtension instead of fileNameWithoutExtension)
BugWEB-28405closure library - code completion for 'goog.provide' symbols inside 'goog.module' is not working
BugWEB-31285Unnecessary code completion within JSX tags (without braces)
BugWEB-33818Handle TSX type context when converting class component to functional
BugWEB-33802'React functional to class component' should add .propTypes and .defaultValues in JSX expression context
BugWEB-34352Angular: property with `$` name suffix is detected as "unused" when it's used with "async" pipe
BugWEB-33826Return type is missing after converting React component
BugWEB-34010'Extract React component' in Flow should generate prop types as type declaration, not propTypes
BugWEB-34489React extract component: better handling of key attribute
BugWEB-32564Vue.j SFC not resolving @ alias with @vue/cli 3 if vue is installed in a subfolder
JavaScript. InspectionsFeatureWEB-34117if (a = b) is not a warning
BugWEB-34278Object Shorthand Methods es6 syntax does not show as error in Webstorm when in Javascript language version set below 6.
BugWEB-33846Incorrect mismatched query and update of collection with JSX
BugWEB-34384JavaScript Redundant Local Variable inspection false positives on compound assignment
BugWEB-33930Webstorm stopped show required props on components
CosmeticsWEB-33289Rename Iterate intention
JavaScript. RefactoringFeatureWEB-33090Move symbol from files without import/export
BugWEB-33831'Move ES6 module member' shows error dialog if non-module file references moved element
BugWEB-33891"Introduce local variable" is not working if caret is positioned after the expression
BugWEB-33890"Introduce local variable" shouldn't be available inside injected fragments for the outer language
BugWEB-34720Refactoring "Inline function" should be aware of context when inlining async function
BugWEB-34717'Inline local variable' when invoked as fix shouldn't show confirmation dialog
BugWEB-34145Field prefix is placed after renaming an interface member
BugWEB-33986'Replace ?: with if-else' intention should not be shown for const values
BugWEB-34653Click in conflicts view in 'Move module member' refactoring navigates to moved member, should navigate to usage
UsabilityWEB-34440inline constant refactoring should default to removing the constant
JavaScript. TemplatesBugWEB-11024EJS: extra closing tag is added on adding nested tag
TaskWEB-33748Choose one of the pre-defined run configurations by default
LESSBugWEB-34030Less variable should be highlighted if cursor is before "@"
LintersFeatureWEB-34034ESLint should have a 'Fix current error only' quick fix
BugWEB-34689Bundled tslint-schema.json has to be updated
BugWEB-30174Standard code style suppression comments the line
BugWEB-33883.eslintignore lookup should not go outside of project
BugWEB-26709ESLint/Standard: JSX content is not suppressed correctly
BugWEB-32103'Suppress' action for ESLint inspection sometimes generates invalid comments
BugWEB-29400ESLint: do not import rules from the ESLint config in case the Standard linter is defined in the project
BugWEB-33619ESLint: 'Suppress for file' action is shown twice
BugWEB-31134ESLint: eslint-disable-next-line generated in wrong positions
BugWEB-33897ESLint --ignore-pattern is not working if file .eslintignore is not exists
BugWEB-34634JSHint: update the bundled version to 2.9.6
BugWEB-33918ESLint: Don't show quick fix for non-fixable linter rules
BugWEB-31449Stylelint error when file is in .stylelintignore
UsabilityWEB-31204Add option to disable "Undo Reload From Disk?" after running 'Fix ESLint Problems'
Live EditBugWEB-32345Live Edit not working when <noscript> <header> <footer> tags combination is present
Node.jsFeatureWEB-33571Add node_modules/.bin folder to PATH in Terminal for current project
FeatureWEB-34297Provide means for plugin to suppress NPM install notification
FeatureWEB-29975Feature: completion for previous versions of npm packages in package.json
BugWEB-33149WebStorm Node Express Project does not generate correct debug environment variable
BugWEB-34602@Vue package is not resolved in the node.js package list
BugWEB-33931runnerw.exe cannot run Node.js script with WSL bash.exe
Product DocumentationBugWEB-33935Help for Extract Method in TypeScript
BugWEB-33168Move module members has no help
ProfilingExceptionWEB-33825Profiling: Heap: Throwable on the opening the Occurrence tab
SASSBugWEB-34131Good code red: animation-timing-function inside SASS nested property
TypeScriptFeatureWEB-30212Auto-imports should prefer symlinked file from node_modules to actual file in monorepo projects
FeatureWEB-34455Support TS 3.1 mapped type changes
FeatureWEB-32271Inspection for tsconfig.json
FeatureWEB-33326Add references to TS 3.0 named generic arguments (so that they can be renamed/navigated)
FeatureWEB-27788Alt+Enter (imports all ?!) in .ts file
FeatureWEB-33222Support TypeScript 3.1 named type arguments
FeatureWEB-33221Support TS 3.0 'unknown' type
FeatureWEB-33769TypeScript 3.0 project references in monorepo
BugWEB-34311TypeScript: comment inside the React tag breaks highlighting
BugWEB-34261Typescript - WebStorm includes private methods and properties when using keyof
BugWEB-34511Import All in Webstorm 2018.2.2 doesn't import everything
BugWEB-34516Autocomplete reporting incorrect type with mapped types
BugWEB-32336[TypeScript] RxJS lettable operator - type inference support
BugWEB-30699Type inference problem in Typescript
BugWEB-34229TypeScript autocomplete is broken in PhpStorm 2018.2 (lacks results)
BugWEB-33293Expected type for tuple element shouldn't include types from other elements
BugWEB-34098Monorepo import isn't respected during copy-paste
BugWEB-32021Spell Checking Bug in object property names
BugWEB-34622TypeScript interface field renaming refactoring is ignored with object literals in anonymous functions
BugWEB-34554Wrong tsx syntax inspection when comment has tag
BugWEB-33230typeof dynamic import error: expression expected
BugWEB-33907Intellij highlights variable that has same name as other method as unused even when it was used in Angular template
BugWEB-31080Can't automatically add all imports in TypeScript
BugWEB-29621Support mixin signatures
BugWEB-33037TypeScript mixins do not work
BugWEB-34124Wrong type specifying for unique symbol
BugWEB-34127TypeScript: incorrect import suggestion for @types/mocha@5.2.3
BugWEB-34019Type of 'const foo = Symbol()' should be inferred to 'unique symbol'
BugWEB-33976TypeScript: Renaming an interface member doesn't rename usages in generic curried functions
BugWEB-34074Correctly import modules from @ionic/core
ExceptionWEB-33911Throwable: Infinite type substitution T|never|never|never...
Unit TestsFeatureWEB-34691Upload and display Jest coverage report in the IDE
BugWEB-31143Jest package is set incorrectly if there are two node_modules folders in a project
BugWEB-34422Jest terminates with unknown error (ReactJS, Jest, Jasmine, Typescript)
BugWEB-33855Jest: custom setupTestFrameworkScriptFile is not executed sometimes
BugWEB-34142Not running jest tests
BugWEB-1699Structure view shows nothing for JS test file
BugWEB-33816Jest: initialization error is shown as passed test
BugWEB-34583Cannot run karma tests from WebStorm because of invalid concatenation of paths to intellij.conf.js
BugWEB-30856Jest 'Run with coverage' not showing coverage panel when coverage options exist in package.json
BugWEB-34651Karma: re-run failed tests runs passed tests also
UsabilityWEB-30439Jest: show console.log output in test results console when clicking on test
UsabilityWEB-28401Create react app extension: Jest configuration: add Jest options automatically in Jest conf
UsabilityWEB-28498"Mocha package" field does not persist for my shared Run Configurations
spy-jsBugWEB-33832Spy-js for Node.js cannot be started on Node 9.11.0+
BugWEB-34527"Next call" not recognized as disabled until I arrow-down over them, toggling "filter disabled" won't make them disappear
BugWEB-33835WSL: Spy-js for Node.js fails to trace the application
No subsystemFeatureDBE-5126Dialect scopes for Live templates
BugDBE-6982Intellij hangs when work in database editor.
DB ConsoleBugDBE-6751Execute stored procedure: specify type length for the result or otherwise (if infer type length is not possible) indicate that the script is invalid
BugDBE-6889MySQL execute procedure in console produces "[S1000] Operation not allowed after ResultSet closed" error
DB IntrospectionBugDBE-6324DataGrip does not understand "included columns" of MS SQL Server indexes
BugDBE-4559MS SQL Server index condition (filter definition)
BugDBE-6362Redshift view with no schema binding - unable to inspect columns
BugDBE-4693Column is missing from FK as displayed in Database tool window
BugDBE-6896Synchronizing a Database (Intersystems Caché) forgets the Schema
ExceptionDBE-6818Postgres 11 broke backward compatibility (columns proisagg and proiswindow are dropped from pg_catalog.pg_proc)
Data Import & ExportBugDBE-7012Cannot import into table with ENUM field
BugDBE-7019JSON groovy extractor provides 1.0E8 instead of 100000000
UsabilityDBE-7015Export to Database: do not re-execute the select query if possible
Data ViewsFeatureDBE-4100Feature Request: Show column comments in tooltips
FeatureDBE-6693Qualify table and routine names in editor tabs
BugDBE-5769Table Editor: does not automatically load data on selecting a table
IDE GeneralFeatureDBE-7036DataGrip is missing "Report a Problem" menu item under Help.
Navigation & SearchBugDBE-6796Consider data source group in Go to actions and other places where I'm choosing some database object
UsabilityDBE-5459Remove storage files from "Go to file"
PL & DDL EditorBugDBE-6754Editor tabs are not named consistently so they don't sort consistently
SQL CompletionFeatureDBE-2285Completion for sum() and avg() functions
BugDBE-2824Live template problem
BugDBE-4981REGEXP_COUNT is an unknown database function
BugDBE-6954Improper syntax completion for functions
BugDBE-6541Complete function parameters in drop function statement
BugDBE-4848Code Completion: stored procedure with named parameters (Sql Server)
BugDBE-4246If inside brackets, on completion item selected dot is inserted incorrectly
UsabilityDBE-6606"NOT NULL" should be suggested before "NOT FOR REPLICATION"
SQL Format and StyleFeatureDBE-6822Procedure block: new line after BEGIN
BugDBE-6874MSSQL: Obscure spaces before and after dot between schema and table name
BugDBE-6939SQL formatter - lag and no effects in preview
BugDBE-6823Formatter uses the style named 'Default' instead of currently selected one
SQL GenerationBugDBE-6743MariaDB: Support CREATE OR REPLACE PROCEDURE
SQL HighlightingFeatureDBE-4999Need temporal table support in SQLServer Dialects
FeatureDBE-6759highlight if JOIN aren't paired with ON
FeatureDBE-1456Show warning on DELETE FROM without WHERE clause
BugDBE-4774MySQL: "where" keyword in select statement is highlighted as error
BugDBE-6844Invalid "Ambiguous column reference"
BugDBE-6848Unresolved reference for alias in Redshift
BugDBE-6853Newline concatenation with a bind variable in COPY command is erroneously not recognized as a valid syntax with Postgres
BugDBE-6830'ON' is not treated as value
BugDBE-6125PostgreSQL support USING NEW INTO syntax
BugDBE-6975Support 'or replace, materialized view, precomputed' syntax
BugDBE-6817Oracle ~= (not equals) operator causes parse error
BugDBE-5635Redshift: support varchar(max) syntax
BugDBE-6761PostgreSQL 10 drop function without arguments
BugDBE-7007MySQL dialect constantly resets after IDE restart
BugDBE-6862Syntax for Oracle's sample.
SQL ResolveBugDBE-6947Some MySQL 8 functions aren't resolved
User InterfaceFeatureDBE-6797When renaming a datasource, interpret slashes as groups or interpret slahes in datasource names as groups
FeatureDBE-6753Can not drag Data Source to a group
BugDBE-6808Gutter color is not respected
BugDBE-2390Data Statistic Error
BugDBE-6443Default row height int "Modify Table" dialog is equal to the biggest row in the dialog
UsabilityDBE-6799Moving a datasource to a parent group that has no direct child only possible via "new..." group

RubyMine 2018.3 EAP (build 183.2153.13) Release Notes

No subsystemFeatureRUBY-21941Add XML configurations file for WSL distributions
BugRUBY-19833Navigate to scratches tries to open Rails view
Code InsightFeatureRUBY-21280Exception classes are not on the top of completion in rescue block
BugRUBY-21961Low memory inspection after code inspect for scope
BugRUBY-17797YARD defined named parameters should be resolved
IDEBugRUBY-22085Set default row size for pty, for proper filtering of the long lines
InspectionsBugRUBY-22029'Control flow statement with negative condition' inspection is duplicated and doesn't point to the code
MarkdownFeatureRUBY-18408Markdown Plugin won't recognize TODO comments / TODO List won't show TODO items in Markdown code
FeatureRUBY-18256Horizontal split option for "Markdown support" plugin
BugRUBY-18177Markdown support plugin does not sync content with fragment edit tab
BugRUBY-20990JetBrains Markdown plugin strike-through "~~" token not rendered.
BugRUBY-20617Markdown Support plugin: displays weird message box when rendering editor: "Page ... requested without authorization"
Bug