Skip to end of metadata
Go to start of metadata

RubyMine 2018.2 RC2 (build 182.3684.49) Release Notes

DockerBugRUBY-22064It's impossible to load list of generators or rake task in Docker SDK
No subsystemFeatureIDEA-194897MacBook touch bar: add "Add configuration" button in Run/Debug configuration dialog
BugIDEA-194890MacBook touch bar: More items button does not work in Run/Debug configurations dialog
BugIDEA-194901MacBook touch bar: welcome screen bugs
CosmeticsIDEA-194896MacBook touch bar: use close icon instead of close button
CosmeticsIDEA-194893MacBook touch bar: improve Configurations popover
CosmeticsIDEA-194905MacBook touch bar: use buttons with labels instead of icons in Diff dialog
CosmeticsIDEA-194902MacBook touch bar: debugger improvments
User InterfaceBugIDEA-194924TouchBar support: touch bar is not appeared after first IDE launch
UsabilityIDEA-192403Touchbar support for Select in > Project view
User Interface. Project ViewBugIDEA-189742Items in Project View remain highlighted as incorrect after deleting the class with uncompilable code
CoffeeScriptBugWEB-24288Coffeescript - regex with whitespace considered bad code
JSONBugWEB-33845File type detection on EDT via JsonSchemaVfsListener
Unit TestsBugWEB-33810'Click to update snapshot' link is missing
BugWEB-33816Jest: initialization error is shown as passed test
BugWEB-33855Jest: custom setupTestFrameworkScriptFile is not executed sometimes
UsabilityWEB-30439Jest: show console.log output in test results console when clicking on test

RubyMine 2018.2 RC (build 182.3684.16) Release Notes

DebuggerBugRUBY-22037Continuously prompted to install debugger libraries
BugRUBY-22025Attach to local process doesn't show output until stop
DockerBugRUBY-21137Rubymine can't access rails generators with docker-compose defined remote interpreter
EditingTaskRUBY-21934RCompundStatement should be valid host only in ERB
TaskRUBY-21482Improve autocompletion of the def keyword
Ruby Version ManagersBugRUBY-21993rubocop inspection causes exception on the start with sdk without gem rubocop
BugRUBY-21985Asdf is not descovered if installed with brew
BugRUBY-21988RubyMine uses an incorrect working directory when installing bundler via action
Ruby. FormatterBugRUBY-21892formatting a hash or keyword args with a key public: formats incorrectly [REGRESSION]
TestsBugRUBY-22017Running a single test in Test::Unit runs all the tests in the file
YAMLBugRUBY-21987Schema validation for cloudformation & sam are broken.
BugRUBY-22019Yarn generated lock file contains error
No subsystemBugIDEA-191258Out of memory on opening/reading SVG file.
BugIDEA-189873Run Dashboard: Del pressing in the Find box in console deletes the current run configuration
ExceptionIDEA-192088Exception when starting IntelliJ
Code Analysis. InspectionBugIDEA-195161Reactor. Blocking calls in non-blocking contexts inspections are not reported in lambdas
BugIDEA-194855False positive "Blocking operator in non-blocking scope" for a Flux
ExceptionIDEA-194975Offline Inspection fails with HeadlessException presumably because EAP version is expired
Diff_MergeBugIDEA-194913Zoom is broken in Diff for images
Editor. Editing TextBugIDEA-194978Mouse navigation & tooltips handler: take inlay hints into the account
File SystemUsabilityIDEA-192665Annoying "External file changes sync may be slow" notification
IDE ConfigurationBugIDEA-189920Attribute inheritance flag in Editor color scheme is reverted on Apply
BugIDEA-193029Restarting is not supported on GNU/Linux with Python 3 as the only Python interpreter
IndicesBugIDEA-194315Spring Boot: application.yaml file opened in Editor while indexing is not recognized as SpringBoot configuration file
Java. InspectionsBugIDEA-194863Non-sensical warning and quick fix: Condition is always true
Java. Intention ActionsBugIDEA-194648Simpler expression auto-fix results in different code
Packaging and InstallationTaskIDEA-195115Bundle Kotlin 1.2.51 with IntelliJ IDEA
Plugin DevelopmentBugIDEA-183006Automatically load plugins on which the main plugin optionally depends in tests
RefactoringBugIDEA-187647Rename module does not rename directory
TerminalBugIDEA-194928Terminal console: a few first long lines are not properly carried over to next line
ExceptionIDEA-187084StringIndexOutOfBoundsException while executing some action with long output in the Terminal
Unit Testing. JUnitBugIDEA-194570Wrong total/passed tests count calculation in TestStatusLine.java
User InterfaceBugIDEA-194795Exception appears when try to open file chooser from Welcome screen
Version ControlUsabilityIDEA-193296Assign default shortcut for the "Set Active Changelist" action
Version Control. GitBugIDEA-193934Git clone --recurse-submodules checkouts submodules in detached state which breaks Update project
BugIDEA-195270Missing notification about invalid Git roots
BugIDEA-194991Annotation tooltip is huge and empty
UsabilityIDEA-124453Update Project should not fail completely when some module can't be updated (have no remotes, doesn't have a tracked branch, is in detached state, etc)
Version Control. PerforceBugIDEA-183743Use file revision encoding when comparing file contents
No subsystemFeatureWEB-33712ES6: autoimports for ts declarations inside node_modules
FeatureWEB-33641Angular2: allow injecting languages other than CSS in `styles:[]`
CoffeeScriptBugWEB-33782CoffeeScript: prohibit use of JavaScript Postfix Templates
DebuggerBugWEB-33604Infinite 'Loading value' when calculating a variable
TaskWEB-7998If breakpoints muted, don't stop on debugger keyword
ExceptionWEB-31501[[FunctionLocation]] not found when call 'Jump to source'
File WatchersBugWEB-33661Export File Watchers action: preserve Path Variables
CosmeticsWEB-33683File watchers: column title doesn't fit on Linux
JSONBugWEB-33306JSON Schema Mappings: required fields are not suggested inside 'oneOf' definition
BugWEB-33724Incorrect 'missing property' in case of 'anyOf' with required
BugWEB-33705Unintended autocomplete list pop-ups when typing B or P inside quotes in JSON strings
JavaScriptBugWEB-33611Javascript. Array type is not properly defined
BugWEB-33700JavaScript: 'Method expression is not of Function type' after exporting
CosmeticsWEB-33635Issues with brace highlighting
JavaScript. FrameworksFeatureWEB-20913Intention: Switch between React class and pure function syntax
BugWEB-32986Support pointer events (react 16.4)
BugWEB-33722React: add autoimport for Component based on react.d.ts
JavaScript. InspectionsBugWEB-33365JSDoc error with default + rest arguments
BugWEB-32303Strict mode inspection behavior is not applied in modules and classes
LintersBugWEB-33680Throwable: Read access is allowed from event dispatch thread or inside read-action only
Node.jsBugWEB-33688WSL: covered lines are not marked in the editor
BugWEB-33687WSL: flow doesn't start (Throwable: Can't find node interpreter)
BugWEB-33707WSL: can't install nyc or istanbull via link from error
BugWEB-33708WSL: webpack config can not be analyzed
ExceptionWEB-33725WSL: IllegalStateException when indexing project
TypeScriptBugWEB-21141[TypeScript] false error with generic extends non-named types
BugWEB-33765Completion for generic TSX components doesn't work properly for the first attribute if TS service is enabled
BugWEB-21614invalid error: rest parameter must be an array type
BugWEB-33701[TypeScript] Wrong "Non-ASCII characters in an identifier" inspection on TypeScript decorator with property access
BugWEB-33651Typescript. Autocomplete for properties doesn't show string-named items when service is on
BugWEB-33716Incorrect rest parameter's type in "parameter info" / "quick doc" for aliases and tuples
BugWEB-33632TypeScript: Types are included in pre-populated JSDoc for properties/vars
Unit TestsBugWEB-33594'Show ignored' option doesn't work for Jest
BugWEB-33682Karma: 'Re-run failed tests' button disappears when debugger starts
BugWEB-33664Karma: cannot run single jasmine suite or test
BugWEB-33662Improve description for suits with ignored test when 'Hide ignored' is chosen
BugWEB-33631Jest + Vue: coverage marks not shown in gutter of .vue file
BugWEB-33622WSL: Jest Coverage tool window not showing any stats
DB ConnectivityUsabilityDBE-6655Custom JDBC driver configuration workflow
SQL ResolveBugDBE-6676Quoted Identifiers are case insensitive SQL Server

RubyMine 2018.2 BETA (build 182.3569.32) Release Notes

No subsystemFeatureRUBY-21941Add XML configurations file for WSL distributions
BugRUBY-21930Find usages NPE
Code InsightBugRUBY-21961Low memory inspection after code inspect for scope
BugRUBY-21983Don't show toplevel constants in the completion for colon references
BugRUBY-21984Don't show overridden methods in a completion list.
BugRUBY-21922`#select` on an expression is resolved to `Kernel#select` resulting with invalid missing arg error
BugRUBY-21920CTRL + SHIFT + P does not show a type of an array element.
BugRUBY-21951Code completion not finding anything "on first try"
BugRUBY-21978RClass#resolveSuperClassSymbol fails to resolve a top level qualified name
PerformanceRUBY-21958Performance issue due to constant nesting lookup
PerformanceRUBY-21970Possibly infinite analysis on gitlab project
DebuggerBugRUBY-21948undefined method `each_child' error when start debug with Ruby < 2.5, debase 0.2.3.beta2 and Rails 5.2.0 with bootsnap
Ruby Version ManagersBugRUBY-18970Import settings doesn't validate imported SDKs
BugRUBY-19900Remove rbenv entries
TestsFeatureRUBY-21913Rerun failed features for cucumber Rake task
TaskRUBY-21908Rerun with Spring rerun all tests instead of failed
YAMLBugRUBY-21838Custom region works unstable
BugRUBY-21837Two custom regions in one file don't work
BugRUBY-21802Trim spaces before colon after Alignment on colon if change type of alignment
BugRUBY-21808Sequence item is indented under previous when it was in square brackets or braces
BugRUBY-21789YAML Incorrect formatting of boundary comments
BugRUBY-21788YAML Incorrect parsing of text scalar value with first shifted line
CosmeticsRUBY-21673Fix color scheme for anchors and aliases
No subsystemBugIDEA-194670Memory leak in DocumentationManager
DebuggerUsabilityIDEA-194431Async Stracktraces for Platform.runLater
DockerFeatureIDEA-150690Docker - add --rm option
BugIDEA-194072Dead `--rm` container shown as not removed from the IDE view
BugIDEA-192393Dockerfile "cannot resolve stage" with valid --from syntax
BugIDEA-194659DockerCompose: impossible to run docker-compose run configuration
UsabilityIDEA-163754Docker. Container, Exec menu item. Set focus on the command line after Exec-> bash
IDE ConfigurationBugIDEA-194876When removing "Other" from "B" live template context, it's reset to "None"
Java. InspectionsFeatureIDEA-189130Inspection not compatible with Java 10
BugIDEA-194440Can't see expected inferred Unmodifiable annotation for List.of
BugIDEA-194454Replacing stream chain with loop breaks line comment
BugIDEA-194009False "Redundant step in Stream" inspection
JavaEE.StrutsBugIDEA-194802OGNL Sanity Test Fail - OgnlVariableExpression ref
BugIDEA-194799OGNL: Sanity Test Fail OgnlReferenceExpressionBase
Packaging and InstallationBugIDEA-194822Incorrect sed command in non OS_TYPE Linix libyjpagent check breaks non Linux startup
Project ConfigurationBugIDEA-194717Excluded roots are lost after refreshing a repository library
Run | Debug configurationUsabilityIDEA-181847RunDashboard: auto-scroll to the running item in case of many items in the view
TerminalBugIDEA-173259fish plugin functions do not work on macOS in built-in terminal
User InterfaceFeatureIDEA-163208Add support for MacBook Touch Bar (Magic Toolbar)
BugIDEA-193115TouchBar: dropdown values are not selectable
BugIDEA-193777Cannot switch on 'Show function keys on touchbar' feature
BugIDEA-194712Messages tool window header is missing "Collapse/expand all" icons
BugIDEA-194716Fatal error reporting with optional files not working correctly
ExceptionIDEA-193393TouchBar: exception is thrown after cancelling Project Structure window
User Interface. DarculaCosmeticsIDEA-191671Mac menu icons don't handle Darcula well
Version ControlUsabilityIDEA-192073Missing 'Expand All/Collapse All' icons in VCS Local changes
Version Control. GitBugIDEA-194449New Git root is not detected until restart, if added externally as a submodule or under a new subdirectory
UsabilityIDEA-144948Branch list in Git Rebase dialog should include remote branches
UsabilityIDEA-144072Sort order of branch names in git branches drop-down lists is not alpha-numerical (Rebase, Branch Widget etc)
No subsystemBugWEB-33569Suggest newer version for 'ng-add' dependencies if older one doesn't support 'ng-add'
BugWEB-33570Do not log issues with bad schematics in New|Angular Schematics... dialog
DebuggerBugWEB-33044Debugger stops on muted breakpoints in React native app
BugWEB-33119Wrong file path in Console when debugging a Vue app
BugWEB-33528Out of memory when debugging React Native application
File WatchersFeatureWEB-33175Add File Watcher template for Prettier
HTMLBugWEB-33582Inspections - Unknown HTML Tag not working
JSONFeatureWEB-33426Support path patterns for JSON mappings
BugWEB-33444JSON Schema mappings are stored with platform-dependent slashes
BugWEB-33014"File is not a schema" error in json widget when file was manually added with a mapping to schema
BugWEB-33215JSON Schema Mappings: Empty file pattern and path should match nothing
CosmeticsWEB-33544Clean up empty items on saving JSON schema mappings
JavaScriptFeatureWEB-30594jsDoc | Add support for optional properties in @typedef with @property
BugWEB-33591Reduce availability range of some intentions for class members
BugWEB-32953No support for Node.js Async Hooks module
BugWEB-30291Flow Project errors does not show warnings if there are no errors
BugWEB-33574JS: Changing language level doesn't trigger reindexing node modules
BugWEB-32208React Stateless Functional Component autocomplete doesn't work with Flow prop types
BugWEB-33435Imported class member not resolved when using singleton pattern
BugWEB-30386TypeScript import added when pasting from clipboard into comment
UsabilityWEB-33552Autocomplete for properties doesn't show string-named items when typing a capital letter
JavaScript. FormatterTaskWEB-33431Formatting for conditional types, named and default generics, variadic tuples
JavaScript. FrameworksFeatureWEB-31654Can't autoimport React HOCs
BugWEB-33599Do not list already installed packages in New|Angular Dependency... dialog
BugWEB-33605Load karma and protractor config paths from angular.json
BugWEB-33573Do not show ng add/install things if @angular/cli is not installed
BugWEB-33575Can't create react-native project
BugWEB-31992auto-imports for scoped packages resolves to wrong file
JavaScript. InspectionsBugWEB-33610Wrong "Iterate with for..of" intention inside strings
BugWEB-33556Inspections: "Missing require() statement" inspection has no description
BugWEB-33588inspection "TypeScript | Unsound 'typeof' type guard check" is not fully correct
BugWEB-32956False positive for inspection "Primitive type object wrapper used"
ExceptionWEB-33555Throwable: Tool 'JSUnresolvedFunction' registers INFORMATION level problem in batch mode
JavaScript. RefactoringBugWEB-33107Move module member fails with resolve to implicit overload element
LintersBugWEB-33055Guessing linters shouldn’t happen while indexing on initial project generation
Live EditBugWEB-29792Live Edit: 'restart if hotswap fails' doesn't work with Node.js 8+
TypeScriptFeatureWEB-33546TypeScript service: provide show quick fixes for "suggestion" annotations
BugWEB-33590TypeScript objects with getters/setters fail type validation
BugWEB-33612Incorrect lexing of tuples in TSX tag generic arguments
BugWEB-33644Add 'extends' to the suggestion list for conditional types
BugWEB-33647Broken 'Create from usage' and 'Introduce type alias' in TSX tag generics
BugWEB-33584TypeScript Auto-complete for new Promise is worse now
UsabilityWEB-33609Inaccurate typescript autocomplete for text "ret"
Data ViewsFeatureDBE-4150Show # of selected rows in IDE
BugDBE-5204Database Table DDL does not open in active window group
SQL Code StyleFeatureDBE-4923First word right-aligned code style
BugDBE-6681Formatter unwraps MySQL-style line comments
User InterfaceUsabilityDBE-6679Provide an easy way to create custom Data Source

RubyMine 2018.2 EAP7 (build 182.3458.16) Release Notes

No subsystemPerformanceRUBY-21864Stuck on go to declaration
Code InsightFeatureRUBY-21280Exception classes are not on the top of completion in rescue block
BugRUBY-21911Invalidate ancestors caches when related stub indices are changed
BugRUBY-17797YARD defined named parameters should be resolved
BugRUBY-21690add interprocedrual support for indexing operator
BugRUBY-21820add support yield in return value during interprocedural analysis
BugRUBY-21882RConstantImpl don't add non-declaration constants to stubs
BugRUBY-21883Don't resolve attr calls to field declarations during type inference.
BugRUBY-21874Correctly resolve constant with same name as a parent class/module
TaskRUBY-21778Add rubystubs26 for Ruby-2.6.0-preview1
TaskRUBY-21855Create an automatic script for generating stubs for all supported rubies
TaskRUBY-21806Create extension point for symbolic type inference
TaskRUBY-21704Revise enumerable support in RubyMine
CucumberBugRUBY-21863add features directory to library path
DebuggerFeatureRUBY-16863set value is disabled for hash elements
BugRUBY-20684Cannot stop on the breakpoint in Rails code with Rails 5.2.0.beta2 and Ruby 2.5.0
InspectionsBugRUBY-21912False RuboCop inspection in Editor about "Carriage return character missing"
TestsBugRUBY-21887Rerun failed tests doesn't show failed tests in some cases
Code NavigationBugIDEA-194408Exception in 3rd party plugin breaks core functionality
DockerBugIDEA-158217Docker: stop and delete old container after redeploy, even if container name is not set
Editor. Code CompletionBugIDEA-193509Unintended code completion list pops up when typing non-ASCII strings
BugIDEA-193689IDEA logs of EAP version have eaten all free space of a /home - threaddumps
Editor. Color SchemesFeatureIDEA-193070"Syntax highlight > Language defaults > Parameter" should have option to inherit from "Identifiers > Default" since it's Identifier
Editor. Editing TextBugIDEA-192438Underline is always bold underline
Java. InspectionsBugIDEA-194439Regression: Enum.toString() should not be externally annotated as @NotNull
BugIDEA-194278"Too weak variable type leads to unnecessary cast" does not detect some cases
BugIDEA-191576@NotNull/@Nullable problems inspections warns where it shall not
BugIDEA-193692Dumb change proposed to misc.xml
BugIDEA-193896"Can be final" is not true
JavaEE.StrutsBugIDEA-194195OGNL Sanity Test: failed completion with OgnlNewArrayExpression
Platform APIFeatureIDEA-169107Create an API to add custom text in place of OuterLanguageElement-s to aid template data language lexer
BugIDEA-193989IDE does not start - broken icon loading by relative path and IconPathPatcher in multiple plugins
Plugin DevelopmentBugIDEA-194306Devkit: fix quick/full doc for extension point w/ "qualifiedName"
BugIDEA-194424DevKit: fix usage scope for Action/Group
Task ManagementBugIDEA-193736Task intgaration with GitLab does not work - 410: Gone error
User InterfaceBugIDEA-194010New SE: some toggles do not change their state while action performed
Version Control. GitBugIDEA-193788Git: Submodules: attempt to merge conflicts fails
BugIDEA-193140Can't undo rewording of a commit made before a merge commit and get an exception
ExceptionIDEA-194024AssertionError at git4idea.rebase.GitRebaseLineListener.onLineAvailable
XMLBugIDEA-194328Bundled XMLSchema-instance.xsd refers to nill- instead of nil-attribute
No subsystemFeatureWEB-33236Add ng add integration
BugWEB-33364Angular template reference wrong typing
DartFeatureWEB-33112Be able to run test of dart 2 code in intellij
BugWEB-33251Unable to run unit tests from folder with space in path
BugWEB-33011Unfortunate Dart formatting of syntactically valid code
BugWEB-33051Dart formatter swallows white space on line merge
DebuggerBugWEB-33398CSS Coverage is shown for the generated .css, not for the apprepriate .sass file
BugWEB-33397No CSS coverage for 'Web Starter Kit' project
JSONBugWEB-33494Incorrect handling of allOf+oneOf combination
JavaScriptFeatureWEB-22059@providesModule
BugWEB-33498Navigate/Declaration works wrong when using computed properties
BugWEB-33061WebStorm doesn't type 'this' properly when used in JSDoc
BugWEB-32421next/prev method ignores es6 object methods when {key: function} is present within a method
BugWEB-32977Undefined property assignment incorrectly triggering
BugWEB-33349Spread expression types in calls are always evaluated as 'any', that is incorrect
BugWEB-24606Intellisense taking the wrong JS file and not the one imported in require('./...) using NodeJS
CosmeticsWEB-31831Settings: JS/TS: Code generation: align fields on the page
JavaScript. FrameworksFeatureWEB-33381Show type of React props in completion popup
BugWEB-32507wrong type mismatch error when using template reference variable for <textarea> (due to uppercase-misspelling)
BugWEB-30850React Native: no completion for native components properties
BugWEB-33526React Class Component template should be 'Component' instead of 'PureComponent'
BugWEB-33451Insufficient new project name validation for latest Angular CLI versions
JavaScript. RefactoringFeatureWEB-13098Replace if/else chain with switch statement when using identity operator
BugWEB-33091UI issues with the Move Symbol dialog on resize
BugWEB-33416Disable Inline refactoring for React functional components
JavaScript. TemplatesBugWEB-18941Handlebars: avoid errors when expression is used as attribute value
LESSBugWEB-33442less file '{' expected with guard clause
Node.jsBugWEB-33263WSL: interpreter from linux is incorrect for some RC
TypeScriptFeatureWEB-33447Replace if with switch intention in should work with enums and constant variables/fields
FeatureWEB-33448Intention actions to convert TypeScript parameter-property to field and back
FeatureWEB-33291Support TS 3.0 tuples in function calls
FeatureWEB-33454Support TS 3.0 tuple type inference
BugWEB-33519Remove redundant empty line when replacing if with switch
BugWEB-33467Incorrect type text for tuples with repeating same types
BugWEB-33491Array destructuring should support TS 3.0 variadic tuples
BugWEB-33457Spread expressions in arrays are always treated as 'any'
Unit TestsBugWEB-33259WSL: interpreter from linux is invalid for Karma RC
Data ViewsBugDBE-1858Fiter in database table view does not apply to query result after cleared
IDE GeneralBugDBE-6544Fail to generate pojos.groovy on view in database

RubyMine 2018.2 EAP6 (build 182.3341.19) Release Notes

Ruby Version ManagersBugRUBY-21844Update to RM 2018.2 EAP 5: Rubies installed via rbenv are not detected
TestsFeatureRUBY-21752There is no button re-run failed tests for cucumber features
FeatureRUBY-21749There is no rerun failed test option for rake task test/spec
YAMLFeatureRUBY-20082Apply JSON Schema to YAML
FeatureRUBY-7231"Copy key" feature in YAML files
FeatureRUBY-19614Yaml. Flattening yml files for searching
No subsystemBugIDEA-193835IDEA starts with error Could not initialize class com.intellij.internal.statistic.eventLog.FeatureUsageLogger
BugIDEA-193747Clicking Help | Register does nothing in a Toolbox-installed PhpStorm
UsabilityIDEA-194132Hide JSON widget for Spring Boot YAML configuration files
TaskIDEA-194110Turn on Run Anything action in IDEA
AntBugIDEA-173612Ant coloured output configurable
DebuggerBugIDEA-193733history-paste doesn't work in debug-watches, even though it's offered
DockerFeatureIDEA-175476Add option to wrap words in docker logs
UsabilityIDEA-194040Typing in Attached Console is very slow
Editor. Editing TextBugIDEA-194054Gutter icons of the underlying code displayed on folded region quick view
Find, Replace, Find UsagesBugIDEA-193321SearchEverywhere: on scope switching the 'include non-project items' checkbox loses its state
IDE ConfigurationBugIDEA-187365Floating license activation over HTTPS on a private network: add 'Test connection' button to Register dialog
Java. InspectionsFeatureIDEA-187212Suggest to use Java 10 List/Set/Map.copyOf where possible
BugIDEA-193915Quick-fix to add generic parameter to javadoc works incorrectly
BugIDEA-193827Redundant initializer warning produces incompilable code when `var` is used (java-10)
BugIDEA-193618Invalid code generated after "Can be replaced with 'collect' call"
BugIDEA-193876Replace explicit type with var misses annotations
CosmeticsIDEA-193810Inspection 'Standard Charset object can be used' doesn't show warning for ASCII
Java. Intention ActionsBugIDEA-193829"Expand boolean" produces incorrect code when boolean is declared using java 10 'var'
Packaging and InstallationFeatureIDEA-194011Turn vcs.log.graph module into a healthy maven dependency
Project ViewBugIDEA-192364Problems with opening multiple files when Scoped view is selected
UsabilityIDEA-182143Edit Scopes option only appears in Project tool window's menu when a custom scope is selected
CosmeticsIDEA-168362Inconsistent labels in Project Tree View
Unit Testing. JUnitBugIDEA-193925Inspection "JUnit 5 malformed parameterized test" is triggered on legal source: @ArgumentsSources
BugIDEA-193920JUnit: preserve slashes in suites names
User InterfaceBugIDEA-193493"Tip of the day" pixelated but correct size with 125% DPI scaling
BugIDEA-193875Synchronise '' context menu item
Version Control. GitBugIDEA-108316Unregistered Git roots are not auto-detected if they are more than 2 folder levels deep than any project module
No subsystemBugWEB-33287Nested indices access in JsTestSourcesFilter may cause deadlock
DartBugWEB-32955Dart tab-autocompletion deletes code
DebuggerBugWEB-33288Incorrect coverage report for @angular/cli 1.7.4
BugWEB-33328Node.js remote debugger ignores breakpoints in .ts file inside Docker container
CosmeticsWEB-33294Attach to Node.js configuration: add separator
File WatchersFeatureWEB-33319Add Insert Macro button for the Program path field in File Watchers
FeatureWEB-33321Add File Watchers to Settings for Default Project
JSONUsabilityWEB-33404Add an API to suppress JSON widget for particular files
JavaScriptFeatureWEB-33343Copy path breadcrumbs to clipboard for JS/TS
FeatureWEB-18381Flow/TSX/React: provide possibility to navigate via namespaced React tags
JavaScript. FrameworksFeatureWEB-33304Remove "introduce local variable" intention for angular methods/data
BugWEB-33378Angular Schematics dialog: show completion when typing `--`
BugWEB-30682Angular. ngIf then/else block shows the error (statement expected)
BugWEB-31322Angular 5 -> Attribute i18n is not allowed here
BugWEB-28018Angular: support navigation/completion for template reference variables in `@ViewChild()` decorator
BugWEB-32323IDE doesn't recognize local variables prior to *ngFor
JavaScript. RefactoringBugWEB-33309'Move module member' should move assignments to properties
Node.jsBugWEB-33368Incorrect encoding in console.table() output
TypeScriptBugWEB-33355Generic type arguments in JSX elements should allow whitespaces between tag name and generic list
Unit TestsBugWEB-33260WSL: interpreter from linux is invalid for mocha RC
BugWEB-33356Jest: re-run failed tests can be faster
BugWEB-33353Jest, re-run failed tests: all test files are shown in the result tree
BugWEB-33354Jest, re-run failed tests: all same-named tests are run (even not failed)
User InterfaceUsabilityDBE-6527Cannot create datasource with MSSQL jdbc driver

RubyMine 2018.2 EAP5 (build 182.3208.25) Release Notes

CucumberFeatureRUBY-20444Step definitions with ParameterType aren't recognized
DebuggerBugRUBY-21826Debug is not run with rbenv sdk without bundle exec
IDEBugRUBY-21769Default Keymap is not defined on the start with clear Settings
Ruby Version ManagersFeatureRUBY-14086Please support the chruby Ruby switcher
FeatureRUBY-20370Support the asdf ruby/tool version manager
FeatureRUBY-11581Rbenv-vars support
BugRUBY-21816Ruby Arguments parameter in the Run Configuration created with old template will be not empty
TestsFeatureRUBY-1631Tests Runner : rerun failed tests action
BugRUBY-19960Cannot run unit tests with spring
YAMLFeatureRUBY-18318YAML should support custom folding markers (regions)
FeatureRUBY-2185Formatter for YAML
FeatureRUBY-10801YAML: autoindent the cursor position on Enter if the : precedes it
FeatureRUBY-10800YAML copy-paste formatting issues
BugRUBY-21783YAML Separate colon from key
BugRUBY-21784YAML Incorrect parsing in case of spaces between string scalar key and colon
No subsystemBugIDEA-193544100% CPU When Memory View (Debugger tool window) is visible
Code NavigationBugIDEA-193708Navigate from enum constant to enum class if no enum constructor is available
DebuggerFeatureIDEA-181675Cross-project HotSwap
BugIDEA-191337Select All from debug tooltip variable select code editor instead of Tooltip variable value
Diff_MergeBugIDEA-193373Diff in Commit Changes: cannot resize TTF preview below some limit
DockerFeatureIDEA-153443Base directory for Docker deployment
BugIDEA-180157Docker Run configuration : replace JSON file with explicitly listed options in CLI format
ExceptionIDEA-193603Docker: IllegalOptionException at saving run configuration with a folder instead of the Dockerfile
Editor. Editing TextBugIDEA-193436editor component draws a typed char in editor component even if a typed handler does nothing and returns STOP
Editor. Intention ActionsUsabilityIDEA-193480Unable to add annotations to parameters from the gutter icon
File SystemBugIDEA-193418Deadlock on project open
Find, Replace, Find UsagesBugIDEA-191479"Find in Path" partial results can flicker/selection is reset while the search is in progress
ExceptionIDEA-193330AIOOBE at com.intellij.ide.actions.searcheverywhere.SearchEverywhereUI$SearchListModel.getContributorForIndex
IDE ConfigurationExceptionIDEA-193753MissingResourceException: Can't find resource for bundle java.util.PropertyResourceBundle, key show.new.plugin.page
JSONBugIDEA-193494IndexNotReadyException
ExceptionIDEA-193553Error while indexing .stylelintrc
Java. InspectionsFeatureIDEA-193573IDEA doesn't recornize static import on replacing by StandardCharsets
FeatureIDEA-182699Numeric overflow: add an option to ignore if left bitwise shift result makes number negative
BugIDEA-193530"Replace with 'try' with resources" generates incorrect (and invalid) code
BugIDEA-190938Spell check should work inside raw string literals
BugIDEA-193548Redundant cast not reported on Java class fields
BugIDEA-193614IntelliJ replaces the code "var x = new Integer[]{2, 4, 8};" with invalid code "var x = {2, 4, 8};"
BugIDEA-192300Redundant If statement inspection does not work with else if
BugIDEA-193726Nullable/NotNull inspection false positive ("Parameter annotated @Nullable should not receive null as an argument")
UsabilityIDEA-193645'Collections.sort() can be replaced with List.sort()' shouldn't show warning for java 7 modules
Java. Intention ActionsBugIDEA-193499"Replace with 'if' statement" on code "var key = first != null ? first : second;" generates invalid code (for Java 10)
PerformanceIDEA-193479Java editor hangs when navigating around code that doesn't compile
ExceptionIDEA-177291Control flow fails with an exception during "Invert if condition" on incorrect code
Packaging and InstallationTaskIDEA-189413Bundle Kotlin 1.2.50 with IntelliJ IDEA
RefactoringBugIDEA-176840View / Expression Type just after closing pair character changes user selection
Unit Testing. JUnitBugIDEA-155008"Jump to source" is not available for tests that have dot in name
Unit Testing. TestNGBugIDEA-193485"Jump to source" action broken for failed tests
User InterfaceBugIDEA-193536scaling a composite icon modifies the base icons
BugIDEA-193316Font setting for IDE appearance is ignored
BugIDEA-192976MacBook Touch Bar: show debugger actions when run configuration is shown in Run Dashboard
BugIDEA-193383New SE: please remember last action I typed
BugIDEA-174739Combobox text is doubled in Android UI designer
BugIDEA-193398New SE: multi selection is not supported
PerformanceIDEA-192424Editors are leaked forever after opening, via EditorTabbedContainer.CloseTab shortcut
CosmeticsIDEA-193276Strange gray rectangle instead of disabled value when moving Class
ExceptionIDEA-193575New SE: ClassCastException on selecting filter criteria
ExceptionIDEA-186452StackOverflowError on setting Floating mode for console
Version ControlFeatureIDEA-193537Update "Commit Message History" action UI
PerformanceIDEA-174636Unregistered VCS root scanning, which happens in the Settings | Version Control, should be moved out of the EDT
PerformanceIDEA-131357Idea stucks after "accept mine" for 100 files in merge dialog
Version Control. GitFeatureIDEA-147018Delete git tag
BugIDEA-193688Squash message editor starts with an extra line break
UsabilityIDEA-180118Interactive Rebase: Clicking Cancel in the dialog to enter a message for Squashed commits should cancel rebase.
UsabilityIDEA-192333Automatically register Git submodules as VCS roots
Version Control. LogFeatureIDEA-190615Explore the source code based on specific revision
UsabilityIDEA-160834Log: do not display 2 progresses when filtering
Version Control. PerforceBugIDEA-193396Perforce: 2 default changelists are displayed by default, and the one not marked as default can't contain any changes
No subsystemFeatureWEB-31541Generate debug configuration for @angular/cli
BugWEB-33217DartAnalysisServerService trying to read files on disposed project
DebuggerFeatureWEB-23258Configurable remote mappings for "Attach to Node.js/Chrome" run configuration
BugWEB-33170Breakpoints not matched properly
BugWEB-33151NPE when hovering over field declaration during debug session
BugWEB-33132JS Coverage: create-react-app, App.js is not added in coverage result
BugWEB-33033IntelliJ 2018.1.3 does not show frames when debugging webpack
File WatchersBugWEB-33191File Watcher with custom scope is triggered on all files if this custom scope is deleted
JSONBugWEB-33179Exception while trying to add missing property to JSON file
BugWEB-32514JSON: escape tilde and slash symbols on "Copy JSON Pointer to clipboard" action invocation
BugWEB-33235JSON schema: Don't suggest non-string variants inside string literals
PerformanceWEB-33189Add file-based index for "$schema" and "$id"/"id" properties in JSON
UsabilityWEB-33265JSON Schema widget is always visible when index is being updated
UsabilityWEB-33178'Missing property' inspection in JSON should provide all missing property names at once
UsabilityWEB-20445JSON Schema: errors from schema in Event log should not be red-colored
UsabilityWEB-33103JSON Schema Mappings: no validation for empty path to file/pattern
TaskWEB-33207Limit JSON schema services only to supported files
JavaScriptFeatureWEB-31502Support for webpack 4 built-in plugin's schemas
FeatureWEB-31579Intention action to add/remove numeric separators
FeatureWEB-33195'Iterate' intention action for JS/TS
CosmeticsWEB-33186Wrong before preview for "switch" postfix action
JavaScript. FrameworksFeatureWEB-33244React: more of prop-types should be supported
FeatureWEB-29682Angular CLI 1.5 generators don't have command line arguments info
BugWEB-33114Completion of function inserts parens when completing in JSX with expected function type
JavaScript. InspectionsBugWEB-28206Allow to skip files from webpack code analysis
Node.jsBugWEB-33248'WSL Ubuntu is not available' when try to run or debug
BugWEB-32859Incorrect view of ANSI symbols in run tool window when create create-react-app project
BugWEB-33246WSL: can't configure node coding assistance
BugWEB-33256WSL: can't create project via Ubuntu legacy
BugWEB-32697Node.js: Run console width is limited to 80 symbols
TypeScriptBugWEB-33225TypeScript: better error messages
BugWEB-33194TypeScript User Defined Type Guards: Renaming parameter does not rename type gurad definition "x is Y"
Unit TestsFeatureWEB-33200Rerun failed Karma tests
BugWEB-33261WSL: interpreter from linux is invalid for jest RC
BugWEB-33218ClassCastException when rerun Jest and Mocha test in 'Run with coverage' mode
BugWEB-33216Error when rerun failed Karma test in 'Run with coverage'
SQL HighlightingBugDBE-5919DataGrip: Color coding when calling a user defined procedure with SQL Server global variables does not work

RubyMine 2018.2 EAP4 (build 182.2949.15) Release Notes

Code InsightFeatureRUBY-21733add type inference support for hashes with elements
BugRUBY-21728Incorrect exception constructor resolution due to incorrect stubs
BugRUBY-21720Variable is not used false inspection
TaskRUBY-21732Rework RCollectionType
IDEBugRUBY-21741Show Console Prompt is not presented in Debug Tool Window
Rails. Code InsightFeatureRUBY-21604Support `config_accessor`
No subsystemBugIDEA-186750Indent guides often disappear
TaskIDEA-185056Remove pin icon from quick navigate tooltip
Code Analysis. DependenciesBugIDEA-193128Type hierarchy empty element while it is loading
Code CoverageExceptionIDEA-193071Throwable at com.intellij.openapi.application.impl.ApplicationImpl.assertReadAccessAllowed
Cucumber JVMBugIDEA-192819Cucumber for Java 8 should understand string concatenation in step definition
Editor. Code CompletionFeatureIDEA-192382Override unused imports when adding class with same name
Editor. Editing TextFeatureIDEA-152160Add options to "Save as" for scratch files
BugIDEA-192970Jump outside closing bracket/quote: doesn't work if if/while/switch statements were completed
BugIDEA-190665Caret is not repainted correctly
BugIDEA-192919Custom file type: incorrect Expand selection if word is between backslashes (tested with in C files)
BugIDEA-192777Builder methods return hints duplication in the editor.
Find, Replace, Find UsagesExceptionIDEA-189500Search does not work
IDE ConfigurationUsabilityIDEA-193234Sort Live Template Scopes alphabetically
IndicesBugIDEA-193172Deadlock while typing after auto completion
Java. InspectionsBugIDEA-193102x > Double.NaN comparison should be highlighted as always false
BugIDEA-193196Wrong 'always false' warning when comparing floating point value with constant
BugIDEA-193097Redundant cast is reported for cast on functional expression inside synchronized()
BugIDEA-193096Unnecessary boxing is reported for synchronized statement
BugIDEA-193167False positive "Condition is always true" with two boolean comparisons in one expression
Java. Intention ActionsBugIDEA-193066boolean used for new symbol instead of known Object-type for intention "Create local variable", parameter etc
BugIDEA-193060"Create type parameter" intention non-sensical when assigning to unknown target
BugIDEA-193106Intention 'Replace with if statement' extracts wrong conditional expression
BugIDEA-192958"Split into declaration and assignment" is incomplete for non-terminated statement
BugIDEA-193174'Ambiguous method call' quick fix proposes int instead of Integer
Platform APIFeatureIDEA-193136Synchronous notification on file opening
FeatureIDEA-192305EditorTabTitleProvider: pass FileEditor, not just VirtualFile
TaskIDEA-193114Make property-based and code insight sanity testing frameworks available outside IntelliJ IDEA repository
Plugin DevelopmentUsabilityIDEA-193156DevKit: keep "plugin.xml" in editor tab title
Project ConfigurationBugIDEA-192913Stop updating misc.xml with test statistics
Project ViewBugIDEA-191952Scopes view: flatten packages doesn't work
Run | Debug configurationUsabilityIDEA-169476Run configurations are too easily deleted
Settings RepositoryBugIDEA-193023completion.factors.user.xml should not be synchronized by Settings Repository
Structural Search and ReplaceBugIDEA-192548Structural replace replaces arrays with plain values in method signature and class fields
ExceptionIDEA-193171Existing pattern "all methods of the class (within hierarchy)" fails
Unit Testing. TestNGBugIDEA-193024Execution hangs when Testng testsuiterunner throws runtime exception in onStart/onExecutionStart
User InterfaceFeatureIDEA-163208Add support for MacBook Touch Bar (Magic Toolbar)
BugIDEA-190948Dropdown button for elements content in Artifacts panel is not very good looking
BugIDEA-193169badly rendered SVG icons in Customize dialog
BugIDEA-133900Can't type @ in Find/Replace dialog
BugIDEA-192168Touch bar for CLion doesn't have build action
Version ControlFeatureIDEA-193058Update commit legend UI
BugIDEA-193195Compare Before with Local should support file move
Version Control. GitBugIDEA-193141Git: on saving file after Reword Commit performing i often get the File Caches Conflict dialog
BugIDEA-186342Cherry-pick with auto-commit uses full hash in the suffix, while cherry-pick showing the dialog uses short hash
UsabilityIDEA-192982Multiple Github Accounts: if default account is selected and you are logged in, use this account for sharing and skip not authenticated ones
UsabilityIDEA-163630"Cherry-picked from" suffix should be optional
ExceptionIDEA-193107IllegalArgumentException trying to open Branches menu in the detached HEAD state
ExceptionIDEA-192978kotlin.UninitializedPropertyAccessException at org.jetbrains.plugins.github.GithubShareAction$Companion$shareProjectOnGithub$1.onSuccess
DebuggerFeatureWEB-32096Show coverage on source files when source maps are used
TaskWEB-33027JS Coverage: hide the Debugger and Elements tabs in tool window, add notification
File WatchersFeatureWEB-12478Global File Watchers
JSONBugWEB-33099JSON Schema Mappings: conflicting mappings for newly added item
JavaScriptFeatureWEB-33050Support 'Jump outside closing bracket/quote with Tab' feature for Javascript/Typescript files
BugWEB-32935Install and add to dependencies should respect project package manager
BugWEB-33077Instance fields have inconsistent styling
BugWEB-33129Add keyword completion for 'new.target' and 'import.meta'
JavaScript. FrameworksBugWEB-33064Regression. imported 3rd party vue components are not resolved (vuetify)
BugWEB-33121Do not suggest running npm install when creating a new Vue project
JavaScript. RefactoringBugWEB-33049'Move into matching file' intention should escalate visibility of non-exported items in modules
BugWEB-33062`Refactor -> Move` is very slow as it checks node_modules too
TypeScriptBugWEB-32189Abstract fields should not be in suggestion list to generate getters/setters/constructors
Unit TestsBugWEB-33076org.jetbrains.concurrency.InternalPromiseUtil$MessageError: No tabs to inspect when debug KarmaHeadless test
IDE GeneralBugDBE-6544Fail to generate pojos.groovy on view in database
SQL Code StyleBugDBE-2799SQL formatting: case - when - then else alignment
User InterfaceFeatureDBE-6537Database view: add database element to a favourites by Drag and Drop
BugDBE-6551Database coloring stops working for some Editor tabs on project re-opening

RubyMine 2018.2 EAP3 (build 182.2757.25) Release Notes

Code InsightFeatureRUBY-21587Use callsite context for type inference inside code blocks
CucumberFeatureRUBY-21278Navigation from Cucumber Expression parameter to its definition
IDEBugRUBY-21622Navigation links to Views under gutters in controllers have not wrapping
ParsingTaskRUBY-21664Do not wrap rescue =>e variable in BLOCK_VARIABLES
TaskRUBY-21665Provide RArgumentList in block parameters instead of RBlockVariables for consistency
RubyGemsFeatureRUBY-21556RubyMine 2018.1.2 doesn't show the source code of the gems in external libraries folder.
YAMLFeatureRUBY-12492Add support of YAML references in structure view
BugRUBY-21661Incorrect visualization of anchor type in 'Find usages' view
No subsystemBugIDEA-182889Shortcut conflict: Rerun & Refresh
BugIDEA-192359Project Files view in CLion shows two folders as one folder named “A/B” when A doesn't have other content
BugIDEA-192799Winp exception in the log
BugIDEA-192579Breakpoints may lose urls
Code Formatting and Code StyleBugIDEA-175161Javadoc formatter joins lines incorrectly
DebuggerFeatureIDEA-191508Breakpoint intentions
Diff_MergeBugIDEA-187715Local history ignore encoding settings and show wrong diff.
UsabilityIDEA-90565Diff View:git: do not show LF|CRLF when I have option "automatically convert line separators" on
Editor. Editing TextBugIDEA-191750Expand selection (ctrl+w) doesn't work correctly for case statements
UsabilityIDEA-191765soft wrap for active editor switches off
Find, Replace, Find UsagesBugIDEA-170585Disable tooltip for regex find
JSPBugIDEA-191271Find usages doesn't find usages in JSPs
JavaBugIDEA-192293PsiUtil.isAccessible doesn't change module dependencies
Java. InspectionsFeatureIDEA-191762"Call to a native method while locked" should have exception list
BugIDEA-191856"Replace Optional.isPresent() condition with functional style expression" creates bad code when used with Type Promotion
BugIDEA-192696Javadoc Inspection doesn't catch missing @param for generic method
BugIDEA-192735Field can be local issue.
BugIDEA-192123Don't follow code after System.exit() in the nullability system
BugIDEA-192372'Annotate override method parameters as @Nonnull' quick-fix does nothing
BugIDEA-192521Expect warning "Always true" when double compared to NaN and negated
BugIDEA-192527warning persists on field when overriding @Nonnull custom annotation with a @Nonnull(When.Maybe) annotation
BugIDEA-191042"Assignment or return of field with mutable type" to ignore types like guava's ImmutableSet
Java. Intention ActionsBugIDEA-192252"Remove unnecessary parentheses" produces PSI-text inconcistency on commutative operators
BugIDEA-192541DeMorgan intentions break PSI-text consistency within polyadic expressions
ExceptionIDEA-192532PIEAE when inverting if condition on red code
JavaScriptBugIDEA-190826@NotNull method com/intellij/lang/javascript/nashorn/library/NashornJSLibraryProvider$1.compute must not return null
Packaging and InstallationTaskIDEA-192733Update bundled JDOM to 2.0
TaskIDEA-166447Provide separate application icon for EAP distributions
Platform APIUsabilityIDEA-192560ReplaceConstructorWithFactoryDialog has non public constructor
TaskIDEA-192805Clean up values set by Look-n-Feel
Project ViewBugIDEA-192028Directories with dots in the name show up incorrectly in Project pane
RefactoringBugIDEA-191733Copy file dialog: selection with mouse does not select words
TerminalBugIDEA-118871Integrated terminal doesn't scroll to bottom on "movement-keys"
UsabilityIDEA-186170Enter key in terminal doesn't scroll down
CosmeticsIDEA-126617Resizing terminal moves caret
Unit Testing. JUnitBugIDEA-189761Missing stdout for failed tests when loading in-memory test history
User InterfaceBugIDEA-192055Focus goes nowhere after breakpoint popup
BugIDEA-192691Wrong title of JetBrains Privacy Policy window
BugIDEA-192720Selection in Local changes resets when context menu invoked via keyboard
BugIDEA-192713focus is lost on opening Find Usages tool window
BugIDEA-191613Structure tool window steals focus (regression)
BugIDEA-191807Cannot paste file into Scratches
TaskIDEA-192417Provide an API for adding status bar widgets
Version ControlBugIDEA-192552CloneDvcsDialog#prependToHistory: Cannot use this method with a non-Mutable data model
Version Control. GitFeatureIDEA-192369Allow configuring VCS icon group in "Appearance & Behavior | Menus and Toolbars"
FeatureIDEA-75835Init Git projects submodules automatically or by asking user at least?
FeatureIDEA-74492Git: Checkout tag or revision: provide a list of available tags in combobox
FeatureIDEA-192678Multiple Github accounts: show login dialog if attempt to perform the remote operation fails
BugIDEA-192800Allow force push is available in Find action but does nothing
BugIDEA-192906Git Push with Rebase puts all changes into the Default changelist
No subsystemBugWEB-33007Folder is automatically being excluded, cannot be undone
BugWEB-32985Documentation popup: gear icon overlaps with the text
BugWEB-33002'Change signature to match and update call' removes 'new'
CoffeeScriptBugWEB-32778CoffeeScript "code reformat" change semantics of the string tag
BugWEB-32793Class as prop value error: unexpected indentation
DartFeatureWEB-32957Dart Command line app / Flutter app debugging: make 'Evaluate Expression' available not only when paused on a breakpoint
BugWEB-32974Incorrect 'Pin Tab' icon in Dart 'Get Dependencies' console.
DebuggerBugWEB-32921Turn off breakpoints when run js with coverage
BugWEB-32851Debugging Karma tests with karma-browserify not working sometimes
BugWEB-33020IndexOutOfBoundsException when stop JS 'Run with coverage'
HTMLBugWEB-31136SVG attributes marked as not allowed in injected HTML fragment
JSONFeatureWEB-32826JSON schema: Provide quick fixes for schema incompatibility errors
BugWEB-32972JSON switcher: schema causes conflict instead of switching for a file in nested folder
BugWEB-32960JSON Schema switcher: applying schema for the file for several times multiplies this file in Schema Mappings
JavaScriptFeatureWEB-32924Better default values for object literals, tuples, arrays and functions
FeatureWEB-32919Support 'import.meta' metaproperty
BugWEB-24263Scratch files don't support ES6
BugWEB-32006assignment to es6 class properties are considered redefinement and marked as unused (possible 2018.1 regression)
BugWEB-32971Do not show 'with' keyword on top of completion
BugWEB-32966No completion for `async` keyword after `=` in function expression
ExceptionWEB-32917Mac. exception in JSUnusedGlobalSymbolsInspection
JavaScript. FrameworksFeatureWEB-30481Code completion for Vue events and event modifiers
BugWEB-32583Vue project generation fails with @vue/cli 3.0.0-beta.9 and later
BugWEB-32949Exception when renaming methods/data in .vue files
JavaScript. RefactoringBugWEB-32849Move module member: dependent member highlighting in dialog has wrong color
LintersBugWEB-32991Code styles from ESLint config inside package.json are not applied
TypeScriptFeatureWEB-32847TS. Suggest inline implementations for abstract classes in the completion after the "new" keyword
FeatureWEB-31994TypeScript: Make method protected (on call from derived class)
FeatureWEB-32997Suggest static factory methods based on expected types
FeatureWEB-32988'Is not accessible' inspection and quickfix "Make constructor public" for private/protected constructors
FeatureWEB-32945TS: completion after 'new' should assign higher priority if contextual type is a supertype
BugWEB-31742Typescript. Incorrect type inference for array after ternary operator
BugWEB-32241Generic TSX component tag without any attributes is parsed incorrectly
BugWEB-32788TypeScript return value checker erroring when using indexable types
BugWEB-32989Classes with private/protected constructors are suggested after "new" word outside their visibility zone
BugWEB-32965Incorrect unresolved 'super' in case of object literals
BugWEB-33001Bad "Must be lvalue" inspections in typescript
BugWEB-32524Traversing base types for non-implemented members doesn't take into account type members from aliases
BugWEB-32952Incorrect errors with class expressions
BugWEB-32943Error about non-implemented members is not shown for unnamed class expressions
BugWEB-32593TypeScript: Renaming an interface member doesn't rename usages in curried functions
TaskWEB-33010TypeScript: remove "rxjs" from default blacklist
TaskWEB-33013TypeScript: enable excluding js sources for node modules packages with typings
Unit TestsBugWEB-9523An issue of running Node.js task & karma server at same time
No subsystemBugDBE-6451DataGrip: Execution of SQL command does not ask for colon-parameter values if not whole SQL command is selected
Data ViewsBugDBE-6436Filter correction does not bring back matching column list
IDE GeneralFeatureDBE-6502YAML plugin in DataGrip
SQL GenerationBugDBE-6473"Request and copy original DDL" action fails

RubyMine 2018.2 EAP2 (build 182.2574.11) Release Notes

RefactoringsFeatureRUBY-21634Intention to replace `if` with `unless`, `while` with `until` and similar
UsabilityRUBY-21633Do not introduce `then` after `if`s in intentions/quickfixes
YAMLFeatureRUBY-21454Implement anchors and aliases support in YAML
FeatureRUBY-15844Support find usages for YAML aliases and references
BugRUBY-15112HippieCompletion should not delete node alias indicator
No subsystemPerformanceIDEA-172762ProjectRootManagerComponent$1.fileTypesChanged on AWT causes 30-60s freeze
ExceptionIDEA-192088Exception when starting IntelliJ
Code Analysis. InspectionFeatureIDEA-49092Inspection profiles: provide possibility to create a scope from inspections dialog
BugIDEA-192189"Settings" button disabled in inspections result if focus is in editor
Code CoverageUsabilityIDEA-192287Show full package name at coverage view
Code Formatting and Code StyleBugIDEA-191843"Adjust code style settings" adds additional chars
DebuggerFeatureIDEA-186951Caller method filter
BugIDEA-94049Debugger: Return ability to set field watch point via alt+gutter click
Diff_MergeUsabilityIDEA-191716"Cancel Visual Merge" dialog is shown even with no modifications when pressing Esc
UsabilityIDEA-182230VCS "visual merge" window: don't ask "Are you sure" if there was no changes
Editor. Code CompletionUsabilityIDEA-144321LookupElementProximityWeigher should work for all lookup items that have PSI
JavaBugIDEA-191988Template languages: outer elements shouldn't be inserted as the very first children of template data Java elements
Java. InspectionsBugIDEA-192226Don`t inlined a value if the character is '\n'
BugIDEA-192301"Extract common part" loses comment
Java. Intention ActionsBugIDEA-192268ConvertToLocal intention for field incorrectly treats its javadoc comment
Packaging and InstallationFeatureIDEA-187763Register our IDE for compatible file type on macOS
CosmeticsIDEA-161414"Profiling agent is not enabled" should not be a WARN log entry and / or chatter to the terminal
TaskIDEA-192182Extract sources of java annotations to separate GitHub repository
Password SafeUsabilityIDEA-191264Uncheck remember on push credentials dialog by default
Platform APIMeta IssueIDEA-175637Check in tests that PSI text can be parsed back to a similar PSI structure
Plugin DevelopmentBugIDEA-191217Devkit: "Element should be registered in ..." false positives
BugIDEA-163694Devkit: fix IdeaPlugin DOM
Project ConfigurationUsabilityIDEA-192234Quickfixes offer to add annotation and junit jars from IDEA installation directory to project configuration
RegExpBugIDEA-191355SingleCharAlternationInspection quick fix produces inconsistent PSI
BugIDEA-186023Regexp: "Single character alternation" quickfix yields invalid code
User InterfaceBugIDEA-191122"Captured Snapshot" notification's "Show in Explorer" link does not work when IDEA is installed on alternate drive letter
BugIDEA-151301Navigation over highlighted search matches in "Override/impl method" dialog only works for method names
BugIDEA-192157When configuring touch bar, I would like to be able to see changes instantly.
PerformanceIDEA-192184Goto Class/File/Symbol popups leak via native window and focus traversal policy
Version ControlBugIDEA-192203keymap "Xcode" not found warnings on startup from Git4Idea & hg4idea
BugIDEA-115100Maven project import sets Subversion VCS for submodules, if there is a folder or file called .svn in parent folders
PerformanceIDEA-192017Unshelving creates a thread for each shelved file
Version Control. GitBugIDEA-180112IDEA stores passwords in memory even when "Remember" is unchecked
CosmeticsIDEA-192092Rephrase a notification that appears when users switch branches
CosmeticsIDEA-192384History for Selection shouldn't be visible in the context menu of Project Files
Version Control. SubversionBugIDEA-192371NPE on importing project with directory mappings set to "Subversion", but without real svn working copy
No subsystemBugWEB-32769Webpack config rejects automaticNameDelimiter optimization setting
BugWEB-32040Missing support for JSON in Prettier
CosmeticsWEB-32801Webpack option schema has a wrong link in the inspection description
CSSFeatureWEB-24774Support inline comments in PostCSS
FeatureWEB-32672WebStorm doesn't recognize backdrop-filter
FeatureWEB-25011Colors and Fonts/CSS should have it's own field for class and attribute identifiers
BugWEB-26368CSS '/deep/' combinator causes 'unexpected token' error if it's the first item in selector list
BugWEB-26828reformating CSS with :host >>> subselect ends up with :host > > > subselect
BugWEB-22895PostCSS: Colors & Fonts: arithmetic symbols are not colored
BugWEB-22894PostCSS: Colors & Fonts: Tag name is not colored
BugWEB-22893PostCSS: Colors & Fonts: unknown-at-rule cannot be colored
BugWEB-28165Wrong CSS syntax check for @apply rule
BugWEB-24628CSS: string literal with backslash as property value is not parsed correctly
BugWEB-24619BUG: PostCSS code completion doesn't work right before an &-sign (Ampersand).
ExceptionWEB-22810"PSI and index do not match" exception while editing CSS
DartFeatureWEB-32909Provide code completion when editing Dart breakpoint condition and in Evaluate Expression dialog
DebuggerFeatureWEB-14403Drop to frame / Restart frame not available in JavaScript debugger
BugWEB-32714Debugger steps into node_modules even if "Do not step into library scripts" is enabled
BugWEB-32908Can't resolve breakpoints in webpack 3.X project
BugWEB-32389Assertion failed: Debug tool window not initialized yet!
PerformanceWEB-31775Debugger: false stops in same-named files cause delays when debugging
UsabilityWEB-32843Node.js global.console has duplicate logs in Console tab when Debugger Console tab is hidden, when debugging
UsabilityWEB-32810Add to watch is not always possible in JavaScript
JSONBugWEB-32038JSON schema for multiple projects
BugWEB-32852JSON schema switcher: correctly map built-in and local schemas when remote sources are not allowed
BugWEB-32853JSON schema: do not remove manually added schema on schemas reassign
UsabilityWEB-32878Not clear behavior when trying to use json schema outside of the project
JavaScriptBugWEB-32790WebStorm decides to stop accessing .d.ts files for es features for a project
BugWEB-32691'Implement missing members' for object generates redundant comma
CosmeticsWEB-32663Remove "Implement methods" for objects without contextual type
JavaScript. FormatterBugWEB-29105JSX in vue uses HTML indentation settings
JavaScript. InspectionsBugWEB-32839Wrong warning var' variables cannot share name with block sc...
JavaScript. RefactoringBugWEB-32838Rename should not change default re-export
BugWEB-32829Introduce var: wrong caret position after introduce variable /var postfix template
LESSFeatureWEB-24450Copyright plugin: support Less, Stylus and PostCSS file types
BugWEB-20921Add support for valid HTML syntax for including LESS/SCSS in <style> tags
LintersFeatureWEB-30482Apply code style from ESLint JavaScript configs automatically or show notification
BugWEB-28870Support for "extends" in TSLint
BugWEB-32110Allow comments in specific JSON configuration files
Node.jsFeatureWEB-28587Understand module field in package.json
FeatureWEB-32689Understand esnext field in package.json
TypeScriptBugWEB-32792Typescript: quick documentation doesn't show properties of type aliases
Unit TestsBugWEB-32653Can't run Karma in @angular/cli 6 project
BugWEB-32883Cannot run karma tests in @angular/cli 6 project with multiple targets
DB ConnectivityUsabilityDBE-6321Postgres: if database in connection parameters differs from the database selected in Schemas tab IDE may fail to connect
DB IntrospectionBugDBE-6409MariaDB schema discovery fails with: Unknown column 'purchase_date' in 'field list'
IDE GeneralUsabilityDBE-6405Query plan fails for sub-queries in sqlite
SQL EditingFeatureDBE-2647Custom Parameter %VAR% not working when wrapped in single quotes.
SQL HighlightingFeatureDBE-521Psi aware brace highlighter
User InterfaceCosmeticsDBE-1851Clearer connection status indication

RubyMine 2018.2 EAP (build 182.2371.40) Release Notes

No subsystemFeatureRUBY-21128Support Debian and Kali distributions in WSL
BugRUBY-20326long delay (~4sec) when selecting and right clicking classes (e.g. .col-xs-12) in haml
BugRUBY-21077Do not wrap conditions in parentheses
BugRUBY-21004Set value for Array item is broken
UsabilityRUBY-21123Code completion firing when not needed
TaskRUBY-20997Introduce `{class,module}_eval` blocks de-anonymization
TaskRUBY-20996Introduce explicit singleton/superclass/include/extend retreival
ExceptionRUBY-20815Exception during statistics calculation
Code InsightFeatureRUBY-20979Provide completion in documentation comments
FeatureRUBY-21068Resolve does not know about define_singleton_method
BugRUBY-21047Postfix completion .par for all expression add double parentheses
BugRUBY-21101Review and remove excessive postfix completion templates
BugRUBY-21140Postfix completion 'def' puts expression into body of the method
BugRUBY-21043assert_selector and assert_text are resolved incorrect in test
BugRUBY-19952Irrelevant completion list
BugRUBY-17695No completion for named arguments
BugRUBY-21051Rails method layout in controller is not resolved into Rails
BugRUBY-21054Resolving for self.methods was changed
BugRUBY-21060Postfix completion could remove element instead of wrapping in views
ExceptionRUBY-209112018.1 EAP IDE fatal error: Parameter specified as non-null is null: codeInsight.ArgMapping.getIncomingType, parameter argument
DebuggerBugRUBY-21143Stable/Experimental debugger feature toggle
DockerBugRUBY-21022Docker-compose integration doesn't work
IDEBugRUBY-20932Rake tasks cannot be found by namespace
UsabilityRUBY-20955Rails console via Run Anything is shown without prompt
InspectionsBugRUBY-21025RubyLiteralArrayInspection throws exception when Inspect code for all project is run
UsabilityRUBY-20688Rubocop is constantly report about errors and switch focus to the Message tool window
MarkdownBugRUBY-20855Markdown xml fragment preview
TaskRUBY-18089Make JavaFX preview default one and get rid of the Lobo
RHTMLUsabilityRUBY-15663Incorrect behavior of line comment on printing some data in html
RailsBugRUBY-21096False warning for `next` in scope
RefactoringsFeatureRUBY-20744Convert double quote to single quote string intention
Ruby Version ManagersBugRUBY-21108Sdk libraries are not attached into External Libraries
BugRUBY-21003Multi-user RVM sdks are not detected
RubyGemsBugRUBY-21040Two SDKs are selected simultaneously
Run ConfigurationsBugRUBY-21090Run anything does not work with scratch files
SlimBugRUBY-20577Can not edit slim files
TestsFeatureRUBY-17548rubymine should support rspec be_empty building matcher
TextMate BundlesBugRUBY-21041textmate bundles use wrong theme which can't be changed
No subsystemFeatureIDEA-188135Don't report always true asserts: support expression parts; support assertion methods
BugIDEA-186858Scrollbars not visible in Run and Debug output - can't scroll
BugIDEA-187609NPE in sheets when project does not exist
BugIDEA-187695Idea logging from the "Periodic tasks thread" leads to a deadlock
BugIDEA-76438Directory diff: can't resize the columns
BugIDEA-185805Reset Default Scheme removes duplicated Scheme
BugIDEA-191955Focus is lost during typing
BugIDEA-187611Support custom icons for NamedScope to use it in the Project toolwindow
BugIDEA-187505Locally-referenced images are not displayed in quick doc
BugIDEA-185285Navigate Class/File/Symbol, Find in Path popup windows don't pick characters from input method
BugIDEA-187182Project encoding wrong after first opening of a solution
BugIDEA-186977NullPointerException appears on Welcome screen after typing
UsabilityIDEA-84622Default "Open directory/project" path and better navigation
UsabilityIDEA-187112UML diagrams: use editor background color for UML tab background on darcula
TaskIDEA-187791Make JButtons colorable
ExceptionIDEA-187858NPE on search in settings if nothing was found
Code Analysis. DependenciesBugIDEA-187189Analyze Dependency Matrix does not found a class if there is a package with same name
Code Formatting and Code StyleFeatureIDEA-152088Java Code Style. Add option to not line wrap on import statements
FeatureIDEA-98499Allow staticly imported class members to have a different style than other constants
BugIDEA-166202<pre> tags in Javadoc should not be wrapped
BugIDEA-186983NullPointerException at saving changed code folding settings
BugIDEA-21623Formatter does not respect <pre> tags with attributes
BugIDEA-158493Code formatter adds empty strings when breaking up too long string literal.
Code NavigationPerformanceIDEA-187744High CPU usage when idle, never stops
UsabilityIDEA-187037Provide ability to change name and presentation of 'Navigate | Class' aciton in IntelliJ-based IDEs
ColdFusionExceptionIDEA-188010Unsatisfiable dependency on disabled IntelliLang plugin
Cucumber JVMBugIDEA-185206Cucumber plugin seems not to include asserts of @After Hooks
BugIDEA-186701Cucumber java run config loses "Glue" and "Feature or folder path"
DebuggerFeatureIDEA-153569Copy current thread stack trace
BugIDEA-187709Huge number of captureXXXX.props files created under C:\Users\Миша\AppData\Local\Temp.
BugIDEA-187528Quick evaluate with lambdas broken
BugIDEA-187338Async stacktraces may not work with several debug sessions
BugIDEA-187968Expressions in window watches are not editable
BugIDEA-184352java.io.FileNotFoundException
BugIDEA-186803Debugger frame view doesn't show recursion depth if "show package names" option is off
BugIDEA-183804Update default remote debugger config for jdk9
BugIDEA-181303java.lang.IllegalArgumentException by org.jetbrains.org.objectweb.asm.ClassVisitor while running JUnit tests with latest EAP
BugIDEA-172425debugger under jdk9 throws NoClassDefFound
BugIDEA-187632Remove extra colon in breakpoint configuration
PerformanceIDEA-187063During debugging IntelliJ IDEA gets extremely slow
PerformanceIDEA-184521Please re-enable killing processes via WinP
UsabilityIDEA-186171Turn breakpoint condition field background to pink when there is a syntax error
DecompilerBugIDEA-187608java.lang.ThreadDeath on initial opening of decompiled class
DockerFeatureIDEA-185384Docker. Support --cpus command line option
FeatureIDEA-184656Support --shm-size, --security-opt, --name options
BugIDEA-186907DockerCompose. RunConfig: IDE fatal errors at attempt to choose services for some compose files
BugIDEA-187014DockerCompose: Two nodes instead of one when folder name contains punctuation
BugIDEA-187158DockerCompose: RunConfig. Different path separators: "/" and "\" in the "Compose Configuration Files" dialog
BugIDEA-187326Invalid target key inspection in docker-compose.yml
BugIDEA-186952DockerCompose. RunConfig. Choose Configuration File dialog: disable "Ok" until we choose or auto-detect any file
BugIDEA-186890DockerCompose: correct the path to the chosen compose file: display all the "/" in the same way
BugIDEA-186939DockerCompose: No values are taken from .env file
BugIDEA-186934DockerCompose: Deployed ok, but the content of the docker-compose node is empty
BugIDEA-187035DockerCompose: RunConfig: "Environment variables" field. Cut spaces at the beginning/end when saving
BugIDEA-187009Docker, DockerCompose. DockerView: "Show stopped containers" filter doesn't work
BugIDEA-187496DockerCompose: False inspection error for the value: ulimits
BugIDEA-178756compose YAML: support types with different scalar / sequence / dictionary representation
UsabilityIDEA-187279DockerCompose: Rename "Force build" option
UsabilityIDEA-187016DockerCompose: Provide navigation by F4 and double-click from any compose node to the corresponding configuration file
UsabilityIDEA-187025DockerCompose: Change the icon for the root docker-compose nodes
UsabilityIDEA-187040DockerCompose: RunConfig. "Choose configuration file or folder" dialog: provide multi-selection.
Editor. Code CompletionPerformanceIDEA-186114Code completion is extremely slow
Editor. Editing TextFeatureIDEA-178801Multi-line pasting in line comments
BugIDEA-189650IDE closes empty files when restarting
BugIDEA-187135Pasting multiple lines of Javadoc is broken
BugIDEA-184675Structure view: incorrect, unexpected Expand behavior
BugIDEA-187042arg postfix template incorrectly replaces whole line
ExceptionIDEA-187187Save settings failed: "Cannot get ScratchFileService component state"
Find, Replace, Find UsagesBugIDEA-187131Find popup shows incomplete usages and doesn't indicate they're incomplete
BugIDEA-185627Regression: 'Search/Replace in Path' popup doesn't find usages under .idea directory even if explicitly invoked on that directory
BugIDEA-186556Find symbol should show [jdk9] module at beginning of the list when exact name entered
UsabilityIDEA-175973Enter file name search popup is not closing itself after losing focus when no value available in textbox.
UsabilityIDEA-186671Find in path: automatically include project files into search scope if *.iml is set as a file mask
HTML.PreviewBugIDEA-184915IntelliJ doesn't rescale an SVG properly after editing its viewbox property
IDE ConfigurationBugIDEA-187735Comment live template macros show long description text in completion
IndicesPerformanceIDEA-186709freezes on older project open/branch checkout
Java. InspectionsFeatureIDEA-171940Add "ignored if annotated by" to the "Interface which has no concrete subclass" inspection
FeatureIDEA-187022LinkedList should be included into scope of inspection 'Redundant Collection.addAll'
FeatureIDEA-175914Reactor inspection: Unfinished StepVerifier
FeatureIDEA-187213Stream API migration: support Java 10 toUnmodifiableList/Set/Map collections
FeatureIDEA-187211Suggest using StandardCharsets.XYZ instead of "XYZ" where possible
FeatureIDEA-187214Stream to loop inspection: support Java 10 toUnmodifiableList/Set/Map
FeatureIDEA-187215Support Java10 toUnmodifiableXYZ collectors in dataflow
FeatureIDEA-186797'Result of method call ignored' should check methods from java.lang.Thread
FeatureIDEA-176358Improve Unnecessary call to 'String.valueOf()'
FeatureIDEA-184148Inspection to warn if module-info.java contains less dependencies than project model/used by code
FeatureIDEA-187123Refactoring suggestion of boolean expression to stream
FeatureIDEA-186380Restore "Optional.get() without Optional.isPresent()" as a separate inspection
FeatureIDEA-187130Inspection: Comparison of primitives with compareTo()
FeatureIDEA-187548Show generic parameters as redundant for non-generic method
FeatureIDEA-187349Inspection Unnecessary call 'toString' should be smarter
FeatureIDEA-187578Inspection to detect when Optional is compared with null
BugIDEA-188088Suspicious parameter/name combination does not work for camelCaseWords
BugIDEA-187645NPE warning is not issued when "null -> null" method is called with Nullable argument
BugIDEA-187205Redundant cast false positive
BugIDEA-187410Unnecessary call to 'String.valueOf()' problems
BugIDEA-188026Inspection "'if' statement replaceable with 'switch' statement" can introduce NPE
BugIDEA-186852Incorrect refactoring for Float.valueOf(0x123) and Float.valueOf(0123)
BugIDEA-188117"Remove redundant call to String.format()" loses comment
BugIDEA-187321Static method referenced via subclass should warn on method reference
BugIDEA-187506Deprecation inspection actions should insert SuppressWarnings instead of noinspection
BugIDEA-186732Incorrect nullability analysis when using method reference
BugIDEA-184105"too broad scope" false positive
BugIDEA-187941Field naming convention: "Constant with mutable field type" does not recognize UnmodifiableCollection
BugIDEA-187094Assume.assumeNotNull() from JUnit is not taken into account by the NullPointerException-related inspection
BugIDEA-187974Good code red: don't warn on method references if static method is called on a class inheritor
BugIDEA-188134Set inspection option fix does not work when options differ by scope
BugIDEA-187493False "Field may be final" inspection
BugIDEA-187756Variable initializer is redundant false-positive when the value is read before write
BugIDEA-187758Variable initializer is redundant false-negative with chained constructors
UsabilityIDEA-187319Rationalize static field reference on subclass can be cleanup inspection
CosmeticsIDEA-186767Magic constant: false positive for JFrame.EXIT_ON_CLOSE
ExceptionIDEA-186946TooBroadScopeInspectionBase: ClassCastException: com.intellij.psi.impl.source.PsiJavaCodeReferenceElementImpl cannot be cast to com.intellij.psi.PsiReferenceExpression
Java. Intention ActionsFeatureIDEA-187224Add inspection for substring with String#length as second param
BugIDEA-187524"Move assignment to field declaration" loses comment on class initializer
BugIDEA-188072"Merge sequential if" exception when there's intervening comment
BugIDEA-188021"Move assignment to field declaration" leaves comment in class initializer
BugIDEA-186826"Add on-demand static import" removes method reference qualified
BugIDEA-188061'Replace qualified name with import' on inaccessible class reference in Javadoc results in red code
BugIDEA-188063"Replace method reference with lambda" loses comment
BugIDEA-188068Variable might not have been initialized if a method is missing the return type
BugIDEA-185629When «Private field is never assigned» «Suppress for fields annotated by ...» is sometimes absent in popup.
BugIDEA-187531"Add on demand static import" with intervening comment and an empty line breaks code
BugIDEA-187940Annotation parameters are not copied when implementing methods
ExceptionIDEA-187526"Add static import" with an intervening comment leads to exception
ExceptionIDEA-188113"Create property appOutputPath" leads to exception
JavaEE.JBossBugIDEA-187787Unable to deploy on WildFly 12 Final with Java 9
KubernetesFeatureIDEA-185224Kubernetes: Yaml. Validate Integer values
BugIDEA-187853Kubernetes. Yml. Labels: false inspection by empty label values
BugIDEA-187357Kubernetes. Yml. Labels: false inspection by empty labelValue and absent error at key/value ending with "_"
BugIDEA-187343Kubernetes: improve "Change Notes" for plugin
BugIDEA-184998Kubernetes: Yml. QuickHelp. Show it for the completion list items
UsabilityIDEA-183805Kubernetes: update the view of the quickhelp
Packaging and InstallationBugIDEA-188130Launcher should be able to recover when config/port contains invalid value
Platform APIPerformanceIDEA-187382Documents for LightVirtualFile's are leaked via SmartPointerManager
Plugin DevelopmentUsabilityIDEA-187502Add module for IntelliJ IDEA Community as well as joint module for both Community and Ultimate
Plugin ManagementBugIDEA-182869Plugin update fail if requested with major version IDE patch update
UsabilityIDEA-176508Unable to install plugins when their download URL returns 307 redirect
Project ConfigurationBugIDEA-186834Creating a project in the drive root adds the second backslash leading to the wrong project working directory for Run Configurations
BugIDEA-182850Module with a dot in the name is displayed as if it were a module group
BugIDEA-187313New Project Wizard unexpectedly replaces path by '~'
BugIDEA-187885Modules may disappear from 'Load/Unload Modules' dialog
RefactoringBugIDEA-176840View / Expression Type just after closing pair character changes user selection
Run | Debug configurationBugIDEA-187519Run button not disabled for for debug only run/debug configurations
BugIDEA-184007Run dashboard debugger window very narrow
Structural Search and ReplaceBugIDEA-187291Replacing an XML tag set as target does not work correctly
BugIDEA-176024Adding an annotation with structural replace breaks a nested class reference in annotation parameters
BugIDEA-146380Structural replace fails
BugIDEA-187663JavaScript replace replaces only first statement of multiple statement result
BugIDEA-187725Bad Groovy script can cause exception
BugIDEA-187436Malformed pattern warning expected on incorrect use of variables
BugIDEA-187437ActionScript annotation matching incorrectly matches attributes
BugIDEA-187532Reference target constraints panel visible for replacement variable
ExceptionIDEA-141767NPE at at com.intellij.structuralsearch.plugin.replace.ui.ReplaceUsageViewContext.replaceOne(ReplaceUsageViewC ontext.java:130)
Task ManagementBugIDEA-187507Cannot save Trello integration settings in 2018.1
BugIDEA-187128Generic task server configuration cannot be saved in settings
Template Languages. FreeMarkerBugIDEA-187664FreeMarker continue directive not supported in plugin
TerminalBugIDEA-186950Exception on trying to evaluate java program that throws exception in terminal
ExceptionIDEA-187084StringIndexOutOfBoundsException when execute Jest ui test
UMLBugIDEA-187287SVG UML Diagram Export results on zero length file
Unit Testing. JUnitFeatureIDEA-186922Spock library not found : no FIX
User InterfaceBugIDEA-187834Replace translucent text rendering in tab pane with opaque one using premultiplied alpha and srcOver rules
BugIDEA-187932Invoking some features does not affect productivity guide statistics
BugIDEA-184963"Diff Viewer" switch via popup breaks focus
BugIDEA-186564Default size of Edit configuration -> tasks before launch is just for 1 step
BugIDEA-186229'Search everywhere' loses focus after some item selecting by mouse in the drop-down
BugIDEA-187482ToolWindow header becomes active when context menu is invoked on editor
BugIDEA-186989Invoking "find action" in Evaluate dialog moves focus to the main window
UsabilityIDEA-187091'Mark Directory as | Unmark root' option name is confusing
CosmeticsIDEA-174261"Unused declaration" inspection settings has ugly buttons
Version ControlBugIDEA-187108Commit action does not respect file selection in Local changes
BugIDEA-187101EAP #IC-181.3870.7:Create partial patch does not work as expected
BugIDEA-186725Changes grouping by repository: confusing results for external VCS root if group by module is used
UsabilityIDEA-187405Copy to clipboard can copy the currently visible in-place diff instead of the just selected text in editor
Version Control. GitBugIDEA-187375Partial commit checkboxes are not always shown
BugIDEA-187702Git: Resolve conflict during rebase - "Accept Theirs" does not work
BugIDEA-187706Partial Commits: First included file is not selected in commit dialog by default
BugIDEA-187335On Partial Shelve reverts only selected changes are shelved, but the whole file is reverted
BugIDEA-187748Partial Commit: can't move file with changed line separators to another changelist
BugIDEA-185964Git: Partial Commits: after turning the HighlightFilesFromNonActiveChangelists ON the behavior becomes unpredictably wrong
BugIDEA-187425Partial Commits: Exclude Lines From Commit action does not work with deleted blocks
BugIDEA-187426Partial Commits: Exclude Lines From Commit action does not work with selection in left editor
BugIDEA-187498On partial shelve the changes excluded from shelve are moved to default changelist
BugIDEA-140196Built-in SSH: does not support strong security ciphers - Cannot negotiate, proposals do not match
BugIDEA-185221Git 2.16 considers Builtin SSH as simple client => `ssh variant 'simple' does not support setting port` error on remote operations
Version Control. PerforceBugIDEA-187738Changelist is duplicated in IDEA after partial commit (Perforce)
No subsystemBugWEB-31307'Reformat with prettier' action is disabled on first opening of project
BugWEB-31520TypeScript parse/syntax error: "formal parameter expected"
BugWEB-31206Renaming exported const does not rename import statement
BugWEB-31399Surround with Emmet doesn't work with linewise selection of JSX
BugWEB-31108"closing tag matches nothing" shows on the correct tag of vue file
BugWEB-31444When debugging Node.js, computer logs out after a while
BugWEB-31461prettier: should use builtin config cache
BugWEB-31412React Native Run configuration does not start
Build toolsFeatureWEB-30117Allow to remove/disable gulp tool window
CSSFeatureWEB-7317Provide option to complete styles from all CSS files even if current file has a style tag
BugWEB-31567'<?php' symbols in CSS class completion
BugWEB-31295CSS code completion is shown in JSX after className=<space>
BugWEB-18258Update css-text spec
PerformanceWEB-30965Slow CSS completion
CoffeeScriptBugWEB-31455CoffeeScript the "from" operator is not highlighted in orange
DartBugWEB-31074Formatting a dart file with syntax errors reformats the file with one token per line
BugWEB-31403Dart Structure View missing sort button
BugWEB-27128When no selection for Extract Method, IDE sets it to the full line
BugWEB-31482Intention action list is sometimes wrong in Dart
BugWEB-31486Dart code completion list is incorrectly sorted
TaskWEB-31498Auto-exclude .dart_tool folder
DebuggerBugWEB-31589Warning about breakpoints in JSX tags with event handlers
BugWEB-31314Client-side debugging pauses in same-named files loaded before the file breakpont is set in
File WatchersBugWEB-31413File watcher (prettier) marks files as generated files
UsabilityWEB-27952File Watchers which modify the current file cause prompts to Reload From Disk on Undo
HTMLBugWEB-26242HTML: Code styles: Project scheme doesn't use quote marks value
JSONFeatureWEB-31912Add support for extension JSON schema property for pure HTML description
UsabilityWEB-31904Kubernetes. Json. Add "type" tip into the inspection error description.
JavaScriptFeatureWEB-31369Support revised standard for template strings lexing
FeatureWEB-30918webpack 4: exclude dist folder by default
FeatureWEB-27638Support Named capture groups for JavaScript RegExps
FeatureWEB-24395Flow: Type annotations need a different color
FeatureWEB-27640Support RegExp lookbehind assertions
FeatureWEB-31275Intentions: 1) move type into separate file with matching name, 2) rename file to match type name
FeatureWEB-31578'Introduce variable' intention action
FeatureWEB-31581Code style for JS file names
FeatureWEB-29250Support yarn workspaces (better indexing of node_modules parent directories)
BugWEB-29193JSDoc formatting of @example blocks could be better
BugWEB-31695'Implement methods' quick fix generates prototype-based members for a class expression
BugWEB-31629Flow: cannot parse signature with multiple parameters represented by union types
BugWEB-31616Flow: 'declare export default' is supported incompletely
BugWEB-31665"Implement methods" cannot generate paired accessors and async/generator methods in pure JS
BugWEB-31610Cannot parse valid Flow syntax for generic lambdas in type annotations
BugWEB-31613Flow: weird 'declare expected'
BugWEB-31612Cannot parse generic lambda as type argument in Flow
BugWEB-31615Flow: cannot parse call signature in ambient class
BugWEB-31614Flow: incorrect lexing of generic lambda with lambda as a parameter
BugWEB-31299Quick Doc: Markdown: open angular bracket is changed into the &lt; symbol
BugWEB-31361No 'abstract class / interface cannot be instantiated' warning when implementing JSDoc interface with imports
BugWEB-31336Problems with private fields
BugWEB-24161CommonJS: properties of function object returned by exported module not resolved
BugWEB-28158Method is missed in completion/not resolved if class is exported like module.exports=class
BugWEB-31571'Implement missing members' should work for object literals with expected types in pure JS
BugWEB-26860Quick Documentation - JSDoc @property annotation not handled over multiple lines
BugWEB-24352JSDoc: Inline documentation window mangles the JSDoc comment text
BugWEB-31346Only first @example from JSDoc is properly shown in the documentation
BugWEB-30113Incorrect suggestion for empty return statement inside generator function
BugWEB-31289Create interface doesn't work via inspection
BugWEB-19719ES6: The `yield` and `new.target` keywords may not be used in an arrow function's body
BugWEB-31637Flow and TypeScript: trailing commas are okay in generic parameter lists, but we don't parse that
BugWEB-31633Flow: 'declare function' should be allowed to have unnamed parameters
BugWEB-31464Simple Flow function return type syntax is not recognized
PerformanceWEB-31271IDE Hangs
PerformanceWEB-31630Very high CPU usage when indexing node_modules
UsabilityWEB-31473Flow's output changed in version 0.66, now the IDE's Flow error messages need to be adapted
TaskWEB-31296Remaining things about private JS class members
TaskWEB-31469webpack 4: update config schema
JavaScript. FormatterBugWEB-31326Code Style: No space at right side of arrow if Arrow function is checked and Function left brace is unchecked
BugWEB-31019ES6 Bind operator (::) improperly indents.
JavaScript. FrameworksFeatureWEB-28160Vue.js Add opportunity to create a new vuejs project
BugWEB-30759Vue Plugin got warning while props with .sync
BugWEB-30287Code completion for TypeScript Vue components
BugWEB-31439Create a method from angular template with params generates red code
BugWEB-31480Win. Wrong symbol when creating vue project
BugWEB-31484Renaming an angular component should suggest to rename file according to Angular style guide
BugWEB-31475Vue CLI: do not show progress as a separate dialog window
BugWEB-31474Vue CLI: reset project creation on pressing cancel
BugWEB-31479Project template dropdown should be disabled for @vue/cli
BugWEB-31506Vue create project: empty combo box for linter selection
BugWEB-31646Vue: generate imports when completing not global vue-class-components
BugWEB-31580Auto import of Vue components doesn't respect Auto Import preferences
BugWEB-31512Generating Angular Components doesn't work
UsabilityWEB-31675Vue extract component: add action, corresponding to intention, into Refactor and Refactor This groups
CosmeticsWEB-31499Vue CLI: update texts
CosmeticsWEB-31476Vue CLI: capitalise yes-no answers
TaskWEB-31545Update Angular Live Templates
JavaScript. InspectionsFeatureWEB-31568"Create derived class / implement interface" intention action
JavaScript. RefactoringBugWEB-31477Exception when moving Angular component class
BugWEB-31588'Rename class in file' dialog shown when not necessary
LESSUsabilityWEB-31609Default Less File Watcher options are not optimal
LintersFeatureWEB-31338Prettier: recognize "prettier" option inside the package.json file (completion, schema)
FeatureWEB-31158Support reformatting non-JS files with 'prettier' (CSS, vue, markdown, etc)
BugWEB-31363Prettier: Settings: correctly layout labels and do not mark page as changed when no action was performed
BugWEB-31339Prettier: hide "Reformat with Prettier" action for not supported files
BugWEB-31022ESLint: Cannot get result from language service
BugWEB-31342Prettier: do not mark file as changed when formatter does nothing
BugWEB-31465vue project created by <vue cli 3.0> has no eslint error inspection in ".vue" file
Node.jsFeatureWEB-31207Support npx in project generators
FeatureWEB-29184Add tab with stdout/stderr in Node.js run/debug tool window
BugWEB-31352Readme for npm package is not detected if module has a slash in the path
UsabilityWEB-31323Check installed dependencies should not work inside node_modules
SASSBugWEB-31193Go to symbol for Sass/SCSS mixins and variables doesn't work when typing dash
StylusBugWEB-31356Vue stylus deep selector error CSS_PERIOD
TypeScriptFeatureWEB-31364Support mapped type modifiers overriding (TS 2.8)
FeatureWEB-30820Add type guard statements to postfix templates
FeatureWEB-31577Intention action to implement interface or abstract class member in derived types
FeatureWEB-31041Bundle TypeScript 2.7
BugWEB-31306False positive in Unsound instanceof type guard check
BugWEB-31076Typescript Complete current statement for interface not adding semicolon
BugWEB-31457TypeScript: incorrect resolve for overrides when we have several merged interfaces
BugWEB-31620inlining variable produces incorrect code
BugWEB-31493TS valid syntax marked as invalid: readonly async
BugWEB-31397'Specify type explicitly' produces 'void' for generators
BugWEB-31402Create method when missing should create it under imports
BugWEB-31405Invalid priority of 'as' expression in TypeScript
BugWEB-31333Cannot parse 'async async' or 'async public' in object literals
BugWEB-31385Type of '+' expression is evaluated as dynamic in TypeScript
BugWEB-31388'Make private'/ 'Make static' fixes generate incorrect code with generators
BugWEB-31374Typescript:can't infer type from non-existing optional property
BugWEB-31470Getter/Setter should be generated with the same access type
BugWEB-30637'Create Method' not working on instance of a generic class in TypeScript
BugWEB-31606Don't suggest to add getter/setter and to 'make private' on abstract class members
BugWEB-31540StackOverflowError occurs when parsing TypeScript with certain generics
BugWEB-31549Blinking overload resolution
BugWEB-30042JS unused local symbols inspection reports many false positives for unused parameters in .ts files
PerformanceWEB-31148Terrible performance with Typescript Intellisense (ngrx selectors, composed functions)
Unit TestsBugWEB-32840Karma package is set to @angular/cli
BugWEB-31383Degraded mocha support if dev dependencies only include electron-mocha but not mocha itself
DB ConsoleBugDBE-5904Database Console name in Files have turning into Guids
BugDBE-2297Changes to Tools > Database > User Parameters are only in effect until PhpStorm is restarted
ExceptionDBE-5953DBE-5953 AE: SqlPsiElementFactory#createROFile
DB IntrospectionFeatureDBE-2102Default constraints in MS SQL
BugDBE-5968Sybase: incorrect length for types nchar, nvarchar, unichar, univarchar
BugDBE-4962Cascade rules of foreign keys not correctly displayed for Microsoft SQL Server
DB RefactoringBugDBE-634MS SQL Incorrect statements for modifying a table column default value
Data Import & ExportExceptionDBE-5985java.lang.IllegalArgumentException: Argument for @NotNull parameter 'typeName' of com/intellij/database/extractors/ObjectFormatter.isBit must not be null
Data ViewsBugDBE-5969Syntax error inserting row with all column values default similar DBE-2057
UsabilityDBE-6003Ctrl+Shift+Left should be used as Editor Action: Move Caret to Previous Word with Selection
IDE GeneralFeatureDBE-5999Ability to sort items in structure pane
BugDBE-6004Run and Synchronize Options in Scratches and Console Window show GUIDS and not logical names
BugDBE-6005Clicking issue does not work in update GUI
SQL EditingBugDBE-5958DB2: Syntax Error at temporal Table Select Statement with BUSINESS_TIME alias
BugDBE-5928Oracle: Don't report OVERLAPS function as error
BugDBE-4532Structure tool window view changed in recent IDE versions
BugDBE-5896MySQL dialect does not recognize CTEs
BugDBE-5930Oracle: ELSEIF should not be valid keyword
UsabilityDBE-2249SQL: File Structure: if current statement is not shown selection could be preset to the nearest shown element
UsabilityDBE-2248SQL: File Structure: table item is preselected if the caret is right after the last character of a column definition
SQL GenerationBugDBE-5825MySQL code generator: invalid CHARSET clause for column definition
SQL HighlightingBugDBE-5859MySQL Create Table Syntax parse error
BugDBE-5952False positive: Condition X is always true
BugDBE-5791oracle dialect -> support for TYPE records
BugDBE-5995PostgreSQL. Good code red. Custom sampling_method
BugDBE-6028CTE ("with" statement) and code folding are not working together (2018.1 EAP, MySQL 8/MariaDB 10.2)
BugDBE-5891Can't change SQL dialect for the injected string
BugDBE-5960Window functions support for MySQL
BugDBE-5935PostgreSQL dialect Valid SQL marked as red
UsabilityDBE-5855PostgreSQL CITEXT type and extensions not supported
User InterfaceFeatureDBE-5515Make it possible to choose default console for all project SQL files
BugDBE-5927Speed search next match doesn't always work
BugDBE-4822"DB Consoles" from "Tool Windows / Files / Scratches" doesn't respect colors
BugDBE-4273Table Names Sort Does work on DB2 database

  • No labels