Skip to end of metadata
Go to start of metadata
No subsystemFeatureRUBY-18127Support code insight in the .ruby-gemset file
FeatureRUBY-7865feature request: ability to collapse commented out code
FeatureRUBY-17793Select first RailsApp is the list
FeatureRUBY-13536Make "New Ruby Class" module-aware
BugRUBY-18659Exception on attempt to add Ruby on Rails facet to java module
BugRUBY-7636Unquoted comma breaks getText() and getValueText() of YAMLKeyValue
BugRUBY-195272017.1.2.rc1 broke all run configurations other than rails
BugRUBY-17804Remove 'Rails' prefix of rails related projects templates on welcome screen
BugRUBY-18242RubyMine won't recognice Rails 5 Models
BugRUBY-17751Support groups for project templates e.g. 'Rails', 'Web'
BugRUBY-18322"Scanning for gem requirements" prevent me from using RubyMine 2016.2
BugRUBY-19033New Rails API 'create rvm sdk' combo isn't properly updated
BugRUBY-8001I18n support cannot find declaration of i18n key when defined with new lines preserved
BugRUBY-17229attr_writer and attr_accessor not visible in structure view
BugRUBY-17780Description of samples is editable
BugRUBY-18084"controller#action" string is detected as a single reference to action
BugRUBY-18057Find in path does not work if searching for a numeric literal when "whole words only" is enabled
BugRUBY-8701Yaml code style annoyance
BugRUBY-19920Provide custom CSS URI validation
BugRUBY-5771Do not create folding for empty values
BugRUBY-17667Language Level not set correctly to 2.3
BugRUBY-17678Get rid of rbenv gemsets feature flag
BugRUBY-17989Rake tasks fail to start
BugRUBY-5354I18n: Go to declaration doesn't work with count parameter
BugRUBY-19611'Has missing gems' inspection may lead to deadlock
BugRUBY-8883Custom TODO pattern is not highlighted
BugRUBY-18604Remove Docker options from Remote Interpreters configuration
BugRUBY-18381askForSudo option set to `true` creates two processes
BugRUBY-10405Commented line in locale files raise inspection errors
BugRUBY-18943Rails missing on create new Application
BugRUBY-17622Run Rake Task command does not work.
BugRUBY-9430YAML Syntax Highlighting Incorrectly Treats Periods ('.') as Special
BugRUBY-19368Always indexing after upgrading to RubyMine 2017.1
BugRUBY-7279missing closing accolate in externalized string inline preview
BugRUBY-18911opened singleton class nodes in find usages results (grouped by file structure) are labeled "self"
BugRUBY-19198Notification with Rollback action after controller creation is about Test generation
BugRUBY-18007Productivity Guide misleading for refactoring features
UsabilityRUBY-18583Speed searching should expand SDKs if gemsets are matched
UsabilityRUBY-17782Navigation gutter to Channel from coffee template to show possibility of navigation
CosmeticsRUBY-17781Size of frame with railsapps list changing after templates are uploaded and some of them is selected
CosmeticsRUBY-17757Strange dialog title
TaskRUBY-17755Templates list should be sorted by popularity, e.g. by stars
TaskRUBY-17754Show short description of selected template
TaskRUBY-19914Hide default markdown css style URI
TaskRUBY-19922Move 'preview' subsettings onto 'Markdown' main settings pane
TaskRUBY-17366Exclude local rbenv gemsets and add gems as external libraries
ExceptionRUBY-19621'sqlite3-ruby' gem missing exception
ExceptionRUBY-18975Spring customization may be failed when project has already disposed
ExceptionRUBY-17663Project is not yet initialized error with exception if gemset pointed in the ruby-gemset is not exist
Code CoverageBugRUBY-16176Run with coverage annotations doesn't respect :nocov:
PerformanceRUBY-18264Slow UI performance after running tests
Code InsightFeatureRUBY-17831Frozen string literal inspection
FeatureRUBY-16041Completion in the code for defined yard attributes
BugRUBY-18900inspection of frozen string fail
BugRUBY-19535Search Everywhere is not useful when searching methods
BugRUBY-1827Tuple of variables used as a block parameter is unresolved
BugRUBY-18878Create property quick fix is missing
BugRUBY-17798Yard defined attribute readers don't resolve to attribute name
BugRUBY-17893RubyMine does not resolve class from parent module
BugRUBY-18152Stubs generation failed for mysql gem
BugRUBY-18236Find usages do not work with rspec let statements
BugRUBY-18414RubyMine 2016.2 freezes with regularity, becomes unusable
BugRUBY-17603New method creation quick fix adds a parameter in any cases
BugRUBY-17707YARD-defined symbols are not resolved to
BugRUBY-17267No autocompletion for ’type’ reserved word in annotations & YARD directives
BugRUBY-19177Incorrect call argument count inspection doesn't recognize keyword arguments
ExceptionRUBY-18944Open Ruby project throws IndexNotReady exception
CucumberFeatureRUBY-18956Cucumber 3 support
BugRUBY-16697Non-english keywords in step definition file make feature step unresolved
BugRUBY-17541Cucumber tests run correctly, but reporting of results is wrong
BugRUBY-18947Cannot find cucumber step reference when the \h metacharacter is used
PerformanceRUBY-19603High CPU while working with Cucumber
DebuggerBugRUBY-18038Unable to debug with remote SDK in case of Trinidad server
BugRUBY-18066Can't install debug gems into JRuby-9.1.0.0
BugRUBY-16546can't set a breakpoint on a standalone '}', terminating a hash literal expression
BugRUBY-18354unable to set breakpoint for debugging in slim templates
BugRUBY-17990Non-existent breakpoints getting “hit”
BugRUBY-19046Cannot attach to native SDK processes on Linux
BugRUBY-18399watches in the variables window should be identifiable
PerformanceRUBY-17156Filtering non-project sources causing slowness in debugger almost in 4 times
DockerBugRUBY-20090Cannot run application with Docker SDK in debug mode
DocumentationBugRUBY-19600Help topic for Ruby Run Console
EditingBugRUBY-8357Good code is red: illegal/unsupported escape sequence in regex
BugRUBY-19625RubyMine can't open some files
HAMLBugRUBY-18447Do not move comments when reformat
BugRUBY-16293interpolation causes string end to be missed by inspections in haml javascript filter
BugRUBY-15540Ruby HAML plugin is identifying valid attributes as invalid
BugRUBY-18231HAML following javascript filter blocks is marked as red/unresolved
BugRUBY-18415RubyMine 2016.2.1 freezes while open HAML file
BugRUBY-12007haml: cant go to class declaration if node have 2+ classes
BugRUBY-16900HAML case/when/else red code
BugRUBY-18276spurious haml illegal nesting
BugRUBY-18289IntelliJ 2016.2 freezes while indexing HAML file
IDEFeatureRUBY-19129Parameter Hints for Ruby
FeatureRUBY-18619Set up keymap screen for initial configuration
FeatureRUBY-17640Exclude .yarb files generated by bytecode cache from the project view
BugRUBY-17813Horizontal scrollbar blinks in debug tool window, Rails/IRB console
BugRUBY-18809Support changing language level for JRuby and Rubinius sdks
BugRUBY-18327rubymine.bat needs a few improvements
BugRUBY-16963Can't use bundler while install gems with sudo on Linux
BugRUBY-5336YAML folding is broken
BugRUBY-19024Gems are not installed into just created gemset
BugRUBY-18458Speed search doesn't work in the list of SDKs and gemsets
BugRUBY-19015JRuby versions selector doesn't work well with clear settings
BugRUBY-19018Cannot create any new project if any project is already opened in the Editor
BugRUBY-16153ENV['PWD'] Variable Not Set in RubyMine
BugRUBY-19481New Rails application wizard: Rails version is changed back to the default after changing the project's location
BugRUBY-17528Cannot set SDK in Default settings
BugRUBY-18983Font style in create new project wizard is different for plain ruby application
BugRUBY-17636Can't uncheck rbenv gemset
BugRUBY-18407'rubystubs24 directory cannot be null' exception on the start project with Ruby 2.4
BugRUBY-17326rbenv-gemsets file is not associated with text by default
BugRUBY-19615Implement breadcrumbs for ruby
BugRUBY-17618Gemset can be created in unrelated sdk
BugRUBY-17615.rbenv-gemsets created forcibly if select rbenv sdk
BugRUBY-17610rbenv gemsets are not available
BugRUBY-19040'No SDK selected' in Create new Project wizard
BugRUBY-18952Template project name stuck for RailsApp Sample project
BugRUBY-19572'Install Rails gem' label remains in the field after Rails installation instead of set installed version
BugRUBY-18291Installing Rails gem doesn't refresh Create New Project dialog after finish
BugRUBY-19194Methods with named arguments are not overridden correctly
UsabilityRUBY-17573"Create method" quickfix should be available on toplevel
UsabilityRUBY-16860Project name and other options are reset if change project type in Create new Project dialog
UsabilityRUBY-18391Notification 'Cannot save settings' of Ruby SDK and Gems should list modules names without SDK in case of multiple projects
CosmeticsRUBY-18262Sorting order for Rails 5.0.0 and 5.0.0.racecar1 is incorrect
CosmeticsRUBY-18359Different layouts causes 'fields jumping' in the Create new Project wizard
TaskRUBY-18316Support Language level Ruby 2.4
TaskRUBY-17122Combination of rbenv SDK and gemset doesn't provide ability to use gems from gemset
TaskRUBY-17611Remove Kusunoki as codename
ExceptionRUBY-19025Open application throws assertion
InspectionsBugRUBY-18175Inspection about replace double quoted string with single quoted is shown twice for Channel name in coffee template
BugRUBY-18615'Unless' statement quickfix message has a typo
BugRUBY-19086Run RuboCop inspection by name throws exception
CosmeticsRUBY-19066RuboCop is used without CamelCase
JRubyBugRUBY-18064JRuby 9.1.0.0 is treated as language version 2.2 instead of 2.3
MarkdownFeatureRUBY-17962Markdown Preview in Scratch files with md extension
FeatureRUBY-18536Structure view of markdown plugin should show actual structure in terms of headers, sub-headers and so on
BugRUBY-18120Markdown preview does not update image references when the underlying image changes
BugRUBY-19479Markdown plugin doesn't render *.markdown extension
BugRUBY-19001Underscore now treated as word break in Markdown files regardless of settings
BugRUBY-19487Markdown: Custom CSS is not applied
BugRUBY-19489Markdown preview scaling on HiDPI Linux (+win) is lost
BugRUBY-18237URLs with dashes are not rendered correctly in Markdown JavaFX preview panel
BugRUBY-17329SVG images in md preview browser can cause crash
BugRUBY-17188Markdown Plugin 8.0.0.20150924 preview is nearly unreadable with darcula
BugRUBY-18504Completion for languages in code fences
BugRUBY-19494NPE disabling Markdown "Apply CSS from URI" setting
UsabilityRUBY-18462Markdown: hard to type triple-back-tick
UsabilityRUBY-17155Markdown preview should have dark theme when using Darcula
UsabilityRUBY-17635Markdown preferences: UX impovements
ExceptionRUBY-19488MaliciousURLOpenedException when clicking on the link inside document
ParsingFeatureRUBY-17518Introduce support for Ruby 2.3 language level
FeatureRUBY-16078Inject Language/Reference doesn't work in string contexts but works in comment contexts
BugRUBY-19348Division operator is interpreted as beginning of regular expression
BugRUBY-5351Inclined quotes parsed incorrectly
BugRUBY-19036Rubocop is not available in Run Inspection by name option
BugRUBY-18444ruby 2.3 (2.1?) parameters aren't understood - wrong error markup
BugRUBY-16172failure to parse method invocations in default block parameter value expressions
BugRUBY-15367RubyMine syntax validator and indent does not work with || + block
BugRUBY-15106Ruby 1.9 deprecation warning in Rails project
BugRUBY-17227method call in default block param value expression is parsed/styled as a param
BugRUBY-17533multiple problems parsing default param value expressions
BugRUBY-18525Parentheses around empty arguments list error if a method's parameter decelerated in a new line
PerformanceRUBY-16887Indexing hangs, RubyMine becomes unresponsive
UsabilityRUBY-19052Rubocop's inspection 'too long' class or method makes is very agressive
ExceptionRUBY-4999YAML SOE: ASTWrapperPsiElement.getParent
Plugin ReportsFeatureRUBY-17658Support rbenv gemsets in Ruby Plugin
BugRUBY-17808Gems for rbenv/rvm Rubies not discovered correctly on OSX [no rails in JDK][ruby-debug-ide not installed]
BugRUBY-18468Ruby Plugin can't recognise gem project
BugRUBY-18672JRuby submodule in Java project uses old configurable interface
BugRUBY-19109Cannot add new Ruby Module with JRuby SDK
BugRUBY-19122New slim file creation throws ClassNotFound exception
BugRUBY-18558Ruby plugin doesn't recognise quoted symbols as keys. Rubymine works fine
BugRUBY-17675Library bigdecimal already exist error doesn't allow select any SDK for module
BugRUBY-18163Generate Rails mountable Engine checkbox don't work
BugRUBY-18576Ruby SDK added in the SDKs global list are available in the Modules settings after reopen Settings
BugRUBY-18564Node on the top of the list is not a currently selected gemset
BugRUBY-18622Checking node of rbenv SDK doesn't show gems from all checked gemsets
PerformanceRUBY-17140Project's settings freezes Intellij IDEA with ruby Plugin
PuppetFeatureRUBY-16330Introduce new create puppet module wizard
FeatureRUBY-17069Puppet hashrocket alignment
FeatureRUBY-18037Support functions written in the Puppet language
BugRUBY-17992'default' unexpected using per-expression resource default attributes in puppet 4
BugRUBY-18907puppet plugin: incorrect code reformatting with ordering arrow
BugRUBY-18129Puppet: lexer fails on long strings
BugRUBY-18678ElementDescriptionProvider shows internal info
BugRUBY-19327Variables names are partially highlighted in the Find Usages results
BugRUBY-17102regsubst() with backslashes in single quotes is escaped and evaluated
BugRUBY-17495Puppet parser doesn't understand nested functions with array access
BugRUBY-19486Puppet Plugin missing withpath for notify
BugRUBY-17410Puppet parser can't handle nested functions that take a block
BugRUBY-16912Method fail causes highlighting in good code
BugRUBY-19280Puppet Plugin: Incorrect format with empty curly braces
BugRUBY-18972Gem Manager trying to install missing gems from dependent modules
BugRUBY-18963No quick-fix to install librarian-puppet from IDE
BugRUBY-16524Heredoc highlighting may be broken after editing in some cases
BugRUBY-18036Using `Optional[key]` in a hash passed to the Struct type confuses the parser.
BugRUBY-19197Puppet related gems installation link is never expired
UsabilityRUBY-19228No hot keys for Puppet settings in the Puppet new module dialog
UsabilityRUBY-18973Null in puppet project name in the project view if version is not specified
CosmeticsRUBY-19276Suggestion for module and user names doesn't fit in create new project dialog
CosmeticsRUBY-19203Make dialog for add new Puppet module wider
ExceptionRUBY-18676CompletionProvider throws exception while hit Enter after variable inside of resource definition
ExceptionRUBY-18954Project is already disposed exception is shown if close project from a separate window
RHTMLPerformanceRUBY-16157HTML/ERB editor performance degradation
RailsFeatureRUBY-17899Install Rails list for ruby 2.1 should not include Rails 5
FeatureRUBY-17713ActionCable: channel related files
FeatureRUBY-3654Treat contents of Rails' javascript_tag as javascript
FeatureRUBY-19151Cannot rollback generator action
BugRUBY-18207Rubymine fails to run rspec if rspec has been run from the command line with spring enabled
BugRUBY-17785Can't destroy Channel
BugRUBY-18424Spring - Started by RubyMine - cannot be controlled (stop, status, etc.) and remains running after shutting down RubyMine.
BugRUBY-19555Support form_with
BugRUBY-19556remove warning "This version is not fully supported" for Rails 5.1
BugRUBY-19566Allow to choose webpack libraries in Rails new
BugRUBY-17898We need to only show ruby 2.2+ when creating a new Rails API app
BugRUBY-17655'get available generators script executes with errors:' warning is shown without errors
UsabilityRUBY-17921No warning message for user if downloading rails apps from github is failed
UsabilityRUBY-19070Don't show reload generators/rake tasks warnings in RM
TaskRUBY-17597Rails API project generation from wizzard
TaskRUBY-17599Fix route variables in Rails API apps
TaskRUBY-17598Do not create gutter in controllers in case of Rails API
TaskRUBY-18221RubyMine can't detect Rails version from .gemspec file
TaskRUBY-17795Add Rails API type project into Ruby Plugin
Meta IssueRUBY-17510Integrate Rails Templates
ExceptionRUBY-17788Editing channel's coffee template might throw assertions, then Rails view is unavailable
ExceptionRUBY-7934Key conflicts with existing one: 'null.support.array.words_connector'
ExceptionRUBY-17724Registered post-startup activity that will never be run assertion after opening a new project
Rails. Code InsightFeatureRUBY-17714ActionCable: error highlighting and intention action for a channel
BugRUBY-17815go to declaration for has_many associations does not work
BugRUBY-18017Block and splat parameters are not recognized when using #@!method
BugRUBY-17715ActionCable: navigation to channel action from JS
Rails. DiagramsExceptionRUBY-18189Rails model dependency diagram fails to be generated
Rails. Project ViewFeatureRUBY-17712ActionCable: add channels to Rails Project View
RakeBugRUBY-18097Last rake task name is displayed in the Tools menu instead of Run Rake task
RefactoringsFeatureRUBY-9955Allow RSpec let(:variable_name) refactoring
FeatureRUBY-13313Unable to rename a file
BugRUBY-11508Incomplete renaming in rspec tests after controller/model rename
BugRUBY-17574Extract Constant causes exception
BugRUBY-7260Renaming controller/resource route should rename view macro usage, eg 'edit_car_path'
BugRUBY-11511Rename refactoring: doesn't rename in short-hand controller/action declarations "controller#action" in RSpec tests
BugRUBY-18302RSpec Let refactoring should not have "Extract" in it
BugRUBY-17419Extract parameter can cause mismatching order of parameters in caller and callee
BugRUBY-16527RenameTable migration doesn't work
BugRUBY-16917Reformat code adds space before %> in .erb in case of encoding
BugRUBY-18158Client channel file is not renamed on channel rename
BugRUBY-18169Rename model incorrect path_name
UsabilityRUBY-18128Rename refactoring shows user unfriendly warning on Mac OS X if list of failed to rename items is big
Remote InterpretersBugRUBY-14931Speed up remote gem downloading
BugRUBY-19311Debug ruby application in Docker container
BugRUBY-18712Remote gems are not downloaded
BugRUBY-18109Debug Rails Console command does not work.
UsabilityRUBY-18497Add synchronise button to the SSH tab in Configure Remote Ruby Interpreter dialog
UsabilityRUBY-15010Clicking "Cancel" for remote SDK doesn't cancel
ExceptionRUBY-19241Adding Docker SDK may throw exception
ExceptionRUBY-19599Closing project with Docker SDK throw an exception
Ruby Version ManagersFeatureRUBY-10373Create RVM gemset from SDK configurable
FeatureRUBY-18916Add an option to create a dedicated gemset on Ruby/Rails project creation
BugRUBY-18348rbenv gemset - gems installed via github are not shown in "external libraries" and "Gem Environment" RubyMine 2016.2 trial
BugRUBY-18294Default SDK will not apply for Create new project wizard
BugRUBY-18293Rbenv gemset for new installed sdk will not shown after creation until switch from IDE and return
BugRUBY-18122Remove selected for a project gemset from Settings causes exception if use .ruby-gemset
BugRUBY-18538Current selection is reset if new Ruby SDK is added
BugRUBY-18323Two items with name 'global' are suggested in completion in the .rbenv-gemsets file
BugRUBY-18490Project SDK selected in Create New Project wizard is not selected in the Project Settings
BugRUBY-18585rbenv gemset deletion removes the entire SDK
BugRUBY-18051Can't run specs with RSpec Run/Debug Configuration if gem rake is installed only in the gemset
BugRUBY-18088Gems are not synchronized in External Libraries after adding/removing gemsets in rbenv-gemsets file
BugRUBY-18512Gems of non-rvm/rbenv SDK can't be detected in new configurable
BugRUBY-18516RVM sdk is selected instead of gemset
BugRUBY-18515SDK settings reset if gemset is configured via .ruby-gemset file
BugRUBY-19677New gemset created for new rails application not detected for plain Ruby app
BugRUBY-18085Create new rbenv gemset inspection causes exception
BugRUBY-18610Escape of quick search results reset current SDK selection
BugRUBY-18592Remote rvm gemset is not shown in the SDKs list
BugRUBY-18021Incorrect .ruby-version configured in RailsApp Sample (plus associated issues)
BugRUBY-18562Buttons Expand all and Collapse all are useless on Windows
BugRUBY-18560RVM global gemset is not checked by default when rvm sdk is checked
BugRUBY-18295Gems installed into gemset may be not available (again)
BugRUBY-18582Quick Search results should be reset by ESC
BugRUBY-18492Rbenv gemsets selection resets after switch to other SDK and return to previous settings during one session
BugRUBY-18030Gems installation into rbenv gemset causes gem is not available in the SDK warning until reopen Settings
BugRUBY-18352.ruby-gemset file if contains folder's name makes RubyMine exclude it
BugRUBY-14605Need to watch files .ruby-version and .ruby-gemset
UsabilityRUBY-18300Two inspections appear in the same time for non-existing gemset
UsabilityRUBY-18185No SDK selected value will be changed to random SDK while create RailsApps Sample
UsabilityRUBY-18545View of the SDK may be scrolled to the right after opening if remote sdk is selected
UsabilityRUBY-18611Selected sdk should be still selected after Esc search results
CosmeticsRUBY-18299Replace 'Gemsets have been changed' to 'File .rbenv-gemsets has been changed'
TaskRUBY-18473Measure SDK and gemsets statistics
ExceptionRUBY-18012Removing selected for the project rbenv gemset causes exception
Ruby. FormatterBugRUBY-8500The "Strip trailing spaces" feature removes spaces in Here Documents
BugRUBY-17584Comment confuses "align right parts of assignment" setting for ruby formatter
BugRUBY-19471align multiline list items failure
BugRUBY-19468wrong indent for private def method_name (when indent relative to expression start is on)
BugRUBY-19058Code block indentation relative to the method chain
BugRUBY-19354bad indent for chained ternary expressions
RubyGemsFeatureRUBY-18018Local Gem not recognized When The Path is a Variable
BugRUBY-17116Gems referenced via git_source don't appear in External Libraries
BugRUBY-19138"external libraries" looks for vendor cached git gems in the wrong location
RubyMotionBugRUBY-18203Debugger is not started with iOS app
BugRUBY-18186Variables unavailable when debugging RubyMotion iOS app
Run ConfigurationsBugRUBY-18957JRuby icon is displayed for Use other SDK field in Run/Debug configuration
SlimBugRUBY-18278Eternal indexing in Slim
BugRUBY-17473*a_method_return_hash syntax is not supported in Slim
BugRUBY-17997[Slim] Formatting is broken for several cases
BugRUBY-19141Slim file with JS causes exception
BugRUBY-17443New hash syntax doesn't work in Slim
BugRUBY-17719Unexpected and duplicated unreachable code inspection
TestsFeatureRUBY-16613minitest failure result nodes need "jump to test" functionality
FeatureRUBY-5449Prompt to create Test for class in it doesn't exists on goto test action
FeatureRUBY-10777support for MiniTest::Spec
BugRUBY-18929running single rspec results in failure to load project correctly ("cannot load such file -- rails_helper)
BugRUBY-16730RubyMine 7.1.2 fails to find TeamCity formatter for RSpec
BugRUBY-19012rspec context detection is weaker in 2017.1 EAP compared to previously
BugRUBY-19463RubyMine missing run dialog on test files since 2017.1
BugRUBY-13615RubyMine does not know about context when running RSpec feature specs
BugRUBY-18171Rspec tests failing
BugRUBY-18752uninitialized constant Test::Unit::AutoRunner::RUNNERS when trying to run unit tests
BugRUBY-18364Cannot run minitest - cannot load such file -- test_helper
UsabilityRUBY-18992Suggestion to create test should not be dependent on installed gems
TextMate BundlesFeatureRUBY-15510Add ability to add custom textmate *themes* for the textmate bundle support
BugRUBY-17606esac keyword in shell script is not highlighted
YAMLFeatureRUBY-17496Update breadcrumbs to show the element values
BugRUBY-18345Yaml file with multiline string containing jinja code can't be opened
BugRUBY-13914Yaml: parse errors on key value
BugRUBY-15402Yaml: Error with colon inside YamlKey
BugRUBY-17933.yaml files no longer collapse
BugRUBY-14451Incorrect YAML Parsing
BugRUBY-4996YAML - structure view reflects commented values
BugRUBY-15345Invalid YAMLCompoundValue
BugRUBY-12083Wrong syntax highlighting for single quotes in YAML
BugRUBY-11336RubyMine does not support keys with brackets in YAML files
BugRUBY-7680YAML highliting error
BugRUBY-13152Colon inside quotes should be treated as regular symbol
BugRUBY-15143RubyMine Freezing when Indexing Project (Mac OS Mavericks)
BugRUBY-14738Yaml: Remove special "?" psielement
BugRUBY-17558Can't edit ERB / RHTML files in RubyMine 8.0.2 on OSX El Capitan
BugRUBY-17414Multiline double quoted scalars with escaped newlines are not parsed correctly
BugRUBY-12598Autocompletion for double-quoted keys in .yml files
BugRUBY-13218Wrong brackets matching in YAML file
BugRUBY-12586Opening square bracket in array of strings break syntax highlight for YML/YAML files
BugRUBY-12217Yaml files with a hash (#) in single quotes causes problems
BugRUBY-16796The YAML syntax highlighting doesn't handle linebroken scalar values.
BugRUBY-11497Incorrect syntax highlighting of YAML comments
BugRUBY-16245Intellij Freezes when Indexing project. Clearing cache does not help
BugRUBY-18147Unexpected multi typing is appear in InjectionEditor
BugRUBY-14864highlighting yaml >- blocks
BugRUBY-18290Сan not open yml file
BugRUBY-13802incorrect yaml comment highlighting
BugRUBY-17389Empty hash as dict value is not parsed correctly
ExceptionRUBY-5000java.lang.AssertionError: (0,0) - FoldingDescriptor.<init>
ExceptionRUBY-5002YAML lists - NPE:PresentationData.updateFrom
No subsystemFeatureIDEA-139038Project management feature: Usable "known projects list" for reopening them in any supported way
FeatureIDEA-60161Automatically "inherit" quick javadoc for getters/setters from field
FeatureIDEA-143686Add ability to export class hierarchy to text file
FeatureIDEA-147176Create "lowercaseAndDash" function for live templates
FeatureIDEA-143452Show Running List action shows run processes from the current project only
FeatureIDEA-135255new Predefined Function "dashesToCamelCase()" to Use in Live Template Variables
FeatureIDEA-164176Delete old thread dumps in the IDE log folder
FeatureIDEA-158366Allow to run tests from find usages view
FeatureIDEA-168089New outline for text field components with invalid values
BugIDEA-157496Webstorm freezes at splash screen
BugIDEA-167799HiPDI menu arrows are too small for Darcula/IntelliJ themes on Windows and Linux
BugIDEA-76804[yaml] sequence parsing improvement
BugIDEA-167694Live Templates: order of default values are reversed
BugIDEA-156970No classpath jar in command line on dynamic.classpath=true when too many files in tmp on Windows
BugIDEA-145303RubyMine hangs on refactoring if "Align right parts of assignments or hashes" is checked
BugIDEA-145308ExpandedItemRendererComponentWrapper is broken
BugIDEA-140824Search Everywhere popup doesn't display relevant class name if jar name is too long
BugIDEA-151256Unable to switch boot JDK in minor IDEs
BugIDEA-172705Big files marked as read-only can't be deleted
BugIDEA-166669FileTypeRegistry.FileTypeDetector should not be skipped for large files
BugIDEA-146669Enable Mac native file dialogs
BugIDEA-142156Project leak on SheetController$2
BugIDEA-159850NPE on welcome screen (Import Project)
BugIDEA-156165WinPty process subprocesses are not killed
BugIDEA-147100Default File Header template causes pointless javadocs in projects
BugIDEA-161604Deadlock on startup in Promises
BugIDEA-156284Force Touch: Keymap, Add/Find Mouse Shortcut panel: after Button 1 is clicked and set in shortcut preview, Force Touch is ignored
BugIDEA-163567FileChooserFactoryImpl.createSaveFileDialog doesn't use native file chooser
BugIDEA-144866Changes in DocumentImpl related to setting bulk update mode broken ability to reformat non-physical document in non-dispatch thread
BugIDEA-162067Cannot create plain-text scratch file
BugIDEA-167050After cut+paste some methods from class to new-created one the pasted code is shown as duplicate
BugIDEA-178347UI is frozen for a long time in ModuleManagerImpl.loadModules
BugIDEA-159840Impossible to select a boot jdk from disk with native file dialogs on mac
BugIDEA-131012Support "delete word left" command in quick search
BugIDEA-151469ImplementingFunctional2x.png is not used because it is named with capital letter
BugIDEA-159270Can't delete *.class file
BugIDEA-145094PSI invalidated outside transaction
BugIDEA-156299Force Touch: 'Force Touch' is replaced with 'Button 1 click' after restart
BugIDEA-143263Find In Path is not autopopulating a selection from Find Preview window
BugIDEA-167089MacOSX: support tcsh shell for loading environment variables
BugIDEA-167880Dump data to file adds / to filename
BugIDEA-140901Tip of the Day is not working nicely with HiDPI under Linux
BugIDEA-171543RtfTransferableData: java.io.IOException: mark/reset not supported
BugIDEA-1724032017.2 EAP does not save changes to default font
BugIDEA-153873Pressing Shift+Enter in Navigate File popup opens the file in a new window instead of the current window
BugIDEA-155804LIVE TEMPLATE PROBLEM VARIABLES NEXT TO EACH OTHER
BugIDEA-167541Font baseline is shifted down for default font settings
BugIDEA-151033Usability issue with multiple block carets
BugIDEA-160282Lock not released in PagedFileStorage after VCS log exceptions
BugIDEA-136385Find Action / Search Everywhere: "Show Log in Explorer/Finder" action is missing
BugIDEA-165949[hidpi-jdk] IDEA main frame doesn't restore its bounds on the second monitor when reopened
BugIDEA-159742IllegalArgumentException: parent must be showing
BugIDEA-170221Download Sources not working after 2017.1 update
BugIDEA-168010Editor notification should be updated on the file extension change
BugIDEA-167719Test Runner: missing info about skipped tests in results popup
BugIDEA-157371Error updating com.intellij.openapi.editor.ex.util.LexerEditorHighlighter
BugIDEA-172247Plugins: NPE at PluginManagerConfigurable.apply() on restart after installing a plugin
BugIDEA-146153Text label disappears when click on it
BugIDEA-156065WinPty process does not kill agent on end
BugIDEA-156069Impossible to work with project which opened from starting window second time
BugIDEA-171238Keymap of Export Test Results does not function
BugIDEA-178693Already disposed: com.intellij.util.messages.impl.MessageBusImpl in PlatformTestCase.teardown
BugIDEA-160461Sort fonts case-insensitively
BugIDEA-144892Distraction free mode: Cancel action for compilation is not working
BugIDEA-149724Live Templates: IDE does not see the change if Copy action was used for creation of a new template
BugIDEA-90488Php editing/Single quote duplication bug
BugIDEA-156259idea.log spammed by "PerformanceWatcher - High memory usage"
BugIDEA-152628shift-F1 displays two URL
BugIDEA-171900Find in path popup isn't descriptive enough (poor feedback on search progress/status)
BugIDEA-160926Backspace doesn't join empty lines in JTextArea
BugIDEA-161155Per Project Modality: when Commit or Push dialog is opened in one IDEA frame, it's impossible to hide or show tool windows in the other frame
BugIDEA-74100[yaml] key-value parsing improvement
BugIDEA-148696Contextual menu won't close
BugIDEA-145363ConcurrentModificationException when a widget is added or removed in the status bar
BugIDEA-165879Unguarded section in DocumentCommitThread that leads to spontaneous assertion
BugIDEA-146929IntelliJ 15 EAP - Won't start when there is 100% packet loss - Crash
BugIDEA-172231Incorrect rendering of text with combining marks
BugIDEA-128057Editor search closes dialog on Enter, if there are nothing find
BugIDEA-149312Unstable width of "Preferences" window
BugIDEA-157874ERROR - #com.intellij.ide.plugins.PluginManager - Argument for @NotNull parameter 'action' of com/intellij/openapi/actionSystem/AnActionEvent.createFromAnAction must not be null
BugIDEA-67763tabs in split window view
BugIDEA-167627Reference search doesn't work for files added via AdditionalLibraryRootsProvider
BugIDEA-144512File Colors for project are removed after IDEA restart
BugIDEA-85304Icon for Use Soft Wraps doesn't show in the toolbar
BugIDEA-145356activity in a Scratch window triggers auto-refresh of tests
BugIDEA-166321Setting 'reopen last project on startup' doesn't work
BugIDEA-156993Project Name replaced with Directory Basename in Welcome Screen (EAP, Regression)
BugIDEA-156846Color: "Default text" resets to white by itself, leads to brackets on white background
BugIDEA-157266Safe delete: Exclude file is enable
BugIDEA-156193Toggle using soft wraps in current editor not working
BugIDEA-145341EAP 15 - settings pane number box doesn't have enough room to show default numbers
BugIDEA-77217[yaml] key value parsing improvement
BugIDEA-151527Sticky Selection cannot be escaped unless the cursor is in a different location than when toggled
BugIDEA-173347PSI invalidated outside transaction
BugIDEA-1721075+ minutes synchronize after remove of 11k files
BugIDEA-159941Mac native file chooser cannot select multiple files
BugIDEA-159940Wrong default location for new jdk mac open dialog
BugIDEA-84414Reporting a problem to plugin vendor in "IDE Fatal Errors" doesn't work ("mailto" link)
BugIDEA-156186Project names containing dot (.) causes display problem
BugIDEA-160763IDEA hangs on startup, during splash screen
BugIDEA-155360Open In Browser : files from library jars cannot be opened
BugIDEA-155362Open In Browser : action should work for files versons from History or be disabled
BugIDEA-161165Per Project Modality: when Commit or Push dialog is shown in one IDEA window, Code Analyzing hangs with 99% completed in the other window
BugIDEA-75771Create Patch: create patch dialog resizes several time when displayed.
BugIDEA-155763Memory leak detected: 'com.intellij.ui.BalloonImpl
BugIDEA-162032Sonarqube results are not getting displayed in the Inspections Tab.
BugIDEA-160967Endless loop of "JetBrains Account authentication failed. Do you want to try again?" even if pressing No
BugIDEA-128540Plugin installation error on stastup
BugIDEA-149698Cannot rerun tests in dumb mode + batch rerun when getting out of dumb mode
BugIDEA-46170Double quote appears in wrong string literal when a language is injected
BugIDEA-172559Quick-search does not work in "Register new file type association" dialog
BugIDEA-172558Progress popup is small by default
BugIDEA-161948CheckRegExp action: the results are not updated on sample or expression editing
BugIDEA-171010Idea doesn't close properly some project windows
BugIDEA-142785Export settings: IDEA generates 0-sized settings.jar
BugIDEA-151656ProgressableTextEditorHighlightingPass breaks (at least) Inifinitest plugin
BugIDEA-173613IDEA blocked while showing progress window after 'Generate JavaDoc...'
BugIDEA-95941Commit message Ctrl+Space completion of class name - stops working for the second line of the message
BugIDEA-132965Hitting enter in the Expression field in the Edit Template Variables dialog does not save the value
BugIDEA-148512Regression: Import/Export Settings no longer supports 'Remote Tools' after upgrade to IntelliJ 15
BugIDEA-133942Focus often stays in editor when dialogs are shown
BugIDEA-173017JavaFX WebView not HiDPI rendering on Windows 10
BugIDEA-138798Double click maximize tab should not close floating windows
BugIDEA-171717java.lang.IllegalArgumentException: Argument for @NotNull parameter 'fontFamily' of ... must not be null
PerformanceIDEA-167733High CPU usage due to Component.setCursor
PerformanceIDEA-172762ProjectRootManagerComponent$1.fileTypesChanged on AWT causes 30-60s freeze
UsabilityIDEA-157421Long shutdown due to built-in server
UsabilityIDEA-167531During code completion, Home/End keys navigate the menu not the code editor
UsabilityIDEA-149179Inspection settings dialog usability.
UsabilityIDEA-144025Gutter icon "overrides method in some interface" is displayed for lambdas and method references, which is confusing
UsabilityIDEA-123307Squashed tree widget on Windows theme on HiDPI monitor
UsabilityIDEA-164993Support for macOS special character (emoji) insertion popover
UsabilityIDEA-56512Add possibility to edit an entry for the list of packages to exclude from auto import
UsabilityIDEA-165002Can't Disable Message: Remote desktop detected, Animation disabled
UsabilityIDEA-114099Strip white space left of caret on manual save
UsabilityIDEA-98634Favorites List: sort entries
UsabilityIDEA-126373File Structure could have less indenting
UsabilityIDEA-53545Autoimport - Exclude from Import and Completion should be Project-specific - not (just) Global.
UsabilityIDEA-121010TODO, add/edit pattern: 'Inherit Attributes From:' checkbox always disabled
UsabilityIDEA-168138Apply button on changing color scheme doesn't lead to full rehighlighting
UsabilityIDEA-166959Can't see full path to project in welcome screen
UsabilityIDEA-158189Text is flickering when lines overlap vertically
UsabilityIDEA-155075Why file template settings are marked as per-project?
UsabilityIDEA-165863new live template causes unlabeled yellow warning triangle
UsabilityIDEA-160816Search by abbreviation in Keymap configurable
UsabilityIDEA-133381drag and drop file from project view tool window
UsabilityIDEA-85255Tool window options like a "Autoscroll to Source", 'sort by type' etc. should be stored globally, not per-project
UsabilityIDEA-158856Save File As Template dialog: Help is missing
UsabilityIDEA-158213Inconsistent soft wraps all state
CosmeticsIDEA-96168PhpStorm window is not restored in proper maximized state on Windows OS
CosmeticsIDEA-166907Duplicate caption for button
CosmeticsIDEA-115916Tab bug : graphical and not only
CosmeticsIDEA-167361Tip of the day, goto-message, missleading.
CosmeticsIDEA-150957Gutter grows abnormally when increasing line spacing in editor font settings
TaskIDEA-168385Widen Balloon API for new error selection feature
TaskIDEA-165322External annotator inspection
TaskIDEA-144655Smart PSI pointers should retain old offsets after inserting text after them
TaskIDEA-173294Enable by default Win10 LookAndFeel
Auto-reported ExceptionIDEA-55455Editing YAML file throws exception
Meta IssueIDEA-173344System-independent and system-dependent paths are often intermixed in IDEA code
ExceptionIDEA-151601Too many events posted
ExceptionIDEA-134164Could not start Idea
ExceptionIDEA-156293NPE at com.intellij.ui.mac.MacGestureSupportForEditor$1.pressure
ExceptionIDEA-156917Throwable at com.intellij.openapi.application.TransactionGuardImpl.submitTransactionAndWait
ExceptionIDEA-159111IAE at com.intellij.openapi.components.ServiceManager.getService
ExceptionIDEA-173666NPE at com.intellij.openapi.wm.impl.ToolWindowManagerImpl.a
ExceptionIDEA-160790Unable to save settings: Failed to save settings. Please restart PyCharm
ExceptionIDEA-137007NPE at sun.font.FontDesignMetrics$MetricsKey.init(FontDesignMetrics.java:217)
ExceptionIDEA-156466AE at com.intellij.diagnostic.IdeMessagePanel.showErrorNotification
ExceptionIDEA-120967Settings->Menu and Toolbar not expanding
ExceptionIDEA-168411PluginManager StartupAbortedException
ExceptionIDEA-160341Error at com.intellij.credentialStore.OneTimeString.toString
ExceptionIDEA-164698Throwable at com.intellij.openapi.fileEditor.impl.EditorsSplitters.a
ExceptionIDEA-150925IAE at com.intellij.openapi.fileEditor.impl.EditorComposite.<init>
ExceptionIDEA-149660IAE at com.intellij.configurationStore.StateStorageManagerImpl.expandMacro
ArquillianBugIDEA-143282JBoss Arquillian + IPR project format: IAE at StateStorageManagerImpl.expandMacros()
CSSBugIDEA-160317SASS: Built-in fade-out function not recognized
BugIDEA-151772Angular2 CSS not highlighted even when being used in template
ExceptionIDEA-154246Throwable at com.intellij.psi.css.impl.stubs.index.CssIndexUtil.processKeysInScope
CloudsExceptionIDEA-156073Deployment configuration created from 'Application Servers' toolwindow fails to start if no options are changed in 'Create Deployment Configuration' dialog
Code Analysis. DependenciesBugIDEA-144794Module Dependencies -> Analyse Dependency -> Rerun does not rerun the right analysis
Code Analysis. DuplicatesFeatureIDEA-145091Provide option for duplicated code inspection to exclude generated sources duplicates when processing plain source file
Code Analysis. InspectionFeatureIDEA-156821'Inspection results tool window' - suppressing items of specific type should leave ability to suppress others
FeatureIDEA-164129Jigsaw: provide quickfix when module exported to itself
FeatureIDEA-34620Nice to have to be able to specify pattern or signature for entry points in unused declaration inspection
FeatureIDEA-144795Inspections filtering needs filter for inspections without language
BugIDEA-157046'Unused declaration' inspection shows '1 instantiation found' for constructor of not used class
BugIDEA-156394Incorrect control flow that reports a condition always true
BugIDEA-156364'Inspection result tool window' preview doesn't scroll to view problem item
BugIDEA-160955Inspection Results: inspections not enabled "In All Scopes" are confusingly marked as "Disabled"
BugIDEA-157564'Unused declaration' - in inspection result invalid field is not marked as invalid
BugIDEA-157140'Inspection tool window' counter limited to 1 after rerun when grouping by directory enabled.
BugIDEA-156164Inspection result toolwindow tree - exclude in one node also removes in another
BugIDEA-157966Inspection result tool window shows only one result instead of several for one line when grouping by severity enabled
BugIDEA-151242Run Inspection by Name scope dialog has no default button anymore
BugIDEA-157154Throwable - 'No longer valid' nodes after export/import inspection results.
BugIDEA-156376'Convert to project line separators' inspection can be applied many times
BugIDEA-161871Deadlock when running batch inspection and editing
BugIDEA-157777Case where View Offline Inspection Results doesn't show results
BugIDEA-156823'Inspection result tool window' - Exclude/Include increases counter even the problem already resolved
BugIDEA-156825'Inspection result tool window' - Editing setting should not set inspection analysis profile as active one
BugIDEA-157068Inspection result tool window - 'Nothing here' in quickfix pop-up after using Go Next/Prev problem
BugIDEA-168240Rename 'Import Scheme' to 'Import Profile' and 'Add/Edit description'
BugIDEA-157007XML offline inspection results are not sorted in alphabetical order
BugIDEA-140753Every inspection in offline inspection report is listed 3 times
BugIDEA-177356Unused declaration: inspection problem node doesn't show up as error when the inspection is configured to do so
BugIDEA-159101Odd preview pane for 'Unused declaration' entry points module
BugIDEA-168237Unnecessary popup when import/export inspection settings
BugIDEA-168235"Edit Settings" in inspection result toolbar opens Settings for all inspections, but not for specific one
BugIDEA-160655Inspection profile settings - empty line in Profile list after Resetting settings
BugIDEA-163702No quick fix button on inspection preview at inspection level after the first run
BugIDEA-156793'Unused declaration' - please don't count Entry Points - when inspection in progress
BugIDEA-157009XML offline inspection result - no scrolling, no quickfix buttons - Declaration redundancy inspection group
BugIDEA-144275Checked-Out Settings for Inspection Are Not Active until restart
BugIDEA-161358"Cannot load .idea. The file does not exist" error is shown if .idea folder is removed between offline inspection runs
BugIDEA-156478'Inspection results tool window' loose 'Suppress' button after grouping
BugIDEA-157020HTML export of inspection results - Unused declaration inspection always has only one Problem resolution item
BugIDEA-158795'Apply a quickfix' bulb is not enabled when loading offline inspection result
BugIDEA-156163Inspection result tool window: sometimes odd scrolling in preview pane.
BugIDEA-156310'Inspection Result tool window' wrong counter after applying Suppress for several inner classes
BugIDEA-168254Inspect.sh(bat) doesn't work
BugIDEA-157014XML offline inspection result - empty node for 'no longer valid' item
BugIDEA-160657Inspection profile settings - cannot apply changes right after rename inspection profile
BugIDEA-157909Inspection results "Go Next/Prev Problem" buttons should skip non-problem nodes
BugIDEA-111174Status bar should show inspection highlights even for INFO severity
BugIDEA-156169'Inspection result tool window': 'Filter resolved items' doesn't work without 'Group by directory'
BugIDEA-169227Inspection settings: Restore Defaults does not remove option added to disabled inspection
BugIDEA-156180'Inspection result tool window' Suppress for class shown twice
BugIDEA-130443Inspection settings: tree node does not turn to "modified" state on changing scope set
BugIDEA-55394'Condition always true' inspection sometimes incorrect when variable modified in finally block
BugIDEA-156669'Inspection result tool window' - exclude file scope option when use 'Run inspection on...' button on preview pane
BugIDEA-156353'Editor is already disposed' exception when navigating through inspection result tree
BugIDEA-156683'Unused method parameter' inspection finds only first unused parameter but not all
BugIDEA-162159Inconsistent inspection results when "Group by directory" enabled/disabled
BugIDEA-156893'Inspection result tool window' - inspection description font is too big
BugIDEA-158470'Inspection result tool window' - included back node doesn't appear if filter is on
BugIDEA-156354Throwable - at excluding item of inspection result tree
BugIDEA-155813Freeze after running inspections
PerformanceIDEA-161598AnalysisScope uses and retains a lot of memory
PerformanceIDEA-156387'Inspection results tool window' tree creation slowness without grouping by directory
PerformanceIDEA-156384'Inspection results tool window' tree slowness selecting inspection
PerformanceIDEA-156635Running inspection analysis causes idea to freeze
PerformanceIDEA-157006After importing XML offline inspection results any change of grouping is slow
PerformanceIDEA-172904Slowness viewing inspection result
PerformanceIDEA-157005XML inspection report import hangs after switching to another application
UsabilityIDEA-156179'Inspection result tool window' open settings for selected group
UsabilityIDEA-173023Inspection settings: parent elements do not become "changed" after changing inspection severity
UsabilityIDEA-157156'Unused declaration' - suppress &quickfix actions are available after applying
UsabilityIDEA-155319"Run inspection by name" should not reuse "Find Action" search pattern
UsabilityIDEA-155073"Suppress all inspections" is inconveniently placed
UsabilityIDEA-156675'Inspection result tool window' - please preserve selection after inclusion/exclusion
UsabilityIDEA-156673'Inspection result tool window' - Exclude/Include is not affect children nodes as it should
UsabilityIDEA-96532Orders in Severities Editor and in Severity Chooser are opposite
UsabilityIDEA-156728'Unused declaration' inspection - Edit settings doesn't navigate to inspection when entry point selected
UsabilityIDEA-156727'Inspection result tree' Re-arrange menu items in context menu
UsabilityIDEA-156894'Inspection tool window' - preview scrolls to the beginning of the file after Excluding result
CosmeticsIDEA-156173'Inspection result tool window' Cursor in tree may overlap preview pane
CosmeticsIDEA-173147Ugly Suppress combobox in batch inspection results
CosmeticsIDEA-159065Blinking preview pane of inspection result tool window
CosmeticsIDEA-162907Inspections settings: wrong font color for selected top level nodes
CosmeticsIDEA-157206'Inspection result tool window' - Exclude/Include changes font color when should not
CosmeticsIDEA-156462'Inspection result tool window' on preview shows '1 problemS' when performing analysis
CosmeticsIDEA-157004HTML inspection result report - Could we change Warning and other severity colors
CosmeticsIDEA-156157Odd vertical line (and indent) in preview of inspection results
ExceptionIDEA-159043NPE running 'Unused declaration' inspection
ExceptionIDEA-157558Argument for @NotNull parameter 'src' of com/intellij/util/ArrayUtil.remove must not be null
ExceptionIDEA-157153NPE at importing XML results of inspections
ExceptionIDEA-160668Inspection profile settings - NPE after importing inspection settings
ExceptionIDEA-155872NPE running inspection for the first time
ExceptionIDEA-156670Throwable at excluding several nodes
ExceptionIDEA-155886Throwable after usage of 'Inspection Options'
ExceptionIDEA-156469Throwable - running inspections on IDEA java-tests module
ExceptionIDEA-157464ArrayIndexOutOfBoundsException at traversing inspection results
ExceptionIDEA-155839java.lang.IllegalArgumentException: Argument for @NotNull parameter 'parentNode' must not be null
ExceptionIDEA-156891Wrong offset: 13101. Should be in range: [0, 11760] - canceling inspection
Code CoverageBugIDEA-158755Export Coverage Report as HTML produces a NPE
Code Formatting and Code StyleFeatureIDEA-99267Command line formatter could be implemented
BugIDEA-141916The code formatter:off (//@formatter:off) does not work as expected.
BugIDEA-150768Java fields are shown as plain identifiers if custom color scheme is used
BugIDEA-159285Editor doesn't auto-indent within switch-case correctly
BugIDEA-160426Export of Code Style does not include JavaDoc configurations
BugIDEA-146984Lot of Java color options doesn't inherit from Language Default
BugIDEA-166923Reformat code before commit doesn't pick up code style settings
BugIDEA-156914Allow indent options provider to override language specific indents for data language in templates
BugIDEA-156091Scratch files don't use changed code style
BugIDEA-144945Incorrect notification "The file is indented with 3 spaces instead of 2" in Dart file
BugIDEA-52549Reformat Code misbehaviour in a XML file
BugIDEA-160389Manage Code style setting | Copy to project doesn't update settings editor until settings dialog is reopened
BugIDEA-141467"Reformat according to Style"-Checkbox resets on IDE restart
BugIDEA-173502Applying "Use inherited Attributes" on one item will auto-select inherited attributes option on other items
BugIDEA-132970Provide simple import of IntelliJ code style settings
BugIDEA-144196Strip trailing spaces on save should honor keep Indents on empty lines
BugIDEA-156091Scratch files don't use changed code style
BugIDEA-158868Incorrect whitespace insertion into Java reference expression
BugIDEA-144408Adjusting Settings via a Quick-Fix allows alters Default
PerformanceIDEA-72973Converting spaces to tab on a large file seems to effectively kill phpstorm
ExceptionIDEA-173144Find action exception
Code NavigationFeatureIDEA-155607Prefer classes available in the current module
FeatureIDEA-106194Search in File structure dialog with paste support
FeatureIDEA-112841Navigate to file action should support fuzzier path search terms
FeatureIDEA-111332Navigate file doesn't understand line number
FeatureIDEA-151405More flexible go to file and line action
FeatureIDEA-162418Enhanced go to file formats
BugIDEA-128907Goto declaration in code fragment opens new editor
BugIDEA-171098Class/Symbol Navigation behavior change
BugIDEA-157956Breadcrumb font size doesn't scale down.
BugIDEA-160333Override/implements gutter icon not navigating
BugIDEA-158010"Searching for implementations" thread isn't canceled when the Goto Implementation popup is canceled
BugIDEA-156369Go to declaration on lambda param does nothing
BugIDEA-157772Breadcrumbs are shown incorrectly in the decompiled classes
BugIDEA-149235Unexpected classes in type hierarchy when multiple versions of class present
BugIDEA-160567"Navigate to next highlighted error" is broken
BugIDEA-157786File matching pattern results showed twice for some files
BugIDEA-92217Breadcrumbs are not updated on first mouse/keyboard action just after file reopening
BugIDEA-76466Navigate Symbol does not support anonymous inner classes
BugIDEA-158226Goto Declaration action: is available on literals
BugIDEA-124800Does not work go to the implementation of the method
BugIDEA-159305Low relevant elements on top of the results list in Go to class popup
BugIDEA-156984Deadlock in inheritor search
BugIDEA-157671Wrong title when searching for inheritors
BugIDEA-167877Strange "Go to Implementation(s)" behavior with private inheritors
BugIDEA-165329Can't copy class reference by hitting Ctrl+C in Navigate/Class list
BugIDEA-159188'Back' navigation fails if the 'Choose Declaration' popup was shown
PerformanceIDEA-156735Bookmarks causing typing slowness
UsabilityIDEA-172282Disprefer start-matching variants in Goto popups when the input starts with *
UsabilityIDEA-161069Show special gutter icon for 'implemented via sub-class' methods
UsabilityIDEA-163865"Enter class name" popup showing distant matches first
UsabilityIDEA-22690Show definition for class should show the package
CosmeticsIDEA-137806got to file and line using file(number) syntax along with file:number
ConsoleBugIDEA-161123Saving console output to file produces an empty file
BugIDEA-167431Console filters can no longer change foreground text color
BugIDEA-167094Can't remove first char in user input
BugIDEA-132694ANSI colors need restart for a new settings to apply
BugIDEA-152620Move Filter#applyFilter from EDT to the pooled thread
BugIDEA-146228IntelliJ does not respond when searching SQL History
BugIDEA-145124Console contents not visible when window is floating
BugIDEA-149450ANSI escapes not interpreted as expected
PerformanceIDEA-165325version 2016.3 extreme slow console
UsabilityIDEA-63980Make idea.cycle.buffer.size configurable in IDEA GUI / IDEA settings
Cucumber JVMFeatureIDEA-157368Behave: Scenario outline parameters are not highlighted in outline description
Custom JREBugIDEA-166384provide a utility method in IDEA to support JRE-166
UsabilityIDEA-57233Editor font antialising/appearance problems on Linux
DebuggerFeatureIDEA-54188add a configuration option to preselect/automate disconnection and process termination on termination of a debugging session
FeatureIDEA-43728Provide a way to step in a chosen thread while others remain suspended
FeatureIDEA-145368Support force early return
BugIDEA-149816No completion and strange errors in condition field in decompiled files
BugIDEA-150534DebugConfigureAction DebugLogConfigureDialog is missing getDimensionServiceKey()
BugIDEA-156761'Show watches in variables tab' button moves to Server tab
BugIDEA-149017Process list implementation does not provide correct executable names for applications with spaces in their paths
BugIDEA-149786Watches editor is broken
BugIDEA-172505Gradle mulitmodule project debug jumps to wrong module for breakpoint
BugIDEA-152840Breakpoint popup: Condition field mnemonic is passed to main frame
BugIDEA-177131Debugger console should have horizontal scrollbar and the ability to scroll content with the mouse
BugIDEA-156365Force Step Into in debugger causes AbstractMethodError
BugIDEA-150317Debugger: Evaluate dialog: Expression Mode button shows wrong mnemonic
BugIDEA-170677Top-levels tabs in the "Debug" tool window is merged after the IDE restarted
BugIDEA-170670Top-level tabs are losing a state when session restarted
BugIDEA-161754Terminate process on exit choice is not preserved
BugIDEA-150591Attach to process list doesn't show processes launched from terminal with a relative path
BugIDEA-150592Attach to process list doesn't show process with non–latin character
BugIDEA-161086Add to Watches from "Evaluate" dialog should evaluate only once
BugIDEA-145015Quick evaluate expression (ctrl+alt+8) instruction is silently ignored when an attempt is made to evaluate the same expression a second time.
BugIDEA-130822Special Java/Swing widget to enable/disable breakpoints does not hide when active tab changes during debugger session
BugIDEA-150411Debug tool window: on reusing it different type of configuration picks up watches from previous type
BugIDEA-156086Create breakpoint with text selection fail
BugIDEA-131748Stop debug session kills all processes
UsabilityIDEA-144953Navigate from Evaluate Dialog should close it
UsabilityIDEA-120087Debugger: changed state of a breakpoint is not visible, until applied
UsabilityIDEA-142098Multiple breakpoints in a single line: don't display the whole method body in toggle breakpoint drop-down
UsabilityIDEA-167143Invalid focus switching in variables window
UsabilityIDEA-156493"Evaluate Expression" – underlined character conflicts with "Paste from History"
UsabilityIDEA-172133"Add to Watches" action does not "follow" editor selection
UsabilityIDEA-155212breakpoint display in favorites is suboptimal
UsabilityIDEA-124497Debugger: "Resume/Pause Program" in menu "Run" is active active
UsabilityIDEA-152214Xcode like way to disable/remove breakpoints
UsabilityIDEA-151857Field "tooltip delay" is active when the check box is disabled
UsabilityIDEA-172772Action "Resume program" is not available when IDEA is updating indexes
CosmeticsIDEA-57838Different breakpoint icon for conditional breakpoints
CosmeticsIDEA-103215Add automatic word wrap to conditional breakpoint expression modification popup
DecompilerBugIDEA-82515Failed assertions within psi.impl.compiled on opening class files compiled by Kotlin
Diff_MergeFeatureIDEA-170174Implement "Mirror to left/right" from FTP compare on local compare
FeatureIDEA-149184Add auto scale to fit downscaling, remember zoom factor and zoom both images at once options to image diff
FeatureIDEA-64244Enable "annotate" feature in merge window.
FeatureIDEA-138701Separate gutter highlighting for whitespace-only changes
FeatureIDEA-115600Advanced syntax coloring not working properly in 'Show Diff' window
FeatureIDEA-167631Open all files which are modified in the current branch
FeatureIDEA-166528Window "Difference between master and ... (Local) versions in ...
FeatureIDEA-16394Option to turn off inspections in diff window
BugIDEA-160945Inspection highlighting in the Merge dialog does not work
BugIDEA-127612Optimize imports action available in diff
BugIDEA-144276Diff view shows "no differences" message when "Do not highlight" option is set
BugIDEA-173149Next Difference does not work on emptied files
BugIDEA-141370Diff dialog cache for files out of project
BugIDEA-22363Diff Window in Ignore Whitespace Mode: Says "No Difference" Even If Threr're Ignored Differences
BugIDEA-158003Compare Files no longer works with files in archives (jar, zip)
BugIDEA-173906Diff on item in shelf is not syntax highlighted
BugIDEA-111268Tab width not respected when viewing code changes inline
BugIDEA-147700Diff view opens new window in smallest window possible only showing close, min, max buttons
BugIDEA-160646External Diff Tool: file extension is empty for files with unknown file types
BugIDEA-161976Resolve merge conflicts window too small on hidpi screen
BugIDEA-101502Dir diff: Files with different line separators(the only difference) are shown as different in the list, but are actually the same ("no differences")
BugIDEA-156201Insertion / deletion markers are shown at wrong positions with "Ignore whitespaces" policy
BugIDEA-171674First tab is very short in the left Diff pane
BugIDEA-151526No annotate action is enabled in "Compare with..." dialog for repository version
BugIDEA-151524Strange error and exception in log if try to annotate diff for newly added file(from local changes)
BugIDEA-151521Assertion error on try to annotate diff for local changes(in case one line)
BugIDEA-150929Command line "idea.sh diff" does not work if idea is not running
BugIDEA-151274Column selection mode does not work in 3-way merge
PerformanceIDEA-159879Memory leak while looking many diffs
UsabilityIDEA-105203diff section in commit window is not resizable
UsabilityIDEA-137362Commit Changes dialog diff area to small
UsabilityIDEA-137936New diff shows less code than before
UsabilityIDEA-141671Filenames used in external merge are not immediately self-documenting
CosmeticsIDEA-110941Bookmark icons shown flipped horizontally in diff window
CosmeticsIDEA-136265Diff view: the collapsed lines markers are not visible with some look and feels
ExceptionIDEA-162307Cannot open Diff of SQL file anymore: UnsupportedOperationException: Should not be called directly
ExceptionIDEA-167185AE at com.intellij.util.xmlb.MapBinding.deserializeList
DockerFeatureIDEA-142322Add possibility to close attached console
FeatureIDEA-152660Docker Log console does not support ANSI color codes
FeatureIDEA-170246Docker: Support HEALTHCHECK and SHELL instructions in the Dockerfile
FeatureIDEA-170253Docker: Validate the number of arguments for instructions in the Dockerfile
FeatureIDEA-153202Docker plugin - select visible containers/images
FeatureIDEA-172226Support docker stages synthax
FeatureIDEA-178533compose YAML: show enum violations in docker compose inspections
FeatureIDEA-138992Simplify converting options for command line docker util into json
FeatureIDEA-170237Docker: Show inspection errors for invalid LABEL instructions
BugIDEA-157736Deploying docker container fails because HostConfig was removed in docker v1.12
BugIDEA-168191|| missing as operator for Dockerfile RUN command
BugIDEA-162764Docker: wrong item is selected when trying to configure server
BugIDEA-145427Docker: support full set of the options from Docker 1.21 remote api
BugIDEA-175715Docker: display "Dockerfile detection" events only project-dependent
BugIDEA-161488Docker terminal should be available in dumb mode
BugIDEA-155582Docker. Error is displayed for "!" in the correct Dockerfile in the Editor.
BugIDEA-170242Docker: Show inspection errors for invalid ARG instructions
BugIDEA-151477Dockerfile false negative syntax error message
BugIDEA-155150Dockerfile editor misidentifies $(...) as syntax error
BugIDEA-155691Docker: attach fails for remote Docker with insecured HTTP access
BugIDEA-161514Docker Deployment run configuration hangs
BugIDEA-151199Docker: (on win / mac): Compute the local volume bindings considering virtual box path mapping
BugIDEA-159223Support direct connection via unix:// on Mac OS X
BugIDEA-144983Docker: improve UI for configuring container options
BugIDEA-172233Dockerfile: treat variables declared in ARG instructions
BugIDEA-150970Docker: edit container settings in the Docker view
BugIDEA-152971Docker: dedicate view is not created on first server registration until project is reopened
BugIDEA-155508Docker. Error is displayed for the correct Dockerfile in the Editor.
BugIDEA-155353Docker. Idea hangs after opening some amount of container tabs.
BugIDEA-151572Docker: rename Settings / Clouds item to 'Docker' if it's the only cloud available
BugIDEA-145814Dockerfile synthax errors
BugIDEA-173563Docker: ADD instruction: Provide an inspection error in case of multiple source files and "/" absence at the end
BugIDEA-173387Unable to install or update to docker plugin 2.5.5
UsabilityIDEA-177951Docker: Dockerfile detection balloon should handle the case when too many files detected
UsabilityIDEA-155356Docker. Order containers and Images in the Docker View.
CosmeticsIDEA-169257Docker: Find Usages called from Dockerfile. Correct the title and review buttons.
TaskIDEA-144850Docker: run a command in a running container
ExceptionIDEA-173553AssertionError on COPY --from
ExceptionIDEA-145239NPE on adding volume binding
ExceptionIDEA-158428Throwable: Dockerfile detection is already registered
DocumentationBugIDEA-152590Quick doc font size is not remembered between IDE restarts
UsabilityIDEA-158071Documentation of com.intellij.psi.tree.* API classes
Eclipse IntegrationBugIDEA-160071When eclipse plugin is not available, show error message (instead of exceptions)
Editor. Code CompletionFeatureIDEA-171779Make default size of code completion popup configurable
BugIDEA-152395Wrong bracer wrapping in lambda expression
BugIDEA-113393Live Template variable skipped when its default value contains a dash
BugIDEA-165880Out of date psi in completion API
UsabilityIDEA-178522Please repeat "Complete function with parameters" setting in editor
UsabilityIDEA-159953Esc for completion popup also removes the usages highlighting
Editor. Editing TextFeatureIDEA-45030Add ability to specify cursor position in File Templates (e.g. special macros as for Live Templates)
FeatureIDEA-147003Provide syntax aware 'move left'/'move right' actions
FeatureIDEA-111564Leave caret where is if inline refactor mode is exited with Shift-ESC
FeatureIDEA-127539Support for ligatures in editor
FeatureIDEA-23487Parameter Shifting like Method Shifting
FeatureIDEA-145479Live Templates: reverse of underscoresTo*() functions
FeatureIDEA-158886Live Template unable to use variable + constant as default
FeatureIDEA-12068Add ability to go to matching brace/parenthesis/bracket
BugIDEA-178621Join Lines does not add whitespace at the end of lines if they are indented
BugIDEA-149641Scrolling pane horizontal position does not follow the caret if Live Template variable placeholder is active
BugIDEA-96781Quick Documentation: after closing pinned Documentation window it doesn't open when the caret is in documentation comments
BugIDEA-166498Incorrect border effect in editor with new hidpi
BugIDEA-172026No cursor when switching to another window.
BugIDEA-162004Rich copy produces wrong foreground color at the start of copied fragment
BugIDEA-144876Dragging breakpoint produces text selection
BugIDEA-43257When several JDKs are used in project modules, "Overridden in subclasses" list includes classes from every JDK
BugIDEA-111328Move caret to matched brace works incorrectly
BugIDEA-154763Ligature for "[]" doesn't work in C/C++ for arrays with FiraCode
BugIDEA-152063IntelliJ fails to use encoding from project settings for files containing breakpoints when project is opened
BugIDEA-161056In column mode, after pressing Shift-PageDown to efficiently extend the column to the bottom of the page, Shift-UpArrow stops working.
BugIDEA-165577Sibling multi-cursors are merged into one
BugIDEA-166581Incorrect font rendering in vcs change preview (new hidpi)
BugIDEA-159282When commenting with line comment Hebrew text is placed on the left side of the comment
BugIDEA-159281In .rb files when commenting with line comment Hebrew text is inverted
BugIDEA-166059Corrupted zero latency typing with the new hidpi
BugIDEA-160423Caret#selectLineAtCaret(and others) operate on a different caret instance
BugIDEA-150296java.lang.IllegalArgumentException: line must be non negative: -1
BugIDEA-170583"Reformat Code" leads to weird scrolling in the editor window
BugIDEA-158635Toggling Ligatures does not update font preview
BugIDEA-146566Live Templates seem to be ignoring in-line @ symbols
BugIDEA-151013"Move statements right and left" works unreliably in XSLT
BugIDEA-149995Folded code foreground not inherited from default text
BugIDEA-161105Breakpoints move unexpectedly on editing
BugIDEA-159399Selection gets broken for multi clicking Alt+Shift+Middle Mouse Button
BugIDEA-177564Status bar of Console window does not update the "Column" field
BugIDEA-157196Regression: mouse wheel scroll doesn't work while highlighting editor text
BugIDEA-171695Intention bulb blocks cursor placement
BugIDEA-155936Incorrect width of cyrillic letters in editor.
BugIDEA-168069Join Lines throws array index out of bonds on an empty file
BugIDEA-149817IntelliJ: Cannot navigate from usage to declaration of method because documentation overlay hides usage
BugIDEA-158038Multi-caret typing of a text where some characters are inserted automatically results to different content of the first and other lines
BugIDEA-150505Underlines characters invisibles
BugIDEA-158439Newline in FoldingBuilder.getPlaceholderText is displayed differently cross-platform
BugIDEA-159929# in custom File templates in WebStorm are marked as errors
BugIDEA-140614Find action search field doesn't respect editor's keymap for 'paste' and 'cut up to line end' actions
BugIDEA-77306Expand Abbreviation showing red placeholder rectangle and needs to confirm by pressing Tab/Enter/Esc second time (CSS, JS) when caret is in it
BugIDEA-150440Soft-Wrap should wrap at the configured code width
BugIDEA-172241Uncomment of multiple blocks in properties file does removes too many characters
BugIDEA-165853Unable to save settings: Failed to save settings. Please restart IntelliJ IDEA
BugIDEA-150819Keymap - multiple identical shortcuts for the same action
BugIDEA-177979Impossible to enter zero width non-joiner character on Windows 10
BugIDEA-110029documentation window disappears immediately
BugIDEA-161293Console Font preview - gutter is not updated on font size change
BugIDEA-150132When selecting and dragging text to "watches" most of the time the editor will start scrolling down and marking the whole text automatically.
BugIDEA-173263"Auto-Indent Lines" does not move to the next line when caret is inside a string with injected language
BugIDEA-76883The yml file has more code folding outline, and it position is error. (Have picture)
BugIDEA-159777ObjectNotDisposedException on project close with opened evaluate window
BugIDEA-158559Drag in annotations area starts selection
BugIDEA-172912Garbled characters in quick documentation
BugIDEA-167611Default printer font size is big on HiDPI display
BugIDEA-168209Quick doc window is not closed from the first attempt
BugIDEA-162245Auto-import is aggressively importing non-existing symbols
BugIDEA-166403Backspace does not remove indents and new lines in scratch files
BugIDEA-161409Folded imports region opens when imports are added
BugIDEA-167937Documentation window gets focus on second Smart Type completion
BugIDEA-170997Multi-caret: A character is deleted despite empty selection
BugIDEA-150208Text selection is shifted / wrong text selection
BugIDEA-161410Quick Documentation: double opening angle brackets are printed as single brackets
BugIDEA-160904Semantic highlighting setting isn't saved between restarts
BugIDEA-151182AWT freeze after git pull
BugIDEA-161968Multiselection cursor location is unexpected
BugIDEA-167630Backspace > Unindent to nearest indent position option doesn't work as expected beyond the line end
BugIDEA-98074Line spacing makes cursor oversized
BugIDEA-165306Multiple caret Copy and Paste gives inconsistent results
BugIDEA-159638scratch buffers generate errors in undo
BugIDEA-165337Copy-paste from IDEA to TextEdit and back loses line breaks
BugIDEA-173190"Show Breadcrumbs" item in breadcrumbs bar context menu does nothing
BugIDEA-106950Incremental selection doesn't work in android logcat
BugIDEA-157592Move text through drag'n'drop on line numbers doesn't work. It copies the text instead
BugIDEA-156530Trailing whitespace being stripped only from the file which editor tab is active
BugIDEA-160978'Quick Documentation' doesn't work in modal dialogs
BugIDEA-154312IDE becomes unresponsive on file save/sync.
BugIDEA-168452Backspace does not change cursor position
PerformanceIDEA-157963Editor search leak when closing the editor
PerformanceIDEA-157087Issue with Xml with Ligature
PerformanceIDEA-156978LineSet should handle typing in large lines more efficiently
PerformanceIDEA-164157Editor lags on typing 'Tab'
PerformanceIDEA-166747Freeze after calling duplicate action repeatedly
PerformanceIDEA-135620Multiple selections are extremely slow in edge cases
PerformanceIDEA-154272Editor opening should do heavy operations in background
UsabilityIDEA-159851External documentation doesn't jump to method, only top of the file on OS X
UsabilityIDEA-156760'Non-project files protection' dialog is had to use with a keyboard
UsabilityIDEA-97406If user choose bigger edtior font, text effects (underlining, underwaving, strikeout) are still 1 pixel wide
UsabilityIDEA-156759Add an option to 'Non-project files' protection dialog to edit files in a folder
UsabilityIDEA-156758Disable non project files writing protection, when file is opened explicitly
UsabilityIDEA-126952Scratches should have an extension
UsabilityIDEA-158519Property files containing RTL strings and tokens (Arabic and Hebrew) are not rendered correctly
UsabilityIDEA-87318Backspace should delete whitespace to chosen indent level, or be configurable
UsabilityIDEA-115413UI hang on Regex evaluation
UsabilityIDEA-150389Remove the term "Platform" from the UI
UsabilityIDEA-167366When you enter Ctrl-Ctrl Down arrow to enter column mode, then while holding ctrl do shift right arrow, does not move to next word boundary
UsabilityIDEA-173273Renaming a parameter with a hint looks weird
UsabilityIDEA-111169Selecting lines using tap-drag (not click) on macbook forgets last line of selection.
UsabilityIDEA-167931"Quick Evaluate Expression" with default mouse shortcut adds multiple carets on Linux
UsabilityIDEA-156510Action "Toggle case" doesn't change capitalization of characters preceded by escaped backslash
UsabilityIDEA-171904Parameter hints exclude dialog should remember the selected language
UsabilityIDEA-159092Middle mouse double click does selection in editor
UsabilityIDEA-152763Javadoc attached to library made by Doclava doesn't show due to attribute difference
UsabilityIDEA-151393Changed order of intentions
UsabilityIDEA-121829Disallow editing of framework/third-party files
UsabilityIDEA-149632Display editor notification for library class sources that don't match bytecode
UsabilityIDEA-127845Select logical line rather than visual line if an action which requres selection is invoked
CosmeticsIDEA-148843A letter may appear on both sides of the caret
CosmeticsIDEA-170592Choose Content to Paste Dialog (Ctrl+Shift+V) only highlights the first match per line
CosmeticsIDEA-67480Font baseline is shifted for Consolas font
CosmeticsIDEA-178723Non expandable foldings are always selected
TaskIDEA-149785Add an option in editor settings to disable adding carets on double-Ctrl+arrows
ExceptionIDEA-159106TraceableDisposable$DisposalException at at com.intellij.openapi.util.TraceableDisposable.throwDisposalError()
ExceptionIDEA-159934java.awt.HeadlessException is thrown while building searchable options in headless mode
ExceptionIDEA-160466Throwable at com.intellij.openapi.editor.impl.SoftWrapModelImpl.getRegisteredSoftWraps
ExceptionIDEA-172324IndexOutOfBoundsException in SegmentArrayWithData
ExceptionIDEA-160596Transaction assertion from daemon createPasses
Editor. Error HighlightingBugIDEA-144686Inconsistent coloring in Maven pom.xml/Spring config.xml files
BugIDEA-161890Kotlin unused symbol highlighting is not updated after adding/removing single usage in another file
UsabilityIDEA-160408Quote not recognized as an end to String
ExceptionIDEA-160814IndexNotReadyException
Editor. Intention ActionsFeatureIDEA-150587Ability to click on links from inspections above the Editor using keyboard
CosmeticsIDEA-151324Not all actions in Generate menu have description in Status Bar
External ToolsBugIDEA-164380External tool is not invoked after Git commit
BugIDEA-110240Auto select run tool after commit
File SystemBugIDEA-166879IDE cannot handle 2GB+ jars
BugIDEA-166870The IDE cannot access filesystem on AArch64
BugIDEA-56577Report situation when user.home is pointing to an UNC path
BugIDEA-150199cannot create file with non-ascii characters in name
BugIDEA-159022Gradle project doesn't see the updated jar file after sibling Maven module artifact rebuilt
BugIDEA-166196Modules cannot be loaded error when loading a project containing iml reference outside of project dir.
BugIDEA-160580When symlink target changes to another with different content but the same length, content is not reloaded
BugIDEA-151155Standalone inspections fails on Windows
BugIDEA-161568UI Freezes after maven build ends
BugIDEA-162327Recognize NTFS junctions
BugIDEA-157840Save Document action doesn't work during indexing
PerformanceIDEA-165859Pycharm freezes when open a folder with recursive symbolic link
TaskIDEA-103559File sync issues on paths containing non-ASCII characters
ExceptionIDEA-156660at com.intellij.openapi.vfs.impl.local.NativeFileWatcherImpl$MyProcessHandler.notifyTextAvailable
ExceptionIDEA-137695Pycharm was working fine, however i restarted my computer and tried to open it and I got a java.lang.runtime exception
Find, Replace, Find UsagesFeatureIDEA-147920Make Find in Path result previews editable
FeatureIDEA-156611Find/Replace toolbar: Escape now clears the replace lineedit which also clears the lineedit history entry
FeatureIDEA-150915Find in Path Dialog: Preview tab does allow F4 to jump to source when focus in code preview pane (lower half)
FeatureIDEA-166464Be able to merge usage from the same line in the "find in path" preview pane dialog
FeatureIDEA-85093Find in files preview: allow to edit source file
FeatureIDEA-157910Find in path should be able to search in several threads
FeatureIDEA-171606Show VCS change marks in the search results preview editor gutter
BugIDEA-161214Find in Path: Preview editor does not abide by option "Allow placement of caret after end of line"
BugIDEA-155972Find in Path: preview shows wrong position
BugIDEA-112749Find field unicode support
BugIDEA-160080Find query lost when switching between "find in path" and "replace in path" dialogs
BugIDEA-170963Mnemonics shortcuts in new Find in path dialog is a mess
BugIDEA-168276"Find in path" doesn't change the directory to the selected one
BugIDEA-120891PhpStorm stuck after trying to cancel find in path
BugIDEA-157575Unexpected Cursor Behavior in Search
BugIDEA-160785Selection in a find/replace field is broken
BugIDEA-160192Seach and replace inconsistency started from Seach dialog
BugIDEA-167436Rerun 'Find Usages' empties first tab
BugIDEA-167096'Too Many Occurrences' window appears too early
BugIDEA-167546Find/Replace nonfunctional when newlines are embedded in the Find textbox
BugIDEA-170038Find in Path dialog does not close automatically when clicking the code area
BugIDEA-161826Find and Replace keeps previous data in Replace field but it looks cleared
BugIDEA-157351Replace in Path: When next file is opening, code editor is blank (hangs) with "Loading" spinner
BugIDEA-146150Page up/down in preview mode of find in path
BugIDEA-14042910s hang on changing groupping in show usages
BugIDEA-159341Replace in file: Regex for start of line matches twice on empty lines
BugIDEA-68160Find & Replace: preserve case bug
BugIDEA-156921Find In Path toolwindow - focus is stolen by "Preview Occurrences" editor
BugIDEA-166240Unordered line numbers in the "Find" panel
BugIDEA-104681Regex Find always case-sensitive with non-english characters
BugIDEA-159829when editing in find result previews the cursor jumps some number of characters after insertion
BugIDEA-149094Show usages popup speed search issues
BugIDEA-165473Find Usages results tool window scrolls erratically when removing result items and Group by usage type option enabled in view
BugIDEA-160975Find Usages does not search in library sources when there are several JDKs in the project
BugIDEA-150931Find in Path dialog: Preview tab doesn't show file path anywhere.
BugIDEA-144570Regex search freezes due to Preview tab
BugIDEA-120868Usage search "No Results" popup too small
BugIDEA-172370Find in path "Searching..." when nothing found
BugIDEA-150928The regex search dosent work sometimes.
BugIDEA-156850find preview ignores app settings ("soft wraps": off, "indent guides": on)
BugIDEA-140074Find in Path not working in jar file paths - Directory scope not working as before
BugIDEA-167872Find results from different files are merged
BugIDEA-169849Can't undo in Find in Path
UsabilityIDEA-172283'Select All Occurrences' not available in replace mode
UsabilityIDEA-156629No replacement hint for the second and further occurrence in regex replace
UsabilityIDEA-167955Find: `Ctrl+F` on selected word doesn't pre-select text in search field if Find bar is open
UsabilityIDEA-61493Find Usages: Separate "Use soft wraps" option for the preview panel
UsabilityIDEA-80778Folding - provide an option to NOT automatically unfold when user performs Find.
UsabilityIDEA-73115"Show Usages" action should be more smart and detect on which usage it's invoked
UsabilityIDEA-157440No space between line number and code when exporting found occurences to text file
UsabilityIDEA-139310"Find Usages" should report source usages before usages in generated code
UsabilityIDEA-87037Usability: Find in Path -- NOT in Whole project
CosmeticsIDEA-172116Module dropdown in find window is too narrow, not resizable or scrollable
ExceptionIDEA-167571Argument for @NotNull parameter 'scope' of com/intellij/psi/search/LocalSearchScope.<init> must not be null
ExceptionIDEA-171668NPE at com.intellij.usages.impl.UsageViewImpl.doAppendUsage(UsageViewImpl.java:1060)
GWTFeatureIDEA-138721Show module for bundled CSS files
BugIDEA-170329IDEA 2017.1 NoClassDefFoundError: com/intellij/javascript/debugger/sourcemap/SourceMapHelperKt$createResolver$1$1$1$1 when debugging GWT
BugIDEA-157674"Unresolved references in JSNI methods" inspection not detecting anything
HTMLBugIDEA-157251Wrong autocomplete for opening tags
BugIDEA-151185Thymeleaf namespace declaration not recognised in script tag
IDE ConfigurationFeatureIDEA-171540Template Explorer like in Resharper
FeatureIDEA-165592Bring back opening files from CLI in new window as option
FeatureIDEA-158388Add 'fromIDE' to all URLs that are opened from updates dialog
FeatureIDEA-108023Add "mouse wheel up" and "mouse wheel down" to mouse shortcuts
FeatureIDEA-159520Different color for lambda parameter
BugIDEA-172847On restart Intellij keeps clearing my font settings
BugIDEA-156772Some Live Templates lost their "applicable context" IntelliJ 2016.2 EAP
BugIDEA-166807IntelliJ does not recognize and deletes project shared file templates
BugIDEA-167444Deletion of css dialect or template data language left an artefact and causes an IOOBE
BugIDEA-150830Edit Custom VM Options propose to create idea64.vmoptions file instead of idea.vmoptions on OSX
BugIDEA-166732JetBrains IDEs do not restart if IDE is in a directory containing '.app' in it's name on Mac
BugIDEA-156742Save problem for Code Style Setting on Windows
BugIDEA-160459Nothing happens after 'Check for Updates...'
BugIDEA-160474File Templates: 'Enable Live Templates' checkbox is cleared on restart
BugIDEA-166892NullPointerException on startup
BugIDEA-166362Show warning notification concerning outdated boot java runtime
BugIDEA-151560Map help button to the specified id
BugIDEA-155871Page 'http://localhost:63342/m?jar/resources/inherit.gif' requested without authorization popups
BugIDEA-166179Font size is not preserved after updating to EAP build
BugIDEA-157865Lots of 'Already disposed' from 'UpdateChecker.checkForUpdate' when IDE is closed
BugIDEA-165515'Edit Custom VM Options' action should edit file defined by IDEA_VM_OPTIONS environment variable if it's set
BugIDEA-167619I can not add another import to Java|Imports
BugIDEA-166402incorrect warning
BugIDEA-159360Custom file type: inconsistent highlighting of symbols added as keywords
BugIDEA-158422Keymap: for non-QWERTY keyboard layouts Ctrl is processed as Ctrl+Alt (Windows) or Alt (Mac OS) when combined with symbols
BugIDEA-173324Some Code Style settings are applied on Cancel
BugIDEA-160935Could not initialize class com.intellij.codeInsight.template.impl.TemplateContext$ContextInterner in presence of Database Navigator plugin
BugIDEA-151084'Gradle' and 'Maven' items are always shown in results of searching in Keymap by shortcut
BugIDEA-130605Import Settings: "Select Components to Import" dialog has some unreadable items
BugIDEA-162050Show in files does not work in Debian Linux 8
BugIDEA-156990Keymap: for non-QWERTY keyboard layouts semicolon is treated as colon in keyboard shortcuts
BugIDEA-173342Some non-URL paths in IDEA settings are stored with system-dependent separator
BugIDEA-156986Keymap: "English layout support" option gets disabled after reopening Preferences
BugIDEA-134815File templates: can't create templates from file without extension
BugIDEA-153585File Templates can't be exported/imported via Export/Import settings
BugIDEA-159323Custom file type: hex prefix configuration has no effect (no number highlighting)
BugIDEA-157128IDE loses Live Template "Applicable in" status on restart
BugIDEA-153597Settings > Appearance > "Override default fonts" should display current font when unchecked
PerformanceIDEA-173601File synchronization makes the UI freeze for half a minute
UsabilityIDEA-160418Settings search: don't start search when only 1 character was typed
UsabilityIDEA-149673"Update channel switched to Early Access Program" notification is shown even on the first start-up
UsabilityIDEA-165796remove perm gen options from OutOfMemoryDialog
UsabilityIDEA-142986Settings / Colors and Fonts: hyperlink near "Use inherited attribute" could be always enabled
UsabilityIDEA-166720Please sort lines in Settings - Editor - General - Console - "Fold console lines that contains"
UsabilityIDEA-143998Provide direct link for issue creation when an internal error occurs
UsabilityIDEA-177422Remove default shortcut for 'Rerun' action in Visual Studio keymap
CosmeticsIDEA-167421SQL Dialects Settings: the path to specific file/folder uses incorrect slashes on windows
CosmeticsIDEA-148604White box in Keyboard Shortcut dialog in Preferences | Keymap
TaskIDEA-158229Disable "VM options file path missing" warning in headless mode (offline inspections/duplicates)
TaskIDEA-149458Support for parallel update campaigns in a single channel
ExceptionIDEA-159849NPE at com.intellij.openapi.components.impl.ComponentManagerImpl.registerComponentInstance(ComponentManager Impl.java:449) on startup
ExceptionIDEA-148289NPE at com.intellij.ide.passwordSafe.config.PasswordSafeConfigurable.isModified
ExceptionIDEA-158917Exception on startup
IndicesBugIDEA-155918Trying to save settings when everything seems to be already disposed.
BugIDEA-156849Modal indexing
BugIDEA-161307ShutDownTracker#ensureStopperThreadsFinished deadlock
BugIDEA-173382EDT is blocked on start
BugIDEA-166470Deadlock
BugIDEA-156411UI lockup on updating indices
PerformanceIDEA-158106FileContentQueue leaked after indexing and closing all projects
PerformanceIDEA-148981Index rebuild doesn't complete after idea start
PerformanceIDEA-167372Building the stub tree for a file loads its contents twice in a row
PerformanceIDEA-167934Out of memory dialog on IntelliJ IDEA start/open project
UsabilityIDEA-170114"Indexing paused during Power Save mode" shows forever and IntelliSense issues on Power Save mode
ExceptionIDEA-165396Don't start indexing after the project is disposed
JSPBugIDEA-158708JSP code completion not working in IDEA 2016.2
BugIDEA-149951Reformatting JSP does not recognize HTML; flattens everything
Java. InspectionsFeatureIDEA-173177Inspection: Comparing 'compareTo()` or 'Comparator.compare()' result with 1 / -1
FeatureIDEA-159678Warn about possible NullPointerException on throw
FeatureIDEA-163460Recognize patterns convertible to Arrays.setAll()
FeatureIDEA-165942Inspection to replace method call in a loop with bulk operation
FeatureIDEA-165108Objects.requireNonNull with argument of primitive type should be reported as warning
FeatureIDEA-165766Add inspection for explicit calls to no-argument super constructor
FeatureIDEA-160448Simplify groupingBy-collectingAndThen-Optional.get Collectors chain
FeatureIDEA-172417Dataflow analysis: track that loop is visited if and only if array/collection is non-empty
FeatureIDEA-166888Report useless Stream or Optional intermediate operations
FeatureIDEA-146716Add inspection for "Iteration over entrySet() can be replaced with forEach"
FeatureIDEA-171813Inspection to verify parameters of MethodHandle.invoke method
FeatureIDEA-172358Inspection to verify parameters of VarHandle.get(), VarHandle.set(), and similar methods
FeatureIDEA-167318MethodHandle/VarHandle signatures inspection
FeatureIDEA-170892Inspection: Suspicious Arrays.fill() call
BugIDEA-148688"Variable assigned to itself" inspection quickfix breaks code
BugIDEA-172636"Inspect Code" results are closed immediately for "HTML problems in Javadoc"
BugIDEA-172529False positive: "Variable can have 'final' modifier" on code which will be final in byte code
BugIDEA-162106"default package" shown as "<default>" in inspection results after exporting and importing
BugIDEA-173021@SuppressWarnings("JavadocHtmlLint") doesn't work
BugIDEA-166449'Unused declaration' inspection doesn't work for local variables in some cases
BugIDEA-166602Duplicate Structural Search Inspection breaks feature in IDEA 2016.3.2 and 2016.3.3EA
BugIDEA-160991Returning null should result in a warning in @TypeQualifierDefault notnull method
BugIDEA-118095unused field annotated with @Mock not marked as unused
BugIDEA-160298Unused declarations inspection redesign - grouping in tool window affects showed problem
BugIDEA-154071Confusing UnusedParameters inspection result
BugIDEA-160046Unused declarations inspection - FQN of unused class not properly shown on preview pane
BugIDEA-160870Unused declarations inspection - preview pane counts only unused parameters and local variables
BugIDEA-156403JavaDoc inspection false positive for @see with external link
BugIDEA-155863'Missing 'package-info.java' inspection doesn't provide proper quick fix actions and their description
BugIDEA-159674"Constant conditions & exceptions" false positive in GeneralCommandLine.MyTHashMap.putAll()
BugIDEA-173522"Java | Java 9 | Java module naming conventions" inspection has wrong name
BugIDEA-151423Replace all anonymous with lambda does not replace all on first invocation
BugIDEA-148069Declaration can have final modifier reports false positive on @Parameter and @Mock in JUnit tests
PerformanceIDEA-166140Code cleanup is too slow and needs too much memory
UsabilityIDEA-160537Unused declarations inspection - conflicting mnemonics when 'Run inspection by name'
UsabilityIDEA-168244Group inspections in 'Java language level migration aids' by Java version
UsabilityIDEA-160300Unused declarations inspection redesign - unused parameter node also contains quifixes for method
ExceptionIDEA-160735Throwable after adding two custom severities, completing analysis and editing
ExceptionIDEA-160043Unused declarations inspection - exception closing inspection result tool window
ExceptionIDEA-161366Throwable and hangs when try to rename JUnit class name with inspection quickfix
Java. Intention ActionsFeatureIDEA-178774Unroll loop intention action
FeatureIDEA-165428Intention // Inline "else" code branch
BugIDEA-148839Unbounded generic code generated
BugIDEA-157973Create method quickfix delete body of another method if caret is moved to another method body when template is working
BugIDEA-147577Expression type action slightly broken
JavaEE. Deployment and RunBugIDEA-144313Redeploy "null" message
JavaEE.WebLogicBugIDEA-167857Weblogic: log line is marked as a red error while contains a text '<info>'
JavaScript. DebuggerBugIDEA-160102JavaScript Debugger: "Copy Watch"creates buggy code
Language InjectionBugIDEA-119612Settings / Language Injections: duplicate of bundled entry is bundled and not saved on restart
Local HistoryBugIDEA-171946local history revert a dot is inserted in first char of file
BugIDEA-172561Local history diff is not properly rendered unless dialog is resized
Packaging and InstallationFeatureIDEA-155466Make Default Configurations for GNU/Linux's First-Run Wizard Adjustable During Packaging
BugIDEA-170328Command-line launcher does not work on Python 3
BugIDEA-157346/usr/local/bin/idea cannot startup after idea is force killed
BugIDEA-172677MacOS: idea community: incorrect idea installer window opens on .dmg
BugIDEA-160738Update and restart fails after patch is applied with "Patch update is not supported"
BugIDEA-156078"Open recent project" from Windows taskbar does nothing
BugIDEA-151793IDEA failed to restart after plugins activation
BugIDEA-161183Update and Restart still fails in the latest EAP
BugIDEA-161180Installation update: "background task running" dialog; patch is not applied if restart is postponed
BugIDEA-156503Can't update PhpStorm
BugIDEA-161223Patch is not applied (Linux, macOS)
UsabilityIDEA-147676Produce user-friendly error message on attempt to run IDE/Inspections/Duplicates under incompatible JDK
UsabilityIDEA-160700Allow users to update via patch even if restarting isn't supported
CosmeticsIDEA-145376MacOS: "[Errno 2] No such file or directory" error on attempt to open folder with command-line launcher
TaskIDEA-141023Bundle JRE with minor IDEs
ExceptionIDEA-159824Restart failed with exception
Password SafeBugIDEA-159455Can't reset / change the master password or select not to store passwords
BugIDEA-159606Appearance&Behavior | System Settings | Passwords settings page: change the text
BugIDEA-159737Clear message to user about old password db migration
BugIDEA-160375Exception on attempt to connect to db with passwords converted from idea 2016.2
Platform APIFeatureIDEA-177906Extension points for HelpManager
FeatureIDEA-173600Provide public API to get changed document lines
BugIDEA-157691ConversionService fails to show dialog
BugIDEA-164902PersistentStateComponent does not preserve order of 'Set' fields.
BugIDEA-157491Using ParameterInfoHandler not parameterized by PsiElement results in ClassCastException
BugIDEA-166029Another backward-incompatible plugin SDK change in WebBrowserUrlProvider
BugIDEA-160143java.lang.NoSuchMethodError: com.intellij.util.containers.ContainerUtil.intersection(Ljava/util/Collection;Ljava/util/Collection; )Ljava/util/Collection;
BugIDEA-173198EAP 172.2103.15 causes some tests to deadlock (regression from 172.1909.2)
PerformanceIDEA-154453Every PSI change causes full reparse of all other trees in the same multiple-tree view provider
UsabilityIDEA-159584Please add javadoc to FilteredTraverserBase and JBTreeTraverser
TaskIDEA-156609StubBasedPsiElementBase.getParent should choose itself, whether to use stubs or AST
Meta IssueIDEA-121713Locale environment variables are empty on Mac
Plugin DevelopmentFeatureIDEA-156232Show warning for explicit big build numbers in 'until-build' attribute in plugin.xml
Plugin ManagementBugIDEA-151593Cannot run platform tests in plugin project
BugIDEA-164497IntelliJ 2016.3 hangs at startup with message "Scanning files to index"
BugIDEA-164464fileOpened should be executed in a write-safe context
TaskIDEA-171552Allow using methods with Kotlin interfaces in signatures from plugins with their own version of kotlin-runtime library
ExceptionIDEA-155455PPEIE at ExtensionComponentAdapter.getComponentInstance() on project loading
Project ConfigurationFeatureIDEA-27471Temporarily disabling a module
FeatureIDEA-162102Allow including into module directory located under excluded folder
FeatureIDEA-127753Ability to exclude files from indexing in a path by their names (full paths) or by pattern
FeatureIDEA-176860"Load/Unload Modules" modal dialog: double click to load/unload a module
BugIDEA-135096unable to include source folders under an excluded directory
BugIDEA-171776Default settings for copyright not copied into a new project
BugIDEA-161645Module: adding local JAR file uses file: instead of jar: prefix
BugIDEA-166461Cannot revert module language level to 1.8
BugIDEA-159125intelij crashes and deletes whole project
BugIDEA-167087Pressing cancel in Project Structure|SDKs|Sourcepath|'+' file chooser dialog results in confusing dialog box
BugIDEA-167092ConcurrentModificationException while opening another project
BugIDEA-150345Invalidate Cache / Restart doesn't delete unused libraries' cache from .IntelliJIdea16\system\jars
BugIDEA-151029Project Structure: "Invalid item in the dependencies list" tooltip has &lt &gt html entities instead of < >
BugIDEA-147530ModifiableModuleModel#newModule should always create a new module from scratch
BugIDEA-149675Diplicate sources roots on first project import
BugIDEA-157933"More settings" option doesn't reappear if I unchecked "Create Project from Template"
BugIDEA-166580Change made to project library declaration is not stored
PerformanceIDEA-144865ModuleManager#findModuleByName should be O(1)
UsabilityIDEA-149366The error message that is shown on attempt to download library if connection fails should be wrapped
Project ViewBugIDEA-170381Hide empty middle packages bug
BugIDEA-171965Module group nodes with errors aren't marked in Packages View
BugIDEA-143457Project View presentation of a module looses bold font face when there is an error inside
BugIDEA-152049Project view collapses in unpinned mode after some time and changes in editor
BugIDEA-157379'Project Files Tree', copy references doesn't output same content with single or multiple files
BugIDEA-106807Project View: "Folders always on top" option is always enabled after IDE restart
BugIDEA-160131Consider adding roots provided by AdditionalLibraryRootsProvider to External Libraries
BugIDEA-160450"Select Target -> Project View" doesn't work if Project View has multiple selection in it
BugIDEA-167323`Copy as Plain Text` in Project Structure doesn't copy anything
BugIDEA-149666Bookmark icons are not shown for files in Project View
BugIDEA-151067Project view forces slow single threaded file scanning
BugIDEA-158684Select In (Navigate|Select in...) doesn't navigate to library for decompiled sources anymore
PerformanceIDEA-166890Huge number of "Processes Running"
UsabilityIDEA-160381Project Tool Window sorts case insensitive: folders starting with capital letters at the top
ExceptionIDEA-160654'Write access is allowed from write-safe contexts only' switching between files and applications during project opening
RefactoringFeatureIDEA-54664Improve refactoring feedback for long operations
FeatureIDEA-156511"Register New File Type Association" on file creation should be optional, not mandatory
BugIDEA-178002'package-info' is not a va identifier
BugIDEA-150775Deleting any file, IDEA wants to check out every file in project
BugIDEA-157197Safe delete refactoring does nothing if there are usages that are unsafe to delete
BugIDEA-166346gap rename the block variable when on the "Show parameter name hints"
BugIDEA-120116Could not copy file with special characters
BugIDEA-167011Rename refactoring: delete/backspace of the selection stops renaming
UsabilityIDEA-166117Copying a file asks for file type even if "Open copy in editor" is unchecked
UsabilityIDEA-171755duplicate folder issue
UsabilityIDEA-158776Do not show 'Non-Project file protection' dialog when deleting/safe deleting files
UsabilityIDEA-127521Offer to clear r/o status of a directory when users are trying to use alt+ins in it
ExceptionIDEA-167482Throwable when rename vue file
RegExpFeatureIDEA-156407Support for new JDK9 regexp constructs
BugIDEA-152097Error in code highlighting with regular expression
BugIDEA-138863Wrong inspection about "\\R" escape sequence
BugIDEA-156494Unknown character category IsAlphabetic
BugIDEA-123952False positive inspection in the regexp for numeric character
ExceptionIDEA-161946Throwable at com.intellij.openapi.application.impl.ApplicationImpl.assertIsDispatchThread
Run | Debug configurationBugIDEA-168849Cannot stop build with keyboard or menu
BugIDEA-169025Preserve run configurations order
BugIDEA-162766EnvironmentVariablesTextFieldWithBrowseButton doesn't fire change event when env variables changed.
BugIDEA-156114Need to exclude invalid archives from classpath
BugIDEA-157989"Stop" button does not work when the IDE is launched as a background task
BugIDEA-171990Run/Debug configuration - Logs broken
BugIDEA-166448Missing '&', '_' characters in Rerun/Stop buttons' tooltips
BugIDEA-139688Shortcut for terminating (CMD+F2 on mac) multiple runs doesn't work
BugIDEA-159314Launching debug session fails complaining about '-classic' option not supported by JVM
BugIDEA-173350Temporary configurations disappears from compound
UsabilityIDEA-147545When run configuration is under folder, F4 in Run Configurations popup runs configuration instead of opening editor
UsabilityIDEA-155476Run/debug silently fails when 'Run another configuration' step is broken
Settings RepositoryBugIDEA-170170Kotlin compiler cannot find its libraries after the Idea application directory is changed
BugIDEA-153381Settings Repository:NPE com.intellij.openapi.actionSystem.CommonShortcuts.shortcutsById during Overwrite Local
BugIDEA-155715Settings Repository responds with confusing message
BugIDEA-167284Settings repository: unstable sorting order in live template causes unnecessary commits
BugIDEA-144052When "Settings repository" is enabled changes in 'Path Variables' aren't saved to default path.macros.xml file causing errors in build process
BugIDEA-170795Intellij freezes completely everytime on startup
BugIDEA-141891Custom keymaps not getting cloned/merged
BugIDEA-160565Do not accept your login and password by Atlassian for bitbucket.org
BugIDEA-159397Error while uploading settings to repository
BugIDEA-160367Settings Repository: login dialog should get focus when appears
BugIDEA-138631Read-only sources of settings
UsabilityIDEA-163756SettingsRepository: dialog prompting to enter authentication token is shown on IDEA closing unexpectedly
ExceptionIDEA-166041IllegalArgumentException when open the project
Structural Search and ReplaceBugIDEA-172620Structural search and replace is not properly using captured variables in replacement.
BugIDEA-172046Replacing/removing a modifier removes all other modifiers
BugIDEA-171214Structural Search and Replace doesn't correctly find expression statement evaluating to specified ExpressionType
BugIDEA-168119Structural Search dialog can change it's width to be unusable (because of long Status: text)
TapestryBugIDEA-152132Tapestry templates: cannot cmd + click to navigate from CSS class name to its definition
Task ManagementFeatureIDEA-156017Open Task dialog allow checking out of existing branches
BugIDEA-130279sporadically missing actions/buttons in "Time Tracking" tool window
BugIDEA-136797GitHub integration ignores 'no proxy for' setting
Template Languages. FreeMarkerBugIDEA-145592ClassCastException on loading Freemarker template
BugIDEA-172756FreeMarker editor: Slow when editing large files with no FTL markup
Template Languages. VelocityFeatureIDEA-152774Need #capitalizeAndUnderscore method available for getter/setter templates or a way to extend the StringUtils class in use
BugIDEA-158193Escape sequences in Apache Velocity Template Language
TerminalFeatureIDEA-117485Support Find in Terminal panel
FeatureIDEA-142926Shortcuts for scrolling in terminal.
FeatureIDEA-136672Terminal should have clickable URLs
BugIDEA-120046Built in terminal uses wrong clipboard on Ubuntu
BugIDEA-142555Terminal in presentation mode
BugIDEA-113214Alt+Backspace, Ctrl+Right and Ctrl+Left don't work in Terminal
BugIDEA-143004Full-width character is not displayed correctly in SSH terminal.
BugIDEA-162282built in terminal doesn't work with zsh
BugIDEA-160742Ctrl+Shift+F12 doesn't work in Terminal tool window.
BugIDEA-128332Embedded terminal window character encoding problems
BugIDEA-114126terminal tab launches a login shell
BugIDEA-172594Terminal session takes long time to initialize in EAP 2017.2
BugIDEA-157927com.jediterm.terminal.ui.TerminalPanel leaks Timer Object
BugIDEA-162329Cannot set shell path options in Terminal settings
BugIDEA-161309Terminal view doesn't work if Fish is used as a shell
BugIDEA-169111Fish user functions not loaded
UsabilityIDEA-156404From Terminal to Editor
UsabilityIDEA-151339Terminal swallows keyboard shortcuts
UsabilityIDEA-156885.bashrc is not sourced in IntelliJ IDEA terminal
Unit Testing. JUnitFeatureIDEA-161184Cannot invoke "run test" action from "Recent files" popup
FeatureIDEA-162336JUnit Ant XML test results report can only be viewed as plain XML - Eclipse has a graphical viewer
BugIDEA-156747Only 1 of multiple failures shown from JUnit MultipleFailureException sometimes
BugIDEA-163388org.junit.ComparisonFailure does not show full right side
BugIDEA-160397System.out is not created as expected when running JUnit 5 Tests
BugIDEA-172258JUnit5M4: @BeforeAll outputs at the end of @ParametrizedTest
BugIDEA-158222Test failures not reported when failure message too long
BugIDEA-164232"Import Test Results" shows only the last 50 lines
BugIDEA-145298Do some delay between repeatable test executions
BugIDEA-161181JUnit5 - strange output formatting after run of the tests class
BugIDEA-166331"JUnit4 test can be JUnit5" shows empty Find Refactoring preview
UsabilityIDEA-155465No assertions text in imported test results list
UsabilityIDEA-165455Navigate to next test when sorted
UsabilityIDEA-161952Misleading number of passed tests in repeated test runs
User InterfaceFeatureIDEA-147774Hide folder name on editor tab
FeatureIDEA-149545Force touch go to declaration
FeatureIDEA-69424Ubuntu global menu integration
FeatureIDEA-141684Tips of the day. Font size.
FeatureIDEA-117223Custom background image/colour for each project
FeatureIDEA-160391Add "copy relative path" or make "copy path" configureable
FeatureIDEA-167606Add utility drawSelection method for component's outline
FeatureIDEA-173639provide SVG images viewer
FeatureIDEA-136007Hide gutter icons in Distraction-free mode
BugIDEA-151515Goto Action sorts incorrectly
BugIDEA-157041New notifications: link click area not working
BugIDEA-157553Welcome Screen: attempt to observe events produce no viewable results
BugIDEA-157555Modal dialogs are shown twice
BugIDEA-156959Scrollbar in Log is not visible when scrolling
BugIDEA-152741Horizontal scrolling is too aggressive in "wide" files
BugIDEA-168194Huge gutter icons in latest 2017.1 EAP
BugIDEA-157311Custom font line spacing won't go under 1.2
BugIDEA-137147Fatal error initializing 'org.intellij.images.fileTypes.impl.ImageFileTypeManagerImpl' (MacOSX 10.10.3 beta)
BugIDEA-161665LayeredIcon offsets are not scaled on hidpi
BugIDEA-162171File > Open points to "C:\" directory
BugIDEA-158653Stdout horizontal scrollbar integer overflow
BugIDEA-159856Colors & Fonts > Import button is present in IDEA-based IDEs and does nothing
BugIDEA-171395Problem focusing particular line in "Open file" / "Open class" window
BugIDEA-170910Diagram printing prints empty
BugIDEA-166279null message on cancelled updated
BugIDEA-162103"Show Log in Explorer" does't work on 163.5726
BugIDEA-149864Switch boot JDK on Windows shouldn't appear since unavailable
BugIDEA-157049Show quickdoc on mouseover is not working when there is some additional notification
BugIDEA-167459[windows] balloons text are cut in multi-dpi-monitor env w/ new hidpi
BugIDEA-156624Unable to assign mouse wheel shortcut
BugIDEA-173836After upgrade to Ubuntu 17.04 integrated menus do not work
BugIDEA-158014Incorrect scrolling in editor text field of small height
BugIDEA-162119Configuration wizard UI theme IntelliJ is not corresponding with IDE theme Default on Mac
BugIDEA-146563[regression] Middle-click on editor tabs, only closes one editor, the following middle-clicks are not registered
BugIDEA-156745Control mouse wheel shortcut works together with scrolling
BugIDEA-161804VCS toolwindow button blinks when project without VCS roots is opened
BugIDEA-86906Move to Opposite Group should keep cursor focus
BugIDEA-160588Transaction assertion from Swing lightweight request processing
BugIDEA-173135Error: 'It's prohibited to access index during event dispatching' during breadcrumbs update
BugIDEA-172066Toolwindow activates in another project
BugIDEA-149219org.GNOME.Accessibility.AtkWrapper should be disabled by default
BugIDEA-158040Recent Files: include current file when one starts to type a filter
BugIDEA-94602IDEA window is incorrectly repainted after automatic window resizing in Windows 7
BugIDEA-138256High DPI monitor issue: New repository location dialog for SVN is cut off
BugIDEA-156648Tree view is compacted in 2016.2 EAP
BugIDEA-132765Floating progress indicator doesn't disappear after exiting Distraction Free mode or Presentation mode
BugIDEA-149818Smart Step Into (Shift+F7) context menu focus does not between windows
BugIDEA-137774TreeTableTree doesn't support the case where the tree column isn't the first column
BugIDEA-150347Design for remote interpreters mapping settings
BugIDEA-157342Gutter margin's width is not reduced after zoom out
BugIDEA-165837Analyze dependencies dialogs are too wide
BugIDEA-148877Ctrl + Button3 not captured
BugIDEA-159498horizontal scrollbar disappearing or not shown in editor
BugIDEA-151325LayeredIcon is scaled wrong in editor gutter
BugIDEA-167579After popup resizing first click on items inside doesn't work
BugIDEA-145301HiDPI: font size is too small for text inside HTML <code> elements
BugIDEA-173445IntelliJ L&F: in rename dialog default suggestion should be shown
BugIDEA-165448[hidpi-jdk] windows: sized text "floats" under kbd cursor on 200% scale
BugIDEA-149734About Dialog: link from "VM by Oracle" leads to Jetbrains.com site
BugIDEA-158759'Run' toolwindow in 'Windowed mode' isn't activated when a new run configuration is started
BugIDEA-130506Hotkey for Scroll from source
BugIDEA-161023Hide exception notification balloon when clicking on exception submitter blinking icon
BugIDEA-151303Unneeded inner tab border
BugIDEA-158717Notification link cannot be clicked
BugIDEA-161519java.lang.IllegalStateException: The DialogWrapper can only be used in event dispatch thread.
BugIDEA-157035Editor in separate window does not adopt background image
BugIDEA-145420Shortcut has strange FG color in popup menu
BugIDEA-172322Wrong line spacing for files opened on project start
BugIDEA-167825Active project window is hidden under already opened projects
BugIDEA-150726Gutter icons scaled wrong on Retina
BugIDEA-159671Mac Native File Chooser: after opening file chooser from main IDEA frame, Main Menu become inactive
BugIDEA-70943Tooltip animations and buggy visibility are exceedingly frustrating
BugIDEA-161504HiDPI Linux: Plugins repository: wrong icon rendering
BugIDEA-158611BootJDK switcher incorrectly handles arrow keys
BugIDEA-156312The window title for downloading plugins should be a system state, not a user prompt.
BugIDEA-172136Search text area has an improper height
BugIDEA-155663Left/right arrows doesn't work in Switcher
BugIDEA-171254IDEA freezes when I click on encoding panel for big file
BugIDEA-167760"Reset" button do nothing while trying to undo "Reset" action for default IDE scheme
BugIDEA-145115Code lenz popups do not hide until clicked
BugIDEA-155088Double click on tree's expand icon triggers double click listener
BugIDEA-145568Import Project non-native file chooser on MacOS
BugIDEA-158318File selector in 'Version Control' -> 'History' doesn't work if window was hidden
BugIDEA-160800Decompiler progress shown under AWT lock leads to deadlock
BugIDEA-170099let Swing text components dynamically scale HTML text on user scale factor change
BugIDEA-166759The cursor while over one ToolWindow sees another border toolwindow, located behind
BugIDEA-166152Forced IDEA update
BugIDEA-163839Editor's tabs D'n'D ignores drop position
BugIDEA-141952Reopen Project (ListPopup) does not show the first underscore
BugIDEA-156161"Help - About - Copy to clipboard" sends click to editor
BugIDEA-150336Preview 'Find in Path' effect of enter not intuitive
BugIDEA-151422Copy doesn't work in inspections settings
BugIDEA-145132Esc while editing push target closes the push dialog
BugIDEA-170239Hyperlink click is handled despite mouse clicking outside of it
BugIDEA-151337NPE at com.intellij.openapi.application.ModalityState.current(ModalityState.java:69) when setting Theme on sartup
BugIDEA-159556Editing live templates enables "use static import if possible" option for all java templates
BugIDEA-172571IntelliJ IDEA won't start on Mac OS Sierra
BugIDEA-159500Mac Native File Chooser appears from wrong parent window in some cases
BugIDEA-142106Quick documentation popup always minimized
BugIDEA-156195Improve ImageComponent quality and performance
BugIDEA-154915"find in path" results' window strange behavior (disappears after consequent "find in path" actions 50% of times)
BugIDEA-171299IDE is closed even I canceled exit
BugIDEA-168315Component.getGraphics() should not be used to get scale for the HiDPI API
BugIDEA-144699"Annotate" action from action popup does not redraw toggle when processed
BugIDEA-164211The <Click to see difference> link is not active sometimes
BugIDEA-125027File name displays with folder in the Editor tab for controller's views
BugIDEA-154724Code lens (Scroll Preview) is buggy if there are no ToolWindow on the left edge
BugIDEA-156523Key press doubles in popups
BugIDEA-156246About font on Windows is hardcoded to Tahoma, doesn't support some glyphs (Chinese)
BugIDEA-159947Mac Native File Chooser: selection validation sheet messages appear from main IDEA window in cases when they should appear from dialogs
BugIDEA-161886Inspection Results tool window ignores range
BugIDEA-167003Git branches popup reverts to default size every time it is shown
BugIDEA-167485When both platform and plugin updates are available, unchecking all plugins makes it impossible to update platform
BugIDEA-159508Mac native dialogs: problems when opening native file chooser with some IDEA dialogs opened at the same time
BugIDEA-159621MacPathChooserDialog does not find proper owner if IdeFrame.Child is the active window
BugIDEA-157597Background image: when nothing is selected in the LocalChanges, the PreviewDiff pane doesn't get applied background
BugIDEA-157591Background image: ApplicationServers toolwindow doesn't get the applied background
BugIDEA-167018Cannot drag-and-drop in a just opened project until no files are opened in editor
BugIDEA-171927Event Log background not work properly.
BugIDEA-167782Details in EventLog only clickable once
BugIDEA-159886Switch IDE Boot JDK dialog: selecting a JDK with file chooser adds a new value to Boot JDK combobox, but doesn't set the selected value
BugIDEA-140995Toolwindow popup: no ordering
BugIDEA-158913Quick definition popup does not have focus
BugIDEA-161330Scheme drop-down becomes empty on deleting
BugIDEA-172166[linux] editor font size in Settings may decrease after restart
BugIDEA-148656Should not add .txt extension to a file without extension after copying
BugIDEA-155811Mouse buttons 4/5 next/previous tab not working
PerformanceIDEA-168535Concurrent access to tree set leads to hang
PerformanceIDEA-156869HintManagerImpl#myLastEditor leaks project
PerformanceIDEA-156871Project leaked via BalloonLayout
PerformanceIDEA-154560Find Action should populate the results in background
UsabilityIDEA-166252Horizontal scrollbar is not shown when needed
UsabilityIDEA-148456Regression: Remote SSH External Tools no longer appearing in Action dialog after upgrade to IntelliJ 15
UsabilityIDEA-148218Show contents of multiline pastlets in one line
UsabilityIDEA-156388inspections toolwindow: exclude doesn't restore selection
UsabilityIDEA-142428Display shortcuts for action-intentions name that available by Alt+Enter
UsabilityIDEA-104403Bookmarks popup: speed search conflicts with mnemonics
UsabilityIDEA-164817Analyze|Inspect code window does not remember last selected profile
UsabilityIDEA-153193Tooltips for toolbars block clicks to buttons
UsabilityIDEA-156077Empty space instead of CLion app icon when minimize Welcome screen
UsabilityIDEA-93637Hide cursor while typing
UsabilityIDEA-149852White spaces shown in Editor are hardly noticible on HiDPI monitor
UsabilityIDEA-162076Selection highlighting hidden behind fully opaque background image
UsabilityIDEA-157246Background image: improve UX of removing the background
UsabilityIDEA-140263Focus on checkbox instead of "new window" button in "Open project" pop-up dialog
UsabilityIDEA-102869Automatically create a copy of default scheme for chaging
UsabilityIDEA-172763Breadcrumbs placement setting
UsabilityIDEA-25635Change display behavior during background indexing: disable/remove content of tool windows instead of hiding windows
UsabilityIDEA-145126an option to hide 'tool window' buttons
UsabilityIDEA-155635Select all when focus is switched into proxy port number field
UsabilityIDEA-149961Zero latency typing mode ghosts old caret position briefly when editor.caret.width > 1
CosmeticsIDEA-149918Find Action shows strange "New Group (1)" action group
CosmeticsIDEA-149499Editor gutter: reduce "jumping" on intermediate indexing
CosmeticsIDEA-166908Speed search border has no antialiasing
CosmeticsIDEA-155958Render bug in Find Usages after code updates
CosmeticsIDEA-149501Hector popup: show hector icons next to levels
CosmeticsIDEA-165037Move tab close button to the left on MacOS
CosmeticsIDEA-113878"Compare by" combobox`s selected icon have invalid margins in "Sync with deployed" dialog
CosmeticsIDEA-167612strange highlight of settigns > appearance & behavior > notofications
CosmeticsIDEA-158541Changed font in plugins dialog
CosmeticsIDEA-157466Background Image: some toolwindows don't get the set background when the tab displays 'nothing selected'
CosmeticsIDEA-173706IntelliJ theme: progress bar looks bad
CosmeticsIDEA-145084Use of made up word 'abstragate'
CosmeticsIDEA-150453UI issues with speed-search in popup lists
CosmeticsIDEA-172827Project frame state is cached until IDE is restarted (reopening from welcome screen doesn't preserve window state)
CosmeticsIDEA-165564Breadcrumbs do not use ligature setting
CosmeticsIDEA-155738Inspection Settings: Profile Group separator should be shown iff there are profiles in the group
TaskIDEA-160777Incorrect background in lists with new scrollbars
ExceptionIDEA-159878Mac Native File Chooser: AE at SwitchBootJdkAction$SwitchBootJdkDialog$2$1.validateSelectedFiles
ExceptionIDEA-159369Mac Native File Chooser doesn't open on pressing Browse [...] button; IAE at MacPathChooserDialog.findOwnerByComponent
ExceptionIDEA-167624Find Action popup can not be closed on Welcome Screen; NPE at com.intellij.ide.util.gotoByName.ChooseByNamePopup.dispose
ExceptionIDEA-161318"Write access is allowed from write-safe contexts only" when quickly switching pin mode of QuickDoc
User Interface. AccessibilityBugIDEA-156956GithubLoginPanel doesn't allow to traverse focus to dialog buttons
BugIDEA-145230give an accessibility name to items of the list in the SearchEverywhere action popup
BugIDEA-145149give SimpleColoredComponent an accessible name
BugIDEA-156235apply changes from AndroidStudio (2)
BugIDEA-150547some labels are not accessible by mouse
PerformanceIDEA-150848Editor leak in AccessibleEditorComponentImpl
UsabilityIDEA-145157give SettingsTreeView an accessible name
UsabilityIDEA-111425Accessibility For The Blind And Visually Impaired
User Interface.DarculaBugIDEA-168229Tooltips can intercept click events, can overlap with click targets, and can appear under the mouse arrow
BugIDEA-173312NPE on switching theme to Darcula at first time
UsabilityIDEA-115892Restore previous editor colour scheme when switching to Default LaF
ExceptionIDEA-135796Cyclic component initialization: com.intellij.ide.ui.LafManager
Version ControlFeatureIDEA-55508Need an ability to see file history from repository for file which is now deleted
FeatureIDEA-119269Git: Show history by selection - no way to copy the commit hash
FeatureIDEA-156374Create patch to clipboard
FeatureIDEA-69150Switch Context when switching branches in git
FeatureIDEA-68200New feature: binary patches (changeset context menu)
FeatureIDEA-168078Option to Reset Branches widget size to auto-size.
FeatureIDEA-149782Files Merged with Conflicts dialog should sort files by click to the table headers
FeatureIDEA-169296Allow adding bookmarks from Commit dialog
FeatureIDEA-156250Show files scope background color in the commit dialog
FeatureIDEA-89348"Show history for selection" dialog: lack of "Show All Affected Paths" action
FeatureIDEA-157911Drag'n drop to shelve
FeatureIDEA-166238add "Show file" menu in shelf file list for missing base file.
FeatureIDEA-162845Allow openning commit window when only unversioned files present
BugIDEA-160488Memory leak detected: 'com.intellij.openapi.vcs.history.FileHistoryPanelImpl
BugIDEA-161924Disappearing tabs in version control toolwindow
BugIDEA-178584IDEA hangs when displaying File History in Perforce
BugIDEA-161662VersionControl toolwindow should not be available for project with no VCS enabled
BugIDEA-157159Update Github icon in retina quality
BugIDEA-149784Files Merged with Conflicts dialog does not allow type-to-search in table
BugIDEA-148799Unshelve changes with unassociated file. Don't cancel unshelving.
BugIDEA-127833Non-project file writing access could be bypassed by some VCS actions
BugIDEA-154192Unshelve Changes behaviour
BugIDEA-171325VCS GIT Branches popup collapses
BugIDEA-144633On applying patch for file of unknown type adding the confusing error message is shown
BugIDEA-162135Diff from commit dialog: backspace in commit message editor removes characters from the code
BugIDEA-144946Exceptions from shelf after project move to another folder
BugIDEA-168838Preview diff not refreshed after manually resolved conflict
BugIDEA-168834Do not expand hidden branches on resizing in the case the expanded list exceeds widget size
BugIDEA-166714Wrong shelf background color sometimes
BugIDEA-158750"Apply Patch" adds spurious newline at the end of file
BugIDEA-90228Binary files should be included into patches creates by IDEA
BugIDEA-135267Checkboxes of file selector in "Create patch" from commit dialog do not work
BugIDEA-144407Unshelve: diff dialog has confusing title "(revision )"
BugIDEA-157336IntelliJ Locks on "Shelve Changes" at the "Synchronizing files..." step
BugIDEA-160151Version Control: deleting files in Unversioned files dialog spawns separate background process for each file
BugIDEA-153943Cannot checkout a project from GitHub on Idea start screen
BugIDEA-158554Unversioned file is moved to wrong change list
BugIDEA-161753Adding VCS root to a project which didn't have any doesn't make the VCS toolwindow to appear
BugIDEA-161752VCS toolwindow is not available if the project has <Project> mapping
BugIDEA-168483Show Diff from new file history not available during indexing
BugIDEA-151632"Move to another changelist" shortcut key is not working!
BugIDEA-158157Vcs Log: some nodes in tree are not selectable during speedsearch
BugIDEA-171478Spelling is not checked on first commit dialog invocation
BugIDEA-144287after rebase failure IDEA should be able to restore itself from the shelf (semi-)automatically
BugIDEA-160353Deadlock on applying patch using drag-n-drop
BugIDEA-63884Inactive changelist is deleted without prompt after commit
BugIDEA-168143Branch popup: expanded state of the Repositories section is not saved
BugIDEA-112589Unexpected clipboard content after Ctrl+C on shelf's files list
BugIDEA-153272Files are lost during the movement of unversioned files to overwrite existing files with same names
BugIDEA-150624IDEA 15 "Apply Patch" is broken
PerformanceIDEA-145318IDEA becomes slow with many files in the Local Changes
PerformanceIDEA-158252IDE completely freezed after indices failure
PerformanceIDEA-156615Changes view painting takes significant time when an expanded changelist contains 22K files
PerformanceIDEA-149091Editing is slow because of Local Changes view UI refresh
PerformanceIDEA-155741Move changes to another change list hangs
PerformanceIDEA-155748Create patch shows endless progress
PerformanceIDEA-160152Version Control: removing files from Unversioned Files dialog takes 3 times slower than removing them in Project View
UsabilityIDEA-158645Excluded directories are scanned for VCS roots
UsabilityIDEA-140735"Create patch" should be performed under progress
UsabilityIDEA-168473Enable Store on shelf base revision texts for files by default
UsabilityIDEA-146640If Commit dialog is invoked when index is not built yet it suggests to wait to make code analysis available forever
UsabilityIDEA-80668Move changes to Active Changelist - usability
UsabilityIDEA-75177Create Patch: 'file name length cannot exceed 100 chars' message
UsabilityIDEA-155714Clone Repository - User has a Hard Stop if Directory exists, even after deleting Directory
UsabilityIDEA-159844delete of unversioned files blocks everything and cannot be cancelled
UsabilityIDEA-117462History For Selection: no issue links in message/details panel
UsabilityIDEA-172470Prev/Next occurrences in line status popup are not visible anymore
UsabilityIDEA-102021Shelved changes disappear
UsabilityIDEA-150357Add mnemonic to "remove successfully applied files from the shelf" checkbox in unshelve dialog
UsabilityIDEA-60470Applying Patch: should do best attempt to apply to all files. Currently abandones process at first failure
UsabilityIDEA-141802Git Show history blinks in case of refresh or close/open tab
UsabilityIDEA-171836Don't focus the Update Info tab after executing Update Project
UsabilityIDEA-168355Remote branches status bar popup: UI has gotten worse
UsabilityIDEA-150818It's hard to move changes to existing changelist using keyboard
UsabilityIDEA-68645When I create a patch, binary files should not be shown in the tree, since they could not be included in the path anyway.
UsabilityIDEA-168024Pre-select of previous branch works only when switching to/from master and the branch is not hidden
UsabilityIDEA-141520ApplyPatch should be cancellable
UsabilityIDEA-35927Provide better user experience when applying patch or unshelving fails for some files in the patch/shelf.
UsabilityIDEA-166504Branches popup: make more... element expandable with Enter from keyboard
UsabilityIDEA-166503Branches popup: show only favorite local branches if there are too many of them
UsabilityIDEA-166510Branch popup: do not show empty space on vertical resize if there are branches to be shown
UsabilityIDEA-137693Apply patch requires the patch file to be selected in file chooser
UsabilityIDEA-153163unshelve dialog: no radio buttons please
UsabilityIDEA-166532Branch popup: auto-resize popup on changing number of favorites
UsabilityIDEA-166649Branches popup: cut tracking branch name before local name if they don't fit to the popup width
UsabilityIDEA-149027Not able to clone Repository into existing empty folder
UsabilityIDEA-171718Not possible make current (checked out) branch favorite
CosmeticsIDEA-149151Cannot move focus through "Unshelve..." dialog by TAB
CosmeticsIDEA-145352VersionCintrol | Local Changes toolwindow: space symbols are shown as squares
CosmeticsIDEA-155713Error message refers to a "Directory" and "Path" in the same context.
CosmeticsIDEA-156342Commit popup: inconsistent triangle usage (browser vs Details)
CosmeticsIDEA-159931No mnemonics for Encoding combo in Create patch dialog
CosmeticsIDEA-149652Context menu options for Show/Hide Already Unshelved make no sense
CosmeticsIDEA-116699Cancel button in the wrong location on Mac TODO sheet
CosmeticsIDEA-154756Allow the user to choose a branch as default or to appear at top of the branch list
CosmeticsIDEA-158896Move Changes to Active Changelist window does not have a vertical scrollbar
CosmeticsIDEA-131099VCS: "Do you want to add.." wording
CosmeticsIDEA-172391"Change list" spelling inconsistency
ExceptionIDEA-161905Show VCS Log and Show Local Changes actions cause NPE if Version Control toolwindow was not opened since project start
ExceptionIDEA-148175Exception when reverting a commit from VCS history
Version Control. GitFeatureIDEA-85842Add rebase action to git branch popup
FeatureIDEA-130541Offer to delete remote branch when deleted a local branch which tracks a remote one
FeatureIDEA-146930Provide 'Change Commit Message' action for committed but not pushed commits
FeatureIDEA-76454Ability to change URL of git repository
FeatureIDEA-60389Need GUI to configure remote repository and branch
FeatureIDEA-65721Git sign-off
FeatureIDEA-87099Provide ability to add remote repositories to local git repository
FeatureIDEA-131021Add "Rename branch" action
FeatureIDEA-136565Add "Checkout with Rebase" action equivalent to "git checkout feature & git rebase master"
FeatureIDEA-128727Git log: provide "Undo Commit" action to the head commits of the log which would perform git reset --soft HEAD~n
FeatureIDEA-57707Git Log: revert selected commit
FeatureIDEA-143404Support git worktree feature
BugIDEA-135207Github: login failure while trying to use token authentication with http proxy enabled
BugIDEA-1659032017.1 EAP - Cleanup block the commit to Git
BugIDEA-159283Unversioned files dialog is not refreshed after changes made from this dialog
BugIDEA-160606"undo commit" action incorrectly revert addition under vcs
BugIDEA-87375Git cherry-pick is committed with the original comment suggested by IDEA, without my changes to it
BugIDEA-164512"New Branch..." keyboard shortcut does not work
BugIDEA-168257Deadlock in vcs
BugIDEA-105128Git pull dialog message for upstream branch recommends deprecated feature
BugIDEA-134058Git: can't show diff for removed file in "compare with branch"
BugIDEA-98992Problem with GIT 1.8.0.3, Translated Messages
BugIDEA-142648Continue rebase reports success but does nothing when rebase --skip had to be called
BugIDEA-153870Git throws exception on commit if a submodule is not registered in the Settings (even if trying to commit a file from the main repository)
BugIDEA-135299'Git' -> 'Continue rebasing' reports "Successfully rebased 0 commits!" in case of error
BugIDEA-146022Amend commit: Couldn't load commit message of the commit to amend if there are both Git and Mercurial repositories in the project
BugIDEA-148376Canceling Git operations shouldn't leave index.lock.
BugIDEA-81093Invoke the Conflict Resolver automatically if a conflict happens during rebase
BugIDEA-56814Non-ASCII characters display incorrectly in git annotate
BugIDEA-156244A file created outside of IDE is displayed as not-modified
BugIDEA-145575File History | Show Diff for 2 selected revisions may locate the older revision at the right
BugIDEA-156249GitLogParser fails if there are both \u0001 and \u0003 in the commit message
BugIDEA-155689Unable to view contents of files on shelf that are moved/removed after update
BugIDEA-159580GIT project update hangs
BugIDEA-161352Link in detached HEAD warning is unclickable
BugIDEA-151317Square brackets in file name cause problems with git
BugIDEA-53175Git: attempt to commit file/folder rename with letter case change only fails
BugIDEA-156445blank git log history caused by GIT_TRACE = 1 environment variable
BugIDEA-161332Description of "Checkout with Rebase" action is misleading
BugIDEA-94470Case-renamed file disappears from the Changes view on Save
BugIDEA-72282"Continue rebasing" should be disabled if no rebase operation is in progress
BugIDEA-152968Git. IDEA silently removes newlines in commit message in file history
BugIDEA-156233Backspace key not working in Git Rebase dialog
BugIDEA-148275Git amend returns an error if there is repository with no commits
BugIDEA-81364Git config is case insensitive in the native Git, but not in IDEA
BugIDEA-159506Empty .git folder in a directory considered as a Git root
BugIDEA-159948Git: can't pull branch with name too long
PerformanceIDEA-155116OOME after requesting Git history for method
PerformanceIDEA-167688Git Update Project via Rebase and Stash performs stash-unstash procedure even if there are no local changes
UsabilityIDEA-153297Allow to force delete Git branch without collecting the list of unmerged commits
UsabilityIDEA-55479Git: auto-stash/unstash on 'rebase' command
UsabilityIDEA-136481Commit dialog: auto-popup completion in the author field
UsabilityIDEA-138508Editor for commit messages, that displayed during interactive rebase, doesn't support "undo" action
UsabilityIDEA-151728Provide confirmation for git branch delete operation
UsabilityIDEA-173585Reword and Undo Commit actions are sometimes enabled even for commit pushed to a protected branch
UsabilityIDEA-86712Error message not descriptive "Repository test has failed"
UsabilityIDEA-150358Rebase reports error if user presses "cancel" in the interactive rebase dialog
UsabilityIDEA-135612Git clone dialog: "The parent path must exist" should be a warning
UsabilityIDEA-135353Github: GenerateToken action should be available in login dialog
UsabilityIDEA-160000Keep second line empty in commit messages on git cherry-pick
UsabilityIDEA-149886Let create branch without checking it out
UsabilityIDEA-118140Don't add renamed or moved files to git index unless configured to do so
UsabilityIDEA-167023Menu «Git branches» became worse
UsabilityIDEA-111929Make temp dir customizable if the default one is mounted as nonexec
UsabilityIDEA-78105Don't use the same icon for 'git push' and 'git commit'
UsabilityIDEA-149441Please add "checkout from version control" to the VCS->Git
UsabilityIDEA-60413IntelliJ should understand git rebase and show only relevant menu items
CosmeticsIDEA-165570When there are no remote heads, the git remotes dialog looks weird
CosmeticsIDEA-172787Bad wording in the dialog "Parent directory"
TaskIDEA-166094Git.Application.Settings — do not save detected path to git as user setting
ExceptionIDEA-155679Throwable at com.intellij.openapi.application.TransactionGuardImpl.submitTransactionAndWait
ExceptionIDEA-170463Throwable on authentication failure in case both login and password asked
Version Control. LogFeatureIDEA-86855Git Log: provide "Create Mail" functionality
BugIDEA-159852Git Log is opened in the minimized window when invoked via VCS | BrowseVCSRepository | ShowGitRepositoryLog in project with no VCS
BugIDEA-149285VCS Log: details panel has no horizontal scrollbar
BugIDEA-159468NPE in VCS Log renderer leads to UI corruption
BugIDEA-147977Bug in drawing selected edges
BugIDEA-158666Cannot copy text from Details of Git "Show History"
BugIDEA-155788Colon in IDEA project name causes git log tab to hang
BugIDEA-170468git show history for a file is missing commits
BugIDEA-157907user filter shows no changes after scrolling down
BugIDEA-146846Vcs log root filter: Ctrl+Click should be Cmd+Click on Mac
BugIDEA-139989VCS Log: Structure filter: can't select folder not under any module
PerformanceIDEA-118190VCS Log: Select All in a large repository freezes the UI forever
UsabilityIDEA-143431Git log filter value is not applied on focus change
UsabilityIDEA-153118Display a visual clue when Git Head is detached
UsabilityIDEA-159965Author email information is missing from GIT commit details
UsabilityIDEA-142375Mousewheel scrolling in Git commit details pane is slow
UsabilityIDEA-158862Copy from log should copy just the commit message
ExceptionIDEA-161650IAE at com.intellij.ui.ColorUtil.toHex
ExceptionIDEA-173990A lot of Throwable after opening IDEA project
ExceptionIDEA-149987Completion in Go To Ref/Tag/Branch popup frequently throws an Already Disposed exception
Version Control. MercurialBugIDEA-158778Switching Tasks fails to switch branch
BugIDEA-157085Mercurial: change even one line forces to mark all content fo file as new, until force refresh in "Version Control" tab
BugIDEA-170411hg4idea always tries to load too much data sometimes completely filling Java heap
BugIDEA-157578Mercurial Commit and Close (spelling error)
BugIDEA-150091Can not disable the plugin hg4idea
BugIDEA-159828Mercurial: entered password is not saved between idea sessions despite the settings
BugIDEA-159546Problem with pull\push operation on hg
BugIDEA-130621HG problems with different locales, Translated Messages.
ExceptionIDEA-159729CME at java.util.HashMap$HashIterator.nextNode
ExceptionIDEA-159723SOE on UpdateProject invocation
ExceptionIDEA-161831Throwable at com.intellij.openapi.application.TransactionGuardImpl.assertWriteActionAllowed
Version Control. PerforceBugIDEA-163966Merge P4CONFIG files in all parents, if Perforce 2015.2 is used
BugIDEA-155493IDEA hanged after "Perforce go Online" action was cancelled
BugIDEA-145202Perforce shelve: on shelving files from same changelist add them to existing shelf instead of new changelist creating
BugIDEA-145196Perforce shelve: unshelve with conflicts (between local change and shelved change) should be treated correctly
BugIDEA-177922Diff does not work properly for Perforce overlay views
BugIDEA-145185Perforce Shelve: consider the 'checked' and 'unchecked' status for nodes
BugIDEA-113824Perforce asks to delete inactive empty changelist with p4 shelved changes
BugIDEA-144949Shelve/unshelve doesn't work with renamed or moved files
BugIDEA-148592Dead lock in IntelliJ 15.0.1!
BugIDEA-145183Perforce Shelve: refresh is required after unshelving change
BugIDEA-145190Perforce shelve: after file unshelve it appears in the Default changelist even if initial changelist is not empty
BugIDEA-149870NPE when clicking Refresh in Repository tab of Version Control panel when using Perforce server
BugIDEA-150303Default p4 path doesn't work when running IDEA from JetBrains Toolbox on MacOS
BugIDEA-144951Don't allow to delete empty changelists that have associated Perforce shelves
BugIDEA-158329In the editor and submit to perforce the current code is shown with highlight not to the last revision
BugIDEA-162033Exception during perforce operations
BugIDEA-145208Allow to associate jobs with Perforce changelists with no local changes
BugIDEA-172380IDEA got totally frozen after renaming directory with many files
UsabilityIDEA-145242Perforce shelve: treat attempt to commit changelist with shelved files more user-friendly
UsabilityIDEA-145204Perforce shelve: don't suggest to remove changelist with shelved files on making it non-active
CosmeticsIDEA-145118Perforce login dialog: add blank space to message
CosmeticsIDEA-148401Perforce: EditJobs dialog looks bad in case of multiple connections
ExceptionIDEA-145203RE at com.intellij.openapi.vcs.changes.ChangeListWorker.removeChangeList
ExceptionIDEA-178642Perforce revert causes exception
Version Control. SubversionFeatureIDEA-133398support svn 1.8 automatic reintegration merge
FeatureIDEA-138320SvnDiffProvider#getLatestCommittedRevision not implemented
BugIDEA-113567Subversion1.8: cleanup invoked from file context menu fails with error
BugIDEA-139795ideaIU-14.1.[2345] - Repeatable file/memory cache conflicts on move refactoring
BugIDEA-129671OK/Cancel actions switched on warning of Subversion move of "trunk"
BugIDEA-92665Create SVN patch for a revisions containing binary files
BugIDEA-160693Active windows could be not showing
UsabilityIDEA-140862Do not reset selection / scroll position when removing a filter in the Repository view
UsabilityIDEA-170598Subversion: update settings page: use tree instead of tabs, update hint labels
CosmeticsIDEA-115024Grammar error in SVN error message
Web ServicesBugIDEA-165641IDEA 2016.3.1: Wrong unused import recognition in xml files
XMLFeatureIDEA-150753Make 'Collapse empty tag' quick fix available for tags with whitespace contents
FeatureIDEA-147004Provide action to change order of attributes in xml tag
BugIDEA-162824"Resource registered by this uri is not recognized" spuriously triggers for "http://www.w3.org/2001/XMLSchema-instance" running tests
BugIDEA-167726PyCharm's XSD does not resolve the extension base when base schema does not have a namespace
BugIDEA-163906Incorrect XSD validation result in editor
BugIDEA-156292In XmL Editor view Idea does not accept a seemingly valid XML
BugIDEA-150458Xml: invalid regular expression error
PerformanceIDEA-157959XML Breadcrumbs hold strong references to AST
i18nBugIDEA-150401Strip trailing spaces strips escaped spaces at the end of properties files breaking next property
No subsystemFeatureWEB-15687Export EditorConfig file based on internal IDE settings
FeatureWEB-21873Automatically group related generated files
FeatureWEB-17977Feature: Configure Patterns for Automatic Nesting of Transpiled Files
FeatureWEB-23134ES6 refactorings: convertion require() -> import
FeatureWEB-23847Add support for command line parameters for react-native-cli
FeatureWEB-20263Enable Fill Paragraph for JS
FeatureWEB-15190Ignore validity of library code
FeatureWEB-24551Add ability to run ESLint for the TypeScript sources files
FeatureWEB-40Custom folding regions should be visible in structure view (CSS)
FeatureWEB-22722Update bundled JSHint version to 2.9.2
FeatureWEB-16605Flow syntax extensions support
FeatureWEB-15916Enable "Simultaneous Tag Editing" for more file types
BugWEB-22156Missing import statement
BugWEB-26720Doctype breaks HTML language auto-injection in JS template literals / strings
BugWEB-24874'var' JS inspection suggests replace 'var' with 'const' in for loops
BugWEB-7877Code editor vibrates during typing
BugWEB-24475External annotators for a base language are ignored when another external annotator exists for a more specific flavor
BugWEB-21469Flow declarations are formatted incorrectly
BugWEB-25382Cannot make eslint to work
BugWEB-21997Go to URL matches urls incorrectly if url contains $ in it
BugWEB-22163Add braces to arrow function statement — doesn't work as expected
BugWEB-24269The underscore in node_modules is interpreted as a shortcut key
BugWEB-20052Emmet: abbreviations with multiplication are not expanded in JSX context
BugWEB-23055Support ASCII control characters to improve webpack progress showing in console
BugWEB-17148Structural replace broken
BugWEB-20041In Angular2, inside a Template, doing cont-/ to comment produces // comment instead of <!-- HTML type comment
BugWEB-22560assertion on downloading typescript stub library
BugWEB-18650Structural search and replace doesn't work in JavaScript
BugWEB-22601When collapsing a react/jsx component it shows as <xml /> instead of the component name.
BugWEB-19336Live template `func` doesn't work for me
BugWEB-25284Sass partials starting with double underscore cannot be resolved
BugWEB-20245Strings in require() statements are spell-checked
BugWEB-20554Autopop documentation will not turn off
BugWEB-24760Project Tool Window: CSS source maps (gulp-generated) not grouped under the same name, but JS does.
BugWEB-22481quickdoc for array of mixed type is wrong
BugWEB-19527Unreadable global variables color
BugWEB-26269Missing escaping quotes when insert in string variable
BugWEB-24820React: creating react application as a submodule of existing IDEA project fails
BugWEB-24911Strange errors when using flow-typed with flow
BugWEB-25225Unable to save settings
BugWEB-21928JavaScript file that includes nothing but 'export' statements is recognized as minified (generated)
BugWEB-21921Only 1 Startup Task is starting automatically
BugWEB-26528Webstorm does not recognise awaited async-function as parameter for JSDoc
BugWEB-19341Align assignments does not work in case of inline comment
BugWEB-23073"to template string" quick helper generates invalid output
BugWEB-27176show method separators doesn't work with shorthand methods
BugWEB-19429Fat arrow after function() does not produce error
BugWEB-23441Suggest inserting 'use strict' / Syntax Error not being caught
BugWEB-26787Can't download d.ts file for paper
BugWEB-15602Ctrl + F11 does not re-run app
BugWEB-19705Disable startup tasks in Default preferences
BugWEB-22496JavaScript live templates needs to drop quotes for jsMethodName()
BugWEB-22819ESLint and .vue files
BugWEB-19944.eslintrc: missing property 'webextensions'
BugWEB-23186JavaScript - Invalid Inspections - Implicitly declared global JavaScript variable & Unused JavaScript / ActionScript local symbol
BugWEB-24885Cannot download javascript libraries. Languages&Frameworks > Javascript > Libraries > Download > Typescript Community Stubs > webaudioapi
BugWEB-22519Use of double dollar sign variable names (e.g $$customer) as JSX attributes causes red syntax warning/error
BugWEB-21743Electron - console.log output isn't displayed within webstorm ( terminal / npm run script )
BugWEB-18153JSCS: respect excludeFiles property
BugWEB-24504JSX comments are still not working
BugWEB-22901Broken "to template string" helper
BugWEB-22126Autocompletion for JSDoc
BugWEB-20244Foundation 6 not updated yet in new version. How do you do this manually?
BugWEB-17450Startup failure when blocked in firewall
BugWEB-25244Throwable when open color picker
BugWEB-14867Extra space added to jQuery statements
BugWEB-23153Generated source files should not be edited message for init.js files that are created by me
BugWEB-16334Code-completion/inspection not working properly with node modules with closure structure.
BugWEB-20002Template sring `${new Date().getTime()}${Math.random()}` breaks syntax higlighting
BugWEB-21028Supplementary Unicode characters cause 'Unsupported characters for the charset 'UTF-8'' warning
BugWEB-22493Go To Declaration/Implementation does not jump to the function definition with `module.exports` function reference
BugWEB-24702Respect "Use semicolon to terminate statements" Code Style option when "Add braces to arrow function statement"
BugWEB-17803Built-in webserver truncates output on large php files
BugWEB-23386ES6 convert require() -> import: make inner scopes option only for "Fix all" mode
BugWEB-23380Object destructuring assignment expression with default value reports incorrect warning
BugWEB-17691built-in server doesn't serve files it doesn't have in the project tree
BugWEB-18541Reformat code during commit unminifies minified CSS files
PerformanceWEB-12270Make intellisense.filesize property be ignored for library files.
PerformanceWEB-24768Indexing a large .js file causes IDE to run out of memory
PerformanceWEB-19403WebStorm hangs on project open
PerformanceWEB-24880ES6ExportDefaultReferenceSearcher unstubs declaration's file on highlighting usages in a current file
UsabilityWEB-16297Annoying emmet bug
CosmeticsWEB-25204Missing colon in new project wizard (IDEA)
CosmeticsWEB-28608Change signature dialog: cosmetics
TaskWEB-22183Enable 'var' used instead of 'let' or 'const' inspection
ExceptionWEB-20107Code inspection not working in latest EAP
Build toolsFeatureWEB-13409Support ability to navigate webpack's enhanced requires
FeatureWEB-14753Should be able to use grunt and gulp tasks and npm scripts as before launch options without creating separate run configurations
FeatureWEB-21829Allow using path variables in grunt-cli package value
BugWEB-22153Gulp executed within PhpStorm throws errors while executed in console runs fine
BugWEB-23589Jump to source and Debug shortcuts are hardcoded for build tools tool window
BugWEB-21763Gulp run task does not recognise folder named "gulpfile.js"
BugWEB-27119Grunt: VFS is not refreshed on running `watch` task when using Grunt 1.0.1
BugWEB-14876Grunt: delayed visibility of file change when using jit-grunt for loading tasks
BugWEB-22859Restart task from Task run window (Alt+F11)
BugWEB-22578Debugging Gulp with Node.js v6: add --expose-debug-as=v8debug
BugWEB-18289npm scripts: can't select package.json
PerformanceWEB-19333Grunt "serve" task and Bower listing cause multiple blocked node processes
UsabilityWEB-19862Ability to collapse all gulp file nodes in the gulp tool window
CSSFeatureWEB-28480provide support for `scroll-behavior` CSS property
FeatureWEB-24273PostCSS: support postcss-modules-values plugin
FeatureWEB-23345Stylelint: provide parsing for rc file
FeatureWEB-16792Support WebPack specific import statements
FeatureWEB-17950CSS breadcrumbs
FeatureWEB-4585Consider CSS selectors used if they show up in string literals
FeatureWEB-20101Support file structure for inline styles
FeatureWEB-14124Support for CSS Custom Properties
FeatureWEB-150CSS completion of ID/CLASS name of html files in the project
BugWEB-21523Errors in mixed PHP+CSS
BugWEB-22846SCSS: "Cannot find variable" when it's imported from a package loaded via Webpack's sass-loader
BugWEB-23601PostCSS: bad inspection CssNegativeValue
BugWEB-22894PostCSS: Colors & Fonts: Tag name is not colored
BugWEB-22893PostCSS: Colors & Fonts: unknown-at-rule cannot be colored
BugWEB-27117Provide resolve for files in CSS @value declaration
BugWEB-27116CSS modules values: provide resolve for reference after 'from' in import
BugWEB-27071Reporting invalid parameter in -webkit-column-span: all; even though "all" is a cs supported parameter
BugWEB-25193Add support for "::placeholder" and ":placeholder-shown" pseudo selectors
BugWEB-19417`speak` property support.
BugWEB-16861JQuery CSS: typing extra quote when adding multiple selectors shouldn't add another pair of quotes
BugWEB-22781Red code in css - values of 'text-justify'
BugWEB-20333HiDPI display: small gutter icon for CSS color preview
BugWEB-26826When formatting CSS with braces set to "on next line", if there are parentheses for a mixin, the brace style is not honored
BugWEB-21567Inline CSS: delete extra entered semicolon when completing property value
BugWEB-25121Stylelint: .stylelintignore file is not respected
BugWEB-23095Choosing severity level doesn't work for 'Invalid CSS pseudo-selector' inspection
BugWEB-22913Invalid property value on calc function
BugWEB-23373Stylelint: correct name of the property used in the package.json
BugWEB-19831suppress syntax error when generating CSS in HTML template
BugWEB-24700Stylelint 7.7.0 support
BugWEB-195Code-Folding support in CSS and CSS super-languages
TaskWEB-23340Stylelint: WS does not find path to stylelint
TaskWEB-25427Incorrect CSS inspection warning "should be integer" on decimal letter-spacing
TaskWEB-15537Emmet: Change $VAR0$ variables to $END$ in templates which has single variable
ExceptionWEB-26721'Extract inline CSS | Current file' causes PsiInvalidElementAccessException
ExceptionWEB-23350Stylelint: Provide icon for rc file
ExceptionWEB-24917Throwable when choose color
ExceptionWEB-22810"PSI and index do not match" exception while editing CSS
CoffeeScriptBugWEB-21854Opening coffee file throws exception
BugWEB-17872'use strict' breaks CoffeeScript destructuring
BugWEB-22422CoffeeScript string template highlight error
CosmeticsWEB-15718Preview of folded method should be cut if it reaches right margin
ExceptionWEB-20180Defining getter in CoffeeScript class throws error
DebuggerFeatureWEB-13024Javascript asynchronous callstack
FeatureWEB-7986Debug web workers
FeatureWEB-19984Debugging Node.js app built with Webpack
FeatureWEB-23955debugging react native always attempts to run react-native run-android
BugWEB-20925Node Debugger incorrectly reports the lexical `this` in arrow functions (ES6)
BugWEB-18080JS console doesn't print log messages any more
BugWEB-25012Node 7: React native debugger does not work
BugWEB-22545Debugger ignores breakpoints and 'debugger' keyword
BugWEB-21991New Node.js debug protocol incompatibilities
BugWEB-24721Angualr2 with Angular-cli (Webpack) VERY often break points are missed and the only way to fix is use ;debugger keyword
BugWEB-26732Attempt to debug Nashorn project fails if the javascript language version is set to Nashorn js
BugWEB-27123Node 8: Can't debug npm script
BugWEB-18646Regularly getting error: Failed to find breakpoint by id
BugWEB-26794Can't debug node 8 nightlies
BugWEB-19464Debugging Angular 2 has no debug info
BugWEB-19983Compiled TypeScript not stopping at breakpoints
BugWEB-24960MessageError when 'Copy JSON'
BugWEB-19334Debugging Meteor 1.2.x is essentially broken for any language.
BugWEB-15998Karma JS debugger does not suspend on breakpoints with the browserify + istanbul preprocessor
BugWEB-19982Cannot debug ES6 - Babel - Webpack apps
BugWEB-22522Debugger: java.nio.file.AccessDeniedException on Karma tests debug
BugWEB-21717Debugging IntelliJ with NodeJS 6.2.0 shows many ReferenceError v8debug on start of app
BugWEB-14454Breakpoints not hit when using inline sourcemaps produced by browserify
BugWEB-21574FireFox: some breakpoints are skipped
BugWEB-22491Breakpoint is ignored with 'Async' checkbox
BugWEB-21106Cannot change numeric value of Javascript property when stopped in debugger
BugWEB-26960Node 7, 8: Debugger can't detach when execution finishes
BugWEB-26567console.log() cause bug about file and line info when output has newlines
BugWEB-22121Debugging Karma tests no longer works
BugWEB-25061Node 7: Stopping at breakpoint opens a new read-only editor (Windows)
BugWEB-22466Debug with node 6.3.0 don't work at WebStorm 2016.2
BugWEB-22597Node 6.*: debugging multi-threaded applications doesn't work
BugWEB-21447Attached files (.css, .js) are not served by built-in webserver
BugWEB-20141Freezing, StackOverflow and many other errors when run JS debugger
PerformanceWEB-20618JS debugger memory leak
File WatchersBugWEB-17949.es6 Babel file watcher watches incorrect files by default
BugWEB-23527Babel File Watcher predefined options problems
BugWEB-23553File Watcher Macros Ignore System Directory Delimiter
BugWEB-22607IncorrectOperationException when move file+generated via file watcher files
BugWEB-17071Stylus file watcher: changing partial file should result in re-compiling main files
HTMLFeatureWEB-7856Priorize suggestion of compatible file types in file path autocompletion
FeatureWEB-18809Add some exotic, but standardised, HTML attribute awareness
FeatureWEB-204Dragging JS/CSS into HTML Document adds tag
FeatureWEB-20704Emmet: allow to configure bem separators
FeatureWEB-21768Code folding enhancement
FeatureWEB-393Add reference to the image (<img> tag with filled in 'src' attribute) after drag an image to the Editor
BugWEB-17992HTML5: "autocomplete" tag should accept more values than only "on" or "off"
BugWEB-5071Pressing enter outside expanded ZenCoding snippet causes cursor jumps
BugWEB-315Don't highlight href of type "javascript:" as "Cannot resolve file"
BugWEB-14119"Auto-close tag on typing '</'" don't work on template languages
BugWEB-9936Strange tab (auto-complete) behaviour in html files.
BugWEB-26853Wrong redutant notification
BugWEB-12182Please remove u-tag decrepated alert
BugWEB-313HTML Code Style - insert new line berfore bug
BugWEB-19972Subresource integrity attributes are marked as invalid in HTML files
BugWEB-19451Nested <dl> not validating
BugWEB-17897Line of HTML disappears when moving other lines
BugWEB-18213html page format error
BugWEB-428php tags in className - broken breadcrumbs.
BugWEB-426"onclick" attribute parse bug
BugWEB-21707Don't create duplicating links
UsabilityWEB-7947Tags whose contents are functional shouldn't be broken on "Move block"
UsabilityWEB-23578HTML tag "hgroup" marked as not recognized (both in HTML and CSS): change to deprecated
CosmeticsWEB-430Tag bounds shower is not updated after a single-row tag is selected
ExceptionWEB-26738NullPointerException when call Code | Generate | XML Tag
JavaScriptFeatureWEB-12730Indexed support for JavaScript AMD
FeatureWEB-22930Flow: provide intention when @flow comment is present inside the code
FeatureWEB-23358Detect react or react-dom packages and set JS version to the React JSX for the new project
FeatureWEB-23357Detect .flowconfig and set JS version to the Flow for the new project
FeatureWEB-20920JavaScript completion should be sorted by frequency
FeatureWEB-20078Complete string literals where they expected
FeatureWEB-23359Detect .babelrc or babel package and set JS version to the ECMAScript 6 for the new project
FeatureWEB-16359Intention for converting string concatenation into ES6 template string
FeatureWEB-24344WebStorm keeps autosaving files, related option is unchecked
FeatureWEB-17170Support folding in ES6 import statements
FeatureWEB-3536Support JSON schema
FeatureWEB-23511Fix action 'Split into declaration and initialization (and move to scope start)' for destructuring
FeatureWEB-25303name property of package.json should default to the name of the directory it is created in not "application-name"
FeatureWEB-19775Code folding for ES6 imports
FeatureWEB-20252Support trailing commas in function parameter lists and calls
FeatureWEB-20003Auto Completion for ES6 String Interpolation Doesn't Work
FeatureWEB-1221Structure and code completion make no distinction between static and instance members
FeatureWEB-13892Writing html tags in jsx blocks does not autocomplete the closing tag like when editing html
FeatureWEB-18844[FEATURE_REQUEST]Folding anonymous function to arrow function like Android Studio folds Callables
FeatureWEB-26560Improve function callback completion
FeatureWEB-25905Flow: provide a way to restart Flow service
FeatureWEB-16444ES6 inside inline scripts
FeatureWEB-7522Support JSDoc's @template mechanism on a class level
FeatureWEB-22473Add Code Completion for ES2015 Object Literal Shorthands
FeatureWEB-20977Flow: provide 'before type reference colon' and 'after type reference colon' options to Code Style/Javascript/Spaces
FeatureWEB-22120Missing parameters when generating abstract method bodies
FeatureWEB-20944Single step import for ES6 classes at new keyword
FeatureWEB-22281Provide coding assistance for declaration names
FeatureWEB-7386Add breadcrumb for JavaScript
FeatureWEB-23096Support JavaScript generic/template types in autocomplete
FeatureWEB-20715Auto indentation not occurring on ES6 imports
FeatureWEB-25101Colors and Fonts: provide separate option for the arrow function sign
FeatureWEB-24675Support `import()` function
FeatureWEB-22928Flow: provide Flow View to list current and project errors.
BugWEB-20038E4X path navigation expressions that use namespace qualification are incorrectly flagged as not supported
BugWEB-21529Annotations, inherited array properties code auto-complete doesn't work
BugWEB-25397Find imports in other files for default exports
BugWEB-17446Wrong message "overrides method in object" in node.js project
BugWEB-21350"get" keyword has wrong highlighting in JavaScript
BugWEB-23036ES intention "Convert anonymous function to arrow function": wrong result
BugWEB-23176JSDoc and destructuring: Works without type definition but not with a type
BugWEB-16555Type checking doesn't work for es6 class fields
BugWEB-21281folding object error
BugWEB-19696Find usages doesn't work in VanillaJS code
BugWEB-22542JS: let is not considered a keyword
BugWEB-15372"Navigate to declaration" is broken with ES6 style imports
BugWEB-22096Node modules: @types should be always indexed
BugWEB-18073'Find usages' does not work for react component
BugWEB-22369Convert to arrow function produces truncated result
BugWEB-24862JavaScript parsing fails with "0xffe1" (testfile attached)
BugWEB-22521wrong style for js keyword operators (void, typeof)
BugWEB-22520[regression] [js] get and set are not styled as keywords
BugWEB-24266Flow: comma (`,`) and plus (`+`) in generics are marked as bad characters
BugWEB-20237Export foo as default gives issues
BugWEB-20586ES7 Property decorator with the same name as property doesn't navigate to decorator's definition
BugWEB-20129WebStorm, JavaScript autocompletion is out of scope.
BugWEB-20127Merge duplicates in parameter info
BugWEB-21617JSX: Line Comment breaks code inside ternary condition
BugWEB-19688Move statement - screw up if statements with comments (JS)
BugWEB-19111Code completion for multiple levels of inheritance
BugWEB-19668let variables within switch-case-default
BugWEB-22883IDE UI locks up when clicking on 'var' keyword in Javascript file
BugWEB-22398Wrong redundant character escape in ECMAScript 2015 unicode mode
BugWEB-19660Red code in example section of JSDoc comments in uncompressed angular 1.5
BugWEB-23332Carriage return within JSX string value mistakenly marked as error
BugWEB-23020Flow: Settings: correctly detect when "Resolve..." option should become available
BugWEB-21665Node exports not correctly detected
BugWEB-20188No argument hinting for IIFE (Javascript)
BugWEB-25033Troubles with JS libraries in multimodule project
BugWEB-20186CommonJS: no parameter info shown for constructor reference used as exported module property
BugWEB-12681Wrong Singleton highlight in Ecma6 with static
BugWEB-18255Flow: recognize last comma in the tuple type
BugWEB-22345Flow parameter hints incorrectly suggesting optional param
BugWEB-21426JSX: block comment is not undone on comment action re-invocation
BugWEB-26885Edit Live Templates Predefined Functions: JavaScript predefined functions don't appear unless all JS subelements are selected
BugWEB-26881Option to disable auto imports in JavaScript
BugWEB-18235Flow: Settings: color all keywords: 'declare' and 'type'
BugWEB-26408Flow object type spread is not supported
BugWEB-27041Don't report 'red' errors based on JSDoc
BugWEB-23252"Parameter info" is wrong when using an inner arrow function without braces
BugWEB-24930JsDoc @augments ignored
BugWEB-26872Flow: Global error pane shows the wrong line numbers
BugWEB-17483ES6 import resolve error
BugWEB-20919CommonJS: completion shows properties of all exported modules in project
BugWEB-20363refactor move file & import from '../path/bla.jsx'
BugWEB-16165Returned expression type Array is not assignable to type fixme
BugWEB-18253Flow: line comment breaks React tag recognition
BugWEB-24915Unable to change color from gutter if multiple colors are defined on the same line
BugWEB-21786WebStorm go to type declaration
BugWEB-27807Structure Panel Mishandles Array of Objects
BugWEB-20803"Element is not imported" error for "module"
BugWEB-19407Autocomplete doesn't work if object property was created with constructor
BugWEB-10771Invalid Javascript is recognised as valid
BugWEB-13673Moving JavaScript always skips function() block
BugWEB-25223Arrow function and object - Parsing errors for correct code
BugWEB-18593Broken hint and autocomlete for destructured parameters
BugWEB-18201Move caret to matching brace doesn't work for ()
BugWEB-18200ArrayIndexOutOfBoundsException on Move caret to matching brace
BugWEB-23016Flow: disable Suppress for statement in Inspection results
BugWEB-18974Cannot resolve symbol error if multiple implementation match the ES6 import path
BugWEB-26526replace with template string adds extra space
BugWEB-24969Unexpected warning "Element is not exported"
BugWEB-23841Flow checking gives wrong warning & errors in interface files
BugWEB-20791Move Statement Down action breaks code
BugWEB-19437No code completion when using backticks in require statements
BugWEB-19500JSDoc: Erroneous message "Returned expression type ... is not assignable to type ...."
BugWEB-19767ES6: Dummy suggestions for `yield`
BugWEB-25231False error "expected =>" for Flow typecast
BugWEB-22839Debug files in JavaScript library reclassified as release on index
BugWEB-14576Ignore React JS Lifecycle components/properties in JSX files
BugWEB-14550ES6 anonymous class syntax doesn't work
BugWEB-18231ES6/Flow: provide option to color class, member variable, label and type alias
BugWEB-23211'Expression statement is not assignment or call' shown for Chai expectations
BugWEB-24976CommonJS: exported properties are not available in completion after module re-export
BugWEB-20251Corrective auto-complete produces unexpected results
BugWEB-21232[Flowtype] import and importype incorrect hints.
BugWEB-19280JSDoc inline types: Problem with ES 2015 arrow functions with one parameter and no parenthesis syntax
BugWEB-19604JavaScript documentation popup indents parameters too far when @return includes <...>
BugWEB-25336'Create field' quick-fix produces invalid code
BugWEB-25449ES6 Import Code Completion does not match CommonJS
BugWEB-13313JSDoc: Regular expression breaks stub
BugWEB-23996Flow language level syntax highlighting error
BugWEB-20191Convert to ES6 template works incorrectly
BugWEB-7504make JSHint error highlighting more prominent
BugWEB-18548Wrong processing of JSDoc array-parameter fields
BugWEB-14734ES6: silent errors in the import statements
BugWEB-23051'use strict' statement breaks flow highlighting
BugWEB-20434node.js: WS assumes variables in npm packages are available everywhere in normal code
BugWEB-20956ES6: re-exporteing default module causes 'default export not declared in imported module' error
BugWEB-23456JSDoc folding (first empty line)
BugWEB-16271Parameters are missed when generate JSDoc automatically in ES6 file
BugWEB-24881Extend Selection doesn't support javascript es6 "``" syntax
BugWEB-23985folding inline JSDoc issue and adding JSDoc type feature
BugWEB-24080Star-imported es6 module intellisense broken
BugWEB-25041Exception when extracting variable used in decorator
BugWEB-21560"Replace with Template String" fails if original contains a backtick
BugWEB-21773Inline type information in function parameters is not found when param. destructuring is used
BugWEB-19392Unused constant
BugWEB-21968Type detection picking up suggestions from completely and obviously impossible places - even from local variables in other files inside functions
BugWEB-3407JS: Smart Enter fails to add closing parentheses
BugWEB-26101Type detection fails on "await"-ed promise that returns an array (works for simple values)
BugWEB-17918Code completion after await
BugWEB-19495JSDoc: This type string _sometimes_ causes an error
BugWEB-25129JavaScript Intellisense is useless
BugWEB-22972MAJOR refactor bug - Can no longer refactor/rename destructured variables
BugWEB-15808'Invalid' value in completion
BugWEB-22297babelrc doesn't recognize plugin options
BugWEB-17651Split into multiple declarations removes comment
BugWEB-17099CommonJS: module functions not available when re-exporting module instance
BugWEB-22998ES6 Destructuring in require statement completely broken
BugWEB-23540Flow: Project Errors need Jump to Source possibility and grouping by files
BugWEB-21493Autocompletes JavaScript function call incorrectly.
BugWEB-19023ES6/Typescript auto-imported names should be inserted after "use strict" statement if presented
BugWEB-22285Live Templates: jsClassName() doesn't return AMD module name when expanded in ES6 method definition shorthand
BugWEB-21833"u" modifier in JavaScript regular expression
BugWEB-21839knockout observable DefinitelyTyped signatures not being recognized properly
BugWEB-20094JSX: incorrect 'unused import warning' if component binding is unresolved
BugWEB-17979Component is not resolved
BugWEB-21530JSDoc, inherited nested objects code auto-complete doesn't work for additional child properties
BugWEB-22927Flow: provide Live Template for @flow comment
BugWEB-25258Can't find .flowconfig on Javascript project with Flow static type checked enabled
BugWEB-22920JavaScript no syntax error on labeled continue
BugWEB-25251JSDoc is converted to parameter's type when call 'Split into declaration and init'
BugWEB-18186Exposed properties of object created using Revealing-Module-Pattern are not available in completion
BugWEB-3381JavaScript: Move Statement Up/Down moves additional line with code because it treats end-of-line comment as a comment for the next line
BugWEB-3763Context info for extended JavaScript objects
BugWEB-2967"Select Word" (Ctrl-W) feature misses comma in members of variable declarations
BugWEB-16923Javascript: Cannot jump to declarations of destructured variables
BugWEB-23565Support await postfix completion
BugWEB-20261Wrong 'Replace with template string' intention inside angular message
PerformanceWEB-22544Poor editor performance with 25000 line javascript file
PerformanceWEB-23255Major editor slowness when Flow turned on
PerformanceWEB-22042IntelliJ IDEA freezes while editing javascript file
UsabilityWEB-18070ES6: Find usage of default export
UsabilityWEB-25455Module Dependencies Diagram: provide separate popup shown for the empty context
UsabilityWEB-22602ES6: inconsistent availability of "convert to arrow function"
CosmeticsWEB-23101Flow errors tool window: improve UI
CosmeticsWEB-22215Exclude JSDoc from 'assignment' inspection
CosmeticsWEB-201812 actions with same icon
ExceptionWEB-26736Throwable when call require inside script tag in vue
ExceptionWEB-19509IllegalArgumentException when edit template's code
ExceptionWEB-23507ClassCastException When update JSDoc
ExceptionWEB-18225java.lang.NoClassDefFoundError: org/apache/commons/io/FilenameUtils
ExceptionWEB-18019AssertionError when call completion inside script with type 'text/ecmascript-6'
JavaScript. FormatterFeatureWEB-25019"New line after (" in JS function calls should ignore multiline parameters and take into account only line breaks *between* parameters
FeatureWEB-14310Add support for Google JavaScript style guide
FeatureWEB-17895Formatting ES7 decorators: keep decorators on individual lines
FeatureWEB-13303Add an option "Spaces within expression parentheses"
FeatureWEB-20668Code Style: spaces around ES2015 (ES6) Generator
FeatureWEB-19523No 'Wrapping and Braces' alignment code-style options for JavaScript 'new' expressions
FeatureWEB-26042Add minimum number of blank lines to Typescript Code Style
FeatureWEB-24357JavaScript Code style: Space between async and () => {}
FeatureWEB-22783Add options to control blank lines
FeatureWEB-22782Add formatting options to insert/remove trailing commas in Object Literals, Function Declaration Parameters, Function Call Arguments, ES6 Imports/Exports
FeatureWEB-24556Reformatting option to add, remove, or leave alone (default) semicolons
FeatureWEB-19281Code Style for typescript should allow configuring spaces using in es6 import syntax
FeatureWEB-19143Remove last comma in json or js arrays/object automatically
FeatureWEB-22612"Reformat code" is unopinionated on TypeScript generics
FeatureWEB-16727Add formatting for TypeScript/ES6 module import syntax
FeatureWEB-12581New JavaScript formatter option: split variable declarations in lines
FeatureWEB-19585Formatter: provide option for the arrow function in the Around Operators settings
BugWEB-22446JS Alignment of multi-line parameters doesn't work if it's an object instantiation
BugWEB-9146Embedded javascript should be indented according to Javascript settings for indent/continuation indent
BugWEB-16628JavaScript IIFE braces formatting
BugWEB-21149IntelliJ adds linefeed before opening brace in `switch-case` statement
BugWEB-24389Flow: Some flow type syntax confuses the formatter
BugWEB-24126Flow: provide correct formatting for union and intersection types
BugWEB-22093Formatter formats a comment despite (enabled) formatter markers telling it not to
BugWEB-23348Formatting empty class breaks the line when "simple blocks in one line" is enabled
BugWEB-24643Problem with indentation after updating to 2016.3.2
BugWEB-24927'Make static' breaks code or highlighting depending on settings
BugWEB-27105JSX tags are not correctly indented when using ternary operator
BugWEB-2236Arrow function is not formatted properly
BugWEB-25247'Align parameters when multiline' ignores destructuring parameters
BugWEB-14543Code Style for functions as parameters in Javascript treats Arrow Functions different than normal functions
BugWEB-2226JS: "if" braces always inserted on next line by formatter
BugWEB-22268Align var statement and assignments does not align ES6 destructuring assignments
BugWEB-25312Incorrect indentation in JSX using ternary operator
BugWEB-25222es6 destructuring indentation issue
BugWEB-26522wrong reformat of es6+react
BugWEB-1206JS formatting problem after if statement
BugWEB-27149JavaScript punctuation code style options are not respected when formatting code embedded in Vue template
BugWEB-24787Use semicolon to terminate statement option with for loops
BugWEB-24786Wrong indent after 'Extract++'
BugWEB-24789Globally installed Standard always shown in the UI
BugWEB-25235destructured parameter defaults do not obey the alignment formatting options
BugWEB-22016JavaScript reformatting may corrupt chained method calls mixed with line comments
BugWEB-23475Optimizing imports in javascript/ES6 modules ignores inspection controls
BugWEB-22003Function Body is Indented Wrong
BugWEB-13129ES6 Wrong Chaining Indentation
BugWEB-24527Phpstorm does bad auto formatting in functions with jsdoc inside arrays
BugWEB-25218'Use semicolon to terminate statement' is not applied inside 'script' tag in html file
BugWEB-18387Indentation after <ENTER> is wrong
BugWEB-26559Code Style: JavaScript/TypeScript: improve Arrangement
BugWEB-19713Formatting preferences cause AssertionError "Attempt to create a composite block with no children" when accessing certain files
BugWEB-17628javascript indentation problem
BugWEB-18509WS 11 EAP: Assigment syntax dependent indentation issue
BugWEB-26763Wrong indent in .vue files with .editorconfig
BugWEB-21661Wrong 'Format Code' in React render code
BugWEB-21972Indentation problems with JavaScript
BugWEB-24513Reformat code action doesn't retain indent for ES6 shorthand arrow function
BugWEB-24853Formatter doesn't follow the formatting rules when formatting Flow type annotations, also reports valid Flow type as "error"
UsabilityWEB-24704ES6: Preserve order of imports and empty lines between them
ExceptionWEB-25477JS: Throwable when formatting injection in template strings with escaped spaces (\n, \t)
JavaScript. FrameworksFeatureWEB-19890tsconfig, eslintrc: do not show used properties in code completion
FeatureWEB-22524Add integrations with Create React App for creating new projects
BugWEB-22389"Cannot resolve symbol" error for AngularJS modules defined though a wrapper function
BugWEB-26395Vue.js: broken 'async/await' construction highlighting in <script> tag
BugWEB-22659React: don't report 'missing required attribute' error for required properties from defaultProps
BugWEB-26258JSX components are incorrectly marked as deprecated HTML tags
BugWEB-23118Guessing wrong React props - based on name, not actual file
BugWEB-26418Resolve types from React 'prop-types'
BugWEB-23754Missing type introspection inside *ngFor
BugWEB-18256React: completion for imported component doesn't work when not using {}
BugWEB-21677JSX Children PropTypes incorrectly parsed
BugWEB-23268No docs for React component props
BugWEB-21798React: don't report 'Empty tag' violations for tags in JSX
BugWEB-27121WebStorm doesn't understand escaped curlies in Angular2 html templates
BugWEB-25562Angular-cli: New Project Name validation
BugWEB-22184angular-ui-router: UnsupportedOperationException when press cmd+d
BugWEB-19957Incorrect resolve in angular message
BugWEB-21684React: Missing required prop should not trigger warning when defined in getDefaultProps
BugWEB-21692Element X doesn't have required attribute Y
BugWEB-26235Auto import doesn't work for functional React components
BugWEB-26833Formatting: Code Styles: JS/TS: "Keep Maximum Blank Lines" option saves only 2 blank lines
BugWEB-26165Unused default export
BugWEB-24095Add option to pass environment variable in React native configuration
BugWEB-21570React: provide path completion/validation for <img>, etc. tags in JSX components
BugWEB-25212Vue + Typescript: export is not recognized
BugWEB-28192Find Usage / Jump to Declaration (CTRL+Click) in AngularJS is no longer working
BugWEB-25128React native debugger: template app can't be debugged
BugWEB-25479Vue.js: child component appears as 'unknown HTMl tag' in parent template
BugWEB-22277JSX boolean attributes mistakenly reported as not boolean
BugWEB-26324Menu element showing as deprecated in JSX
BugWEB-12115"Mark Directory as Resource Root" from Webstorm doesn't work in Rubymine
BugWEB-19921Red code in Angular 1.4
BugWEB-23154JSConstructorReturnsPrimitive and React stateless functional component
BugWEB-19589React: Refactor - Rename of component doesn't work properly with default exports
BugWEB-22498Good code is red in JSX React syntax
BugWEB-22855aria-attributes are not recognized in JSX
BugWEB-26915VueJS plugin shows unused default export
CosmeticsWEB-26821Vue files don't properly highlight es6 imports
ExceptionWEB-27026IllegalStateException when stop debugger
ExceptionWEB-27194ClassCastException when open a project
JavaScript. InspectionsFeatureWEB-24517Inspection: '==' operator is used instead of '==='
FeatureWEB-20190ES6 imports: suggest to install [with npm] modules metioned in from clause
FeatureWEB-25172Provide import suggestion from .jsx to .js
FeatureWEB-20310Missing import inspection: add symbols from the same module in one statement
FeatureWEB-21230Support ESLint fix
FeatureWEB-12565Exempt @class from function naming convention inspection
FeatureWEB-21946Linters: highlight the whole token
FeatureWEB-24074Add eslint-compatible suppression options
FeatureWEB-19830Add code completion for eslintrc file
BugWEB-20726ES6 destructured assignment warns assigned to variables may not be initialised when being assigned!
BugWEB-25398Throwable when inline variable
BugWEB-22931Inspections: "Remove unnecessary parenthesis": do not suggest it for Flow syntax
BugWEB-23595wrong types recognition by function parameter named as 'props'
BugWEB-20156Missing import inspection: suggest importing CommonJS modules
BugWEB-22166Intentions: "Add braces to arrow function statement" eats any preceding comment
BugWEB-23316Inspections: disable "require() is used instead of import" for TypeScript files
BugWEB-23290Duplicated warnings for non-imported element
BugWEB-24268Imprecise highlight of unused value in ES6 destructuring assignment
BugWEB-21505eslint-plugin-html doesn't validate html files
BugWEB-21054JavaScript useless warning Variable might not have been initialized
BugWEB-21051Missing module dependency: should add a package.json file to the project
BugWEB-24736Potentially invalid usage of this in getters/setters inside constructor
BugWEB-22376"Missing import statement" in code inspection by mistake
BugWEB-22641Convert to let/const inspection in Inspections results
BugWEB-9059JavaScript: "remove redundant else" option is not consistent.
BugWEB-20225Enable "Missing import statement" inspection for JSX/Flow language versions
BugWEB-24926Standard Code Style: correctly setup rules from preset
BugWEB-21334Eslint config with strings
BugWEB-24748JSCS: 'Fix current file with JSCS' doesn't work from Inspections Results toolwindow
BugWEB-22343Duplicate declaration warning when there is no one
BugWEB-23920Magic Number inspection should not apply to JavaScript Object key/value pairs
BugWEB-20694JSCS: requireObjectKeysOnNewLine "allExcept": ["sameLine"]
BugWEB-22502Inspections: "Convert to let": do not place result 'let' into another scope
BugWEB-24754Warning with async functions and no return value
BugWEB-22576Javascript: simplify if statement intention adds additional !!
BugWEB-21568Excessive vertical space in JSCS config description
BugWEB-22755Inspections: async keyword is not treated correctly by "Convert to anonymous function"
BugWEB-23132Missing module dependency inspection shouldn't work independently from library scope
BugWEB-23480Convert to ES6 class: suggest only if source function has prototype assignments or this assignments, or defines static methods
BugWEB-21878Erroneous "type mismatch" inspection warnings when using arrow functions and promises
BugWEB-23315Inspections: "require() is used instead of import": destructing of require is not converted correctly
BugWEB-22690Inspections: "Missing module dependency": correct inspection in Inspection results
BugWEB-22503Inspections: "Convert to let": do not change operations order
BugWEB-16982ESLint: can't run eslint because relative paths to extended configuration files not correctly resolved
BugWEB-20153WebStorm code inspector: 'Interface can not be instantiated' for new Error('ErrorMessage') and for new Buffer(). NodeJs scope ls enabled.
BugWEB-21789False 'missing module dependency' violation for 'express-sessions' module
BugWEB-24686Inspections: do not suggest "Convert 'for..in' to 'for..of'" in case of conflicting error with "Unfiltered for..in loop"
BugWEB-22689Inspections: "Missing import statement"/"Missing require() statement": correct inspections in Inspection results
BugWEB-22684Inspections: "Convert to let" eats preceding block comment
BugWEB-22685Inspections: "Convert to let" duplicates variables both as let and const
BugWEB-22681Update built-in JSLint version
BugWEB-23464Inspections: "require() is used instead of import" put imports to the end of file when both normal and inner requires are present
BugWEB-23205Flow: improve "Coverage errors" inspection
BugWEB-19694global objects are not resolved/behaved as expected
BugWEB-25162ESLint: 'Fix ESLint problems' action is missing in .jsx file right-click menu
BugWEB-25309convert to template string produces invalid code if contains a string argument with newline character.
BugWEB-25234"Content of collection is never updated" is wrongly reported on Sets
BugWEB-23479Intentions: "Convert to ES6 class": when defineProperties() has writable: false do not generate setter
BugWEB-23210No-variable declaring destructuring assignment not recognized as valid
BugWEB-22760JSCS: provide support for new options
BugWEB-12412Inspections: Code quality tools quick fix opens Settings dialog for each item
BugWEB-22824Inspections: disable "Convert to class" intention inside Typescript classes/interfaces
BugWEB-22642Convert to let/const inspection messes up the comments
BugWEB-22310Inspections: "Convert to let" leaves preceding comments untouched while moving declarations
BugWEB-21903'Cannot resolve symbol' exported import es6
BugWEB-22228Incorrect "unresolved variable" warning after a destructing assignment from a require() in Node.js
BugWEB-23044Code analysis after most recent update is very slow
BugWEB-21731Invalid return and break statements
BugWEB-24948Linters auto detection: if local package is installed always set path to local not to global package
BugWEB-25140ESLint highlights incorrect line when line is too long
BugWEB-24630Convert to class intention loses getters and setters
BugWEB-24938ESLint command line error messages are not shown properly
BugWEB-7241Destructured assignment in function parameters causes incorrect inspection warnings
BugWEB-20157Missing import inspection: can't import several symbols from one file
BugWEB-19149Warning about "Potentially invalid usage of this" when accessing property in ES6 generator
BugWEB-22116Intentions "Convert var to let", "Convert var to const" freeze large project
BugWEB-23295Inspections: "require() is used instead of import": comments breaks converted import
BugWEB-20281Inspections: disable "Missing module dependency" for TypeScript ES6-style imports
BugWEB-22879False-positive inspection 'Module is not listed in package.json dependencies'
BugWEB-27515Inspections: Create class/interface quick fix should correctly treat preceding comments
BugWEB-22668Erroneous conversion to arrow function
BugWEB-19487missing AMD warning for 'console' and 'document'
BugWEB-24609'Convert to let' adds redundant export modifier
BugWEB-22864False positive "Element is not exported"
BugWEB-22728ESLint: provide absent rules and options
BugWEB-22260Incorrect detection JSDoc in tag @typedef
BugWEB-22135Convert to let should keep initialization together with declaration
BugWEB-23374Links do not work in Documentation expression popup
BugWEB-23574Missing import statement: for modules having both jsnext:main and main, incorrect import results are suggested
BugWEB-25104Wrong warning about usage of reserved word in destructuring
BugWEB-24672Inspections: "Convert 'for..in' to 'for..of'" is shown twice for each code construct in Inspection Results
BugWEB-19667Variable might not have been initialized with ES6 destructing
BugWEB-19836JSHint 1.8.0 not loaded
BugWEB-18183ESLint: deprecation warning causes the problem with loading linting results
BugWEB-21847Import statement is marked as unresolved
BugWEB-21602v2016.1.2: "Possible iteration over unexpected members" mislead
BugWEB-22092Invalid "Returned expression type ...not assignable to type ..." error
BugWEB-20147False positive "Add missing import"
PerformanceWEB-24567Editing is slow because of 'missing Import' inspection
UsabilityWEB-22763Inspections: "Missing module dependency": reorder list of available package.json files
UsabilityWEB-22757Improve support of eslintConfig section in package.json
UsabilityWEB-24566Linters auto detection: log information about turning on linters into events log
UsabilityWEB-23570Intentions: "Convert to Class": correctly sort generated set/get attributes
CosmeticsWEB-22029Constant 'if' statement inpection: spelling
ExceptionWEB-22394Inspections: Throwable on applying "Convert to let"/"Convert to const" quick fix
ExceptionWEB-26859PsiInvalidElementAccessException when call 'Remove unused export' in vue files
ExceptionWEB-23463Inspections: exception is thrown on attempt to process multiple comments with "Convert to let" Fix all
ExceptionWEB-23076Inspections: AssertionError for "Missing module dependency" group shown in Inspection Results
ExceptionWEB-19198JSCS: Import Code Style: IllegalStateException for empty input file
ExceptionWEB-22616Inspections: "Convert to let": IOOBE is thrown on applying quick fix to Fix all statements
JavaScript. PredefsFeatureWEB-3371Fully implement the Console API
FeatureWEB-28052Support Promise.prototype.finally
FeatureWEB-6574Add matchMedia to DHTML.js
FeatureWEB-28113ES7: add `String.prototype.padEnd()` and `String.prototype.padStart()` to EcmaScript.js
BugWEB-8821Unresolved variable or type 'HTMLSpanElement'
BugWEB-18251Function is not treated as instance of Function
BugWEB-22269EcmaScript6.js (Predefined JavaScript files) claims Array.prototype.fill will return "void"
BugWEB-19648Incorrect signature for document.importNode
BugWEB-23265document.domain is defined as a const
BugWEB-6783JavaScript Math.atan2 signature seems incorrect
BugWEB-6766setTimeout/setInterval inspection expects fixed signature
BugWEB-13840WebGL constants are defined on WebGLRenderingContext, rather than WebGLRenderingContext.prototype
BugWEB-18967Incorrect Event prototype definition makes inspection fail
BugWEB-11805Incorrect DHTML.js, resulting in incorrect inspection
BugWEB-21011Incorrect type annotation on HTMLDocument.prototype.activeElement in DHTML.js
BugWEB-25241Buffer.from pointing to wrong method Array.from
JavaScript. RefactoringFeatureWEB-24775Incorrect shorthand object literal refactoring
FeatureWEB-19996Improve name suggestion for Refactoring | Rename
FeatureWEB-22639ES6 string templates: create intention to convert between line separators
BugWEB-20035Inline doesn't work on class methods
BugWEB-20067"Find Usages" and refactoring does not work, with es6 object definition
BugWEB-17842Rename file takes several minutes
BugWEB-22897'Convert to anonymous function' add extra semicolon
BugWEB-23623Convert to class: when constructor defined as variable, not converted duplicate properties are not shown after refactoring
BugWEB-27074'Refactor | Rename' skips functions call (import via module.exports)
BugWEB-24920ES6 - not correct actions in the Action Menu for Arrow functions with Destructuring objects as function parameters
BugWEB-24742ES6: convert to class with a commented function property: null assertion
BugWEB-21419ES6: Intentions: add support inside HTML script tag and inside JS injections
BugWEB-23483Refactor->Move does not work with Javascript functions from structure tab
BugWEB-23484ES6 convert to class: pseudo-class method definition, expressed as created object's member, should be converted to member function
BugWEB-22694Convert to arrow function creates invalid function with object literal
BugWEB-27023'Refactor | Rename' skips functions call (import via module.exports)
BugWEB-23598Convert require() to import: does not work at the moment with relative paths
BugWEB-28666Can't add parameter without default parameter value
BugWEB-19994NullPointerException when try to extract field from decorators
BugWEB-19995AssertionError when change method's signature
BugWEB-19002ES6: Refactor/Rename directory doesn't correctly update paths in import statements
BugWEB-23455refactoring object property
BugWEB-16440"Redundant variable" warning and "Inline variable" refactoring don't work on a destructuring variable declaration
BugWEB-22611Shorthand property inline adds no key
BugWEB-16872ES6: Refactor/Extract method in class scope should create a class method
BugWEB-20054Create Function Definition feature does not use selected scope - always creates it in global scope
BugWEB-25481'Compute constant value' doesn't support ES6 template strings
BugWEB-22132Convert to let should consider scope
BugWEB-22133NPE during var to let conversion
ExceptionWEB-20603Cannot delete variable from parent : JS:DESTRUCTURING_PROPERTY when use 'Inline'
JavaScript. TemplatesFeatureWEB-19721Allow reformat to place closing tag in new line in JSX
LESSFeatureWEB-14762support inline LESS/SCSS stylesheets
BugWEB-20921Add support for valid HTML syntax for including LESS/SCSS in <style> tags
BugWEB-12012LESS: '~' in calc() function causes 'unexpected term' error
BugWEB-14251Less editor incorrectly shows an error when using tilde ~""
BugWEB-19384expand selection in css/less issue
BugWEB-25471Autocomplete for less
BugWEB-21722IDEA tries to parse @unknown rules in less file
BugWEB-21601String concatenation inside cals in Less files is not recognized
CosmeticsWEB-27002Typo in Sass/SCSS/Less | Resolved by name only inspection popup
LintersBugWEB-26653Standard Code Style: wrong highlighting in the Editor
BugWEB-26393can not get result of ESlint annotation
BugWEB-24814Enable TSLint by default for Angular CLI projects
BugWEB-27100ESLint inspection inexplicably shows an error on ignored file
BugWEB-27024Standard Code Style: can't start linter when using "plugins" option
BugWEB-26756ESLint: warning about new line character is now shown
UsabilityWEB-26971ESLint: Code/Inspect Code reports errors for each ignored file of the .eslintignore
Node.jsFeatureWEB-19559NPM scripts: make messages/errors in console clickable
FeatureWEB-25514Support for n (virtualenv for Node.JS)
FeatureWEB-11419Provide better exclude rules for indexing.
FeatureWEB-15231Notify about changing project package.json after VCS update
FeatureWEB-19093Node.js: support path auto-completion for require statement
BugWEB-20033don't warn about "missing import statement" / "require() call is missing" for mocha describe/it methods
BugWEB-23597"Missing module dependency" inspection "Install module" fix installed previously typed module-name
BugWEB-19697Module is not statement
BugWEB-21725node-globals-stub is wrong for process.hrtime
BugWEB-22620Node.js: node_modules recognition: each node_modules folder is treated as separate library
BugWEB-22652Node.js: node_modules recognition: correctly preserve enabled/disabled library state
BugWEB-19922Node remote interpreter: Multi-Machine Vagrant: wrong error for empty Machine name
BugWEB-21673Adding Electron inside a packaged app as a Node.js interpreter starts the app
BugWEB-19641Node remote interpreter should be shown only for valid Run Configurations
BugWEB-25372Do not suggest packages in devDependencies that are already listed in dependencies
BugWEB-26508NodeJS support cannot be enabled for Node 8
BugWEB-23009File .idea/jsLibraryMappings.xml is created automatically when opening a new project with node_modules
BugWEB-20060Scratches don't recognise project installed NPM modules - Defective behaviour
BugWEB-20061Remote interpreter: handle external changes in path mappings
BugWEB-22327Can't open project. Cyclic dependency: [JSLibraryMappings, JSLibraryMappings]
BugWEB-21931Change text in remote interpreter configuration
BugWEB-24963Bower.json completion hangs IDE due to not installed bower package on Unix/Mac
BugWEB-21685.iml files contain ancient references
BugWEB-22653Node.js: node_modules recognition: excluded folder of the removed library should not be added back as library
BugWEB-22654Node.js: node_modules recognition: library becomes disabled after project opening in different versions
BugWEB-21914angular-cli: Cannot find angular-cli package
BugWEB-20304Hide Remote interpreters from the Node.js and NPM Settings/Preferences
BugWEB-20306Node Interpreters: auto fill in path to the npm package on the Windows
BugWEB-21652Different variable highlighting for Node.js core modules
BugWEB-20278Node.js: update indexes on package.json update
BugWEB-25154[node][es6] Using quickfix to import exported function fails when import is present
BugWEB-23100Show library folder icon for node_modules marked as "library root"
BugWEB-26490Tslint 5.1.0 errors are not clickable in NPM console
BugWEB-25219Improve behavior of Express generator when offline
BugWEB-22102Can't remove Docker node interpreters
BugWEB-19652Node remote interpreter: do not reconnect to all hosts on Settings/RC opening
BugWEB-22923Node Remote Interpreter: Docker: correctly hide "v8-profiler package" field chooser
BugWEB-22499Npm: Missing module dependency inspection: search in all package.json files in the project
BugWEB-22114Node.js Remote Interpreter plugin breaks possibility to manage Node versions in Run Configuration
BugWEB-26965Excluding directory should disable indexing descendant node_modules/ folders
BugWEB-26569process.nextTick() in node.js
BugWEB-20194Remote interpreter: disable "remove" action for inherited path mappings
BugWEB-19617uncaught exception in case when deployment configuration was deleted, but there is still node interpreter referring to it
BugWEB-22619Node.js: node_modules recognition: remove "Node.js dependencies for" library
BugWEB-19812Better warning when a deployment configuration corresponding to a remote interpreter is removed
BugWEB-22900Log is spammed by WARN - ry.NodeModulesDirectoryManager messages
BugWEB-19727rsa key as env variable not working
BugWEB-19920Node remote interpreter: reconnect to Vagrant in the background on RC opening
BugWEB-26576runConfiguration npm type - first argument override
BugWEB-20161"Require() call is missing" inspection: correctly insert require inside inline JavaScript in HTML
BugWEB-19806Connect to remote host dialog pops up when remote interpreter configuration is canceled
BugWEB-19449F_OK, R_OK, W_OK and X_OK are not found by WebStorm
BugWEB-23381Fix the English in the $NODE_DEBUG_OPTION message
UsabilityWEB-22429Node.js: correctly mark node_modules as a library root in the Project View
UsabilityWEB-22658Node.js: node_modules recognition: show folder as Excluded in Directories
UsabilityWEB-18399node.js: record package into package.json quick fix: ask where to create package.json
UsabilityWEB-19901Node remote interpreter: Configure Remote Mappings dialog should have OK and Cancel button
UsabilityWEB-19902Node.js RC: select currently active Node Interpreter on opening "Configure Node.js interpreters" table
UsabilityWEB-19904Node remote interpreter: Vagrant: show absolute path instead of relative to the project root
CosmeticsWEB-22719Node remote interpreter: Docker: correct error message when server is not selected
ExceptionWEB-22627Node.js: node_modules recognition: StackOverflowError on old project opening
ExceptionWEB-25507IllegalStateException is thrown on opening JSCS settings
ExceptionWEB-20303Remote interpreter: IAE is thrown on Canceling the Added Remote configuration
Pug (ex-Jade)TaskWEB-21353Rename Jade plugin to Pug and support Pug language
REST ClientBugWEB-19065REST Client plugin send chatacter '?' on request even without parameters!
BugWEB-28593Diff panel show the wrong files
BugWEB-24584Test REST Client can't delete pramertes or headers anymore
BugWEB-10584support GET params for POST requests in REST Client Tool Window
BugWEB-28564Rest Client: update file references on 'move' refactoring
UsabilityWEB-28596Make "Show Http Requests History" action discoverable
SASSFeatureWEB-13028SASS/SCSS + Compass regular CSS import syntax
FeatureWEB-19089Add foldings for maps
BugWEB-19458SCSS: use "java-resource" root when resolving SCSS import paths
BugWEB-21764Incorrect "Generated source files should not be edited..." warning
BugWEB-20100Inline sass: problem with @import
BugWEB-22357lint says calc does not handle negative first value, but it does
BugWEB-20068Inline scss: problem with @charset
BugWEB-21425SASS: don't add quotes around URL in @import on refactoring
BugWEB-19743"cannot resolve sass into sass/scss file" warning is not relevant with sass globbing pattern resolver importer in project
BugWEB-18234SCSS autocomplete suggests compass methods while compass is not enabled.
BugWEB-25094Error-marker in SCSS file
BugWEB-19351SASS: 'unexpected whitespace' error shown if there is a space after variable name in interpolation
BugWEB-22644"Go to Declaration" doesn't work for variables in .scss files in Bootstrap Ruby gem
BugWEB-12958SASS 3.3: provide completion/navigation for selector created using &_suffix
BugWEB-26792Placeholder selectors are not resolved if defined with parent reference (&, ampersand)
BugWEB-19176Sass @import of css file without extension doesn't resolve
BugWEB-5879SASS: Resolving nested selectors in html
BugWEB-20198Color scheme settings are ignored for Scss line comments (double slash)
BugWEB-20070Inline SCSS: quick-fix 'Expand css shorthand property' enter extra spaces
BugWEB-9251Compass support: correctly update imports on Refactor-Move
BugWEB-20069Inline scss: missing highlighting for some keywords
UsabilityWEB-28576Disabling "Color preview" gutter icon shouldn't affect background preview
StylusBugWEB-13549Stylus: Red code: support @supports at-rule
BugWEB-13543Stylus: Red code: Dot is not recognized as unexpected term
BugWEB-21360Wrong indentation in Stylus files
TypeScriptFeatureWEB-19047TypeScript move statement action moves line, not statement
FeatureWEB-22938TypeScript editor should include typings from tsconfig.json lib property
FeatureWEB-26727ES6 / TypeScript: move symbol refactoring improvements
FeatureWEB-26431Support auto-imports for modules provided by module augmentation
FeatureWEB-23285Autoformat arrow functions like in js
FeatureWEB-22053TypeScript 2.0: parse global module export
FeatureWEB-18094TypeScript 1.6: ES6 Generators support
FeatureWEB-24868Auto-Import not resolving TypeScript source (not declarations) in node_modules
FeatureWEB-21474Issue with interface (TypeScript)
FeatureWEB-11078TypeScript: allow navigation to javascript when using .d.ts
FeatureWEB-18046TypeScript 1.6: Expressions in 'extends' clause
FeatureWEB-20095Update typescript compiler to 1.8.0beta
FeatureWEB-19850TypeScript 1.8: Support comments in tsconfig.json
FeatureWEB-24838TypeScript: Add code style for spaces in Intersection and Union Types
FeatureWEB-22030TypeScript 2.0: parse never type
FeatureWEB-22032TypeScript 2.0: parse optional class members
FeatureWEB-22035TypeScript 2.0: parse 'this' function type
FeatureWEB-20897Add support for "allowSyntheticDefaultImports" for Typescript
FeatureWEB-19986TypeScript: provide new intention "Remove modifier" for invalid code
FeatureWEB-23306TypeScript: import can be shortened inspection + quick fix
FeatureWEB-17369TypeScript optimize imports does nothing
FeatureWEB-17292Javascript/Typescript move symbol refactoring
FeatureWEB-22001Auto-imports are wrong when importing from a library that has pathMapping setup
FeatureWEB-23990TypeScript: provide a 'Create class' quickfix for 'unresolved type' error
FeatureWEB-18113Typescript 1.6: `as` operator type assertions for regular .ts files
FeatureWEB-12611Enforce types in TypeScript
FeatureWEB-24057feature request: autocomplete typescript function callbacks
FeatureWEB-19616Add new intentions for abstract classes
FeatureWEB-18149TypeScript Code Style: support "Indent chained methods" rule
FeatureWEB-8658That TypeScript .d.ts files were folded like .js and .js.map below .ts files in the Project view
FeatureWEB-22280TypeScript 2.0: support 'include' option in tsconfig.json
FeatureWEB-13214Request: improve TypeScript code style flexibility
FeatureWEB-17603Highlight unused TypeScript imports
FeatureWEB-17458Merge autoimport generated statements in TypeScript
FeatureWEB-24840TypeScript: Improve string literal completion (enums)
BugWEB-21528Good Code Red - angular-cli importing index.ts pattern
BugWEB-19222no content awar move down/up in TypeScript
BugWEB-24711Fix 'Split into multiple declarations' for enum
BugWEB-17993Unexpected error from TSLint if tslint.json is presented
BugWEB-26434TypeScript: Nested array in generic argument causes '] expected' error
BugWEB-23352Wrong 'Unresolved function or method deserialize()'
BugWEB-19453Typescript: reexport in d.ts file
BugWEB-24728Applying postfix template to `await` expression breaks the code
BugWEB-22433Function in module wrongly marked unused
BugWEB-21860Good Code Red: @ngrx/db import
BugWEB-18890TypeScript overloads list must not contain method implementation declaration
BugWEB-23166Syntax Highlighting broken for functions defining the type of this
BugWEB-23613Typescript, JSX, Generics - invalid report issue
BugWEB-23344Typescript Compiler "Cannot start language service process"
BugWEB-23614TypeScript: implementing method can not be static
BugWEB-26641TypeScript service doesn't work with typescript@2.3.0-dev.20170420
BugWEB-18212TypeScript: Inspections: overloaded constructor is marked as nested function inside Class expression
BugWEB-11466Typescript: "super" keyword syntax checks are incomplete
BugWEB-23580TypeScript: IntelliSense fails to suggest definitions from global declaration
BugWEB-21299Typescript Formatter for property with "type", "namespace" (and more) name (with included JSDoc)
BugWEB-21612Chrome not loading ts files after security update
BugWEB-24730Extracting field/parameter from `await` expression creates invalid code
BugWEB-18103TypeScript chained methods alignment is wrong
BugWEB-22371Should suggest "Add Class Qualifier" for static methods in TypeScript
BugWEB-18106TypeScript: member visibility doesn't work for variables in module
BugWEB-23244Decorators make class the jsdoc comment inaccessible
BugWEB-22723TypeScript: Type checking for functions checks initializer type instead of type declaration
BugWEB-2344TypeScript: provide completion for 'public' and 'private' keywords inside constructor parameters signature
BugWEB-18733TSX: single quote or double quote causes ") expected" error
BugWEB-20229TypeScript `this` parameter type is not resolved as actual type
BugWEB-24745AssertionError is thrown on caret position at the exponential operator
BugWEB-24740IDEA fails to properly link classes imported using modules in Angular 2 project
BugWEB-21085should not warning "Method can be static" when abstract implementation - TypeScript
BugWEB-19783TypeScript optimize imports: remove duplicates
BugWEB-22416Additional TypeScript annotator in plugin breaks semantic highlighting of TS class names
BugWEB-27829Wrong properties completion when using enum fields as type
BugWEB-21670Angular2: no completion for @angular module inside import statement
BugWEB-20079TypeScript field creation intent generates field with wrong name
BugWEB-20073Completion on React component name doesn't respect named import in TSX file
BugWEB-19868Invalid import organisation in TypeScript
BugWEB-19794extract method doesnt work with tsx code
BugWEB-14301Don't work auto resolve types in classes
BugWEB-23079Typescript won't suggest or import namespaces using ES6 style imports
BugWEB-17028TypeScript: \n,\t and so on are not highlighted in template strings
BugWEB-22199TypeScript: correctly recognize "public static readonly" statement
BugWEB-23604Auto import modules in typescript
BugWEB-17372Non-existent ES6 TypeScript imports are not highlighted as error
BugWEB-23130Cannot find tsconfig.json in angular-cli generated project
BugWEB-17392TypeScript create field/method quick fix produces bad code for interfaces
BugWEB-23640generated files still shown after hiding 'excluded files'
BugWEB-24767Typescript now reporting != as poss type coercion when comparing two numbers
BugWEB-18122inspection TypeScriptValidateTypes for Mocha it functions
BugWEB-22322TypeScript: Convert to shorthand arrow function creates invalid shorthand functions
BugWEB-2475TypeScript: 'split into declaration and initialization' should correcly work for variables of object type
BugWEB-27028Typescript: StackOverflowError on recursive generic types
BugWEB-6784TypeScript: call signatures inherited from base interface are not shown in Structure view
BugWEB-22022Optional properties with "readonly" name breaks code validity
BugWEB-20886TypeScript: todo's in /** multiline */ comments
BugWEB-6819TypeScript Rename Refactoring too Aggressive
BugWEB-28657Extract type refactoring reformats the whole file
BugWEB-22213Typescript Auto Import does not work when TS compiler is enabled
BugWEB-20315Ugly tsx autoformat code
BugWEB-19185TypeScript: Refactor/Rename for class property should also rename properties of class instances
BugWEB-13660Incorrect type inference for enum declaration
BugWEB-27008TypeScript file are not pretty formatted
BugWEB-23217"Cannot resolve symbol" for 3rd party imports using ES6
BugWEB-25844Typescript code navigation does not work in multi-module intellij project
BugWEB-20323Typescript: 'export default class' expects a name
BugWEB-22799model not reconciled after doing an import
BugWEB-19321Better JavaScript docs from .d.ts
BugWEB-18176Set accessor method has type that is not
BugWEB-22008Incorrect error notification
BugWEB-23446Typescript autocomplete with nested templates broken without 'use typescript service' and painfully slow with it.
BugWEB-24945incorrect warning msg
BugWEB-23538TypeScript compiler fails to compute relative output paths
BugWEB-24895typescript format enum incorrect if adding auto semi colon
BugWEB-15045Moving .ts files should leave updated relative references in require() begin with ./ or ../
BugWEB-20750overriding abstract method in abstract class marked as abstract
BugWEB-21207TypeScript Import Optimization messes up inspection statements like "//noinspection"
BugWEB-21757enums not shown in 'navigate to class' popup
BugWEB-22676Typescript: Module importing flags import as unused if only type is imported
BugWEB-19127IntelliSense doesn't work in TypeScript JSX templates
BugWEB-17633Intellisense for typescript classes-in-modules not work, for simple classes produces duplicate jump-to results
BugWEB-17411Typescript Formatter: wrong let and const definitions formatting
BugWEB-20291Refactor: Extract Field: Type should be calculated and applied in method/constructor scopes
BugWEB-22513Incorrect warning that labeled continue is unnecessary at the end of a loop
BugWEB-21562Wrong type checking for TypeScript subtypes after .find or. filter
BugWEB-16214TypeScript: Structure View needs improvements
BugWEB-18150Typescript: Child properties not found if parent property has multiple types
BugWEB-19723Marking correct decorator as error, and break it on code reformatting
BugWEB-17398TypeScript: Overridden marker is not displayed for fields
BugWEB-9583TypeScript: Code Style: wrappings for Extends/Implements don't work
BugWEB-26585TypeScript: "Missing augmentation import": do not suggest module itself
BugWEB-26584TypeScript: "Missing augmentation import": provide suppression for the exported type
BugWEB-20992Rxjs 5.0.0-beta.3. Some operations of Observable are not recognized in WebStorm 2016.1 EAP (build 145.596)
BugWEB-13153TypeScript - Find usages of constructor doesn't work
BugWEB-28549TypeScript. Property names in indexers should be on top of the list with better priority
BugWEB-28547TypeScript. Parameter hint doesn't work in case of a re-assigned method with multiple overloads
BugWEB-15017Moving TypeScript .d.ts files breaks import statements in referencing files and vice versa
BugWEB-18220TypeScript: recognize 'as' operator in all constructs
BugWEB-21755Re-exported type is not resolved
BugWEB-18192"Create field" intention for TypeScript creates field outside of interface declaration
BugWEB-28558Reassigned functions with multiple overloads are handled improperly in code completion and parameter hints
BugWEB-23369Formatting chained methods in Typescript
BugWEB-19442WebStorm reports "function name expected" for generator symbol properties
BugWEB-21623React/Typescript: Functional components are not being recognized
BugWEB-19129Destructuring does not work
BugWEB-22630TypeScript: Newline config ignored when using TypeScript service
BugWEB-26284Use relative path not directory import when auto-importing module under same directory
BugWEB-16583External module references resolved incorrectly for multiple classes with the same local name
PerformanceWEB-25450Losing or very slow TypeScript type information after some time
UsabilityWEB-22428TS: Prefer importing from index.ts & omit 'index' from source path
UsabilityWEB-18968Show red underline for file in Project view / editor tab if there are compiler errors
TaskWEB-23465TypeScript: bundle TypeScript 2.0
ExceptionWEB-24739Typescript: exception is thrown on the first new TS file creating in the project
ExceptionWEB-23499TypeScript: exception is thrown on Auto-import invocation
Unit TestsFeatureWEB-21636electron-mocha runner
FeatureWEB-22793Support test names in "Navigate | Symbol..." popup
BugWEB-26643add support to setuptests.js when running tests in webstorme #2016
BugWEB-23304Karma stacktrace not clickable after updating to karma 1.2.0
BugWEB-19754Stack trace does not link to local test code
BugWEB-23664Protractor: Tests tree: provide "Jump to Source" action
BugWEB-27144Can't debug Jest test with node 8.0.0
No subsystemBugDBE-2607Completion in injection with joom db prefix
DB ConnectivityBugDBE-2858Cannot select private key file while setting MySQL Database over SSH using Key pair
Data ViewsBugDBE-4211Table editor row number misplaced when horizontal scroll bar is present and scrolled to the bottom
User InterfaceUsabilityDBE-2195Make SQL dialect selection dialog keyboard-friendly
  • No labels