Skip to end of metadata
Go to start of metadata

RubyMine 2017.3.4 (build 173.4674.46) Release Notes

Code NavigationFeatureIDEA-177859"Sort by Type" does not function when viewing Scratches
ConsoleUsabilityIDEA-134458Console window's input line should probably disregard 'Allow placement of caret after the end of the line' option
Editor. Editing TextFeatureIDEA-152160Add options to "Save as" for scratch files
BugIDEA-143918Scratch files: on Undo scratch file deleting it is recreated with language == text
BugIDEA-184675Structure view: incorrect, unexpected Expand behavior
BugIDEA-157130New File action (invoked in Scratches Project View) creates a file with ScratchFileType but does not create a mapping in the ScratchFileService
UsabilityIDEA-185789Creating a scratch from the VCS local changes diff preview asks you for language
UsabilityIDEA-147495New Java scratch should have a class declaration and a caret inside main method
ExceptionIDEA-187187Save settings failed: "Cannot get ScratchFileService component state"
IDE ConfigurationFeatureIDEA-186216overriding system proxy settings for the license server
Java. InspectionsBugIDEA-186852Incorrect refactoring for Float.valueOf(0x123) and Float.valueOf(0123)
Language InjectionBugIDEA-157126Scratch files: changing dialect for the injected sql fragment in the scratch file changes the whole scratch file language
RefactoringUsabilityIDEA-168477Renaming scratch files shouldn't suggest to search for usages
User InterfaceBugIDEA-184837'Search with google' doesn't support Unicode
BugIDEA-183442Editor background image is covered by Status Bar and Tool Buttons
BugIDEA-134545Change Signature dialog uses syntax highlight colors, but not background
Version ControlUsabilityIDEA-177714"Commit Message History" items are trimmed unnecessarily
Version Control. GitBugIDEA-140196Built-in SSH: does not support strong security ciphers - Cannot negotiate, proposals do not match
DB ConsoleBugDBE-5904Database Console name in Files have turning into Guids
Data Import & ExportExceptionDBE-5985java.lang.IllegalArgumentException: Argument for @NotNull parameter 'typeName' of com/intellij/database/extractors/ObjectFormatter.isBit must not be null
Data ViewsBugDBE-2057Insert row into SQLite table with default values in Table Editor doesn't work
BugDBE-5969Syntax error inserting row with all column values default similar DBE-2057
UsabilityDBE-6003Ctrl+Shift+Left should be used as Editor Action: Move Caret to Previous Word with Selection
IDE GeneralBugDBE-5601Navigate to symbol works bad with column names
BugDBE-5556Select In database window action does not navigate to corresponding object in Database tool window
SQL CompletionBugDBE-4965Autocomplete too fast and leads to errors when inputting a number
SQL GenerationBugDBE-5745Delete of stored procedure/function from Database tree does not work if procedure/function exist in other than "dbo" schema
User InterfaceBugDBE-5927Speed search next match doesn't always work
UsabilityDBE-5807No way to flatten data source + schema

RubyMine 2017.3.4 RC (build 173.4674.46) Release Notes

Editor. Editing TextBugIDEA-184675Structure view: incorrect, unexpected Expand behavior
Java. InspectionsBugIDEA-186852Incorrect refactoring for Float.valueOf(0x123) and Float.valueOf(0123)
Data Import & ExportExceptionDBE-5985java.lang.IllegalArgumentException: Argument for @NotNull parameter 'typeName' of com/intellij/database/extractors/ObjectFormatter.isBit must not be null
Data ViewsBugDBE-5969Syntax error inserting row with all column values default similar DBE-2057
UsabilityDBE-6003Ctrl+Shift+Left should be used as Editor Action: Move Caret to Previous Word with Selection

RubyMine 2017.3.4 EAP (build 173.4674.6) Release Notes

No subsystemBugRUBY-20884RubyMine freezes when editing Ruby code
CucumberBugRUBY-20571RubyMine does find a Cucumber 3 step def defined with a $ and a cucumber expression.
Rails. Code InsightBugRUBY-20699Rails gutter for namespaced nested controllers are missing
RefactoringsBugRUBY-20738Hash variable inlining turns h['key'] into h('key')
TestsBugRUBY-20718Cannot run RSpec tests
No subsystemBugIDEA-171404allow UI scale exceed 2x
BugIDEA-90162Unlimited re-sizing in Diagrams when scrolling with Mouse Wheel
BugIDEA-185359Focus jumps to parent folder after item rename
BugIDEA-185494make doesn't make enough (for real this time)
Code NavigationFeatureIDEA-177859"Sort by Type" does not function when viewing Scratches
ConsoleUsabilityIDEA-134458Console window's input line should probably disregard 'Allow placement of caret after the end of the line' option
Editor. Editing TextFeatureIDEA-152160Add options to "Save as" for scratch files
BugIDEA-143918Scratch files: on Undo scratch file deleting it is recreated with language == text
BugIDEA-157130New File action (invoked in Scratches Project View) creates a file with ScratchFileType but does not create a mapping in the ScratchFileService
UsabilityIDEA-185789Creating a scratch from the VCS local changes diff preview asks you for language
UsabilityIDEA-147495New Java scratch should have a class declaration and a caret inside main method
ExceptionIDEA-187187Save settings failed: "Cannot get ScratchFileService component state"
Find, Replace, Find UsagesUsabilityIDEA-144928remove results from Find tool window: Alt+Del conflicts with safe delete
GUI DesignerCosmeticsIDEA-182786GUI Designer generated $$$getFont$$$ is not used
IDE ConfigurationFeatureIDEA-186216overriding system proxy settings for the license server
BugIDEA-183434syntax error at ide.sigint.ignored.url?
Java. InspectionsBugIDEA-180676False positive 'Object instantiation inside hashCode()': triggers on auto-un-boxing
JavaEE.TomcatBugIDEA-181566Detection server up with symbolic link tomEE
Language InjectionBugIDEA-157126Scratch files: changing dialect for the injected sql fragment in the scratch file changes the whole scratch file language
RefactoringUsabilityIDEA-168477Renaming scratch files shouldn't suggest to search for usages
Run | Debug configurationBugIDEA-157989"Stop" button does not work when the IDE is launched as a background task
UMLBugIDEA-172583show changes allows infinite scroll
User InterfaceBugIDEA-158873Evaluate window: cannot TAB from expression into results tree
BugIDEA-184837'Search with google' doesn't support Unicode
BugIDEA-185043Dom UI editors don't survive on PSI invalidation on root change
BugIDEA-183442Editor background image is covered by Status Bar and Tool Buttons
BugIDEA-134545Change Signature dialog uses syntax highlight colors, but not background
BugIDEA-149061Tool Window docking issue
BugIDEA-183580New background image feature covers up background color of color schemes
Version ControlUsabilityIDEA-177714"Commit Message History" items are trimmed unnecessarily
Version Control. GitBugIDEA-140196Built-in SSH: does not support strong security ciphers - Cannot negotiate, proposals do not match
JavaScript. FrameworksBugWEB-30866Generating list is empty for Angular-cli
No subsystemBugDBE-5703Invalid DDL is generated when a function with defaults is dropped in Postgres
DB ConnectivityBugDBE-5687NullPointerException connecting to a specific SQL Server database
DB ConsoleBugDBE-5904Database Console name in Files have turning into Guids
BugDBE-5696Dialog pops-up asking for parameters for Postgres query when no parameters are required
DB RefactoringBugDBE-2404Foreign keys: on delete set null missing in Oracle
Data ViewsBugDBE-2057Insert row into SQLite table with default values in Table Editor doesn't work
IDE GeneralBugDBE-5601Navigate to symbol works bad with column names
BugDBE-5556Select In database window action does not navigate to corresponding object in Database tool window
SQL CompletionBugDBE-4965Autocomplete too fast and leads to errors when inputting a number
BugDBE-938Column type completion shows table names on SQLServer
SQL EditingFeatureDBE-2232SQL: proper uncommenting for nested comments
BugDBE-5464MySQL syntax for DROP USER commands does not recognize IF EXISTS clause correctly in Code Inspector
BugDBE-3750SQL: Oracle: numeric literal and FROM without a space between is green
BugDBE-1705Bad code is green: declare not at beginning of function
BugDBE-3849Folding breaks on last column in SELECT list
UsabilityDBE-2244SQL: typing quote does not insert pair quote with non empty string literal after typing position
UsabilityDBE-2245SQL: typing quote does not insert pair quote with more than one character prefix
SQL GenerationBugDBE-5745Delete of stored procedure/function from Database tree does not work if procedure/function exist in other than "dbo" schema
BugDBE-4983newline in Oracle DB adds character 'n' to to DDL
BugDBE-5575Foreign key constraint names are not unique on generation
SQL HighlightingFeatureDBE-5508Add support for method seperator in plsql packages
BugDBE-5636Exasol: support user-defined scalar functions (pl/SQL style) syntax
BugDBE-4356Syntax error: grant update on specific field
BugDBE-3521Error in code analysis when procedure parameter has same name as local variable name (TSQL)
User InterfaceBugDBE-5927Speed search next match doesn't always work
UsabilityDBE-5807No way to flatten data source + schema
UsabilityDBE-5557Hide MySQL Collations & Schemas

RubyMine 2017.3.3 (build 173.4548.40) Release Notes

SlimBugRUBY-20577Can not edit slim files

RubyMine 2017.3.3 RC (build 173.4548.38) Release Notes

No subsystemBugRUBY-20635Add --force-exclusion param to the background linting
BugRUBY-20884RubyMine freezes when editing Ruby code
CucumberBugRUBY-20571RubyMine does find a Cucumber 3 step def defined with a $ and a cucumber expression.
Rails. Code InsightBugRUBY-20699Rails gutter for namespaced nested controllers are missing
RefactoringsBugRUBY-20738Hash variable inlining turns h['key'] into h('key')
Ruby. FormatterBugRUBY-19742wrong indent in rescue block when ensure block is present
ExceptionRUBY-20679java.lang.AssertionError: Block not found for 'List of expressions' on enter press
TestsBugRUBY-20718Cannot run RSpec tests
No subsystemBugIDEA-185359Focus jumps to parent folder after item rename
BugIDEA-182999find in path dialog is not initialized from text selections in find occurrences previews
BugIDEA-171404allow UI scale exceed 2x
ExceptionIDEA-184929NPE at java.lang.Class.forName0(Native Method)
ExceptionIDEA-184156NPE at com.intellij.openapi.wm.ToolWindowType.valueOf(ToolWindowType.java:18)
Code Analysis. InspectionUsabilityIDEA-184412"apply fixes" in HTML file triggers long-running modal process that is not interruptable
Diff_MergeBugIDEA-183823'Compare with clipboard' shortcut is not working in the commit dialog
DockerBugIDEA-158383Docker: unable to delete image with multiple tags
BugIDEA-182541Docker. DockerView: it is impossible to create containers from some temporary images due to the invalid image Id.
Find, Replace, Find UsagesUsabilityIDEA-144928remove results from Find tool window: Alt+Del conflicts with safe delete
CosmeticsIDEA-184726Misspelling in search and replace dialog box
IDE ConfigurationBugIDEA-183434syntax error at ide.sigint.ignored.url?
IndicesBugIDEA-123287Multiple "Updating indices" bg tasks after external file system changes
Project ConfigurationBugIDEA-176554Module rename isn't reflected in dependent module imls
Project ViewBugIDEA-180143Deleting empty package causes Project View to reset selection to the root
Run | Debug configurationBugIDEA-157989"Stop" button does not work when the IDE is launched as a background task
SQLBugIDEA-184057SQL autocomplete is upper case and prepends schema name
User InterfaceBugIDEA-158873Evaluate window: cannot TAB from expression into results tree
BugIDEA-183580New background image feature covers up background color of color schemes
BugIDEA-179312Project View Popup - Does Not Match Settings
BugIDEA-183953Windows: "Show in Explorer" does not work with cyrillic symbols
UsabilityIDEA-183950Create directory/file in project view should move selection to created item
Version ControlBugIDEA-183986Compare with Local works incorrectly in a folder history
BugIDEA-183691modification info not visible in commit dialog
DebuggerBugWEB-30438Unable to debug React Native iOS project - "Error running 'iOS': Can't start debugger" message
JavaScriptFeatureWEB-24395Flow: Type annotations need a different color
REST ClientFeatureWEB-28672Auto-format request results
No subsystemBugDBE-5703Invalid DDL is generated when a function with defaults is dropped in Postgres
DB ConnectivityBugDBE-5687NullPointerException connecting to a specific SQL Server database
DB ConsoleBugDBE-5696Dialog pops-up asking for parameters for Postgres query when no parameters are required
DB RefactoringBugDBE-2404Foreign keys: on delete set null missing in Oracle
Data ViewsBugDBE-2465FETCH ALL IN <cursor name> returns error <failed to load> org.postgresql.jdbc4.Jdbc4ResultSet
SQL CompletionBugDBE-938Column type completion shows table names on SQLServer
SQL EditingFeatureDBE-2232SQL: proper uncommenting for nested comments
BugDBE-1705Bad code is green: declare not at beginning of function
BugDBE-3849Folding breaks on last column in SELECT list
BugDBE-5404DataGrip does not recognize Redshift's WITH NO SCHEMA BINDING clause
BugDBE-3750SQL: Oracle: numeric literal and FROM without a space between is green
BugDBE-5464MySQL syntax for DROP USER commands does not recognize IF EXISTS clause correctly in Code Inspector
UsabilityDBE-2244SQL: typing quote does not insert pair quote with non empty string literal after typing position
UsabilityDBE-2245SQL: typing quote does not insert pair quote with more than one character prefix
SQL GenerationBugDBE-5575Foreign key constraint names are not unique on generation
BugDBE-4983newline in Oracle DB adds character 'n' to to DDL
SQL HighlightingFeatureDBE-5508Add support for method seperator in plsql packages
BugDBE-5636Exasol: support user-defined scalar functions (pl/SQL style) syntax
BugDBE-4356Syntax error: grant update on specific field
BugDBE-3521Error in code analysis when procedure parameter has same name as local variable name (TSQL)
User InterfaceUsabilityDBE-5557Hide MySQL Collations & Schemas

RubyMine 2017.3.3 EAP (build 173.4548.36) Release Notes

No subsystemBugRUBY-20635Add --force-exclusion param to the background linting
BugRUBY-20884RubyMine freezes when editing Ruby code
CucumberBugRUBY-20571RubyMine does find a Cucumber 3 step def defined with a $ and a cucumber expression.
Rails. Code InsightBugRUBY-20699Rails gutter for namespaced nested controllers are missing
RefactoringsBugRUBY-20738Hash variable inlining turns h['key'] into h('key')
Ruby. FormatterBugRUBY-19742wrong indent in rescue block when ensure block is present
ExceptionRUBY-20679java.lang.AssertionError: Block not found for 'List of expressions' on enter press
TestsBugRUBY-20718Cannot run RSpec tests
No subsystemBugIDEA-185359Focus jumps to parent folder after item rename
BugIDEA-182999find in path dialog is not initialized from text selections in find occurrences previews
BugIDEA-171404allow UI scale exceed 2x
ExceptionIDEA-184929NPE at java.lang.Class.forName0(Native Method)
ExceptionIDEA-184156NPE at com.intellij.openapi.wm.ToolWindowType.valueOf(ToolWindowType.java:18)
Code Analysis. InspectionUsabilityIDEA-184412"apply fixes" in HTML file triggers long-running modal process that is not interruptable
Diff_MergeBugIDEA-183823'Compare with clipboard' shortcut is not working in the commit dialog
DockerBugIDEA-158383Docker: unable to delete image with multiple tags
BugIDEA-182541Docker. DockerView: it is impossible to create containers from some temporary images due to the invalid image Id.
Find, Replace, Find UsagesUsabilityIDEA-144928remove results from Find tool window: Alt+Del conflicts with safe delete
CosmeticsIDEA-184726Misspelling in search and replace dialog box
IDE ConfigurationBugIDEA-183434syntax error at ide.sigint.ignored.url?
IndicesBugIDEA-123287Multiple "Updating indices" bg tasks after external file system changes
Project ConfigurationBugIDEA-176554Module rename isn't reflected in dependent module imls
Project ViewBugIDEA-180143Deleting empty package causes Project View to reset selection to the root
Run | Debug configurationBugIDEA-157989"Stop" button does not work when the IDE is launched as a background task
SQLBugIDEA-184057SQL autocomplete is upper case and prepends schema name
User InterfaceBugIDEA-158873Evaluate window: cannot TAB from expression into results tree
BugIDEA-183580New background image feature covers up background color of color schemes
BugIDEA-179312Project View Popup - Does Not Match Settings
BugIDEA-183953Windows: "Show in Explorer" does not work with cyrillic symbols
UsabilityIDEA-183950Create directory/file in project view should move selection to created item
Version ControlBugIDEA-183986Compare with Local works incorrectly in a folder history
BugIDEA-183691modification info not visible in commit dialog
DebuggerBugWEB-30438Unable to debug React Native iOS project - "Error running 'iOS': Can't start debugger" message
JavaScriptFeatureWEB-24395Flow: Type annotations need a different color
REST ClientFeatureWEB-28672Auto-format request results
No subsystemBugDBE-5703Invalid DDL is generated when a function with defaults is dropped in Postgres
DB ConnectivityBugDBE-5687NullPointerException connecting to a specific SQL Server database
DB ConsoleBugDBE-5696Dialog pops-up asking for parameters for Postgres query when no parameters are required
DB RefactoringBugDBE-2404Foreign keys: on delete set null missing in Oracle
Data ViewsBugDBE-2465FETCH ALL IN <cursor name> returns error <failed to load> org.postgresql.jdbc4.Jdbc4ResultSet
SQL CompletionBugDBE-938Column type completion shows table names on SQLServer
SQL EditingFeatureDBE-2232SQL: proper uncommenting for nested comments
BugDBE-1705Bad code is green: declare not at beginning of function
BugDBE-3849Folding breaks on last column in SELECT list
BugDBE-5404DataGrip does not recognize Redshift's WITH NO SCHEMA BINDING clause
BugDBE-3750SQL: Oracle: numeric literal and FROM without a space between is green
BugDBE-5464MySQL syntax for DROP USER commands does not recognize IF EXISTS clause correctly in Code Inspector
UsabilityDBE-2244SQL: typing quote does not insert pair quote with non empty string literal after typing position
UsabilityDBE-2245SQL: typing quote does not insert pair quote with more than one character prefix
SQL GenerationBugDBE-5575Foreign key constraint names are not unique on generation
BugDBE-4983newline in Oracle DB adds character 'n' to to DDL
SQL HighlightingFeatureDBE-5508Add support for method seperator in plsql packages
BugDBE-5636Exasol: support user-defined scalar functions (pl/SQL style) syntax
BugDBE-4356Syntax error: grant update on specific field
BugDBE-3521Error in code analysis when procedure parameter has same name as local variable name (TSQL)
User InterfaceUsabilityDBE-5557Hide MySQL Collations & Schemas

RubyMine 2017.3.2 (build 173.4301.17) Release Notes

InspectionsUsabilityRUBY-20688Rubocop is constantly report about errors and switch focus to the Message tool window
User InterfaceBugIDEA-149061Tool Window docking issue
DebuggerBugWEB-30325[CRITICAL] Can't debug Node.js with `--experimental-modules`
LintersBugWEB-29873ESLint module can't be found when installed in a subfolder
BugWEB-30497ESLint: errors from eslint-plugin-import are reported when they shouldn't
TypeScriptBugWEB-30484Cannot parse TypeScript generic async arrow function
PerformanceWEB-30474Typescript inspections hanging
Remote InterpretersBugPY-27732IDE freezes on close while connecting to an SSH host

RubyMine 2017.3.2 EAP (build 173.4301.4) Release Notes

No subsystemFeatureRUBY-19831Ability to Fold multiline containers in the editor
BugRUBY-20475RubyMine collapses project tree in Project Files view each time a command is run from terminal
BugRUBY-20635Add --force-exclusion param to the background linting
BugRUBY-20514An accident sdk is shown as if default sdk on the very first RM start
BugRUBY-20558RubyMine Gem Manager goes into an infinite loop
Code InsightFeatureRUBY-13950"Unresolved Ruby reference" inspection marks some of rspec methods
BugRUBY-20491Unexpected unknown keyword inspection
BugRUBY-20244"private def" methods with certain code don't appear in the structure window
DockerBugRUBY-20549TestUnit tests cannot be executed with Docker SDK
IDEBugRUBY-19937"No SDK selected" is shown in the Create New Project wizard
BugRUBY-20551Possible to click Create button on wizard when Rails gem is not selected
InspectionsUsabilityRUBY-20648RuboCop spection highlights a whole block/method if there is an issue
ParsingBugRUBY-20485Wrong error message on inspection when having block after Proc
Rails. Code InsightBugRUBY-20508Support parameter force: :cascade in create_table call
BugRUBY-20193go to declaration for activerecord callback symbols fails if the method is declared "private def"
Ruby. FormatterBugRUBY-19742wrong indent in rescue block when ensure block is present
ExceptionRUBY-20679java.lang.AssertionError: Block not found for 'List of expressions' on enter press
SlimBugRUBY-20306When commenting out slim file, space after slash is not added
No subsystemBugIDEA-183951No synchronization for IdeDocumentHistoryImpl.myChangedFilesInCurrentCommand
ExceptionIDEA-181904IAE at com.intellij.ide.util.treeView.AbstractTreeBuilder.sortChildren
ExceptionIDEA-183153NullPointerException: null
Code Analysis. InspectionBugIDEA-160008Found duplicated code inspection -- code is the same as a png???
Code Formatting and Code StyleBugIDEA-183665Continuation Indent for java files max value = 16
DebuggerBugIDEA-139797Default Theme doesn't allow to apply font size to evaluate expression console's input
BugIDEA-182581Edit breakpoint popup doesn't show with gutter icons disabled
CosmeticsIDEA-181693Strange label in evaluate dialog
DockerBugIDEA-183186Valid EXPOSE entry flagged as invalid in docker compose file
UsabilityIDEA-177938Docker: Enable Docker item in View | Tool Windows menu
UsabilityIDEA-182117Docker: DockeView, Image: create a new run configuration with the name "image_name:tag", not "sha.."
Editor. Editing TextBugIDEA-182852Editor antialiasing is not honored in inline diff
External ToolsPerformanceIDEA-183647External system perform IO in EDT during tool window initialization
Find, Replace, Find UsagesFeatureIDEA-72543I would like the ability to configure the max file size to 'Find in Path'.
UsabilityIDEA-175611Search Window: Usability Recursive Search
IDE ConfigurationBugIDEA-182553Lose custom color schemes after disable "IDE Settings Sync"
JavaScriptExceptionIDEA-183639NPE at com.intellij.lang.javascript.modules.LocalReferenceResolver.checkResolveResults
Plugin ManagementBugIDEA-183095error-prone-compiler Plugin not compatible with IDEA 2017.3.1 EAP
Project ConfigurationBugIDEA-175385RemoveInvalidElementsDialog: invalid module references cannot be removed from modules.xml
Project ViewBugIDEA-183205Unnecessary module grouping nodes are shown in Project View if some module names are substring for other module names
BugIDEA-181653"Autoscroll to sources" doesn't work in 181
UsabilityIDEA-183022Flatten modules option missing in Project Tool
ExceptionIDEA-183236PhpStorm 2017.3 doesn't load project tree
RegExpBugIDEA-96094Regex tester forces an exact match
BugIDEA-183559RegExp checker doesn't work for backslash
Run | Debug configurationBugIDEA-182966All run configurations lost after upgrade to 2017.3
TerminalBugIDEA-140061Should be possilbe to pause terminal output
User InterfaceBugIDEA-183241Strange behaviour of File Structure popup
BugIDEA-182710Cannot paste to Clion attach to process window
BugIDEA-183041Background image, displayed "plain", getting clipped after 2017.3 update
BugIDEA-149061Tool Window docking issue
User Interface. AccessibilityBugIDEA-182266[windows] do not override app icon
Version ControlBugIDEA-183003If a file is renamed and not committed, and another file is created with old name, deleting the renamed file deletes both files
BugIDEA-183047Author colum in File history is not sortable anymore
Version Control. LogBugIDEA-177754Too many processes indexing the git repo
BugIDEA-183420Infinite 'Searching for revision ...'
Version Control. SubversionBugIDEA-182963Merge from... do not show options dialog after selecting branch
No subsystemBugWEB-29717com.intellij.psi.stubs.PsiFileStubImpl cannot be cast to com.intellij.util.xml.stubs.ElementStub
CSSPerformanceWEB-30030CSS class completion in HTML files is slow
DebuggerFeatureWEB-30124Meteor debugging: provide possibility to configure inspect & inspect-brk params
BugWEB-29899Jest debugging: breakpoints in forked child process are not hit
BugWEB-30026not possible to debug NodeJS - exit code 130
BugWEB-30039Live edit enabling doesn't affect karma debugging
BugWEB-30006Can't run react-native app (packager isn't started)
BugWEB-30260Don't merge console.logs that output different objects
HTMLBugWEB-29458Spellchecker: Valid attribute values in html gets highlighted by dictionary JSX
BugWEB-29793Error. global.html file is missing when invoking documentation
BugWEB-26133Find usages and refactoring for variables with '$' in angular project is not working properly.
JavaScriptFeatureWEB-30027ES6: Copy-paste support. Add imports for referenced exported elements
BugWEB-29978Links in Flow server error messages navigate incorrectly
BugWEB-30209'Can't resolve file "' when using directory imports in current dir
BugWEB-29885Async generator methods cause syntax errors in Flow
BugWEB-30020Since Flow 0.60: The IDE fails to start a Flow server ("Timeout on starting language server process")
BugWEB-16273ES6: for..of loop triggers uninitialized variable inspection
BugWEB-29920Wrong highlighting of typeof
BugWEB-30082Wrong type mismatch errors when using overloaded functions in typings
BugWEB-30248JSDoc generic Object type assignment
BugWEB-28140Inner backticks are escaped when pasting string literal in template string
BugWEB-28395Empty 'flow executable' field
BugWEB-30123First parameter reported as unused if the second parameter is destructured
PerformanceWEB-30289JS Libraries: list of included @types packages is rebuilt every time for external files
JavaScript. FormatterBugWEB-30234JSX Fragments: indent child elements
BugWEB-30247Typescript code style ES6 import/export 'Chop down if long' behaves like 'wrap if long' in new build
BugWEB-30268Javascript code formatting breaks
JavaScript. FrameworksBugWEB-29969Emmet in JSX doesn't work if code is wrapped with brackets
BugWEB-29964Vue.js: self-closing tags are allowed for vue components, should not be marked by inspection
BugWEB-29962React 16.2 Fragment component support
BugWEB-29970React: use default import instead of namespace for "React"
BugWEB-30214Aliase from merged webpack config for vue project can't be resolved
BugWEB-22656React: don't report child context properties (childContextTypes, getChildContext()) as unused
BugWEB-30028Cannot download any DefinitelyTyped
BugWEB-29981Webpack: Resolve for file alias is broken
BugWEB-29966React-native: don't use `--no-packager' option with old react-native versions
BugWEB-29841React: IDE doesn't use "propTypes" if "@types/react" is installed
JavaScript. InspectionsBugWEB-29353"Unused parameter" inspection interferes with "Local varible '...' is redundant"
BugWEB-30236Missing import inspection for Jest symbols
JavaScript. RefactoringBugWEB-30142Invalid code generated when extracting superclass from static methods
BugWEB-30083TypeScript class won't refactor/rename
LintersFeatureWEB-29351support eslint(with tslint) quick fix feature on vue.file
BugWEB-29873ESLint module can't be found when installed in a subfolder
BugWEB-30100Linters: do not enable JSCS and JSHint when config files are placed inside the node_modules
BugWEB-28555ESLint: auto-fix does nothing if project name contains space
REST ClientFeatureWEB-28672Auto-format request results
FeatureWEB-29865Support authorization with Basic or Digest
SASSBugWEB-30267SASS: sass functions shouldn't be shown on the top of completion list, above CSS property values
TypeScriptFeatureWEB-30110TypeScript service: if project contains only one root tsconfig.json use the config options for all files from the project
BugWEB-29582Higher-order type relationships for mapped and indexed types are not supported, leads to incorrect inference in React's setState
BugWEB-27899Rename should work with shorthand object property implementing TS interface
BugWEB-29980TypeScript unrecognised signature
BugWEB-30130Variable is marked as unused when using for loop
BugWEB-19903TypeScript issue: general JavaScript inspection "Mismatched query and update of collection" is fired incorrectly
BugWEB-30095Move File Refactoring not recognized by TypeScript panel
BugWEB-30077Typescript: support tsconfig.json "include" pattern with implicit file patterns
BugWEB-29959For..of loop, index Variable might not have been initialised
BugWEB-28851Rename class members issue
BugWEB-30014Unusued parameter in constructor action removes all parameters from constructor
BugWEB-29993Types and type inference somehow broken in 2017.3
Unit TestsBugWEB-30377wrong test pattern when running single Jest test, 'no tests found'
BugWEB-30069Jest: result processing throws Exception
BugWEB-30087Jest: unable to run single symlinked test file
No subsystemBugDBE-5185"ApplicationName" from PostgreSQL driver advanced setting is overwritten
BugDBE-5520SQL: PostgreSQL dialect does not support CREATE TEMP VIEW
BugDBE-5359Read-only database connection does not prevent schema changes
DB ConnectivityBugDBE-5563Unable to create Jdbc connection to a local Apache Ignite server using Ignite thin jdbc driver
BugDBE-5547Datagrip doesn't understand ~ in path to ssh key
DB IntrospectionBugDBE-5608Amazon Redshift data sources - unable to synchronize after upgrade to 2017.3.2
BugDBE-4426Cant access SQL server FrontBase anymore
ExceptionDBE-4931java.lang.NullPointerException when retireving schema information from AS400
DDL & PL EditingBugDBE-5577Sql/Plpgsql (PostgreSql) Syntax highlighting and code helping broken
BugDBE-5318Generate DDL To Console Places ENDGo at end
Data ViewsBugDBE-5623Deletion from table editor does not work properly
BugDBE-5512Sql Server - "Save LOB..." error
BugDBE-5474Quick documentation: Rows: ~0 click to count(*) not consistently working
BugDBE-5546DATETIME not being modified correctly
BugDBE-5555Database: Underscores and percents are mistakenly escaped with # in multi-column updates
IDE GeneralFeatureDBE-5322Allow setting default schemas for databases
SQL EditingFeatureDBE-3708Oracle SQL: file reference
BugDBE-4027Editor does not highlight error when using indices with multiple columns
SQL GenerationBugDBE-5274When clause of Trigger doesnt show
SQL HighlightingBugDBE-3864NOWAIT keyword for Oracle
BugDBE-4424Support (NO) MINVALUE, (NO) MAXVALUE, (NO) CYCLE, NO CACHE syntax in sequences
BugDBE-5495Oracle SQL Plus parsing: False positives in GRANT Statement
BugDBE-5484Exasol: support GEOMETRY syntax
SQL ResolveBugDBE-3707SQL: Oracle: column names in PIVOT/UNPIVOT clauses are not resolved
BugDBE-5485DataGrip does not know Azure SQL / SQL Server's string_agg function
User InterfaceCosmeticsDBE-5466Anchoring issue with the 'User parameters' table in the settings
Xcode IntegrationFeatureOC-13193AppCode should use the same derived directory as Xcode
PHP LangBugWI-38965Structure view is always collapsed

RubyMine 2017.3.1 (build 173.3942.35) Release Notes 

No subsystemFeatureRUBY-19831Ability to Fold multiline containers in the editor
BugRUBY-20502Module/Override/Super indicators are not shown
BugRUBY-20514An accident sdk is shown as if default sdk on the very first RM start
BugRUBY-20558RubyMine Gem Manager goes into an infinite loop
Code InsightFeatureRUBY-13950"Unresolved Ruby reference" inspection marks some of rspec methods
BugRUBY-20491Unexpected unknown keyword inspection
BugRUBY-20244"private def" methods with certain code don't appear in the structure window
DockerBugRUBY-20549TestUnit tests cannot be executed with Docker SDK
IDEBugRUBY-19937"No SDK selected" is shown in the Create New Project wizard
BugRUBY-20616Missing "rails views" gutter icon
BugRUBY-20551Possible to click Create button on wizard when Rails gem is not selected
InspectionsBugRUBY-17403Incorrect 'undeclared field' inspection.
BugRUBY-20607"duplicate argument name" error should allow for multiple underscores
UsabilityRUBY-20524Rename the RuboCop button in Run inspection by name
MarkdownBugRUBY-20520Cannot resolve file inspection on http links with slash on the end
BugRUBY-19897Duplicated JavaFX markdown preview panels
ParsingBugRUBY-20485Wrong error message on inspection when having block after Proc
PuppetBugRUBY-20035Search Everywhere doesn't show Puppet classes
RailsBugRUBY-20498Navigation from form_tag inside shared views to controller and action
Rails. Code InsightFeatureRUBY-20404Controllers that are in non-namespace sub-folders
BugRUBY-20489Rails: cannot resolve DB fields
BugRUBY-20508Support parameter force: :cascade in create_table call
BugRUBY-20193go to declaration for activerecord callback symbols fails if the method is declared "private def"
SlimBugRUBY-20306When commenting out slim file, space after slash is not added
No subsystemBugIDEA-182633External system: do not propose to restore removed modules created for the project preview
PerformanceIDEA-182579High memory usage by VfsAwareMapReduceIndex
ExceptionIDEA-182280CCE at com.intellij.execution.testframework.sm.runner.SMTRunnerTreeStructure.getParentElement
Code Analysis. InspectionBugIDEA-180733Element: class com.intellij.psi.impl.source.PsiJavaFileImpl because: different providers:
Code NavigationBugIDEA-179522Navigation bar ignores context when operated with keyboard
DebuggerCosmeticsIDEA-180517Expanded members of a variable are shown quite far away from the pointer
CosmeticsIDEA-181693Strange label in evaluate dialog
Diff_MergeBugIDEA-182059Diff Window file order is different from the file order in Local Changes tool window (path is ignored)
Editor. Code CompletionBugIDEA-182597xml icon is not replaced with plugin icon in second completion
Editor. Editing TextBugIDEA-180934When setting the Live Template context to "Other", it's changed to "Everything"
BugIDEA-181964When using variable-width font, {@code} block in javadoc are not distinguished
Find, Replace, Find UsagesFeatureIDEA-72543I would like the ability to configure the max file size to 'Find in Path'.
IDE ConfigurationBugIDEA-180378Cannot set proxy settings
IndicesBugIDEA-182066Old value is left in stub index when file becomes large
BugIDEA-182716Indexing sometimes stops progressing
BugIDEA-182151Deadlock processing stub indices called from StubIndexImpl.processAllKeys
Packaging and InstallationBugIDEA-162504The windows executable is missing the build number in file details
BugIDEA-159117Silent Install Switch Doesn't Work
BugIDEA-117135Silent installer doesn't write to HKEY_LOCAL_MACHINE\SOFTWARE\Wow6432Node\Microsoft\Windows\CurrentVersion\Uninstall
BugIDEA-154213Win10 Installer issue, obsolete shortcuts left under programs list
BugIDEA-157045Support silent installation for local system user
BugIDEA-144263PyCharm Educational Edition silent installation
BugIDEA-160684Intellij IDEA Setup Windows EXE does not allow idea64.exe to be configured (on 64bit platforms)
BugIDEA-146215SILENT Install should use admin parameters
BugIDEA-171703PyCharm Silent install (/S) creates neither start menu nor uninstall entries
BugIDEA-169935Silent install (/S) on Windows always installs as current user only
TaskIDEA-156081Create icon for running idea on 64-bit JVM from start menu on windows 8/10
Platform APIExceptionIDEA-182134Open/close project with multiple projects causes exception
Plugin ManagementBugIDEA-183095error-prone-compiler Plugin not compatible with IDEA 2017.3.1 EAP
Project ConfigurationBugIDEA-182178Copyright settings are not stored
BugIDEA-181631Settings | Appearance & Behavior | System Settings | HTTP Proxy: entered proxy authentication | login name is not applied
BugIDEA-182200Deleting unloaded module should not delete directory
Project ViewBugIDEA-181653"Autoscroll to sources" doesn't work in 181
ExceptionIDEA-183236PhpStorm 2017.3 doesn't load project tree
User InterfaceBugIDEA-95435No "exclamation sign" on the welcome screen
BugIDEA-183041Background image, displayed "plain", getting clipped after 2017.3 update
BugIDEA-182339"Show in explorer" doesn't work if invoked on file with "=" character in name
BugIDEA-182423ShowInExplorer doesn't work for files that contain double blank space symbols
UsabilityIDEA-181836settings plugin list divider issue
Version Control. GitBugIDEA-182042Rewording latest commit adds staged files to the commit, if Git < 1.7.11.3 is used
BugIDEA-123397Git: History for file doesn't show anything before the move if there were too many changes in the commit that moved the file
BugIDEA-181724Unclear (wrong?) "Error updating changes: fatal: Not a git repository (or any of the parent directories)"
BugIDEA-182022Git interactive rebase dialog is broken for Git < 1.8.0
No subsystemBugWEB-29768Console output doesn't change colors when the theme is changed
BugWEB-12393bower: installing new version of package doesn't work
CSSPerformanceWEB-30030CSS class completion in HTML files is slow
JavaScriptFeatureWEB-29163Surround selection with template string argument on typing '$'
BugWEB-24541Javascript: Flow output much more limited than intended
BugWEB-29657Support for flow predicate functions - %checks
BugWEB-29894Extend selection broken in Vuejs files in 2017.3
BugWEB-29782@var missed in jsDoc suggestions
BugWEB-30020Since Flow 0.60: The IDE fails to start a Flow server ("Timeout on starting language server process")
UsabilityWEB-28669Webstorm runs and kills flow server, instead of letting flow manage the server
JavaScript. FormatterBugWEB-29860Trailing comma not added when using spread syntax for multi-line objects using TypeScript
JavaScript. FrameworksFeatureWEB-29325Configuration for JSX attribute auto-completion
BugWEB-29969Emmet in JSX doesn't work if code is wrapped with brackets
BugWEB-29962React 16.2 Fragment component support
BugWEB-29659Vue.js plugin does not support "props" in custom components
BugWEB-29841React: IDE doesn't use "propTypes" if "@types/react" is installed
BugWEB-28082Vue.js: Optimize imports have no effect
JavaScript. RefactoringBugWEB-29721When I change signature of a method, it only refactors the callers with the exact same number of arguments
REST ClientFeatureWEB-29271Support space around variable name
FeatureWEB-29635Support variables in Authorization
BugWEB-29463'"W:" is not a valid file name' error in REST client
TypeScriptFeatureWEB-19750Add syntax highlighting for TypeScript decorators
FeatureWEB-29769Check JavaScript files with TypeScript service when using // @ts-check
BugWEB-29871ES6: improve typescript /es6 optimize imports
BugWEB-29776TypeScript: proper support allowSyntheticDefaultImports
BugWEB-29290Typescript: No property completion in generator block
BugWEB-29786Custom JSX factory is not recognized (JavaScript/TypeScript)
BugWEB-29639TypeScript: Rename property does rename the corresponding field incorrectly
BugWEB-29733JavaScript/TypeScript: incomplete import is parsed unexpectedly
BugWEB-29840Vue: script tag with "lang="ts"" uses javascript code style settings
BugWEB-29729TypeScript: not null expression must remove nullable and undefined types
BugWEB-29993Types and type inference somehow broken in 2017.3
BugWEB-19816Incorrect "method can be static" hint on a TS class using generics
UsabilityWEB-29647Improve completion presentation for smart items after new
DB ConsoleCosmeticsDBE-5429strange dividers issue
DB IntrospectionExceptionDBE-4931java.lang.NullPointerException when retireving schema information from AS400
DB RefactoringBugDBE-3487Oracle: Context menu action Rename over cluster index do nothing
BugDBE-3587renaming Irrelevant items when renaming a column name
Data Import & ExportBugDBE-5426Error trying to Import Data From File
Data ViewsBugDBE-5246Snowflake DS - table view tries to select "ctid" column
IDE GeneralFeatureDBE-5322Allow setting default schemas for databases
BugDBE-5416uninstalling DG on Windows 7 leaves behind 16 bogus Registry entries (invalid firewall rules)
BugDBE-2723Installer "uninstall" doesn't remove windows uninstall entry
SQL CompletionFeatureDBE-2562Expand wildcards
BugDBE-2711"russian" completion does not work properly
SQL EditingFeatureDBE-3818Consider supporting SQLite dot-commands
FeatureDBE-3708Oracle SQL: file reference
BugDBE-3817SQL: Sybase: good code is red: plan " ... " in weird places
BugDBE-3766MySQL: table alias with column aliases is green
BugDBE-3814SQL: Sybase: good code red: "save tran sometransaction"
BugDBE-5375SQL editor does not recognize block labels in PL/pgSQL code.
BugDBE-2587MySQL: User-defined variable reference resolves to a column
BugDBE-4027Editor does not highlight error when using indices with multiple columns
BugDBE-5438Exception in plugin Database Tools and SQL: null: java.lang.UnsupportedOperationException
SQL HighlightingBugDBE-2546MSSQL: Calling stored procedure problem
BugDBE-3310Oracle: syntax error for SELECT INTO variable statement
BugDBE-3886The Package Editor doesn't know about some Oracle pl\sql syntax elements
BugDBE-3963'Ambiguous reference' doesn't work for simple query
BugDBE-5298DataGrip does not recognize SQL commands that has to do with RESTORE on SQL Server
BugDBE-3977Postgres function body highlighted as string when indexing
BugDBE-2757MySQL syntax error correction incorrect for ALTER TABLE <mytable> ORDER BY <myvar> DESC;
BugDBE-3864NOWAIT keyword for Oracle
BugDBE-3431Derby: support aggregate syntax
BugDBE-3432Derby: support syntax for function/procedure with varargs
BugDBE-3943DB2: support hash in column alias syntax
BugDBE-4424Support (NO) MINVALUE, (NO) MAXVALUE, (NO) CYCLE, NO CACHE syntax in sequences
BugDBE-2731SQL Console for MySQL does not Recognize Syntax
BugDBE-2781"new" is not recognized as a valid alias (Sybase)
BugDBE-5423Support Redshift EXTERNAL TABLE syntax
BugDBE-2010TODO/FIXME comments not recognized in PostgreSQL functions
SQL ResolveBugDBE-3776Oralce: qualified resolve for function arguments
BugDBE-5418Wrong package functions resolve in Oracle
BugDBE-3707SQL: Oracle: column names in PIVOT/UNPIVOT clauses are not resolved
User InterfaceCosmeticsDBE-5466Anchoring issue with the 'User parameters' table in the settings
IDEBugPY-26967Launcher icon still launches older version after snap refresh
Remote InterpretersBugPY-27204Algorithm negotiation fail after upgrading PyCharm to 2017.3
BugPY-27136PyCharm parses incorrectly with HostKeyAlgorithms ssh config
BugPY-27165Extra slash in remote path
BugPY-27184"none" value of ProxyCommand incorrectly treated as a command
PHP LangBugWI-38965Structure view is always collapsed
Plugin: Deployment _ FTP..FeatureWI-39034Deployment: Exclude node_modules, *.pyc and *.hprof files by default
UsabilityWI-39043"No authentication data provided. Set it up here" link missing
RunningBugCPP-11064Can't create run/debug configuration for custom configuration for all targets if some targets are not available under this custom configuration

RubyMine 2017.3.1 RC (build 173.3942.35) Release Notes 

IDEBugRUBY-20616Missing "rails views" gutter icon
InspectionsBugRUBY-20607"duplicate argument name" error should allow for multiple underscores
UsabilityRUBY-20524Rename the RuboCop button in Run inspection by name
PuppetBugRUBY-20035Search Everywhere doesn't show Puppet classes
RailsBugRUBY-20498Navigation from form_tag inside shared views to controller and action
Rails. Code InsightBugRUBY-20489Rails: cannot resolve DB fields
HTMLBugWEB-29522'Extend selection issue' doesn't select tag if started from CSS
JavaScriptBugWEB-29894Extend selection broken in Vuejs files in 2017.3
Remote InterpretersBugPY-27184"none" value of ProxyCommand incorrectly treated as a command
BugPY-27136PyCharm parses incorrectly with HostKeyAlgorithms ssh config
BugPY-27204Algorithm negotiation fail after upgrading PyCharm to 2017.3
BugPY-27165Extra slash in remote path
PS SpecificTaskWI-36823Make notifications to use actions instead of hyperlinks
Plugin: Deployment _ FTP..FeatureWI-39034Deployment: Exclude node_modules, *.pyc and *.hprof files by default
UsabilityWI-39043"No authentication data provided. Set it up here" link missing

RubyMine 2017.3.1 EAP (build 173.3942.16) Release Notes 

No subsystemFeatureRUBY-19831Ability to Fold multiline containers in the editor
BugRUBY-20442"Create new RVM gemset" dialog fields are too short
BugRUBY-20514An accident sdk is shown as if default sdk on the very first RM start
BugRUBY-20502Module/Override/Super indicators are not shown
Code InsightFeatureRUBY-13950"Unresolved Ruby reference" inspection marks some of rspec methods
BugRUBY-20464Argument for @NotNull parameter 'element' of com/intellij/psi/PsiElementResolveResult.<init> must not be null
BugRUBY-20491Unexpected unknown keyword inspection
DebuggerBugRUBY-20300Interactive console hangs
BugRUBY-20313Debugger doesn't work with Ruby 1.8.7
DockerBugRUBY-20549TestUnit tests cannot be executed with Docker SDK
IDEBugRUBY-19937"No SDK selected" is shown in the Create New Project wizard
BugRUBY-20289.iml files are added to project subfolders with Gemfile
BugRUBY-20241Multi-user RVM SDKs are not detected on Ubuntu
BugRUBY-20551Possible to click Create button on wizard when Rails gem is not selected
InspectionsBugRUBY-20329Wrong management of 'new' method
BugRUBY-17403Incorrect 'undeclared field' inspection.
BugRUBY-20217Running RuboCop on all project always shows no suspicion code
MarkdownBugRUBY-19897Duplicated JavaFX markdown preview panels
BugRUBY-20520Cannot resolve file inspection on http links with slash on the end
UsabilityRUBY-20295Improve markdown structure view visuals
ParsingBugRUBY-20485Wrong error message on inspection when having block after Proc
TaskRUBY-20312Tune Ruby blocks parsing to new ruby 2.5 scheme in HAML and Slim
Rails. Code InsightFeatureRUBY-20404Controllers that are in non-namespace sub-folders
BugRUBY-20508Support parameter force: :cascade in create_table call
RefactoringsBugRUBY-20285Refactor inline does not address methods called without parenthesis
Ruby Version ManagersTaskRUBY-20278Fix production-testOnly conflict on fake JDK creation
SlimBugRUBY-20403Slim parse freezes when unclosed string literal
BugRUBY-20306When commenting out slim file, space after slash is not added
No subsystemBugIDEA-182140Last Idea eap spontaneously crash
BugIDEA-182318VFS Exceptions after switch branches.
BugIDEA-182633External system: do not propose to restore removed modules created for the project preview
PerformanceIDEA-182579High memory usage by VfsAwareMapReduceIndex
ExceptionIDEA-182280CCE at com.intellij.execution.testframework.sm.runner.SMTRunnerTreeStructure.getParentElement
Code Analysis. InspectionBugIDEA-180733Element: class com.intellij.psi.impl.source.PsiJavaFileImpl because: different providers:
Code NavigationBugIDEA-179522Navigation bar ignores context when operated with keyboard
DebuggerBugIDEA-180561VirtualMachineProxy classesByName and allClasses may be outdated
CosmeticsIDEA-180517Expanded members of a variable are shown quite far away from the pointer
CosmeticsIDEA-181693Strange label in evaluate dialog
Diff_MergeBugIDEA-182059Diff Window file order is different from the file order in Local Changes tool window (path is ignored)
Editor. Code CompletionBugIDEA-182597xml icon is not replaced with plugin icon in second completion
Editor. Editing TextBugIDEA-180934When setting the Live Template context to "Other", it's changed to "Everything"
BugIDEA-181964When using variable-width font, {@code} block in javadoc are not distinguished
BugIDEA-179753"Undo" action can be invoked from "Undo" confirmation dialog
Find, Replace, Find UsagesFeatureIDEA-72543I would like the ability to configure the max file size to 'Find in Path'.
BugIDEA-182289'Replace All' dialog interprets find/replace contents as HTML
UsabilityIDEA-182181Replace in Path: Replace All dialog: unable to switch between OK and Cancel from keybord
IDE ConfigurationBugIDEA-180378Cannot set proxy settings
IndicesBugIDEA-182151Deadlock processing stub indices called from StubIndexImpl.processAllKeys
BugIDEA-182716Indexing sometimes stops progressing
Packaging and InstallationBugIDEA-162504The windows executable is missing the build number in file details
BugIDEA-117135Silent installer doesn't write to HKEY_LOCAL_MACHINE\SOFTWARE\Wow6432Node\Microsoft\Windows\CurrentVersion\Uninstall
BugIDEA-159117Silent Install Switch Doesn't Work
BugIDEA-154213Win10 Installer issue, obsolete shortcuts left under programs list
BugIDEA-157045Support silent installation for local system user
BugIDEA-144263PyCharm Educational Edition silent installation
BugIDEA-160684Intellij IDEA Setup Windows EXE does not allow idea64.exe to be configured (on 64bit platforms)
BugIDEA-146215SILENT Install should use admin parameters
BugIDEA-171703PyCharm Silent install (/S) creates neither start menu nor uninstall entries
BugIDEA-169935Silent install (/S) on Windows always installs as current user only
TaskIDEA-156081Create icon for running idea on 64-bit JVM from start menu on windows 8/10
Platform APIExceptionIDEA-182134Open/close project with multiple projects causes exception
Plugin DevelopmentFeatureIDEA-181981Provide annotation to mark dynamically loaded classes
Plugin ManagementBugIDEA-183095error-prone-compiler Plugin not compatible with IDEA 2017.3.1 EAP
Project ConfigurationBugIDEA-182178Copyright settings are not stored
BugIDEA-181631Settings | Appearance & Behavior | System Settings | HTTP Proxy: entered proxy authentication | login name is not applied
BugIDEA-182200Deleting unloaded module should not delete directory
Project ViewBugIDEA-181653"Autoscroll to sources" doesn't work in 181
ExceptionIDEA-183236PhpStorm 2017.3 doesn't load project tree
User InterfaceBugIDEA-95435No "exclamation sign" on the welcome screen
BugIDEA-183041Background image, displayed "plain", getting clipped after 2017.3 update
BugIDEA-182339"Show in explorer" doesn't work if invoked on file with "=" character in name
BugIDEA-182423ShowInExplorer doesn't work for files that contain double blank space symbols
BugIDEA-149061Tool Window docking issue
UsabilityIDEA-181836settings plugin list divider issue
Version ControlUsabilityIDEA-179175Unclear 'Branch context has been loaded' message
Version Control. GitBugIDEA-182042Rewording latest commit adds staged files to the commit, if Git < 1.7.11.3 is used
BugIDEA-123397Git: History for file doesn't show anything before the move if there were too many changes in the commit that moved the file
BugIDEA-181724Unclear (wrong?) "Error updating changes: fatal: Not a git repository (or any of the parent directories)"
BugIDEA-182022Git interactive rebase dialog is broken for Git < 1.8.0
No subsystemBugWEB-29768Console output doesn't change colors when the theme is changed
BugWEB-12393bower: installing new version of package doesn't work
BugWEB-29717com.intellij.psi.stubs.PsiFileStubImpl cannot be cast to com.intellij.util.xml.stubs.ElementStub
CSSPerformanceWEB-30030CSS class completion in HTML files is slow
DartBugWEB-29779Debugging in Dartium doesn't work in 2017.3 EAPs
JavaScriptFeatureWEB-29163Surround selection with template string argument on typing '$'
BugWEB-24541Javascript: Flow output much more limited than intended
BugWEB-29657Support for flow predicate functions - %checks
BugWEB-29782@var missed in jsDoc suggestions
BugWEB-30020Since Flow 0.60: The IDE fails to start a Flow server ("Timeout on starting language server process")
UsabilityWEB-28669Webstorm runs and kills flow server, instead of letting flow manage the server
JavaScript. FormatterBugWEB-29860Trailing comma not added when using spread syntax for multi-line objects using TypeScript
JavaScript. FrameworksFeatureWEB-29325Configuration for JSX attribute auto-completion
BugWEB-29969Emmet in JSX doesn't work if code is wrapped with brackets
BugWEB-29962React 16.2 Fragment component support
BugWEB-29659Vue.js plugin does not support "props" in custom components
BugWEB-29841React: IDE doesn't use "propTypes" if "@types/react" is installed
BugWEB-28082Vue.js: Optimize imports have no effect
JavaScript. RefactoringBugWEB-29721When I change signature of a method, it only refactors the callers with the exact same number of arguments
REST ClientFeatureWEB-29271Support space around variable name
FeatureWEB-29635Support variables in Authorization
BugWEB-29463'"W:" is not a valid file name' error in REST client
TypeScriptFeatureWEB-19750Add syntax highlighting for TypeScript decorators
FeatureWEB-29769Check JavaScript files with TypeScript service when using // @ts-check
BugWEB-29871ES6: improve typescript /es6 optimize imports
BugWEB-29776TypeScript: proper support allowSyntheticDefaultImports
BugWEB-29290Typescript: No property completion in generator block
BugWEB-29595Error when extracting an interface
BugWEB-29786Custom JSX factory is not recognized (JavaScript/TypeScript)
BugWEB-29733JavaScript/TypeScript: incomplete import is parsed unexpectedly
BugWEB-29840Vue: script tag with "lang="ts"" uses javascript code style settings
BugWEB-29683TypeScript quickfix "Variable initializer is redundant" results in invalid code.
BugWEB-29729TypeScript: not null expression must remove nullable and undefined types
BugWEB-29993Types and type inference somehow broken in 2017.3
BugWEB-19816Incorrect "method can be static" hint on a TS class using generics
BugWEB-29639TypeScript: Rename property does rename the corresponding field incorrectly
UsabilityWEB-29647Improve completion presentation for smart items after new
DB ConsoleCosmeticsDBE-5429strange dividers issue
DB IntrospectionExceptionDBE-4931java.lang.NullPointerException when retireving schema information from AS400
DB RefactoringBugDBE-3487Oracle: Context menu action Rename over cluster index do nothing
BugDBE-3587renaming Irrelevant items when renaming a column name
Data Import & ExportBugDBE-5426Error trying to Import Data From File
Data ViewsBugDBE-5246Snowflake DS - table view tries to select "ctid" column
IDE GeneralFeatureDBE-5322Allow setting default schemas for databases
BugDBE-5416uninstalling DG on Windows 7 leaves behind 16 bogus Registry entries (invalid firewall rules)
BugDBE-2723Installer "uninstall" doesn't remove windows uninstall entry
SQL CompletionFeatureDBE-2562Expand wildcards
BugDBE-2711"russian" completion does not work properly
SQL EditingFeatureDBE-3818Consider supporting SQLite dot-commands
FeatureDBE-3708Oracle SQL: file reference
BugDBE-3817SQL: Sybase: good code is red: plan " ... " in weird places
BugDBE-3766MySQL: table alias with column aliases is green
BugDBE-3814SQL: Sybase: good code red: "save tran sometransaction"
BugDBE-5375SQL editor does not recognize block labels in PL/pgSQL code.
BugDBE-2587MySQL: User-defined variable reference resolves to a column
BugDBE-4027Editor does not highlight error when using indices with multiple columns
BugDBE-5438Exception in plugin Database Tools and SQL: null: java.lang.UnsupportedOperationException
SQL HighlightingBugDBE-5423Support Redshift EXTERNAL TABLE syntax
BugDBE-2781"new" is not recognized as a valid alias (Sybase)
BugDBE-2546MSSQL: Calling stored procedure problem
BugDBE-3310Oracle: syntax error for SELECT INTO variable statement
BugDBE-3886The Package Editor doesn't know about some Oracle pl\sql syntax elements
BugDBE-3963'Ambiguous reference' doesn't work for simple query
BugDBE-5298DataGrip does not recognize SQL commands that has to do with RESTORE on SQL Server
BugDBE-3977Postgres function body highlighted as string when indexing
BugDBE-2757MySQL syntax error correction incorrect for ALTER TABLE <mytable> ORDER BY <myvar> DESC;
BugDBE-3864NOWAIT keyword for Oracle
BugDBE-3431Derby: support aggregate syntax
BugDBE-3432Derby: support syntax for function/procedure with varargs
BugDBE-3943DB2: support hash in column alias syntax
BugDBE-4424Support (NO) MINVALUE, (NO) MAXVALUE, (NO) CYCLE, NO CACHE syntax in sequences
BugDBE-2731SQL Console for MySQL does not Recognize Syntax
BugDBE-2010TODO/FIXME comments not recognized in PostgreSQL functions
SQL ResolveBugDBE-3776Oralce: qualified resolve for function arguments
BugDBE-5418Wrong package functions resolve in Oracle
BugDBE-3707SQL: Oracle: column names in PIVOT/UNPIVOT clauses are not resolved
User InterfaceCosmeticsDBE-5466Anchoring issue with the 'User parameters' table in the settings
No subsystemBugPY-27030Support substitutions in IdentityFile in OpenSSH config
Remote InterpretersBugPY-27046SFTP deployment doesn't work if OpenSSH config is used
BugPY-25525debugger has trouble with space in path
BugPY-26981ssh config file doesn't work on Windows
PHP LangBugWI-38965Structure view is always collapsed
RunningBugCPP-11064Can't create run/debug configuration for custom configuration for all targets if some targets are not available under this custom configuration

RubyMine 2017.3 (build 173.3727.132) Release Notes

No subsystemFeatureRUBY-20262Tune parser to support ruby 2.5
BugRUBY-20450Incorrect keyword arguments inspection
BugRUBY-20273Ruby class diagram: fields are shown in random order
BugRUBY-20442"Create new RVM gemset" dialog fields are too short
BugRUBY-18828Duplicated argument name
TaskRUBY-20260Add Ruby25 Language Level
TaskRUBY-20265Generate stdlib stubs for Ruby 2.5
TaskRUBY-20334Implement Fall Creators Update Support
Code InsightBugRUBY-20464Argument for @NotNull parameter 'element' of com/intellij/psi/PsiElementResolveResult.<init> must not be null
BugRUBY-18255Jump to other same name class.
DebuggerBugRUBY-20313Debugger doesn't work with Ruby 1.8.7
BugRUBY-20300Interactive console hangs
CosmeticsRUBY-20221Limit options are not disabled if trace 'to_s' option is unchecked
TaskRUBY-20281`cfp` ~~> `ec->cfp` if ruby_version == 2.5.0
DockerBugRUBY-20256Docker-Compose - Unsupported docker compose configuration version: 3
BugRUBY-20242Can't see IRB and Rails console in the Rails project with Docker SDK
HAMLBugRUBY-20183HAML: invalid syntax error (expected argument name) when attribute name starts with a colon
IDEBugRUBY-20340Missed "Indent when case" option
BugRUBY-20250Rails submodule is not recognised as Rails
BugRUBY-20254Gems bundled with bundler path are not available
BugRUBY-19654elements of the %i symbol arrays are excluded from search results as string literals
BugRUBY-20456New Ruby projects action contains modules instead of projects
BugRUBY-20241Multi-user RVM SDKs are not detected on Ubuntu
BugRUBY-20289.iml files are added to project subfolders with Gemfile
UsabilityRUBY-20248SDK for the auto-detected modules is set randomly
UsabilityRUBY-20246Cannot remove auto-detected module
UsabilityRUBY-20332Enable module auto-creation on explicit user request
ExceptionRUBY-20249Closing Ruby project with modules may throw exception
InspectionsBugRUBY-20217Running RuboCop on all project always shows no suspicion code
BugRUBY-20329Wrong management of 'new' method
BugRUBY-20245invalid "found extra arguments" error when passing a hash or a hash splat to a method taking named params
BugRUBY-18816Ruby require keyword arg inspection
BugRUBY-20286RuboCop Error
UsabilityRUBY-20400Add RuboCop: prefix to annotation texts from RuboCop
MarkdownUsabilityRUBY-20295Improve markdown structure view visuals
ParsingFeatureRUBY-20344Prohibit passing block to yield expression
BugRUBY-20320Parser doesn't recognize backticks in heredocs
BugRUBY-19635Wrongly highlighted redundant character escape in regexp
TaskRUBY-20312Tune Ruby blocks parsing to new ruby 2.5 scheme in HAML and Slim
RailsBugRUBY-17686Wrong inspection message in has_and_belongs_to_many relation
RefactoringsBugRUBY-18477Rename refactoring for class doesn't rename corresponding Rspec file
BugRUBY-20285Refactor inline does not address methods called without parenthesis
Remote InterpretersBugRUBY-20392Automatic upload failed: could not connect to SFTP server at "sftp://127.0.0.1/".
CosmeticsRUBY-20222Slashes for remote SDK are inconsistent in the user interface
Ruby Version ManagersTaskRUBY-20278Fix production-testOnly conflict on fake JDK creation
Ruby. FormatterBugRUBY-20076when typing, multiline args in a method call with parens are not aligned
BugRUBY-20371wrong indent in blocks when typing (with indent relative to expression start)
BugRUBY-20198wrong indent inside "private def method_name" when typing (indent relative to expression start is on)
BugRUBY-20390Too much indentation in RSpec with setting 'Use indents relative to expression start'
RubyGemsFeatureRUBY-20093gems.rb support
BugRUBY-20215Install Bundler is shown for plain ruby app even Bundler is installed
TaskRUBY-20264Make sure bundler-related stuff works with Ruby 2.5
SlimBugRUBY-20403Slim parse freezes when unclosed string literal
TestsBugRUBY-20227Can't run rspec describe if it named with non-ascii symbols
No subsystemFeatureIDEA-116686Limit code analysis to user-configurable number of CPU cores to prevent 100% of all cores utilization
BugIDEA-180312Deadlock ? JarHandler
BugIDEA-182140Last Idea eap spontaneously crash
BugIDEA-182318VFS Exceptions after switch branches.
BugIDEA-181581SSH logs are incomplete
BugIDEA-181314Exception appears when copy default run/configurations
BugIDEA-180450Indent provider behaves unexpectedly
BugIDEA-182065Redundant "The project used an invalid path to Node.js" warning for my java project
BugIDEA-180961Navigate | File - Camel Case no longer works
BugIDEA-180414Extra log verbosity upon exception in PersistentBTreeEnumerator.enumerate
BugIDEA-180884Run Dashboard: on clicking in the run configurations tree the corresponding pane doesn't get focus
UsabilityIDEA-161094Option to disable "search everywhere"
UsabilityIDEA-180386Verbose logging from BrowserStarted makes the logs useless
Code Analysis. DuplicatesBugIDEA-180864Extracting method from duplicates creates uncompilable code due incorrect param names
BugIDEA-180092Red code after extracting with duplicates, for method with identical values of parameters
Code Formatting and Code StyleFeatureIDEA-164602format.sh script should also accept .idea/codeStyleSettings.xml
BugIDEA-179073JavaLikeIndentProvider indent miss
Code NavigationBugIDEA-181135Go to File: with "Include non-project files" = No out-of-project files are still suggested
BugIDEA-180339find file no longer supports forward slash separators in windows REGRESSION
BugIDEA-180742Gutter 'Implemented methods' doesn't detect several lambda implementations
BugIDEA-180495Navigate to 'Implementation(s)' is unable to find all implementations
DebuggerBugIDEA-180838Weird order of breakpoints in "Disabled until selected breakpoint is hit"
Diff_MergeBugIDEA-172735Navigation from File structure pop-up does not work inside Diff panel
BugIDEA-180904F7 in commit dialog behaves wonkily in latest update
UsabilityIDEA-171250New Auto Resolving conflicts must not automatically be applied
DockerFeatureIDEA-167859Allow using files with environment variables to run Docker container
FeatureIDEA-181774Check connection for Docker server when creating new one
FeatureIDEA-149314Docker: auto-expose a port, if it is used in a binding but not exposed
BugIDEA-181894Docker run config - Populate Dockerfiles combo with files by their type and not by exact name
BugIDEA-181843Docker: Save ports in DockerView leads to doubling of the existing ports
BugIDEA-181123Docker. Run Configuration. "Command preview" and "Command line options" fields should not remain over the other windows by changing focus
BugIDEA-181258Docker. RunConfiguration. Command preview. Place a space after a not-default Dockerfile name to separate "-t" option from the name
BugIDEA-181170Docker. Run configuration. Correct UI for adding/editing mounts: add "edit" state, add cursor position, add max of empty lines
BugIDEA-180607Typed YAML: Don't suggest existing keys in auto-completion
BugIDEA-180375Docker: IncorrectOperationException at attempt to choose "Convert path to absolute" for ADD and COPY in the Dockerfile Editor
BugIDEA-180376Docker: remove instructions from the completion list for COPY and ADD in the Dockerfile Editor
BugIDEA-181180Docker: Run Configuration. Port bindings from "Command line options" field are ignored if "Bind ports" field is not empty
BugIDEA-181183Docker: Run Configuration. Mount binding from "Command line options" field doesn't work
BugIDEA-180381Docker: Run Configuration. Validate container names
BugIDEA-181161Docker. Run configuration. "Command line options". The string content should not be changed from collapse/expand of the field
BugIDEA-181680Docker - renaming for a file referenced from Dockerfile ADD fails
BugIDEA-181225Docker: Run Configuration. Container name field. Run failed if the field value contains spaces at the beginning/end
BugIDEA-181086Docker. Image Run Configuration. Command preview is always empty
BugIDEA-181011Docker. Run Configuration. The "Executable" section name should be displayed completely, not "Executa..."
BugIDEA-177107docker-plugin - custom network and fixed ip support
BugIDEA-180157Docker Run configuration : replace JSON file with explicitly listed options in CLI format
BugIDEA-181697Docker run config - Support `--network-alias` option
UsabilityIDEA-181803Docker: Build/Run from Dockerfile: make the default run configuration name differ from the default Docker server connection name
UsabilityIDEA-177938Docker: Enable Docker item in View | Tool Windows menu
UsabilityIDEA-181016Docker run config: remove browser block to conserve vertical space
CosmeticsIDEA-181799Docker: Create a container from an image: remove "Deployment" from the dialog name
ExceptionIDEA-181090NumberFormatExcetion for duplicate default option
Editor. Editing TextBugIDEA-180641Expand selection works incorrectly on Java String with slash escaping on last position
BugIDEA-179556Find in updating console
BugIDEA-179890'Copy as rich text' doesn't preserve colors and formatting when pasting to Keynote
BugIDEA-179710Wrong paste from history
BugIDEA-179753"Undo" action can be invoked from "Undo" confirmation dialog
UsabilityIDEA-172415DB output tool window covers active line in editor
Find, Replace, Find UsagesBugIDEA-181019Error when doing a 'find usage' with 'derived class' selected in dialog
BugIDEA-182289'Replace All' dialog interprets find/replace contents as HTML
BugIDEA-181024Replace in path broken
UsabilityIDEA-182181Replace in Path: Replace All dialog: unable to switch between OK and Cancel from keybord
IDE ConfigurationFeatureIDEA-180401Add Background Image feature to general settings
IndicesBugIDEA-180296NPE in MapReduceIndex.flush corrupts indices
ExceptionIDEA-181620Sorry but parent: Application is being disposed so the child: {} will never be disposed
Java. InspectionsBugIDEA-180553Boolean method is always inverted does not work with information inspection level
BugIDEA-181729Java Instance Method naming convention adds a warning for whole JSP files
BugIDEA-179923Option "Check 'static final' fields with a mutable type" of Field name convention does not work
UsabilityIDEA-180501Confusing warning about list get method
JavaScriptBugIDEA-181156Order of sourceFilesUrls elements in JavaScript library configuration file randomly changes
Packaging and InstallationBugIDEA-180730Patch update requires UAC elevation even if product installed locally
BugIDEA-179657Problems with test labels in DMG on macOS High Sierra
Plugin DevelopmentFeatureIDEA-181981Provide annotation to mark dynamically loaded classes
Plugin ManagementTaskIDEA-171552Allow using methods with Kotlin interfaces in signatures from plugins with their own version of kotlin-runtime library
Project ConfigurationFeatureIDEA-178743Support for development builds of JDK
BugIDEA-180674Gradle/Maven: "Store generated project files externally" option is ignored when creating a project from existing sources
BugIDEA-180663Gradle/Maven: odd modules are created on enabling ""Store generated project files externally" option; Throwable at ModuleManagerImpl.loadModules
CosmeticsIDEA-179893Group names not properly escaped on Move Module to Group
ExceptionIDEA-182159Removing a JAR directory root from a project library produces endless exceptions and freezes the UI
RefactoringBugIDEA-180637GUI problem on refactoring module on pressing forward button
Run | Debug configurationBugIDEA-180005Configurations with same name but different type disappear after project reopening
UsabilityIDEA-181198RunDashboard: finished and not started configurations could not be distinguished in tree
Structural Search and ReplaceBugIDEA-181065Search Structurally... misses hits in libraries
UMLBugIDEA-179756IntelliJ crashes system when generating a database diagram
User InterfaceFeatureIDEA-173043Make tooltips background configurable
BugIDEA-174258Painting progress bars eats CPU
BugIDEA-177790tooltip is meaningless
BugIDEA-180135UI scale factor is wrong on Windows with latest EAP
BugIDEA-154559'Git Reset' dialogue looks weird on Linux Mint
BugIDEA-181253Error validation doesn't work in dialogs in real time
BugIDEA-181171Test progress should green/red according to the result of the tests
BugIDEA-159531Comboboxes hide background picture
BugIDEA-180962disable JRE-HiDPI (per-monitor DPI-aware) mode by default in IDEA 2017.3
BugIDEA-180011Cannot set background image in latest PyCharm EAP
BugIDEA-180520AE at com.intellij.openapi.util.text.StringUtil.assertValidSeparators
BugIDEA-180576copy from structure window doesn't work in fresh idea eap
CosmeticsIDEA-181117ExpandableTextField has incorrectly rendered 'Expand' button
CosmeticsIDEA-161840Background Image is not set for the Preview of Find results when it displays 'select occurrence to preview'
TaskIDEA-178638ComboBox with large font
ExceptionIDEA-181936Opening 'Find In Path' from 'Find Class' throws exception
Version ControlBugIDEA-180928[Regression] F6 (move to another changelist) shortcut doesn't work in Commit Changes dialog any longer
BugIDEA-180991VCS group by directory should show path relative to the path of project/module
UsabilityIDEA-179175Unclear 'Branch context has been loaded' message
ExceptionIDEA-181922NPE from VCS
Version Control. GitBugIDEA-180605Git: just created files not added to vcs appear in the LocalChanges UnversionedFiles list after Refresh only
BugIDEA-180850Commit for unversioned files doesn't work
No subsystemBugWEB-29284Wrong (and *very annoying!*) suggestion in JSX page
BugWEB-29204"Rerun tests" notification's location and font
BugWEB-29686JavaScript/ES2015+ com.intellij.psi.PsiInvalidElementAccessException in JS Function Expression
UsabilityWEB-26745Start Flow service using Node
TaskWEB-28990Add an ability to add "Build*" actions in "Before launch" block of any JS run configuration
DebuggerBugWEB-29444Can't debug JavaScript from 2 instances of IDE
BugWEB-18588Node-webkit: debugging doesn't work with NW.js 0.13.+
BugWEB-29107Update Live Edit settings
BugWEB-29409Support ANSI coloring in console messages when debugging node remotely
BugWEB-29569Webstorm react-native does not work on react-native version 0.50 and above
BugWEB-29141JS Debugger does not re-use tab
BugWEB-28311Meteor: debug doesn't work with meteor 1.6
BugWEB-27784Electron 1.7.4: change debug-brk to inspect-brk (breakpoints are not hit)
BugWEB-11110Wrong error message "Built-in HTTP Server on custom port disabled"
BugWEB-29116JavaScript debug is not working without JB Chrome Extension if java SDK is set
BugWEB-28379React Native run starts debug session
UsabilityWEB-28789Rename debug configurations for Node.js and Chrome
HTMLFeatureWEB-27963Inject JavaScript in <form> action attribute value
BugWEB-29031Completion for HTML attributes doesn't work in JSX
BugWEB-29522'Extend selection issue' doesn't select tag if started from CSS
UsabilityWEB-25194HTML in Javascript length limit
JavaScriptFeatureWEB-29032Flow error reporting is way too limited to be useful
FeatureWEB-29454typescript: exclude javascript files from indexing if package contains typescript declarations
FeatureWEB-28741Auto-imports should contain file extension when corresponding option is enabled in Registry
FeatureWEB-28791React autocomplete doesn't work with Flow generic React.Component<Props, State>
FeatureWEB-29094Javascript: add install global types fix
BugWEB-29440ES6: access to static members of imported default unnamed class doesn't work
BugWEB-29594Add import with unresolved symbols on copy & paste from another file
BugWEB-25202No JSDoc deprecated highlighting for default imports
BugWEB-29279Invalid red code (parse error) if Flow return type uses parens
BugWEB-24428Avoid multiple resolving for TypeScript overloads in JavaScript if d.ts files are set up as JavaScript libraries
BugWEB-1292JS: 'unused parameter' inspection doesn't report violations for arrow functions if the function body is not enclosed in curly braces
BugWEB-25805'Cannot resolve file' when importing from module that has `.js` name postfix
BugWEB-29042When auto-imports are enabled, pasting code containing Flow types will incorrectly add an import
BugWEB-29512JavaScript/TypeScript: File Structure doesn't show Inherited members
BugWEB-27944Ignore typescript features when overriding e.g. constructor with generator
BugWEB-29581bound (bind) function results in wrong mark of unused import
BugWEB-19444JS: Invalid 'Duplicate declaration' highlight in destructuring assignment
BugWEB-28847Find usages of default export doesn't find usages via import("") call
BugWEB-29599Automatic imports should be added below "use babel"
BugWEB-19755ES6 implementation of JSDoc defined interface
BugWEB-15855ES: File structure view shows imported data wrong
BugWEB-29688React standard methods/components can't be resolved with react 16.1+
UsabilityWEB-29270Code completion does not understand @param context in JSDoc
UsabilityWEB-29274Properties are sorted randomly in the QuickDoc (Ctrl+Q)
TaskWEB-29497JavaScript: rework "show expression type" UI
TaskWEB-29467Remove option to use Flow for resolving all references
ExceptionWEB-29703Exception in JSDoc completion
JavaScript. FormatterBugWEB-29293Indentation of Flow type cast syntax is messed up
BugWEB-29550JavaScript code contains invalid token after reformat
JavaScript. FrameworksBugWEB-22656React: don't report child context properties (childContextTypes, getChildContext()) as unused
BugWEB-29240componentDidCatch marked as unused method in React 16 component.
BugWEB-28656Don't show "Split current tag" intention for Vue props
UsabilityWEB-25823intellisense doesn't change case
ExceptionWEB-29049Exception in Vue path completion for template and style sources
JavaScript. InspectionsFeatureWEB-14388Invalid "Unused JavaScript / ActionScript local symbol" inspection for unused parameters
BugWEB-29280Invalid 'conflicting inherited declaration' highlight (observable with React components in JS files)
BugWEB-29137not imported symbol is recognized and not-recognized at the same time
BugWEB-29159Intentions: improve "Convert type alias to interface" intention settings
JavaScript. PredefsBugWEB-29218Wrong link to external documentation
BugWEB-29217Unexpected documentation for type
JavaScript. RefactoringBugWEB-29450Refactoring: "Extract Interface" action from the object literal suggests invalid result
BugWEB-29160Refactoring: improve "Extract Interface" action
BugWEB-29092TypeScript/JavaScript: Improve "Pull Members Up" refactoring
LintersBugWEB-29302ESLint: auto-import-settings on first project opening to do its best without any popups
BugWEB-29231Standard code style: can't start ESLint with eslint-plugin-flowtype
BugWEB-29372Standard formatting only honors package.json at project root
Node.jsBugWEB-29651java.lang.UnsupportedOperationException when trying to choose node in setings
BugWEB-29559Update data in the interpreter list when 'Set as project default' is called
BugWEB-29558Suggest to update node interpreter when opening a project
BugWEB-29257Add hyperlink detecting filter to Run console
UsabilityWEB-29147Bower: use bower package rather than bower executable in settings
UsabilityWEB-27579Project node interpreter should be set to the one selected in project generator
REST ClientFeatureWEB-29226Support completion for environment variables
BugWEB-29272Check query after variable substitution (allow https:// to be a part of variable)
UsabilityWEB-29275Add request separator after execution
TaskWEB-28638Support environment variables
TypeScriptFeatureWEB-29047Add an option to import all symbols after paste
FeatureWEB-20969Add support non nullable types
FeatureWEB-29390Show parameter name hints in constructor calls
BugWEB-29282typescript 2.6 support
BugWEB-29447Typescript: completion incorrectly suggests modules with name in quotes
BugWEB-28570TypesScript. Can't Implement/Override protected/public properties
BugWEB-29214'Extract superclass' should insert base constructor call
BugWEB-29210Pull members up, extract super/interface does not work with TS parameter properties
BugWEB-29213TypesScript. Navigate to Type Declaration is broken when parameters destructuring is used with default value
BugWEB-26610Typescript: Cannot Call Overloaded Super Constructor
BugWEB-29408AutoFormat with member reordering issue
BugWEB-29405Wrong typescript error when comparing imported enums
BugWEB-29568Optionality from the key-providing type is not respected in mapped types
BugWEB-28142Type is always `any` when destructuring props in TypeScript React components
BugWEB-29140Auto-Imports from non-d.ts node_modules files are broken in 2017.3
BugWEB-29037Angular and auto method creation from the template
BugWEB-27891Typescript type inference problem with switch statements.
BugWEB-29358TypeScript+React: Intellisense not working for component State properties within calls to React.Component.setSate()
BugWEB-29592'else' branch of ternary type guard is not applied when dealing with aliases
BugWEB-29590Type guard is not evaluated though it should be
BugWEB-29595Error when extracting an interface
BugWEB-26574Typescript. Type information is lost when destructuring types with string index signatures
BugWEB-29178Parameter name hints doesn't show up for negative numbers when using method.
BugWEB-28678Union types in overriden method are broken
BugWEB-22226typescript: useless completion after new
BugWEB-28513Invalid implementing TypeScript interfaces
BugWEB-28455No autocomplete/suggestion for `undefined` keyword in TS.
BugWEB-29675[TypeScript] cannot resolve symbol from some import
BugWEB-17860TypeScript: wrong Quick Documentation popup in case of intersection types
BugWEB-29348TypeScript+React: Documentation of React Props/State properties cannot be found.
BugWEB-21596IntelliSense doesn't recognize generic type of class extended from Array in TypeScript
BugWEB-29584Should check base type properties when checking for implemented interface properties
BugWEB-29586Cannot resolve React props from generic TProps
BugWEB-29587Type guards are applied incorrectly in presence of type aliases
BugWEB-28806ES Module JS file extension when working with TypeScript
BugWEB-26630Comments in tsx do not work
BugWEB-29339TypeScript+React: Non-optional methods in Props interface not auto-stubbed when typing component name as JSX.
BugWEB-29649Issue with indexer type: indexing by 'string | number' should be equivalent to indexing by 'string'
BugWEB-29642Copy-paste with imports doesn't insert imports with RxJS/Observable
BugWEB-29683TypeScript quickfix "Variable initializer is redundant" results in invalid code.
BugWEB-28533Auto-import doesn't correctly work for modules with `.js` name postfix
BugWEB-29393False positive incompatible types
BugWEB-28908Not all class in completion list
BugWEB-27664Typescript inferred type omits null & undefined types
PerformanceWEB-28310IntelliJ hung indexing typescript config file (tsconfig.json)
UsabilityWEB-27772TypeScript errors are hard to read because they remove line breaks and white space
Unit TestsFeatureWEB-26153Unable to specify Node interpreter options for Jest run configurations
DB ConnectivityFeatureDBE-1203Data Source / SSH/SSL: how to use OS native SSH?
FeatureDBE-5107ssh-agent support for Intellij database connections
FeatureDBE-2100Database access through ssh with both key and Google Authenticator (two factor authentication)
BugDBE-3245Incorrect file path if to create Sqlite data source from file
BugDBE-5011Can not set jdbc driver options for Redshift
DB ConsoleBugDBE-53662017.3: unable to ROLLBACK aborted transaction with Postgres
BugDBE-5241Jump to Console new menu useless
DB IntrospectionFeatureDBE-1865Postgres: Foreign Data Wrappers
BugDBE-5252Oracle introspector fails on retrieve cluster info
BugDBE-5309Corrupted dataSources xml
BugDBE-5440Introspection fails with exception on MS_Description = NULL
BugDBE-5379Doesn't show index sort order in table list view, always shows as ASC in Modify Table
DDL & PL EditingBugDBE-5318Generate DDL To Console Places ENDGo at end
Data ViewsFeatureDBE-5324Paste TSV/CSV to Data Edtior
BugDBE-3590Table Editor Should Hide Error Message Upon Successful Operation
BugDBE-3183Can't edit hstore column in Postgres
SQL CompletionBugDBE-2549Code completion can't resolve references in specific circumstances
BugDBE-5321Wrong competition in oracle join statements
SQL EditingFeatureDBE-3760SQL: PostgreSQL: need language injection at dblink queries
BugDBE-3791SQL: correlation name should be used if specified, not table name
BugDBE-3790PostgreSQL: join can't be natural and cross at the same time
BugDBE-3756SQL inspection: Unresolved reference: code with missing table name in FROM clause is green
BugDBE-3421Valid H2 SQL shows red line
SQL HighlightingBugDBE-2341Postresql support composite type expression
BugDBE-5270Qualify object is absent in ORDER BY clauses
BugDBE-5276Wrong alias resolve
BugDBE-5280Support for OPENJSON(...) WITH (...)
BugDBE-5307H2 SQL dialect: ALTER TABLE X ADD [COLUMN] optional keyword not supported
User InterfaceFeatureDBE-77Group Data Sources by folder
BugDBE-5232Database console font is not affected by "Console Font" setting.
UsabilityDBE-5242where is "more schemas" button?
CosmeticsDBE-5362ugly database counter

RubyMine 2017.3 RC2 (build 173.3727.77) Release Notes

IDEBugRUBY-20289.iml files are added to project subfolders with Gemfile
InspectionsBugRUBY-20217Running RuboCop on all project always shows no suspicion code
No subsystemBugIDEA-182318VFS Exceptions after switch branches.
Find, Replace, Find UsagesBugIDEA-182289'Replace All' dialog interprets find/replace contents as HTML
UsabilityIDEA-182181Replace in Path: Replace All dialog: unable to switch between OK and Cancel from keybord
Project ConfigurationExceptionIDEA-182159Removing a JAR directory root from a project library produces endless exceptions and freezes the UI
DB IntrospectionBugDBE-5440Introspection fails with exception on MS_Description = NULL

RubyMine 2017.3 RC1 (build 173.3727.35) Release Notes

No subsystemBugRUBY-20450Incorrect keyword arguments inspection
BugRUBY-20442"Create new RVM gemset" dialog fields are too short
Code InsightBugRUBY-20464Argument for @NotNull parameter 'element' of com/intellij/psi/PsiElementResolveResult.<init> must not be null
BugRUBY-18255Jump to other same name class.
DebuggerBugRUBY-20300Interactive console hangs
BugRUBY-20313Debugger doesn't work with Ruby 1.8.7
IDEBugRUBY-20456New Ruby projects action contains modules instead of projects
BugRUBY-20241Multi-user RVM SDKs are not detected on Ubuntu
UsabilityRUBY-20246Cannot remove auto-detected module
InspectionsBugRUBY-20329Wrong management of 'new' method
BugRUBY-20245invalid "found extra arguments" error when passing a hash or a hash splat to a method taking named params
MarkdownUsabilityRUBY-20295Improve markdown structure view visuals
ParsingTaskRUBY-20312Tune Ruby blocks parsing to new ruby 2.5 scheme in HAML and Slim
RailsBugRUBY-17686Wrong inspection message in has_and_belongs_to_many relation
RefactoringsBugRUBY-20285Refactor inline does not address methods called without parenthesis
Remote InterpretersBugRUBY-20392Automatic upload failed: could not connect to SFTP server at "sftp://127.0.0.1/".
CosmeticsRUBY-20222Slashes for remote SDK are inconsistent in the user interface
Ruby Version ManagersTaskRUBY-20278Fix production-testOnly conflict on fake JDK creation
SlimBugRUBY-20403Slim parse freezes when unclosed string literal
No subsystemFeatureIDEA-116686Limit code analysis to user-configurable number of CPU cores to prevent 100% of all cores utilization
BugIDEA-182140Last Idea eap spontaneously crash
BugIDEA-180450Indent provider behaves unexpectedly
BugIDEA-182065Redundant "The project used an invalid path to Node.js" warning for my java project
UsabilityIDEA-161094Option to disable "search everywhere"
DebuggerBugIDEA-180838Weird order of breakpoints in "Disabled until selected breakpoint is hit"
Diff_MergeUsabilityIDEA-171250New Auto Resolving conflicts must not automatically be applied
DockerFeatureIDEA-181774Check connection for Docker server when creating new one
FeatureIDEA-149314Docker: auto-expose a port, if it is used in a binding but not exposed
BugIDEA-181680Docker - renaming for a file referenced from Dockerfile ADD fails
BugIDEA-181894Docker run config - Populate Dockerfiles combo with files by their type and not by exact name
BugIDEA-181843Docker: Save ports in DockerView leads to doubling of the existing ports
UsabilityIDEA-181803Docker: Build/Run from Dockerfile: make the default run configuration name differ from the default Docker server connection name
CosmeticsIDEA-181799Docker: Create a container from an image: remove "Deployment" from the dialog name
Editor. Editing TextBugIDEA-179710Wrong paste from history
BugIDEA-180641Expand selection works incorrectly on Java String with slash escaping on last position
BugIDEA-179753"Undo" action can be invoked from "Undo" confirmation dialog
Find, Replace, Find UsagesBugIDEA-181024Replace in path broken
IDE ConfigurationFeatureIDEA-180401Add Background Image feature to general settings
Plugin DevelopmentFeatureIDEA-181981Provide annotation to mark dynamically loaded classes
UMLBugIDEA-179756IntelliJ crashes system when generating a database diagram
User InterfaceExceptionIDEA-181936Opening 'Find In Path' from 'Find Class' throws exception
Version ControlUsabilityIDEA-179175Unclear 'Branch context has been loaded' message
ExceptionIDEA-181922NPE from VCS
No subsystemBugWEB-29686JavaScript/ES2015+ com.intellij.psi.PsiInvalidElementAccessException in JS Function Expression
UsabilityWEB-26745Start Flow service using Node
DebuggerBugWEB-28379React Native run starts debug session
BugWEB-29569Webstorm react-native does not work on react-native version 0.50 and above
HTMLFeatureWEB-27963Inject JavaScript in <form> action attribute value
BugWEB-29522'Extend selection issue' doesn't select tag if started from CSS
JavaScriptFeatureWEB-29032Flow error reporting is way too limited to be useful
BugWEB-29594Add import with unresolved symbols on copy & paste from another file
BugWEB-27944Ignore typescript features when overriding e.g. constructor with generator
BugWEB-15855ES: File structure view shows imported data wrong
BugWEB-29581bound (bind) function results in wrong mark of unused import
BugWEB-29599Automatic imports should be added below "use babel"
BugWEB-29688React standard methods/components can't be resolved with react 16.1+
ExceptionWEB-29703Exception in JSDoc completion
JavaScript. FormatterBugWEB-29550JavaScript code contains invalid token after reformat
JavaScript. RefactoringBugWEB-29450Refactoring: "Extract Interface" action from the object literal suggests invalid result
Node.jsBugWEB-29651java.lang.UnsupportedOperationException when trying to choose node in setings
BugWEB-29559Update data in the interpreter list when 'Set as project default' is called
BugWEB-29558Suggest to update node interpreter when opening a project
TypeScriptFeatureWEB-29390Show parameter name hints in constructor calls
BugWEB-29675[TypeScript] cannot resolve symbol from some import
BugWEB-27891Typescript type inference problem with switch statements.
BugWEB-29649Issue with indexer type: indexing by 'string | number' should be equivalent to indexing by 'string'
BugWEB-29642Copy-paste with imports doesn't insert imports with RxJS/Observable
BugWEB-29592'else' branch of ternary type guard is not applied when dealing with aliases
BugWEB-29595Error when extracting an interface
BugWEB-29590Type guard is not evaluated though it should be
BugWEB-17860TypeScript: wrong Quick Documentation popup in case of intersection types
BugWEB-26574Typescript. Type information is lost when destructuring types with string index signatures
BugWEB-29584Should check base type properties when checking for implemented interface properties
BugWEB-29586Cannot resolve React props from generic TProps
BugWEB-29587Type guards are applied incorrectly in presence of type aliases
BugWEB-26610Typescript: Cannot Call Overloaded Super Constructor
BugWEB-22226typescript: useless completion after new
BugWEB-29683TypeScript quickfix "Variable initializer is redundant" results in invalid code.
UsabilityWEB-27772TypeScript errors are hard to read because they remove line breaks and white space

RubyMine 2017.3 Beta2 (build 173.3622.24) Release Notes

No subsystemBugRUBY-18828Duplicated argument name
IDEUsabilityRUBY-20332Enable module auto-creation on explicit user request
ExceptionRUBY-20249Closing Ruby project with modules may throw exception
InspectionsBugRUBY-20286RuboCop Error
BugRUBY-18816Ruby require keyword arg inspection
UsabilityRUBY-20400Add RuboCop: prefix to annotation texts from RuboCop
RefactoringsBugRUBY-18477Rename refactoring for class doesn't rename corresponding Rspec file
Ruby. FormatterBugRUBY-20371wrong indent in blocks when typing (with indent relative to expression start)
BugRUBY-20198wrong indent inside "private def method_name" when typing (indent relative to expression start is on)
BugRUBY-20390Too much indentation in RSpec with setting 'Use indents relative to expression start'
RubyGemsBugRUBY-20215Install Bundler is shown for plain ruby app even Bundler is installed
No subsystemBugIDEA-181581SSH logs are incomplete
DockerFeatureIDEA-167859Allow using files with environment variables to run Docker container
BugIDEA-181697Docker run config - Support `--network-alias` option
UsabilityIDEA-177938Docker: Enable Docker item in View | Tool Windows menu
ExceptionIDEA-181090NumberFormatExcetion for duplicate default option
IndicesExceptionIDEA-181620Sorry but parent: Application is being disposed so the child: {} will never be disposed
Java. InspectionsBugIDEA-181729Java Instance Method naming convention adds a warning for whole JSP files
JavaScriptBugIDEA-181156Order of sourceFilesUrls elements in JavaScript library configuration file randomly changes
Plugin ManagementTaskIDEA-171552Allow using methods with Kotlin interfaces in signatures from plugins with their own version of kotlin-runtime library
RefactoringBugIDEA-180637GUI problem on refactoring module on pressing forward button
User InterfaceBugIDEA-174258Painting progress bars eats CPU
BugIDEA-181171Test progress should green/red according to the result of the tests
DebuggerBugWEB-28311Meteor: debug doesn't work with meteor 1.6
JavaScriptFeatureWEB-28791React autocomplete doesn't work with Flow generic React.Component<Props, State>
BugWEB-19755ES6 implementation of JSDoc defined interface
BugWEB-29512JavaScript/TypeScript: File Structure doesn't show Inherited members
TaskWEB-29497JavaScript: rework "show expression type" UI
LintersBugWEB-29372Standard formatting only honors package.json at project root
TypeScriptBugWEB-29282typescript 2.6 support
BugWEB-29405Wrong typescript error when comparing imported enums
BugWEB-29568Optionality from the key-providing type is not respected in mapped types
BugWEB-29393False positive incompatible types
Unit TestsFeatureWEB-26153Unable to specify Node interpreter options for Jest run configurations
DB IntrospectionBugDBE-5379Doesn't show index sort order in table list view, always shows as ASC in Modify Table

RubyMine 2017.3 Beta (build 173.3415.45) Release Notes

No subsystemTaskRUBY-20334Implement Fall Creators Update Support
IDEBugRUBY-19654elements of the %i symbol arrays are excluded from search results as string literals
BugRUBY-20340Missed "Indent when case" option
BugRUBY-20250Rails submodule is not recognised as Rails
UsabilityRUBY-20248SDK for the auto-detected modules is set randomly
ParsingFeatureRUBY-20344Prohibit passing block to yield expression
BugRUBY-20320Parser doesn't recognize backticks in heredocs
RubyGemsTaskRUBY-20264Make sure bundler-related stuff works with Ruby 2.5
Code NavigationBugIDEA-180742Gutter 'Implemented methods' doesn't detect several lambda implementations
BugIDEA-181135Go to File: with "Include non-project files" = No out-of-project files are still suggested
Diff_MergeBugIDEA-180904F7 in commit dialog behaves wonkily in latest update
DockerBugIDEA-180157Docker Run configuration : replace JSON file with explicitly listed options in CLI format
BugIDEA-180607Typed YAML: Don't suggest existing keys in auto-completion
BugIDEA-180375Docker: IncorrectOperationException at attempt to choose "Convert path to absolute" for ADD and COPY in the Dockerfile Editor
BugIDEA-180376Docker: remove instructions from the completion list for COPY and ADD in the Dockerfile Editor
BugIDEA-181011Docker. Run Configuration. The "Executable" section name should be displayed completely, not "Executa..."
BugIDEA-177107docker-plugin - custom network and fixed ip support
UsabilityIDEA-181016Docker run config: remove browser block to conserve vertical space
Editor. Editing TextBugIDEA-179890'Copy as rich text' doesn't preserve colors and formatting when pasting to Keynote
IndicesBugIDEA-180296NPE in MapReduceIndex.flush corrupts indices
Project ConfigurationBugIDEA-180663Gradle/Maven: odd modules are created on enabling ""Store generated project files externally" option; Throwable at ModuleManagerImpl.loadModules
BugIDEA-180674Gradle/Maven: "Store generated project files externally" option is ignored when creating a project from existing sources
User InterfaceBugIDEA-177790tooltip is meaningless
TaskIDEA-178638ComboBox with large font
Version ControlBugIDEA-180928[Regression] F6 (move to another changelist) shortcut doesn't work in Commit Changes dialog any longer
Version Control. GitBugIDEA-180605Git: just created files not added to vcs appear in the LocalChanges UnversionedFiles list after Refresh only
BugIDEA-180850Commit for unversioned files doesn't work
No subsystemBugWEB-29284Wrong (and *very annoying!*) suggestion in JSX page
DebuggerBugWEB-18588Node-webkit: debugging doesn't work with NW.js 0.13.+
BugWEB-29107Update Live Edit settings
BugWEB-29141JS Debugger does not re-use tab
BugWEB-27784Electron 1.7.4: change debug-brk to inspect-brk (breakpoints are not hit)
HTMLUsabilityWEB-25194HTML in Javascript length limit
JavaScriptBugWEB-29279Invalid red code (parse error) if Flow return type uses parens
BugWEB-28847Find usages of default export doesn't find usages via import("") call
BugWEB-1292JS: 'unused parameter' inspection doesn't report violations for arrow functions if the function body is not enclosed in curly braces
UsabilityWEB-29274Properties are sorted randomly in the QuickDoc (Ctrl+Q)
JavaScript. FrameworksExceptionWEB-29049Exception in Vue path completion for template and style sources
JavaScript. InspectionsBugWEB-29137not imported symbol is recognized and not-recognized at the same time
JavaScript. RefactoringBugWEB-29160Refactoring: improve "Extract Interface" action
BugWEB-29092TypeScript/JavaScript: Improve "Pull Members Up" refactoring
LintersBugWEB-29302ESLint: auto-import-settings on first project opening to do its best without any popups
BugWEB-29231Standard code style: can't start ESLint with eslint-plugin-flowtype
Node.jsUsabilityWEB-29147Bower: use bower package rather than bower executable in settings
REST ClientBugWEB-29272Check query after variable substitution (allow https:// to be a part of variable)
TypeScriptBugWEB-29210Pull members up, extract super/interface does not work with TS parameter properties
BugWEB-28570TypesScript. Can't Implement/Override protected/public properties
BugWEB-29214'Extract superclass' should insert base constructor call
BugWEB-28908Not all class in completion list
BugWEB-29339TypeScript+React: Non-optional methods in Props interface not auto-stubbed when typing component name as JSX.
BugWEB-29358TypeScript+React: Intellisense not working for component State properties within calls to React.Component.setSate()
DB ConnectivityFeatureDBE-1203Data Source / SSH/SSL: how to use OS native SSH?
FeatureDBE-5107ssh-agent support for Intellij database connections
FeatureDBE-2100Database access through ssh with both key and Google Authenticator (two factor authentication)
BugDBE-3245Incorrect file path if to create Sqlite data source from file
DB IntrospectionBugDBE-5309Corrupted dataSources xml
SQL CompletionBugDBE-5321Wrong competition in oracle join statements
SQL EditingFeatureDBE-3760SQL: PostgreSQL: need language injection at dblink queries
BugDBE-3421Valid H2 SQL shows red line
BugDBE-3791SQL: correlation name should be used if specified, not table name
BugDBE-3790PostgreSQL: join can't be natural and cross at the same time
SQL HighlightingBugDBE-5280Support for OPENJSON(...) WITH (...)
BugDBE-5307H2 SQL dialect: ALTER TABLE X ADD [COLUMN] optional keyword not supported

RubyMine 2017.3 EAP6 (build 173.3302.28) Release Notes

No subsystemFeatureRUBY-20262Tune parser to support ruby 2.5
BugRUBY-2Error parsing identifiers with "=" sign
TaskRUBY-20260Add Ruby25 Language Level
TaskRUBY-20265Generate stdlib stubs for Ruby 2.5
DebuggerTaskRUBY-20281`cfp` ~~> `ec->cfp` if ruby_version == 2.5.0
DockerBugRUBY-20242Can't see IRB and Rails console in the Rails project with Docker SDK
BugRUBY-20256Docker-Compose - Unsupported docker compose configuration version: 3
RubyGemsFeatureRUBY-20093gems.rb support
TestsBugRUBY-20139Cannot run RSpec by Japanese name
No subsystemBugIDEA-180414Extra log verbosity upon exception in PersistentBTreeEnumerator.enumerate
UsabilityIDEA-180386Verbose logging from BrowserStarted makes the logs useless
Code Analysis. DuplicatesBugIDEA-180092Red code after extracting with duplicates, for method with identical values of parameters
Code Formatting and Code StyleBugIDEA-179073JavaLikeIndentProvider indent miss
Code NavigationBugIDEA-180495Navigate to 'Implementation(s)' is unable to find all implementations
BugIDEA-180339find file no longer supports forward slash separators in windows REGRESSION
Editor. Editing TextBugIDEA-179556Find in updating console
UsabilityIDEA-172415DB output tool window covers active line in editor
Java. InspectionsBugIDEA-179923Option "Check 'static final' fields with a mutable type" of Field name convention does not work
BugIDEA-180553Boolean method is always inverted does not work with information inspection level
Packaging and InstallationBugIDEA-180730Patch update requires UAC elevation even if product installed locally
Project ConfigurationFeatureIDEA-178743Support for development builds of JDK
CosmeticsIDEA-179893Group names not properly escaped on Move Module to Group
Run | Debug configurationBugIDEA-180005Configurations with same name but different type disappear after project reopening
User InterfaceFeatureIDEA-173043Make tooltips background configurable
BugIDEA-159531Comboboxes hide background picture
BugIDEA-180520AE at com.intellij.openapi.util.text.StringUtil.assertValidSeparators
BugIDEA-180576copy from structure window doesn't work in fresh idea eap
CosmeticsIDEA-161840Background Image is not set for the Preview of Find results when it displays 'select occurrence to preview'
No subsystemBugWEB-29204"Rerun tests" notification's location and font
DebuggerBugWEB-11110Wrong error message "Built-in HTTP Server on custom port disabled"
BugWEB-29116JavaScript debug is not working without JB Chrome Extension if java SDK is set
UsabilityWEB-28789Rename debug configurations for Node.js and Chrome
JavaScriptBugWEB-29042When auto-imports are enabled, pasting code containing Flow types will incorrectly add an import
BugWEB-24428Avoid multiple resolving for TypeScript overloads in JavaScript if d.ts files are set up as JavaScript libraries
JavaScript. FrameworksBugWEB-22656React: don't report child context properties (childContextTypes, getChildContext()) as unused
JavaScript. InspectionsBugWEB-29159Intentions: improve "Convert type alias to interface" intention settings
JavaScript. PredefsBugWEB-29218Wrong link to external documentation
BugWEB-29217Unexpected documentation for type
Node.jsBugWEB-29257Add hyperlink detecting filter to Run console
REST ClientFeatureWEB-29226Support completion for environment variables
UsabilityWEB-29275Add request separator after execution
TypeScriptBugWEB-29213TypesScript. Navigate to Type Declaration is broken when parameters destructuring is used with default value
BugWEB-21596IntelliSense doesn't recognize generic type of class extended from Array in TypeScript
BugWEB-29178Parameter name hints doesn't show up for negative numbers when using method.
BugWEB-28678Union types in overriden method are broken
BugWEB-28513Invalid implementing TypeScript interfaces
BugWEB-29037Angular and auto method creation from the template
BugWEB-27664Typescript inferred type omits null & undefined types
DB ConnectivityBugDBE-5011Can not set jdbc driver options for Redshift
DB ConsoleBugDBE-5241Jump to Console new menu useless
DB IntrospectionFeatureDBE-1865Postgres: Foreign Data Wrappers
BugDBE-5252Oracle introspector fails on retrieve cluster info
Data ViewsBugDBE-3590Table Editor Should Hide Error Message Upon Successful Operation
SQL EditingBugDBE-3756SQL inspection: Unresolved reference: code with missing table name in FROM clause is green
SQL HighlightingBugDBE-5270Qualify object is absent in ORDER BY clauses
BugDBE-5276Wrong alias resolve
User InterfaceFeatureDBE-77Group Data Sources by folder
UsabilityDBE-5242where is "more schemas" button?

RubyMine 2017.3 EAP5 (build 173.3188.32) Release Notes

Code InsightFeatureRUBY-20177Improve code completion for class fields.
CucumberBugRUBY-19850Cucumber formatter `after_features` needs to be updated for Cucumber 3.0.0
TaskRUBY-20220Support Cucumber 3
IDEFeatureRUBY-20211Add new ruby module from new context menu
FeatureRUBY-20196Inline hints for argument grouping syntactic sugar
BugRUBY-20027parameter name hints Ruby instance variables
BugRUBY-20254Gems bundled with bundler path are not available
UsabilityRUBY-19951Excessive hints
PuppetBugRUBY-20184EPP space-trimmed tags cause a parsing error
Remote InterpretersBugRUBY-20216Add space for 'remote-rvm' prefix
Ruby. FormatterBugRUBY-20152Comments after line of code causes auto comment on the new line
No subsystemBugIDEA-180312Deadlock ? JarHandler
BugIDEA-180196Can't jump to customise colour scheme
BugIDEA-179660Copy+Paste in FitNesse files (context.txt) not working anymore.
Code CoverageExceptionIDEA-180148PicoPluginExtensionInitializationException at com.intellij.openapi.extensions.impl.ExtensionComponentAdapter.getComponentInstance(ExtensionCompone ntAdapter.java:96)
Code Formatting and Code StyleUsabilityIDEA-179699Problems with visual guides preview in code style and color scheme settings
CosmeticsIDEA-179429Settings: some visual issues with CodeStyle VisualGuides fields
Code NavigationPerformanceIDEA-179739'Go to file by name' occasionally not finishing with high CPU usage
Diff_MergeBugIDEA-141889Pressing Ctrl+D on an unversioned file in Local Changes results in mysterious "Select Path" dialog
DockerFeatureIDEA-171373Docker Compose: provide completion and navigation for "env_file" values.
FeatureIDEA-172716Docker. Add "Build" action into ">>" for Dockerfiles
FeatureIDEA-175829Add working_dir: autocompletion with directories
BugIDEA-179926Docker: resolve, find usages and inplace-rename doesn't work for docker stages synthax in the Dockerfile editor
Editor. Editing TextBugIDEA-176409Wrong line separators Assertion error in intellij.openapi.progress.Task
Find, Replace, Find UsagesBugIDEA-170103FInd in Path dialog won't close (2017.1 version, Ubuntu 16.04)
IDE ConfigurationBugIDEA-164639Unable to save settings because of symlinks inside config directory
Java. InspectionsBugIDEA-178449Assignment to Collection or array field from parameter inspection does not recognize private inner classes as private
Language InjectionBugIDEA-180223Plain text editor for injected string recognizes backslash as error but "no errors found in this file"
Product DocumentationUsabilityIDEA-180238Missing directory "config" on instruction to change location of "config" and "system" directories on file Install-Linux-tar.txt
Project ConfigurationFeatureIDEA-166061Support qualified module names as a replacement for module groups
FeatureIDEA-180193Automatically unload newly added modules
BugIDEA-179968On new module adding to the project with modules grouped by fqn the module group mode is applied
Project ViewFeatureIDEA-176856Show nodes for unloaded modules in 'Project View' even if their directories aren't located under loaded modules
BugIDEA-180081Project view: don't show unnecessary modules grouping items for projects
Run | Debug configurationBugIDEA-108342'Single instance only' option not copied in Run configuration
BugIDEA-154486JSP compilation fails in 2016.1 and 15.0.5
UsabilityIDEA-165946Provide ability to view classpath of a java process started via run configuration if it is passed via classpath.jar
Structural Search and ReplaceFeatureIDEA-81235Structural Search should be able to find method calls to annotated methods
Task ManagementFeatureIDEA-70996Tasks and IDE Contexts - Shelving changes
Unit Testing. JUnitBugIDEA-165929Running with dynamic.path=true and gettingacnt locate a PowerMock related class
User InterfaceFeatureIDEA-179992Could not change max number of tabs
BugIDEA-174258Painting progress bars eats CPU
BugIDEA-179953Broken hebrew characters in replace preview
BugIDEA-179663"Local Changes" - "Wide selection" is broken
User Interface.DarculaBugIDEA-100256Darcula: Settings->Schemas and DTDs hard to read entries
Version ControlFeatureIDEA-129759File History & Log: Show diff for merge commits as a 3-panel diff instead of proposing a popup with parents selector, or choosing an arbitrary parent.
FeatureIDEA-176722Apply patch (from clipboard) should take the meta-information (commit message, author) from the patch
BugIDEA-169466Author field and Amend checkbox missing when only Unversioned files present
BugIDEA-175125Patch can't be applied if it contains mode changes only (e.g. 644->755)
BugIDEA-161081Unversioned files should be preselected in the commit dialog if they were selected in the Local Changes
BugIDEA-167479File permissions from patch aren't applied
UsabilityIDEA-136238Local Changes | Preview Diff should show current version of the unversioned file
UsabilityIDEA-169729When dragging shelved changes to 'Local Changes' tab, apply them in 'Default' changelist (if it's selected in 'Unshelve...' dialog)
UsabilityIDEA-162615"Create patch" with Russian letters results in unnamed.patch
UsabilityIDEA-156875Display the content for unversioned fIles in the commit dialog
Version Control. GitBugIDEA-179993Freeze on startup
Version Control. LogFeatureIDEA-148143VCS Log: Diff view for a merge commit should show combined difference of all merged commits
i18nBugIDEA-180164Problems on Safe Delete Resource Bundles and properties files
CSSBugWEB-29019CSS property 'dominant-baseline' values support
CoffeeScriptBugWEB-27192'use strict' + Coffeescript destructing highlighted as error
DebuggerBugWEB-28311Meteor: debug doesn't work with meteor 1.6
JavaScriptFeatureWEB-29094Javascript: add install global types fix
BugWEB-29108JavaScript Libraries - Not Working Correctly (PrototypeJS)
JavaScript. FormatterBugWEB-29105JSX in vue uses HTML indentation settings
JavaScript. FrameworksBugWEB-29074Type mismatch errors when annotating `render()` Component method with JSDoc
JavaScript. PredefsFeatureWEB-12145Add documentation for core ECMAScript API
JavaScript. RefactoringBugWEB-28686'Flip if-else' shouldn't generate empty if/else blocks
REST ClientBugWEB-29099Restrict comments in message body
TypeScriptBugWEB-29140Auto-Imports from non-d.ts node_modules files are broken in 2017.3
BugWEB-24458Reserved names used as property name are highlighted as warning
Unit TestsBugWEB-29113Jest: failed test is marked as green
BugWEB-29078Jest console output contains malformed characters from ANSI colors
BugWEB-26705Jest tests not found because rootDir setting is incorrectly set to the same directory as the configuration file
UsabilityWEB-29048Remove Auto-test from Jest run tool window, add --watch to the options field description
DB DiffFeatureDBE-4582Allow comparison of cells in data views
Data ViewsBugDBE-4485Values of LONGVARCHAR columns aren't printed in Database Console's result tables
SQL EditingBugDBE-5224Deferrable exclution constraints marked as red using PostgreSQL dialect
UsabilityDBE-3827PostgreSQL. IDEA should know about regexp_replace and other regexp* functions
SQL HighlightingBugDBE-5214CTE expression within a cursor assignment reports error incorrectly against SQL Server
SQL ResolveBugDBE-5201Regard lower_case_table_names on MariaDB

RubyMine 2017.3 EAP4 (build 173.2941.5) Release Notes

No subsystemTaskRUBY-19853Allow stubbing of some RIdentifiers
Code InsightBugRUBY-18524invalid "local variable can be uninitialized" inspection for unused named params
BugRUBY-20189Fix parameter info calculation for ruby DSLs
DocumentationBugRUBY-20168Link from message doesn't lead to expected page
HAMLBugRUBY-20183HAML: invalid syntax error (expected argument name) when attribute name starts with a colon
IDEBugRUBY-20155Search everywhere in Rails always reports "Capify" as top hit
CosmeticsRUBY-20132Implement proper SDK name visualization on windows
InspectionsFeatureRUBY-18259Ruby inspection: String as hash key - provide a quickfix
FeatureRUBY-16913Double quoted string inspection should be OFF by default
FeatureRUBY-19186Implement proper params-args mapping and improve argument count inspection
BugRUBY-20173Can't remove `return` when it's possible in the case of inline array
BugRUBY-19509Single line if then inspected as a multi-line one
BugRUBY-17181falty "unnecessary return statement" warning for last line return
MarkdownBugRUBY-20169Can no longer open markdown files
RailsFeatureRUBY-19035Support for routes placed in different files
RubyGemsFeatureRUBY-12247Show "Install Bundler gem" action under Tools | Bundler when all other actions are disabled because Bundler is not installed
No subsystemBugIDEA-179331Run Dashboard: it should not be possible to start the same configuration few times
BugIDEA-168781Mnemonics for run actions is broken in case of '_' and '&' in configuration name
CosmeticsIDEA-179681Initial configuration: improve layout on Ubuntu
ExceptionIDEA-164682Removing sdk leads to exception
Code Analysis. InspectionFeatureIDEA-162912Framework specific inspection settings
BugIDEA-179173Please merge Groovy class naming convention inspections
Code NavigationBugIDEA-179522Navigation bar ignores context when operated with keyboard
BugIDEA-179329Go To File: prefer strict matching when using package name+file name without separator
ConsoleBugIDEA-137769ANSI colors are not interpreted on System.err
DebuggerBugIDEA-144150It's possible to mark two different objects with the same name in debugger
Diff_MergeBugIDEA-179819Empty lines added when computing diffs between the VCS state and current
DockerBugIDEA-179724Docker: Resolve and find usages don't work for ENV in the Dockerfile editor
UsabilityIDEA-179734Build args field looks like disabled
Editor. Editing TextBugIDEA-178503Parameter hint blocks cursor
Find, Replace, Find UsagesExceptionIDEA-179577NPE at com.intellij.ide.actions.SearchEverywhereAction$CalcThread.isEnabled(SearchEverywhereAction.java:195 7)
IDE ConfigurationBugIDEA-170552Code lens and other appearance settings unable to be reset or modified, Apply settings broken
IndicesExceptionIDEA-179342"Outdated stub in index" exception
Internal build scriptsBugIDEA-179182IntelliJ Community Builds fail with missing junit 5 artifact
JSPBugIDEA-179665New JSP file creating causes error
Java. InspectionsFeatureIDEA-179354Warn if Map/Set entry is overwritten in a series of consecutive add/put calls
BugIDEA-179812Not proper warning "Use settings of class naming convention"
BugIDEA-179773Inner class not shown as as a class node in Inspection result toolwindow
BugIDEA-179694Merged 'Class name convention' reset to default when one of old inspection had several scopes
Plugin DevelopmentFeatureIDEA-177986DevKit: Structure view for plugin.xml
Project ConfigurationBugIDEA-178542loading/unloading a module confuses maven - delete not available
UsabilityIDEA-174389Unloading Modules: the unloaded module that is re-imported back gets unloaded after project reopening
UsabilityIDEA-174410Modules Unloading: it would be nice to pre-select the module when action is invoked on some file/folder inside module
User InterfaceBugIDEA-178632Switching Default/Darcula themes on mac breaks combobox borders
BugIDEA-171750Code lens "turn off" option not working
CosmeticsIDEA-178925Import wizard last step animation goes in the wrong direction
Version ControlPerformanceIDEA-179246Laziness for VCS local changes tree
Version Control. GitBugIDEA-126914Private Gists are actually called 'Secret', the checkbox must be renamed
BugIDEA-179546Revert commit: files to be deleted are not checked fro commit by default
Version Control. PerforceFeatureIDEA-179402Add "sync to changelist" in Perforce "incoming" view
BugIDEA-178876Perforce: comparison of two revisions of SQL file with UTF-16 BOM uses a wrong encoding
No subsystemBugWEB-28976UI: package field component has wrong vertical alignment on OSX
BugWEB-25059Inspect code not working as expected for Unused CSS Selector
BugWEB-28427webpack.config.js: Webpack aliases not resolved when exporting multiple targets
BugWEB-29020Spell checking should exclude function names in template strings
CoffeeScriptBugWEB-16823Spell check in CoffeeScript inside string blocks
DebuggerBugWEB-28799Breakpoints with node --inspect (Chrome protocol) do not not work with sourcemap files (TypeScript)
HTMLFeatureWEB-20599HTML: add completion for 'sandbox' attribute
JavaScriptFeatureWEB-16758All keywords in JavaScript are highlight in blue, except "undefined"
BugWEB-27636Moving does not update paths in JS.
BugWEB-28092Undefined method 'hasOwnProperty' on window object
JavaScript. FormatterBugWEB-28925Formatter: "Function declaration parentheses" changes "In async arrow function" option behavior
BugWEB-27531Typescript Code Style. Problem with object inside array
BugWEB-28822[Typescript][Formatting] Wrong alignment of close brackets
JavaScript. FrameworksBugWEB-27945Webpack config file autosaves on every keystroke in 2017.2
BugWEB-28859Webpack Failing Loading Plugin BrowserSync
UsabilityWEB-28980Improve error message for webpack.config.js load fail
ExceptionWEB-29049Exception in Vue path completion for template and style sources
ExceptionWEB-28981Webstorm fails to load webpack.config.js if webpack-dashboard plugin is included.
JavaScript. InspectionsBugWEB-28930Inspection and Intention "Replace Assignment With Operator Assignment" - false positive and broken code for `a = a !== false`
JavaScript. PredefsFeatureWEB-28052Support Promise.prototype.finally
BugWEB-25673Missing property declarations on HTMLTextAreaElement.prototype in DHTML.js
JavaScript. RefactoringFeatureWEB-22198Refactoring [to / from] [ES6 / Typescript] object literals
TypeScriptFeatureWEB-29012TypeScript: provide quick fix for installing "@types/" definitions
FeatureWEB-27704"Extract interface" refactoring for TypeScript (just like "extract variable")
BugWEB-22610TypeScript: false errors/wrong navigation for functions that return union type
Unit TestsBugWEB-27246Jest plugin doesn't know how to parse javascript Jest configuration
UsabilityWEB-27314Running Jest individual tests within describe doesn't focus the tests in the output pane
DB ConsoleBugDBE-2996Postgres: Database console sets different timezone in session that PGAdmin
DB IntrospectionBugDBE-5060DataGrip repace escape character \' in MySQL procedure
Data ViewsBugDBE-4810Cannot directly edit json fields, throws error.
SQL EditingBugDBE-5193Editor hangs up while editing PlPgSql code
BugDBE-3768SQL: Inspections: Types compatibility: no warnings at derived table with join after it
BugDBE-3809Identity not restarting in DB2
BugDBE-3775SQL: Inspections: DB2, Sybase: Types compatibility: false positive if the result of join has several columns with the same name
BugDBE-3824PostgreSQL. 'Expand column list' produces incorrect query
BugDBE-3788PostgreSQL:no quick fix for 'unresolved reference' if the column at FOREIGN KEY

RubyMine 2017.3 EAP3 (build 173.2696.24) Release Notes

InspectionsBugRUBY-19997Spurious Rubocop offenses due to ignoring Exclude paths
RubyGemsBugRUBY-19010Gems are not attached in External libraries until reopen project if use require
No subsystemBugIDEA-179333Can't install featured plugin
BugIDEA-179514Non-pinned Spring and JavaEnterpise toolwindows are closed unexpectedly on clicking
BugIDEA-179213NullPointerException in com.intellij.openapi.externalSystem.settings.AbstractExternalSystemSettings.setLinkedProjectsSetting s in offline inspections mode
Code Analysis. InspectionCosmeticsIDEA-179091"Run inspection by name" dialog: improve layouting on resize
Code NavigationBugIDEA-178943GoToFile: on directory name entering the confusing list of found files is shown
BugIDEA-179184Go to file regression -- no longer matches on forward slashes in Windows
Diff_MergeBugIDEA-178618Command line diff between directories: can't show diff error for files
DockerFeatureIDEA-170244Docker: provide completion and navigation for ADD instruction values
BugIDEA-178899Docker: Default docker run configuration: no dialog is opened at attempt to call docker connection settings
BugIDEA-179219Missing container name in the deployment log
BugIDEA-179316DockerView: "docker" connection item: the text should not be unselected after a second
IDE ConfigurationBugIDEA-179502Exception when saving an imported color scheme
Java. InspectionsBugIDEA-179191False Inspection Alert "Method can be void" on TestNG DataProvider Methods
Java. Intention ActionsFeatureIDEA-179280java9 - intention to use Map.ofEntries
ExceptionIDEA-179116'Replace '?:' with 'if else'' exception on invalid code
Plugin DevelopmentBugIDEA-178997Running IntelliJ from Gradle with JDK9
Project ConfigurationFeatureIDEA-166061Support qualified module names as a replacement for module groups
SQLBugIDEA-179487Improve SQL dialect handling
User InterfaceBugIDEA-179150Gray background in combobox expander on mac
BugIDEA-178825Inspections "Filter by Language" causes UI to ignore mouseover
UsabilityIDEA-104403Bookmarks popup: speed search conflicts with mnemonics
User Interface.DarculaBugIDEA-94527Darcula: autocomplete white border
Version ControlUsabilityIDEA-179175Unclear 'Branch context has been loaded' message
Version Control. SubversionBugIDEA-179420Usability - SVN Diff Left/Right Switch?
XMLBugIDEA-179210Project view: "Validate" action for valid xml files results to no messages and hides bottom views
CSSFeatureWEB-28693Add CSS min-width/min-height auto property
BugWEB-28446CSS autocomplete for rgb color broken
BugWEB-28808Add dB attribute in the completion for the "voice-volume" parameter
BugWEB-27414CSS units are auto inserted
UsabilityWEB-28861Code completion should suggest only applicable units after a number.
DebuggerBugWEB-28780Always show async stacktraces
HTMLFeatureWEB-16029Support Emmet abbreviation preview in JSX
BugWEB-28841Can't add a single closing curly brace in HTML files
JavaScriptBugWEB-28922ES6 / TypeScript: enable "directory" import by default
BugWEB-28772Different JS versions in project: settings for flow are not show after reopenng the project settings
BugWEB-24603Flow autocomplete does not show params and params types
JavaScript. FormatterBugWEB-13304JS "Line comment at first column" always on for HTML scripts
JavaScript. FrameworksFeatureWEB-28689Configure react className not use brace
BugWEB-28659Wrong Top-level 'this' warning in Vue files
JavaScript. InspectionsBugWEB-27916Javascript generate intentions not available in html files <script> tags
LintersBugWEB-28290.eslintrc importer is unable to map space-before-function-paren rules properly
Node.jsBugWEB-28621"npm install" rather than "npm update" after updating package.json
TypeScriptBugWEB-28801Reformat code removes escape inside string
BugWEB-26285Typescript. Code completion for string based enums
BugWEB-25908TypeScript: support "key/in" / generic types
BugWEB-28853AssertionError while analyzing TypeScript file
BugWEB-27494Wrong type inference for const variables
UsabilityWEB-27910Suddenly 2 new menu items appearing in the context menu
Unit TestsFeatureWEB-27863Create react app extension support
DB ConsoleBugDBE-5170DB2 LUW View Creation fails from improper syntax
DB DiagramBugDBE-2130Only some foreign key edges are shown in the diagram
DB IntrospectionBugDBE-4760SQLServer Database plugin has NullPointerException running DDL From Dialogue
SQL CompletionFeatureDBE-1140A little smarter completion for JOINs
SQL EditingBugDBE-51672017.3 EAP 173.2290.12 - Inspections Hang (Stuck)
SQL HighlightingBugDBE-2898Oracle SQL. PIVOT keyword is unknown.
BugDBE-5155DataGrip does not recognize SQL commands GROUP BY ROLLUP and GROUP BY CUBE for SQL Server
User InterfaceBugDBE-3224Navigation to database tree is not working if DDL as data source

RubyMine 2017.3 EAP2 (build 173.2463.3) Release Notes

RailsBugRUBY-20119Not possible to navigate from action to view or generate it
TextMate BundlesUsabilityRUBY-13617Make Textmate section in Settings | File types read-only
No subsystemPerformanceIDEA-179003IntelliJ 2017.3 EAP takes longer to load list of actions in Ctrl-Shift-A than 2017.2
UsabilityIDEA-85375Run configurations dropbox should not change its width
ExceptionIDEA-178586NPE at com.intellij.ide.util.DeleteHandler.a
Code Analysis. InspectionCosmeticsIDEA-179055Run inspection by name dialog incorrect radio group value change order
Code Formatting and Code StyleFeatureIDEA-178779In certain cases, allow empty folding placeholders in IDEA 2017.3
DockerFeatureIDEA-174375Support passing --build-arg's to docker build from run configuration
BugIDEA-155539Docker. Run configuration. Image tag. It is impossible to create an image with a tag containing any upper-case letter.
BugIDEA-178929Docker: "Dockerfile detection" events appear many times and have wrong content
BugIDEA-175794Docker: Display error msg on-place in case of ADD [""] and COPY [""]
BugIDEA-178594Docker: Run configuration, choose path dialog. The wrong item in the tree is selected if the dialog is reopened.
UsabilityIDEA-171004Docker: Allow to select and copy errors in the Docker view by invalid connection to the docker
CosmeticsIDEA-178904Docker: disable "Filter" button on toolbar for not connected Docker
Editor. Code CompletionFeatureIDEA-173927Support keywords autocompletion when keyboard layout is incorrect
Editor. Editing TextBugIDEA-178809Issue highlighting line on last row in document
File SystemBugIDEA-178871com.intellij.openapi.vfs.VfsUtilCore#copyFile partially ignores requestor parameter
IndicesBugIDEA-176474pause index affecting multiple projects
Java. InspectionsBugIDEA-178944No warning on inner class creation from nullable reference
Unit Testing. JUnitBugIDEA-178770Right-clicking on maven-backed module in navigation bar no longer presents a "run all tests in..." option
User InterfaceBugIDEA-179056Confirm Exit, Do not ask me again - always appearing
BugIDEA-176821"Hide file extensions in editor tabs" removes all after dot
BugIDEA-178315Balloons opened using Show balloon form the Event log does not have scroll bar
Version ControlBugIDEA-169466Author field and Amend checkbox missing when only Unversioned files present
Version Control. GitBugIDEA-178492The Untracked files preventing checkout dialog loses list of files on grouping toggle
Version Control. PerforceBugIDEA-178876Perforce: comparison of two revisions of SQL file with UTF-16 BOM uses a wrong encoding
UsabilityIDEA-178155Lengthy background Perforce operations give no feedback as to progress or outcome
UsabilityIDEA-178641Perforce: it would be nice to show some descriptive error on commit failure
ExceptionIDEA-179077NPE at org.jetbrains.idea.perforce.application.PerforceInfoAndClient.calcInfoMap
XMLBugIDEA-167961XSD editor with with multiple <xsd:import> for the same namespace only recognoses elements from the first import
No subsystemBugWEB-25093Unused field propTypes
CSSFeatureWEB-27776CSS color properties should provide code completion for 'rgb()', 'hsl()', etc. syntax
FeatureWEB-4698Expand CSS support to include new CSS3 additions and vendor prefixes
FeatureWEB-4CSS, @font-face: provide completion for formats in 'format' hint in src references
BugWEB-27875Completion for CSS Transition values
BugWEB-8686Unknown CSS property pointer-events
BugWEB-9540CSS3: support 'initial' keyword
BugWEB-26458CSS autocomplete list should have defaults
BugWEB-27587CSS3: provide completion for CSS transform functions
TaskWEB-10783Support for CSS3 speech module
DebuggerBugWEB-28692Extra instance of react-native with the default port is started when debug with custom port
JavaScriptFeatureWEB-27592Support Optional Chaining syntax
FeatureWEB-12666Ability to have different JS versions in project
FeatureWEB-27135Add `*.mjs` file extension to JavaScript file patterns
BugWEB-28738Resolve for Bookshelf methods has changed
BugWEB-27576When generating JSDoc, don't put a dot before angle brackets in the return type
BugWEB-23997@mixes and @mixin is ignored when using JSDoc with EcmaScript 2015
BugWEB-28816Different JS versions in project: can't configure version per file
BugWEB-28641Structure View shows wrong hierarchy
JavaScript. FrameworksBugWEB-26772React: don't report `static defaultProps` as unused field
BugWEB-28400Create react app extension: add UI items
BugWEB-28384Provide completion for React components that extend PureComponent
BugWEB-28717Comment out property on JSX not reservable #JSX #React
JavaScript. RefactoringBugWEB-28800convert to let/const in batch does not work after recent changes in 5a58af90ab0b8a2ca0d1c7cc06e0049bb53ef3c8
LESSBugWEB-20066Missing property values in completion in .less if put cursor before a value
LintersFeatureWEB-27908Add .eslintrc.js support
BugWEB-28713JSHint: check "Use config" if config file is found
REST ClientBugWEB-28720SEGMENT expected
TypeScriptFeatureWEB-24153TypeScript: Semantic support for "Object spread"
BugWEB-27696WebStorm doesn't infer generic types from indexers
BugWEB-28464add support for TypeScript 2.4+ dynamic import expression
BugWEB-28490Typescript 2.4 mapped types issue
BugWEB-28674Subtyping type guards don't work at all
BugWEB-28245Change signature. Can't remove optionality from one of parameters
BugWEB-27786React/typescript: setState({}) autocomplete not supported for latest @types/react (v15.0.37)
TaskWEB-28253Change signature. Change help link

RubyMine 2017.3 EAP1 (build 173.2099.29) Release Notes

No subsystemFeatureRUBY-18127Support code insight in the .ruby-gemset file
FeatureRUBY-7865feature request: ability to collapse commented out code
FeatureRUBY-17793Select first RailsApp is the list
FeatureRUBY-13536Make "New Ruby Class" module-aware
BugRUBY-18659Exception on attempt to add Ruby on Rails facet to java module
BugRUBY-7636Unquoted comma breaks getText() and getValueText() of YAMLKeyValue
BugRUBY-195272017.1.2.rc1 broke all run configurations other than rails
BugRUBY-17804Remove 'Rails' prefix of rails related projects templates on welcome screen
BugRUBY-18242RubyMine won't recognice Rails 5 Models
BugRUBY-17751Support groups for project templates e.g. 'Rails', 'Web'
BugRUBY-18322"Scanning for gem requirements" prevent me from using RubyMine 2016.2
BugRUBY-19033New Rails API 'create rvm sdk' combo isn't properly updated
BugRUBY-8001I18n support cannot find declaration of i18n key when defined with new lines preserved
BugRUBY-17229attr_writer and attr_accessor not visible in structure view
BugRUBY-17780Description of samples is editable
BugRUBY-18084"controller#action" string is detected as a single reference to action
BugRUBY-18057Find in path does not work if searching for a numeric literal when "whole words only" is enabled
BugRUBY-8701Yaml code style annoyance
BugRUBY-19920Provide custom CSS URI validation
BugRUBY-5771Do not create folding for empty values
BugRUBY-17667Language Level not set correctly to 2.3
BugRUBY-17678Get rid of rbenv gemsets feature flag
BugRUBY-17989Rake tasks fail to start
BugRUBY-5354I18n: Go to declaration doesn't work with count parameter
BugRUBY-19611'Has missing gems' inspection may lead to deadlock
BugRUBY-8883Custom TODO pattern is not highlighted
BugRUBY-18604Remove Docker options from Remote Interpreters configuration
BugRUBY-18381askForSudo option set to `true` creates two processes
BugRUBY-10405Commented line in locale files raise inspection errors
BugRUBY-18943Rails missing on create new Application
BugRUBY-17622Run Rake Task command does not work.
BugRUBY-9430YAML Syntax Highlighting Incorrectly Treats Periods ('.') as Special
BugRUBY-19368Always indexing after upgrading to RubyMine 2017.1
BugRUBY-7279missing closing accolate in externalized string inline preview
BugRUBY-18911opened singleton class nodes in find usages results (grouped by file structure) are labeled "self"
BugRUBY-19198Notification with Rollback action after controller creation is about Test generation
BugRUBY-18007Productivity Guide misleading for refactoring features
UsabilityRUBY-18583Speed searching should expand SDKs if gemsets are matched
UsabilityRUBY-17782Navigation gutter to Channel from coffee template to show possibility of navigation
CosmeticsRUBY-17781Size of frame with railsapps list changing after templates are uploaded and some of them is selected
CosmeticsRUBY-17757Strange dialog title
TaskRUBY-17755Templates list should be sorted by popularity, e.g. by stars
TaskRUBY-17754Show short description of selected template
TaskRUBY-19914Hide default markdown css style URI
TaskRUBY-19922Move 'preview' subsettings onto 'Markdown' main settings pane
TaskRUBY-17366Exclude local rbenv gemsets and add gems as external libraries
ExceptionRUBY-19621'sqlite3-ruby' gem missing exception
ExceptionRUBY-18975Spring customization may be failed when project has already disposed
ExceptionRUBY-17663Project is not yet initialized error with exception if gemset pointed in the ruby-gemset is not exist
Code CoverageBugRUBY-16176Run with coverage annotations doesn't respect :nocov:
PerformanceRUBY-18264Slow UI performance after running tests
Code InsightFeatureRUBY-17831Frozen string literal inspection
FeatureRUBY-16041Completion in the code for defined yard attributes
BugRUBY-18900inspection of frozen string fail
BugRUBY-19535Search Everywhere is not useful when searching methods
BugRUBY-1827Tuple of variables used as a block parameter is unresolved
BugRUBY-18878Create property quick fix is missing
BugRUBY-17798Yard defined attribute readers don't resolve to attribute name
BugRUBY-17893RubyMine does not resolve class from parent module
BugRUBY-18152Stubs generation failed for mysql gem
BugRUBY-18236Find usages do not work with rspec let statements
BugRUBY-18414RubyMine 2016.2 freezes with regularity, becomes unusable
BugRUBY-17603New method creation quick fix adds a parameter in any cases
BugRUBY-17707YARD-defined symbols are not resolved to
BugRUBY-17267No autocompletion for ’type’ reserved word in annotations & YARD directives
BugRUBY-19177Incorrect call argument count inspection doesn't recognize keyword arguments
ExceptionRUBY-18944Open Ruby project throws IndexNotReady exception
CucumberFeatureRUBY-18956Cucumber 3 support
BugRUBY-16697Non-english keywords in step definition file make feature step unresolved
BugRUBY-17541Cucumber tests run correctly, but reporting of results is wrong
BugRUBY-18947Cannot find cucumber step reference when the \h metacharacter is used
PerformanceRUBY-19603High CPU while working with Cucumber
DebuggerBugRUBY-18038Unable to debug with remote SDK in case of Trinidad server
BugRUBY-18066Can't install debug gems into JRuby-9.1.0.0
BugRUBY-16546can't set a breakpoint on a standalone '}', terminating a hash literal expression
BugRUBY-18354unable to set breakpoint for debugging in slim templates
BugRUBY-17990Non-existent breakpoints getting “hit”
BugRUBY-19046Cannot attach to native SDK processes on Linux
BugRUBY-18399watches in the variables window should be identifiable
PerformanceRUBY-17156Filtering non-project sources causing slowness in debugger almost in 4 times
DockerBugRUBY-20090Cannot run application with Docker SDK in debug mode
DocumentationBugRUBY-19600Help topic for Ruby Run Console
EditingBugRUBY-8357Good code is red: illegal/unsupported escape sequence in regex
BugRUBY-19625RubyMine can't open some files
HAMLBugRUBY-18447Do not move comments when reformat
BugRUBY-16293interpolation causes string end to be missed by inspections in haml javascript filter
BugRUBY-15540Ruby HAML plugin is identifying valid attributes as invalid
BugRUBY-18231HAML following javascript filter blocks is marked as red/unresolved
BugRUBY-18415RubyMine 2016.2.1 freezes while open HAML file
BugRUBY-12007haml: cant go to class declaration if node have 2+ classes
BugRUBY-16900HAML case/when/else red code
BugRUBY-18276spurious haml illegal nesting
BugRUBY-18289IntelliJ 2016.2 freezes while indexing HAML file
IDEFeatureRUBY-19129Parameter Hints for Ruby
FeatureRUBY-18619Set up keymap screen for initial configuration
FeatureRUBY-17640Exclude .yarb files generated by bytecode cache from the project view
BugRUBY-17813Horizontal scrollbar blinks in debug tool window, Rails/IRB console
BugRUBY-18809Support changing language level for JRuby and Rubinius sdks
BugRUBY-18327rubymine.bat needs a few improvements
BugRUBY-16963Can't use bundler while install gems with sudo on Linux
BugRUBY-5336YAML folding is broken
BugRUBY-19024Gems are not installed into just created gemset
BugRUBY-18458Speed search doesn't work in the list of SDKs and gemsets
BugRUBY-19015JRuby versions selector doesn't work well with clear settings
BugRUBY-19018Cannot create any new project if any project is already opened in the Editor
BugRUBY-16153ENV['PWD'] Variable Not Set in RubyMine
BugRUBY-19481New Rails application wizard: Rails version is changed back to the default after changing the project's location
BugRUBY-17528Cannot set SDK in Default settings
BugRUBY-18983Font style in create new project wizard is different for plain ruby application
BugRUBY-17636Can't uncheck rbenv gemset
BugRUBY-18407'rubystubs24 directory cannot be null' exception on the start project with Ruby 2.4
BugRUBY-17326rbenv-gemsets file is not associated with text by default
BugRUBY-19615Implement breadcrumbs for ruby
BugRUBY-17618Gemset can be created in unrelated sdk
BugRUBY-17615.rbenv-gemsets created forcibly if select rbenv sdk
BugRUBY-17610rbenv gemsets are not available
BugRUBY-19040'No SDK selected' in Create new Project wizard
BugRUBY-18952Template project name stuck for RailsApp Sample project
BugRUBY-19572'Install Rails gem' label remains in the field after Rails installation instead of set installed version
BugRUBY-18291Installing Rails gem doesn't refresh Create New Project dialog after finish
BugRUBY-19194Methods with named arguments are not overridden correctly
UsabilityRUBY-17573"Create method" quickfix should be available on toplevel
UsabilityRUBY-16860Project name and other options are reset if change project type in Create new Project dialog
UsabilityRUBY-18391Notification 'Cannot save settings' of Ruby SDK and Gems should list modules names without SDK in case of multiple projects
CosmeticsRUBY-18262Sorting order for Rails 5.0.0 and 5.0.0.racecar1 is incorrect
CosmeticsRUBY-18359Different layouts causes 'fields jumping' in the Create new Project wizard
TaskRUBY-18316Support Language level Ruby 2.4
TaskRUBY-17122Combination of rbenv SDK and gemset doesn't provide ability to use gems from gemset
TaskRUBY-17611Remove Kusunoki as codename
ExceptionRUBY-19025Open application throws assertion
InspectionsBugRUBY-18175Inspection about replace double quoted string with single quoted is shown twice for Channel name in coffee template
BugRUBY-18615'Unless' statement quickfix message has a typo
BugRUBY-19086Run RuboCop inspection by name throws exception
CosmeticsRUBY-19066RuboCop is used without CamelCase
JRubyBugRUBY-18064JRuby 9.1.0.0 is treated as language version 2.2 instead of 2.3
MarkdownFeatureRUBY-17962Markdown Preview in Scratch files with md extension
FeatureRUBY-18536Structure view of markdown plugin should show actual structure in terms of headers, sub-headers and so on
BugRUBY-18120Markdown preview does not update image references when the underlying image changes
BugRUBY-19479Markdown plugin doesn't render *.markdown extension
BugRUBY-19001Underscore now treated as word break in Markdown files regardless of settings
BugRUBY-19487Markdown: Custom CSS is not applied
BugRUBY-19489Markdown preview scaling on HiDPI Linux (+win) is lost
BugRUBY-18237URLs with dashes are not rendered correctly in Markdown JavaFX preview panel
BugRUBY-17329SVG images in md preview browser can cause crash
BugRUBY-17188Markdown Plugin 8.0.0.20150924 preview is nearly unreadable with darcula
BugRUBY-18504Completion for languages in code fences
BugRUBY-19494NPE disabling Markdown "Apply CSS from URI" setting
UsabilityRUBY-18462Markdown: hard to type triple-back-tick
UsabilityRUBY-17155Markdown preview should have dark theme when using Darcula
UsabilityRUBY-17635Markdown preferences: UX impovements
ExceptionRUBY-19488MaliciousURLOpenedException when clicking on the link inside document
ParsingFeatureRUBY-17518Introduce support for Ruby 2.3 language level
FeatureRUBY-16078Inject Language/Reference doesn't work in string contexts but works in comment contexts
BugRUBY-19348Division operator is interpreted as beginning of regular expression
BugRUBY-5351Inclined quotes parsed incorrectly
BugRUBY-19036Rubocop is not available in Run Inspection by name option
BugRUBY-18444ruby 2.3 (2.1?) parameters aren't understood - wrong error markup
BugRUBY-16172failure to parse method invocations in default block parameter value expressions
BugRUBY-15367RubyMine syntax validator and indent does not work with || + block
BugRUBY-15106Ruby 1.9 deprecation warning in Rails project
BugRUBY-17227method call in default block param value expression is parsed/styled as a param
BugRUBY-17533multiple problems parsing default param value expressions
BugRUBY-18525Parentheses around empty arguments list error if a method's parameter decelerated in a new line
PerformanceRUBY-16887Indexing hangs, RubyMine becomes unresponsive
UsabilityRUBY-19052Rubocop's inspection 'too long' class or method makes is very agressive
ExceptionRUBY-4999YAML SOE: ASTWrapperPsiElement.getParent
Plugin ReportsFeatureRUBY-17658Support rbenv gemsets in Ruby Plugin
BugRUBY-17808Gems for rbenv/rvm Rubies not discovered correctly on OSX [no rails in JDK][ruby-debug-ide not installed]
BugRUBY-18468Ruby Plugin can't recognise gem project
BugRUBY-18672JRuby submodule in Java project uses old configurable interface
BugRUBY-19109Cannot add new Ruby Module with JRuby SDK
BugRUBY-19122New slim file creation throws ClassNotFound exception
BugRUBY-18558Ruby plugin doesn't recognise quoted symbols as keys. Rubymine works fine
BugRUBY-17675Library bigdecimal already exist error doesn't allow select any SDK for module
BugRUBY-18163Generate Rails mountable Engine checkbox don't work
BugRUBY-18576Ruby SDK added in the SDKs global list are available in the Modules settings after reopen Settings
BugRUBY-18564Node on the top of the list is not a currently selected gemset
BugRUBY-18622Checking node of rbenv SDK doesn't show gems from all checked gemsets
PerformanceRUBY-17140Project's settings freezes Intellij IDEA with ruby Plugin
PuppetFeatureRUBY-16330Introduce new create puppet module wizard
FeatureRUBY-17069Puppet hashrocket alignment
FeatureRUBY-18037Support functions written in the Puppet language
BugRUBY-17992'default' unexpected using per-expression resource default attributes in puppet 4
BugRUBY-18907puppet plugin: incorrect code reformatting with ordering arrow
BugRUBY-18129Puppet: lexer fails on long strings
BugRUBY-18678ElementDescriptionProvider shows internal info
BugRUBY-19327Variables names are partially highlighted in the Find Usages results
BugRUBY-17102regsubst() with backslashes in single quotes is escaped and evaluated
BugRUBY-17495Puppet parser doesn't understand nested functions with array access
BugRUBY-19486Puppet Plugin missing withpath for notify
BugRUBY-17410Puppet parser can't handle nested functions that take a block
BugRUBY-16912Method fail causes highlighting in good code
BugRUBY-19280Puppet Plugin: Incorrect format with empty curly braces
BugRUBY-18972Gem Manager trying to install missing gems from dependent modules
BugRUBY-18963No quick-fix to install librarian-puppet from IDE
BugRUBY-16524Heredoc highlighting may be broken after editing in some cases
BugRUBY-18036Using `Optional[key]` in a hash passed to the Struct type confuses the parser.
BugRUBY-19197Puppet related gems installation link is never expired
UsabilityRUBY-19228No hot keys for Puppet settings in the Puppet new module dialog
UsabilityRUBY-18973Null in puppet project name in the project view if version is not specified
CosmeticsRUBY-19276Suggestion for module and user names doesn't fit in create new project dialog
CosmeticsRUBY-19203Make dialog for add new Puppet module wider
ExceptionRUBY-18676CompletionProvider throws exception while hit Enter after variable inside of resource definition
ExceptionRUBY-18954Project is already disposed exception is shown if close project from a separate window
RHTMLPerformanceRUBY-16157HTML/ERB editor performance degradation
RailsFeatureRUBY-17899Install Rails list for ruby 2.1 should not include Rails 5
FeatureRUBY-17713ActionCable: channel related files
FeatureRUBY-3654Treat contents of Rails' javascript_tag as javascript
FeatureRUBY-19151Cannot rollback generator action
BugRUBY-18207Rubymine fails to run rspec if rspec has been run from the command line with spring enabled
BugRUBY-17785Can't destroy Channel
BugRUBY-18424Spring - Started by RubyMine - cannot be controlled (stop, status, etc.) and remains running after shutting down RubyMine.
BugRUBY-19555Support form_with
BugRUBY-19556remove warning "This version is not fully supported" for Rails 5.1
BugRUBY-19566Allow to choose webpack libraries in Rails new
BugRUBY-17898We need to only show ruby 2.2+ when creating a new Rails API app
BugRUBY-17655'get available generators script executes with errors:' warning is shown without errors
UsabilityRUBY-17921No warning message for user if downloading rails apps from github is failed
UsabilityRUBY-19070Don't show reload generators/rake tasks warnings in RM
TaskRUBY-17597Rails API project generation from wizzard
TaskRUBY-17599Fix route variables in Rails API apps
TaskRUBY-17598Do not create gutter in controllers in case of Rails API
TaskRUBY-18221RubyMine can't detect Rails version from .gemspec file
TaskRUBY-17795Add Rails API type project into Ruby Plugin
Meta IssueRUBY-17510Integrate Rails Templates
ExceptionRUBY-17788Editing channel's coffee template might throw assertions, then Rails view is unavailable
ExceptionRUBY-7934Key conflicts with existing one: 'null.support.array.words_connector'
ExceptionRUBY-17724Registered post-startup activity that will never be run assertion after opening a new project
Rails. Code InsightFeatureRUBY-17714ActionCable: error highlighting and intention action for a channel
BugRUBY-17815go to declaration for has_many associations does not work
BugRUBY-18017Block and splat parameters are not recognized when using #@!method
BugRUBY-17715ActionCable: navigation to channel action from JS
Rails. DiagramsExceptionRUBY-18189Rails model dependency diagram fails to be generated
Rails. Project ViewFeatureRUBY-17712ActionCable: add channels to Rails Project View
RakeBugRUBY-18097Last rake task name is displayed in the Tools menu instead of Run Rake task
RefactoringsFeatureRUBY-9955Allow RSpec let(:variable_name) refactoring
FeatureRUBY-13313Unable to rename a file
BugRUBY-11508Incomplete renaming in rspec tests after controller/model rename
BugRUBY-17574Extract Constant causes exception
BugRUBY-7260Renaming controller/resource route should rename view macro usage, eg 'edit_car_path'
BugRUBY-11511Rename refactoring: doesn't rename in short-hand controller/action declarations "controller#action" in RSpec tests
BugRUBY-18302RSpec Let refactoring should not have "Extract" in it
BugRUBY-17419Extract parameter can cause mismatching order of parameters in caller and callee
BugRUBY-16527RenameTable migration doesn't work
BugRUBY-16917Reformat code adds space before %> in .erb in case of encoding
BugRUBY-18158Client channel file is not renamed on channel rename
BugRUBY-18169Rename model incorrect path_name
UsabilityRUBY-18128Rename refactoring shows user unfriendly warning on Mac OS X if list of failed to rename items is big
Remote InterpretersBugRUBY-14931Speed up remote gem downloading
BugRUBY-19311Debug ruby application in Docker container
BugRUBY-18712Remote gems are not downloaded
BugRUBY-18109Debug Rails Console command does not work.
UsabilityRUBY-18497Add synchronise button to the SSH tab in Configure Remote Ruby Interpreter dialog
UsabilityRUBY-15010Clicking "Cancel" for remote SDK doesn't cancel
ExceptionRUBY-19241Adding Docker SDK may throw exception
ExceptionRUBY-19599Closing project with Docker SDK throw an exception
Ruby Version ManagersFeatureRUBY-10373Create RVM gemset from SDK configurable
FeatureRUBY-18916Add an option to create a dedicated gemset on Ruby/Rails project creation
BugRUBY-18348rbenv gemset - gems installed via github are not shown in "external libraries" and "Gem Environment" RubyMine 2016.2 trial
BugRUBY-18294Default SDK will not apply for Create new project wizard
BugRUBY-18293Rbenv gemset for new installed sdk will not shown after creation until switch from IDE and return
BugRUBY-18122Remove selected for a project gemset from Settings causes exception if use .ruby-gemset
BugRUBY-18538Current selection is reset if new Ruby SDK is added
BugRUBY-18323Two items with name 'global' are suggested in completion in the .rbenv-gemsets file
BugRUBY-18490Project SDK selected in Create New Project wizard is not selected in the Project Settings
BugRUBY-18585rbenv gemset deletion removes the entire SDK
BugRUBY-18051Can't run specs with RSpec Run/Debug Configuration if gem rake is installed only in the gemset
BugRUBY-18088Gems are not synchronized in External Libraries after adding/removing gemsets in rbenv-gemsets file
BugRUBY-18512Gems of non-rvm/rbenv SDK can't be detected in new configurable
BugRUBY-18516RVM sdk is selected instead of gemset
BugRUBY-18515SDK settings reset if gemset is configured via .ruby-gemset file
BugRUBY-19677New gemset created for new rails application not detected for plain Ruby app
BugRUBY-18085Create new rbenv gemset inspection causes exception
BugRUBY-18610Escape of quick search results reset current SDK selection
BugRUBY-18592Remote rvm gemset is not shown in the SDKs list
BugRUBY-18021Incorrect .ruby-version configured in RailsApp Sample (plus associated issues)
BugRUBY-18562Buttons Expand all and Collapse all are useless on Windows
BugRUBY-18560RVM global gemset is not checked by default when rvm sdk is checked
BugRUBY-18295Gems installed into gemset may be not available (again)
BugRUBY-18582Quick Search results should be reset by ESC
BugRUBY-18492Rbenv gemsets selection resets after switch to other SDK and return to previous settings during one session
BugRUBY-18030Gems installation into rbenv gemset causes gem is not available in the SDK warning until reopen Settings
BugRUBY-18352.ruby-gemset file if contains folder's name makes RubyMine exclude it
BugRUBY-14605Need to watch files .ruby-version and .ruby-gemset
UsabilityRUBY-18300Two inspections appear in the same time for non-existing gemset
UsabilityRUBY-18185No SDK selected value will be changed to random SDK while create RailsApps Sample
UsabilityRUBY-18545View of the SDK may be scrolled to the right after opening if remote sdk is selected
UsabilityRUBY-18611Selected sdk should be still selected after Esc search results
CosmeticsRUBY-18299Replace 'Gemsets have been changed' to 'File .rbenv-gemsets has been changed'
TaskRUBY-18473Measure SDK and gemsets statistics
ExceptionRUBY-18012Removing selected for the project rbenv gemset causes exception
Ruby. FormatterBugRUBY-8500The "Strip trailing spaces" feature removes spaces in Here Documents
BugRUBY-17584Comment confuses "align right parts of assignment" setting for ruby formatter
BugRUBY-19471align multiline list items failure
BugRUBY-19468wrong indent for private def method_name (when indent relative to expression start is on)
BugRUBY-19058Code block indentation relative to the method chain
BugRUBY-19354bad indent for chained ternary expressions
RubyGemsFeatureRUBY-18018Local Gem not recognized When The Path is a Variable
BugRUBY-17116Gems referenced via git_source don't appear in External Libraries
BugRUBY-19138"external libraries" looks for vendor cached git gems in the wrong location
RubyMotionBugRUBY-18203Debugger is not started with iOS app
BugRUBY-18186Variables unavailable when debugging RubyMotion iOS app
Run ConfigurationsBugRUBY-18957JRuby icon is displayed for Use other SDK field in Run/Debug configuration
SlimBugRUBY-18278Eternal indexing in Slim
BugRUBY-17473*a_method_return_hash syntax is not supported in Slim
BugRUBY-17997[Slim] Formatting is broken for several cases
BugRUBY-19141Slim file with JS causes exception
BugRUBY-17443New hash syntax doesn't work in Slim
BugRUBY-17719Unexpected and duplicated unreachable code inspection
TestsFeatureRUBY-16613minitest failure result nodes need "jump to test" functionality
FeatureRUBY-5449Prompt to create Test for class in it doesn't exists on goto test action
FeatureRUBY-10777support for MiniTest::Spec
BugRUBY-18929running single rspec results in failure to load project correctly ("cannot load such file -- rails_helper)
BugRUBY-16730RubyMine 7.1.2 fails to find TeamCity formatter for RSpec
BugRUBY-19012rspec context detection is weaker in 2017.1 EAP compared to previously
BugRUBY-19463RubyMine missing run dialog on test files since 2017.1
BugRUBY-13615RubyMine does not know about context when running RSpec feature specs
BugRUBY-18171Rspec tests failing
BugRUBY-18752uninitialized constant Test::Unit::AutoRunner::RUNNERS when trying to run unit tests
BugRUBY-18364Cannot run minitest - cannot load such file -- test_helper
UsabilityRUBY-18992Suggestion to create test should not be dependent on installed gems
TextMate BundlesFeatureRUBY-15510Add ability to add custom textmate *themes* for the textmate bundle support
BugRUBY-17606esac keyword in shell script is not highlighted
YAMLFeatureRUBY-17496Update breadcrumbs to show the element values
BugRUBY-18345Yaml file with multiline string containing jinja code can't be opened
BugRUBY-13914Yaml: parse errors on key value
BugRUBY-15402Yaml: Error with colon inside YamlKey
BugRUBY-17933.yaml files no longer collapse
BugRUBY-14451Incorrect YAML Parsing
BugRUBY-4996YAML - structure view reflects commented values
BugRUBY-15345Invalid YAMLCompoundValue
BugRUBY-12083Wrong syntax highlighting for single quotes in YAML
BugRUBY-11336RubyMine does not support keys with brackets in YAML files
BugRUBY-7680YAML highliting error
BugRUBY-13152Colon inside quotes should be treated as regular symbol
BugRUBY-15143RubyMine Freezing when Indexing Project (Mac OS Mavericks)
BugRUBY-14738Yaml: Remove special "?" psielement
BugRUBY-17558Can't edit ERB / RHTML files in RubyMine 8.0.2 on OSX El Capitan
BugRUBY-17414Multiline double quoted scalars with escaped newlines are not parsed correctly
BugRUBY-12598Autocompletion for double-quoted keys in .yml files
BugRUBY-13218Wrong brackets matching in YAML file
BugRUBY-12586Opening square bracket in array of strings break syntax highlight for YML/YAML files
BugRUBY-12217Yaml files with a hash (#) in single quotes causes problems
BugRUBY-16796The YAML syntax highlighting doesn't handle linebroken scalar values.
BugRUBY-11497Incorrect syntax highlighting of YAML comments
BugRUBY-16245Intellij Freezes when Indexing project. Clearing cache does not help
BugRUBY-18147Unexpected multi typing is appear in InjectionEditor
BugRUBY-14864highlighting yaml >- blocks
BugRUBY-18290Сan not open yml file
BugRUBY-13802incorrect yaml comment highlighting
BugRUBY-17389Empty hash as dict value is not parsed correctly
ExceptionRUBY-5000java.lang.AssertionError: (0,0) - FoldingDescriptor.<init>
ExceptionRUBY-5002YAML lists - NPE:PresentationData.updateFrom
No subsystemFeatureIDEA-139038Project management feature: Usable "known projects list" for reopening them in any supported way
FeatureIDEA-60161Automatically "inherit" quick javadoc for getters/setters from field
FeatureIDEA-143686Add ability to export class hierarchy to text file
FeatureIDEA-147176Create "lowercaseAndDash" function for live templates
FeatureIDEA-143452Show Running List action shows run processes from the current project only
FeatureIDEA-135255new Predefined Function "dashesToCamelCase()" to Use in Live Template Variables
FeatureIDEA-164176Delete old thread dumps in the IDE log folder
FeatureIDEA-158366Allow to run tests from find usages view
FeatureIDEA-168089New outline for text field components with invalid values
BugIDEA-157496Webstorm freezes at splash screen
BugIDEA-167799HiPDI menu arrows are too small for Darcula/IntelliJ themes on Windows and Linux
BugIDEA-76804[yaml] sequence parsing improvement
BugIDEA-167694Live Templates: order of default values are reversed
BugIDEA-156970No classpath jar in command line on dynamic.classpath=true when too many files in tmp on Windows
BugIDEA-145303RubyMine hangs on refactoring if "Align right parts of assignments or hashes" is checked
BugIDEA-145308ExpandedItemRendererComponentWrapper is broken
BugIDEA-140824Search Everywhere popup doesn't display relevant class name if jar name is too long
BugIDEA-151256Unable to switch boot JDK in minor IDEs
BugIDEA-172705Big files marked as read-only can't be deleted
BugIDEA-166669FileTypeRegistry.FileTypeDetector should not be skipped for large files
BugIDEA-146669Enable Mac native file dialogs
BugIDEA-142156Project leak on SheetController$2
BugIDEA-159850NPE on welcome screen (Import Project)
BugIDEA-156165WinPty process subprocesses are not killed
BugIDEA-147100Default File Header template causes pointless javadocs in projects
BugIDEA-161604Deadlock on startup in Promises
BugIDEA-156284Force Touch: Keymap, Add/Find Mouse Shortcut panel: after Button 1 is clicked and set in shortcut preview, Force Touch is ignored
BugIDEA-163567FileChooserFactoryImpl.createSaveFileDialog doesn't use native file chooser
BugIDEA-144866Changes in DocumentImpl related to setting bulk update mode broken ability to reformat non-physical document in non-dispatch thread
BugIDEA-162067Cannot create plain-text scratch file
BugIDEA-167050After cut+paste some methods from class to new-created one the pasted code is shown as duplicate
BugIDEA-178347UI is frozen for a long time in ModuleManagerImpl.loadModules
BugIDEA-159840Impossible to select a boot jdk from disk with native file dialogs on mac
BugIDEA-131012Support "delete word left" command in quick search
BugIDEA-151469ImplementingFunctional2x.png is not used because it is named with capital letter
BugIDEA-159270Can't delete *.class file
BugIDEA-145094PSI invalidated outside transaction
BugIDEA-156299Force Touch: 'Force Touch' is replaced with 'Button 1 click' after restart
BugIDEA-143263Find In Path is not autopopulating a selection from Find Preview window
BugIDEA-167089MacOSX: support tcsh shell for loading environment variables
BugIDEA-167880Dump data to file adds / to filename
BugIDEA-140901Tip of the Day is not working nicely with HiDPI under Linux
BugIDEA-171543RtfTransferableData: java.io.IOException: mark/reset not supported
BugIDEA-1724032017.2 EAP does not save changes to default font
BugIDEA-153873Pressing Shift+Enter in Navigate File popup opens the file in a new window instead of the current window
BugIDEA-155804LIVE TEMPLATE PROBLEM VARIABLES NEXT TO EACH OTHER
BugIDEA-167541Font baseline is shifted down for default font settings
BugIDEA-151033Usability issue with multiple block carets
BugIDEA-160282Lock not released in PagedFileStorage after VCS log exceptions
BugIDEA-136385Find Action / Search Everywhere: "Show Log in Explorer/Finder" action is missing
BugIDEA-165949[hidpi-jdk] IDEA main frame doesn't restore its bounds on the second monitor when reopened
BugIDEA-159742IllegalArgumentException: parent must be showing
BugIDEA-170221Download Sources not working after 2017.1 update
BugIDEA-168010Editor notification should be updated on the file extension change
BugIDEA-167719Test Runner: missing info about skipped tests in results popup
BugIDEA-157371Error updating com.intellij.openapi.editor.ex.util.LexerEditorHighlighter
BugIDEA-172247Plugins: NPE at PluginManagerConfigurable.apply() on restart after installing a plugin
BugIDEA-146153Text label disappears when click on it
BugIDEA-156065WinPty process does not kill agent on end
BugIDEA-156069Impossible to work with project which opened from starting window second time
BugIDEA-171238Keymap of Export Test Results does not function
BugIDEA-178693Already disposed: com.intellij.util.messages.impl.MessageBusImpl in PlatformTestCase.teardown
BugIDEA-160461Sort fonts case-insensitively
BugIDEA-144892Distraction free mode: Cancel action for compilation is not working
BugIDEA-149724Live Templates: IDE does not see the change if Copy action was used for creation of a new template
BugIDEA-90488Php editing/Single quote duplication bug
BugIDEA-156259idea.log spammed by "PerformanceWatcher - High memory usage"
BugIDEA-152628shift-F1 displays two URL
BugIDEA-171900Find in path popup isn't descriptive enough (poor feedback on search progress/status)
BugIDEA-160926Backspace doesn't join empty lines in JTextArea
BugIDEA-161155Per Project Modality: when Commit or Push dialog is opened in one IDEA frame, it's impossible to hide or show tool windows in the other frame
BugIDEA-74100[yaml] key-value parsing improvement
BugIDEA-148696Contextual menu won't close
BugIDEA-145363ConcurrentModificationException when a widget is added or removed in the status bar
BugIDEA-165879Unguarded section in DocumentCommitThread that leads to spontaneous assertion
BugIDEA-146929IntelliJ 15 EAP - Won't start when there is 100% packet loss - Crash
BugIDEA-172231Incorrect rendering of text with combining marks
BugIDEA-128057Editor search closes dialog on Enter, if there are nothing find
BugIDEA-149312Unstable width of "Preferences" window
BugIDEA-157874ERROR - #com.intellij.ide.plugins.PluginManager - Argument for @NotNull parameter 'action' of com/intellij/openapi/actionSystem/AnActionEvent.createFromAnAction must not be null
BugIDEA-67763tabs in split window view
BugIDEA-167627Reference search doesn't work for files added via AdditionalLibraryRootsProvider
BugIDEA-144512File Colors for project are removed after IDEA restart
BugIDEA-85304Icon for Use Soft Wraps doesn't show in the toolbar
BugIDEA-145356activity in a Scratch window triggers auto-refresh of tests
BugIDEA-166321Setting 'reopen last project on startup' doesn't work
BugIDEA-156993Project Name replaced with Directory Basename in Welcome Screen (EAP, Regression)
BugIDEA-156846Color: "Default text" resets to white by itself, leads to brackets on white background
BugIDEA-157266Safe delete: Exclude file is enable
BugIDEA-156193Toggle using soft wraps in current editor not working
BugIDEA-145341EAP 15 - settings pane number box doesn't have enough room to show default numbers
BugIDEA-77217[yaml] key value parsing improvement
BugIDEA-151527Sticky Selection cannot be escaped unless the cursor is in a different location than when toggled
BugIDEA-173347PSI invalidated outside transaction
BugIDEA-1721075+ minutes synchronize after remove of 11k files
BugIDEA-159941Mac native file chooser cannot select multiple files
BugIDEA-159940Wrong default location for new jdk mac open dialog
BugIDEA-84414Reporting a problem to plugin vendor in "IDE Fatal Errors" doesn't work ("mailto" link)
BugIDEA-156186Project names containing dot (.) causes display problem
BugIDEA-160763IDEA hangs on startup, during splash screen
BugIDEA-155360Open In Browser : files from library jars cannot be opened
BugIDEA-155362Open In Browser : action should work for files versons from History or be disabled
BugIDEA-161165Per Project Modality: when Commit or Push dialog is shown in one IDEA window, Code Analyzing hangs with 99% completed in the other window
BugIDEA-75771Create Patch: create patch dialog resizes several time when displayed.
BugIDEA-155763Memory leak detected: 'com.intellij.ui.BalloonImpl
BugIDEA-162032Sonarqube results are not getting displayed in the Inspections Tab.
BugIDEA-160967Endless loop of "JetBrains Account authentication failed. Do you want to try again?" even if pressing No
BugIDEA-128540Plugin installation error on stastup
BugIDEA-149698Cannot rerun tests in dumb mode + batch rerun when getting out of dumb mode
BugIDEA-46170Double quote appears in wrong string literal when a language is injected
BugIDEA-172559Quick-search does not work in "Register new file type association" dialog
BugIDEA-172558Progress popup is small by default
BugIDEA-161948CheckRegExp action: the results are not updated on sample or expression editing
BugIDEA-171010Idea doesn't close properly some project windows
BugIDEA-142785Export settings: IDEA generates 0-sized settings.jar
BugIDEA-151656ProgressableTextEditorHighlightingPass breaks (at least) Inifinitest plugin
BugIDEA-173613IDEA blocked while showing progress window after 'Generate JavaDoc...'
BugIDEA-95941Commit message Ctrl+Space completion of class name - stops working for the second line of the message
BugIDEA-132965Hitting enter in the Expression field in the Edit Template Variables dialog does not save the value
BugIDEA-148512Regression: Import/Export Settings no longer supports 'Remote Tools' after upgrade to IntelliJ 15
BugIDEA-133942Focus often stays in editor when dialogs are shown
BugIDEA-173017JavaFX WebView not HiDPI rendering on Windows 10
BugIDEA-138798Double click maximize tab should not close floating windows
BugIDEA-171717java.lang.IllegalArgumentException: Argument for @NotNull parameter 'fontFamily' of ... must not be null
PerformanceIDEA-167733High CPU usage due to Component.setCursor
PerformanceIDEA-172762ProjectRootManagerComponent$1.fileTypesChanged on AWT causes 30-60s freeze
UsabilityIDEA-157421Long shutdown due to built-in server
UsabilityIDEA-167531During code completion, Home/End keys navigate the menu not the code editor
UsabilityIDEA-149179Inspection settings dialog usability.
UsabilityIDEA-144025Gutter icon "overrides method in some interface" is displayed for lambdas and method references, which is confusing
UsabilityIDEA-123307Squashed tree widget on Windows theme on HiDPI monitor
UsabilityIDEA-164993Support for macOS special character (emoji) insertion popover
UsabilityIDEA-56512Add possibility to edit an entry for the list of packages to exclude from auto import
UsabilityIDEA-165002Can't Disable Message: Remote desktop detected, Animation disabled
UsabilityIDEA-114099Strip white space left of caret on manual save
UsabilityIDEA-98634Favorites List: sort entries
UsabilityIDEA-126373File Structure could have less indenting
UsabilityIDEA-53545Autoimport - Exclude from Import and Completion should be Project-specific - not (just) Global.
UsabilityIDEA-121010TODO, add/edit pattern: 'Inherit Attributes From:' checkbox always disabled
UsabilityIDEA-168138Apply button on changing color scheme doesn't lead to full rehighlighting
UsabilityIDEA-166959Can't see full path to project in welcome screen
UsabilityIDEA-158189Text is flickering when lines overlap vertically
UsabilityIDEA-155075Why file template settings are marked as per-project?
UsabilityIDEA-165863new live template causes unlabeled yellow warning triangle
UsabilityIDEA-160816Search by abbreviation in Keymap configurable
UsabilityIDEA-133381drag and drop file from project view tool window
UsabilityIDEA-85255Tool window options like a "Autoscroll to Source", 'sort by type' etc. should be stored globally, not per-project
UsabilityIDEA-158856Save File As Template dialog: Help is missing
UsabilityIDEA-158213Inconsistent soft wraps all state
CosmeticsIDEA-96168PhpStorm window is not restored in proper maximized state on Windows OS
CosmeticsIDEA-166907Duplicate caption for button
CosmeticsIDEA-115916Tab bug : graphical and not only
CosmeticsIDEA-167361Tip of the day, goto-message, missleading.
CosmeticsIDEA-150957Gutter grows abnormally when increasing line spacing in editor font settings
TaskIDEA-168385Widen Balloon API for new error selection feature
TaskIDEA-165322External annotator inspection
TaskIDEA-144655Smart PSI pointers should retain old offsets after inserting text after them
TaskIDEA-173294Enable by default Win10 LookAndFeel
Auto-reported ExceptionIDEA-55455Editing YAML file throws exception
Meta IssueIDEA-173344System-independent and system-dependent paths are often intermixed in IDEA code
ExceptionIDEA-151601Too many events posted
ExceptionIDEA-134164Could not start Idea
ExceptionIDEA-156293NPE at com.intellij.ui.mac.MacGestureSupportForEditor$1.pressure
ExceptionIDEA-156917Throwable at com.intellij.openapi.application.TransactionGuardImpl.submitTransactionAndWait
ExceptionIDEA-159111IAE at com.intellij.openapi.components.ServiceManager.getService
ExceptionIDEA-173666NPE at com.intellij.openapi.wm.impl.ToolWindowManagerImpl.a
ExceptionIDEA-160790Unable to save settings: Failed to save settings. Please restart PyCharm
ExceptionIDEA-137007NPE at sun.font.FontDesignMetrics$MetricsKey.init(FontDesignMetrics.java:217)
ExceptionIDEA-156466AE at com.intellij.diagnostic.IdeMessagePanel.showErrorNotification
ExceptionIDEA-120967Settings->Menu and Toolbar not expanding
ExceptionIDEA-168411PluginManager StartupAbortedException
ExceptionIDEA-160341Error at com.intellij.credentialStore.OneTimeString.toString
ExceptionIDEA-164698Throwable at com.intellij.openapi.fileEditor.impl.EditorsSplitters.a
ExceptionIDEA-150925IAE at com.intellij.openapi.fileEditor.impl.EditorComposite.<init>
ExceptionIDEA-149660IAE at com.intellij.configurationStore.StateStorageManagerImpl.expandMacro
ArquillianBugIDEA-143282JBoss Arquillian + IPR project format: IAE at StateStorageManagerImpl.expandMacros()
CSSBugIDEA-160317SASS: Built-in fade-out function not recognized
BugIDEA-151772Angular2 CSS not highlighted even when being used in template
ExceptionIDEA-154246Throwable at com.intellij.psi.css.impl.stubs.index.CssIndexUtil.processKeysInScope
CloudsExceptionIDEA-156073Deployment configuration created from 'Application Servers' toolwindow fails to start if no options are changed in 'Create Deployment Configuration' dialog
Code Analysis. DependenciesBugIDEA-144794Module Dependencies -> Analyse Dependency -> Rerun does not rerun the right analysis
Code Analysis. DuplicatesFeatureIDEA-145091Provide option for duplicated code inspection to exclude generated sources duplicates when processing plain source file
Code Analysis. InspectionFeatureIDEA-156821'Inspection results tool window' - suppressing items of specific type should leave ability to suppress others
FeatureIDEA-164129Jigsaw: provide quickfix when module exported to itself
FeatureIDEA-34620Nice to have to be able to specify pattern or signature for entry points in unused declaration inspection
FeatureIDEA-144795Inspections filtering needs filter for inspections without language
BugIDEA-157046'Unused declaration' inspection shows '1 instantiation found' for constructor of not used class
BugIDEA-156394Incorrect control flow that reports a condition always true
BugIDEA-156364'Inspection result tool window' preview doesn't scroll to view problem item
BugIDEA-160955Inspection Results: inspections not enabled "In All Scopes" are confusingly marked as "Disabled"
BugIDEA-157564'Unused declaration' - in inspection result invalid field is not marked as invalid
BugIDEA-157140'Inspection tool window' counter limited to 1 after rerun when grouping by directory enabled.
BugIDEA-156164Inspection result toolwindow tree - exclude in one node also removes in another
BugIDEA-157966Inspection result tool window shows only one result instead of several for one line when grouping by severity enabled
BugIDEA-151242Run Inspection by Name scope dialog has no default button anymore
BugIDEA-157154Throwable - 'No longer valid' nodes after export/import inspection results.
BugIDEA-156376'Convert to project line separators' inspection can be applied many times
BugIDEA-161871Deadlock when running batch inspection and editing
BugIDEA-157777Case where View Offline Inspection Results doesn't show results
BugIDEA-156823'Inspection result tool window' - Exclude/Include increases counter even the problem already resolved
BugIDEA-156825'Inspection result tool window' - Editing setting should not set inspection analysis profile as active one
BugIDEA-157068Inspection result tool window - 'Nothing here' in quickfix pop-up after using Go Next/Prev problem
BugIDEA-168240Rename 'Import Scheme' to 'Import Profile' and 'Add/Edit description'
BugIDEA-157007XML offline inspection results are not sorted in alphabetical order
BugIDEA-140753Every inspection in offline inspection report is listed 3 times
BugIDEA-177356Unused declaration: inspection problem node doesn't show up as error when the inspection is configured to do so
BugIDEA-159101Odd preview pane for 'Unused declaration' entry points module
BugIDEA-168237Unnecessary popup when import/export inspection settings
BugIDEA-168235"Edit Settings" in inspection result toolbar opens Settings for all inspections, but not for specific one
BugIDEA-160655Inspection profile settings - empty line in Profile list after Resetting settings
BugIDEA-163702No quick fix button on inspection preview at inspection level after the first run
BugIDEA-156793'Unused declaration' - please don't count Entry Points - when inspection in progress
BugIDEA-157009XML offline inspection result - no scrolling, no quickfix buttons - Declaration redundancy inspection group
BugIDEA-144275Checked-Out Settings for Inspection Are Not Active until restart
BugIDEA-161358"Cannot load .idea. The file does not exist" error is shown if .idea folder is removed between offline inspection runs
BugIDEA-156478'Inspection results tool window' loose 'Suppress' button after grouping
BugIDEA-157020HTML export of inspection results - Unused declaration inspection always has only one Problem resolution item
BugIDEA-158795'Apply a quickfix' bulb is not enabled when loading offline inspection result
BugIDEA-156163Inspection result tool window: sometimes odd scrolling in preview pane.
BugIDEA-156310'Inspection Result tool window' wrong counter after applying Suppress for several inner classes
BugIDEA-168254Inspect.sh(bat) doesn't work
BugIDEA-157014XML offline inspection result - empty node for 'no longer valid' item
BugIDEA-160657Inspection profile settings - cannot apply changes right after rename inspection profile
BugIDEA-157909Inspection results "Go Next/Prev Problem" buttons should skip non-problem nodes
BugIDEA-111174Status bar should show inspection highlights even for INFO severity
BugIDEA-156169'Inspection result tool window': 'Filter resolved items' doesn't work without 'Group by directory'
BugIDEA-169227Inspection settings: Restore Defaults does not remove option added to disabled inspection
BugIDEA-156180'Inspection result tool window' Suppress for class shown twice
BugIDEA-130443Inspection settings: tree node does not turn to "modified" state on changing scope set
BugIDEA-55394'Condition always true' inspection sometimes incorrect when variable modified in finally block
BugIDEA-156669'Inspection result tool window' - exclude file scope option when use 'Run inspection on...' button on preview pane
BugIDEA-156353'Editor is already disposed' exception when navigating through inspection result tree
BugIDEA-156683'Unused method parameter' inspection finds only first unused parameter but not all
BugIDEA-162159Inconsistent inspection results when "Group by directory" enabled/disabled
BugIDEA-156893'Inspection result tool window' - inspection description font is too big
BugIDEA-158470'Inspection result tool window' - included back node doesn't appear if filter is on
BugIDEA-156354Throwable - at excluding item of inspection result tree
BugIDEA-155813Freeze after running inspections
PerformanceIDEA-161598AnalysisScope uses and retains a lot of memory
PerformanceIDEA-156387'Inspection results tool window' tree creation slowness without grouping by directory
PerformanceIDEA-156384'Inspection results tool window' tree slowness selecting inspection
PerformanceIDEA-156635Running inspection analysis causes idea to freeze
PerformanceIDEA-157006After importing XML offline inspection results any change of grouping is slow
PerformanceIDEA-172904Slowness viewing inspection result
PerformanceIDEA-157005XML inspection report import hangs after switching to another application
UsabilityIDEA-156179'Inspection result tool window' open settings for selected group
UsabilityIDEA-173023Inspection settings: parent elements do not become "changed" after changing inspection severity
UsabilityIDEA-157156'Unused declaration' - suppress &quickfix actions are available after applying
UsabilityIDEA-155319"Run inspection by name" should not reuse "Find Action" search pattern
UsabilityIDEA-155073"Suppress all inspections" is inconveniently placed
UsabilityIDEA-156675'Inspection result tool window' - please preserve selection after inclusion/exclusion
UsabilityIDEA-156673'Inspection result tool window' - Exclude/Include is not affect children nodes as it should
UsabilityIDEA-96532Orders in Severities Editor and in Severity Chooser are opposite
UsabilityIDEA-156728'Unused declaration' inspection - Edit settings doesn't navigate to inspection when entry point selected
UsabilityIDEA-156727'Inspection result tree' Re-arrange menu items in context menu
UsabilityIDEA-156894'Inspection tool window' - preview scrolls to the beginning of the file after Excluding result
CosmeticsIDEA-156173'Inspection result tool window' Cursor in tree may overlap preview pane
CosmeticsIDEA-173147Ugly Suppress combobox in batch inspection results
CosmeticsIDEA-159065Blinking preview pane of inspection result tool window
CosmeticsIDEA-162907Inspections settings: wrong font color for selected top level nodes
CosmeticsIDEA-157206'Inspection result tool window' - Exclude/Include changes font color when should not
CosmeticsIDEA-156462'Inspection result tool window' on preview shows '1 problemS' when performing analysis
CosmeticsIDEA-157004HTML inspection result report - Could we change Warning and other severity colors
CosmeticsIDEA-156157Odd vertical line (and indent) in preview of inspection results
ExceptionIDEA-159043NPE running 'Unused declaration' inspection
ExceptionIDEA-157558Argument for @NotNull parameter 'src' of com/intellij/util/ArrayUtil.remove must not be null
ExceptionIDEA-157153NPE at importing XML results of inspections
ExceptionIDEA-160668Inspection profile settings - NPE after importing inspection settings
ExceptionIDEA-155872NPE running inspection for the first time
ExceptionIDEA-156670Throwable at excluding several nodes
ExceptionIDEA-155886Throwable after usage of 'Inspection Options'
ExceptionIDEA-156469Throwable - running inspections on IDEA java-tests module
ExceptionIDEA-157464ArrayIndexOutOfBoundsException at traversing inspection results
ExceptionIDEA-155839java.lang.IllegalArgumentException: Argument for @NotNull parameter 'parentNode' must not be null
ExceptionIDEA-156891Wrong offset: 13101. Should be in range: [0, 11760] - canceling inspection
Code CoverageBugIDEA-158755Export Coverage Report as HTML produces a NPE
Code Formatting and Code StyleFeatureIDEA-99267Command line formatter could be implemented
BugIDEA-141916The code formatter:off (//@formatter:off) does not work as expected.
BugIDEA-150768Java fields are shown as plain identifiers if custom color scheme is used
BugIDEA-159285Editor doesn't auto-indent within switch-case correctly
BugIDEA-160426Export of Code Style does not include JavaDoc configurations
BugIDEA-146984Lot of Java color options doesn't inherit from Language Default
BugIDEA-166923Reformat code before commit doesn't pick up code style settings
BugIDEA-156914Allow indent options provider to override language specific indents for data language in templates
BugIDEA-156091Scratch files don't use changed code style
BugIDEA-144945Incorrect notification "The file is indented with 3 spaces instead of 2" in Dart file
BugIDEA-52549Reformat Code misbehaviour in a XML file
BugIDEA-160389Manage Code style setting | Copy to project doesn't update settings editor until settings dialog is reopened
BugIDEA-141467"Reformat according to Style"-Checkbox resets on IDE restart
BugIDEA-173502Applying "Use inherited Attributes" on one item will auto-select inherited attributes option on other items
BugIDEA-132970Provide simple import of IntelliJ code style settings
BugIDEA-144196Strip trailing spaces on save should honor keep Indents on empty lines
BugIDEA-156091Scratch files don't use changed code style
BugIDEA-158868Incorrect whitespace insertion into Java reference expression
BugIDEA-144408Adjusting Settings via a Quick-Fix allows alters Default
PerformanceIDEA-72973Converting spaces to tab on a large file seems to effectively kill phpstorm
ExceptionIDEA-173144Find action exception
Code NavigationFeatureIDEA-155607Prefer classes available in the current module
FeatureIDEA-106194Search in File structure dialog with paste support
FeatureIDEA-112841Navigate to file action should support fuzzier path search terms
FeatureIDEA-111332Navigate file doesn't understand line number
FeatureIDEA-151405More flexible go to file and line action
FeatureIDEA-162418Enhanced go to file formats
BugIDEA-128907Goto declaration in code fragment opens new editor
BugIDEA-171098Class/Symbol Navigation behavior change
BugIDEA-157956Breadcrumb font size doesn't scale down.
BugIDEA-160333Override/implements gutter icon not navigating
BugIDEA-158010"Searching for implementations" thread isn't canceled when the Goto Implementation popup is canceled
BugIDEA-156369Go to declaration on lambda param does nothing
BugIDEA-157772Breadcrumbs are shown incorrectly in the decompiled classes
BugIDEA-149235Unexpected classes in type hierarchy when multiple versions of class present
BugIDEA-160567"Navigate to next highlighted error" is broken
BugIDEA-157786File matching pattern results showed twice for some files
BugIDEA-92217Breadcrumbs are not updated on first mouse/keyboard action just after file reopening
BugIDEA-76466Navigate Symbol does not support anonymous inner classes
BugIDEA-158226Goto Declaration action: is available on literals
BugIDEA-124800Does not work go to the implementation of the method
BugIDEA-159305Low relevant elements on top of the results list in Go to class popup
BugIDEA-156984Deadlock in inheritor search
BugIDEA-157671Wrong title when searching for inheritors
BugIDEA-167877Strange "Go to Implementation(s)" behavior with private inheritors
BugIDEA-165329Can't copy class reference by hitting Ctrl+C in Navigate/Class list
BugIDEA-159188'Back' navigation fails if the 'Choose Declaration' popup was shown
PerformanceIDEA-156735Bookmarks causing typing slowness
UsabilityIDEA-172282Disprefer start-matching variants in Goto popups when the input starts with *
UsabilityIDEA-161069Show special gutter icon for 'implemented via sub-class' methods
UsabilityIDEA-163865"Enter class name" popup showing distant matches first
UsabilityIDEA-22690Show definition for class should show the package
CosmeticsIDEA-137806got to file and line using file(number) syntax along with file:number
ConsoleBugIDEA-161123Saving console output to file produces an empty file
BugIDEA-167431Console filters can no longer change foreground text color
BugIDEA-167094Can't remove first char in user input
BugIDEA-132694ANSI colors need restart for a new settings to apply
BugIDEA-152620Move Filter#applyFilter from EDT to the pooled thread
BugIDEA-146228IntelliJ does not respond when searching SQL History
BugIDEA-145124Console contents not visible when window is floating
BugIDEA-149450ANSI escapes not interpreted as expected
PerformanceIDEA-165325version 2016.3 extreme slow console
UsabilityIDEA-63980Make idea.cycle.buffer.size configurable in IDEA GUI / IDEA settings
Cucumber JVMFeatureIDEA-157368Behave: Scenario outline parameters are not highlighted in outline description
Custom JREBugIDEA-166384provide a utility method in IDEA to support JRE-166
UsabilityIDEA-57233Editor font antialising/appearance problems on Linux
DebuggerFeatureIDEA-54188add a configuration option to preselect/automate disconnection and process termination on termination of a debugging session
FeatureIDEA-43728Provide a way to step in a chosen thread while others remain suspended
FeatureIDEA-145368Support force early return
BugIDEA-149816No completion and strange errors in condition field in decompiled files
BugIDEA-150534DebugConfigureAction DebugLogConfigureDialog is missing getDimensionServiceKey()
BugIDEA-156761'Show watches in variables tab' button moves to Server tab
BugIDEA-149017Process list implementation does not provide correct executable names for applications with spaces in their paths
BugIDEA-149786Watches editor is broken
BugIDEA-172505Gradle mulitmodule project debug jumps to wrong module for breakpoint
BugIDEA-152840Breakpoint popup: Condition field mnemonic is passed to main frame
BugIDEA-177131Debugger console should have horizontal scrollbar and the ability to scroll content with the mouse
BugIDEA-156365Force Step Into in debugger causes AbstractMethodError
BugIDEA-150317Debugger: Evaluate dialog: Expression Mode button shows wrong mnemonic
BugIDEA-170677Top-levels tabs in the "Debug" tool window is merged after the IDE restarted
BugIDEA-170670Top-level tabs are losing a state when session restarted
BugIDEA-161754Terminate process on exit choice is not preserved
BugIDEA-150591Attach to process list doesn't show processes launched from terminal with a relative path
BugIDEA-150592Attach to process list doesn't show process with non–latin character
BugIDEA-161086Add to Watches from "Evaluate" dialog should evaluate only once
BugIDEA-145015Quick evaluate expression (ctrl+alt+8) instruction is silently ignored when an attempt is made to evaluate the same expression a second time.
BugIDEA-130822Special Java/Swing widget to enable/disable breakpoints does not hide when active tab changes during debugger session
BugIDEA-150411Debug tool window: on reusing it different type of configuration picks up watches from previous type
BugIDEA-156086Create breakpoint with text selection fail
BugIDEA-131748Stop debug session kills all processes
UsabilityIDEA-144953Navigate from Evaluate Dialog should close it
UsabilityIDEA-120087Debugger: changed state of a breakpoint is not visible, until applied
UsabilityIDEA-142098Multiple breakpoints in a single line: don't display the whole method body in toggle breakpoint drop-down
UsabilityIDEA-167143Invalid focus switching in variables window
UsabilityIDEA-156493"Evaluate Expression" – underlined character conflicts with "Paste from History"
UsabilityIDEA-172133"Add to Watches" action does not "follow" editor selection
UsabilityIDEA-155212breakpoint display in favorites is suboptimal
UsabilityIDEA-124497Debugger: "Resume/Pause Program" in menu "Run" is active active
UsabilityIDEA-152214Xcode like way to disable/remove breakpoints
UsabilityIDEA-151857Field "tooltip delay" is active when the check box is disabled
UsabilityIDEA-172772Action "Resume program" is not available when IDEA is updating indexes
CosmeticsIDEA-57838Different breakpoint icon for conditional breakpoints
CosmeticsIDEA-103215Add automatic word wrap to conditional breakpoint expression modification popup
DecompilerBugIDEA-82515Failed assertions within psi.impl.compiled on opening class files compiled by Kotlin
Diff_MergeFeatureIDEA-170174Implement "Mirror to left/right" from FTP compare on local compare
FeatureIDEA-149184Add auto scale to fit downscaling, remember zoom factor and zoom both images at once options to image diff
FeatureIDEA-64244Enable "annotate" feature in merge window.
FeatureIDEA-138701Separate gutter highlighting for whitespace-only changes
FeatureIDEA-115600Advanced syntax coloring not working properly in 'Show Diff' window
FeatureIDEA-167631Open all files which are modified in the current branch
FeatureIDEA-166528Window "Difference between master and ... (Local) versions in ...
FeatureIDEA-16394Option to turn off inspections in diff window
BugIDEA-160945Inspection highlighting in the Merge dialog does not work
BugIDEA-127612Optimize imports action available in diff
BugIDEA-144276Diff view shows "no differences" message when "Do not highlight" option is set
BugIDEA-173149Next Difference does not work on emptied files
BugIDEA-141370Diff dialog cache for files out of project
BugIDEA-22363Diff Window in Ignore Whitespace Mode: Says "No Difference" Even If Threr're Ignored Differences
BugIDEA-158003Compare Files no longer works with files in archives (jar, zip)
BugIDEA-173906Diff on item in shelf is not syntax highlighted
BugIDEA-111268Tab width not respected when viewing code changes inline
BugIDEA-147700Diff view opens new window in smallest window possible only showing close, min, max buttons
BugIDEA-160646External Diff Tool: file extension is empty for files with unknown file types
BugIDEA-161976Resolve merge conflicts window too small on hidpi screen
BugIDEA-101502Dir diff: Files with different line separators(the only difference) are shown as different in the list, but are actually the same ("no differences")
BugIDEA-156201Insertion / deletion markers are shown at wrong positions with "Ignore whitespaces" policy
BugIDEA-171674First tab is very short in the left Diff pane
BugIDEA-151526No annotate action is enabled in "Compare with..." dialog for repository version
BugIDEA-151524Strange error and exception in log if try to annotate diff for newly added file(from local changes)
BugIDEA-151521Assertion error on try to annotate diff for local changes(in case one line)
BugIDEA-150929Command line "idea.sh diff" does not work if idea is not running
BugIDEA-151274Column selection mode does not work in 3-way merge
PerformanceIDEA-159879Memory leak while looking many diffs
UsabilityIDEA-105203diff section in commit window is not resizable
UsabilityIDEA-137362Commit Changes dialog diff area to small
UsabilityIDEA-137936New diff shows less code than before
UsabilityIDEA-141671Filenames used in external merge are not immediately self-documenting
CosmeticsIDEA-110941Bookmark icons shown flipped horizontally in diff window
CosmeticsIDEA-136265Diff view: the collapsed lines markers are not visible with some look and feels
ExceptionIDEA-162307Cannot open Diff of SQL file anymore: UnsupportedOperationException: Should not be called directly
ExceptionIDEA-167185AE at com.intellij.util.xmlb.MapBinding.deserializeList
DockerFeatureIDEA-142322Add possibility to close attached console
FeatureIDEA-152660Docker Log console does not support ANSI color codes
FeatureIDEA-170246Docker: Support HEALTHCHECK and SHELL instructions in the Dockerfile
FeatureIDEA-170253Docker: Validate the number of arguments for instructions in the Dockerfile
FeatureIDEA-153202Docker plugin - select visible containers/images
FeatureIDEA-172226Support docker stages synthax
FeatureIDEA-178533compose YAML: show enum violations in docker compose inspections
FeatureIDEA-138992Simplify converting options for command line docker util into json
FeatureIDEA-170237Docker: Show inspection errors for invalid LABEL instructions
BugIDEA-157736Deploying docker container fails because HostConfig was removed in docker v1.12
BugIDEA-168191|| missing as operator for Dockerfile RUN command
BugIDEA-162764Docker: wrong item is selected when trying to configure server
BugIDEA-145427Docker: support full set of the options from Docker 1.21 remote api
BugIDEA-175715Docker: display "Dockerfile detection" events only project-dependent
BugIDEA-161488Docker terminal should be available in dumb mode
BugIDEA-155582Docker. Error is displayed for "!" in the correct Dockerfile in the Editor.
BugIDEA-170242Docker: Show inspection errors for invalid ARG instructions
BugIDEA-151477Dockerfile false negative syntax error message
BugIDEA-155150Dockerfile editor misidentifies $(...) as syntax error
BugIDEA-155691Docker: attach fails for remote Docker with insecured HTTP access
BugIDEA-161514Docker Deployment run configuration hangs
BugIDEA-151199Docker: (on win / mac): Compute the local volume bindings considering virtual box path mapping
BugIDEA-159223Support direct connection via unix:// on Mac OS X
BugIDEA-144983Docker: improve UI for configuring container options
BugIDEA-172233Dockerfile: treat variables declared in ARG instructions
BugIDEA-150970Docker: edit container settings in the Docker view
BugIDEA-152971Docker: dedicate view is not created on first server registration until project is reopened
BugIDEA-155508Docker. Error is displayed for the correct Dockerfile in the Editor.
BugIDEA-155353Docker. Idea hangs after opening some amount of container tabs.
BugIDEA-151572Docker: rename Settings / Clouds item to 'Docker' if it's the only cloud available
BugIDEA-145814Dockerfile synthax errors
BugIDEA-173563Docker: ADD instruction: Provide an inspection error in case of multiple source files and "/" absence at the end
BugIDEA-173387Unable to install or update to docker plugin 2.5.5
UsabilityIDEA-177951Docker: Dockerfile detection balloon should handle the case when too many files detected
UsabilityIDEA-155356Docker. Order containers and Images in the Docker View.
CosmeticsIDEA-169257Docker: Find Usages called from Dockerfile. Correct the title and review buttons.
TaskIDEA-144850Docker: run a command in a running container
ExceptionIDEA-173553AssertionError on COPY --from
ExceptionIDEA-145239NPE on adding volume binding
ExceptionIDEA-158428Throwable: Dockerfile detection is already registered
DocumentationBugIDEA-152590Quick doc font size is not remembered between IDE restarts
UsabilityIDEA-158071Documentation of com.intellij.psi.tree.* API classes
Eclipse IntegrationBugIDEA-160071When eclipse plugin is not available, show error message (instead of exceptions)
Editor. Code CompletionFeatureIDEA-171779Make default size of code completion popup configurable
BugIDEA-152395Wrong bracer wrapping in lambda expression
BugIDEA-113393Live Template variable skipped when its default value contains a dash
BugIDEA-165880Out of date psi in completion API
UsabilityIDEA-178522Please repeat "Complete function with parameters" setting in editor
UsabilityIDEA-159953Esc for completion popup also removes the usages highlighting
Editor. Editing TextFeatureIDEA-45030Add ability to specify cursor position in File Templates (e.g. special macros as for Live Templates)
FeatureIDEA-147003Provide syntax aware 'move left'/'move right' actions
FeatureIDEA-111564Leave caret where is if inline refactor mode is exited with Shift-ESC
FeatureIDEA-127539Support for ligatures in editor
FeatureIDEA-23487Parameter Shifting like Method Shifting
FeatureIDEA-145479Live Templates: reverse of underscoresTo*() functions
FeatureIDEA-158886Live Template unable to use variable + constant as default
FeatureIDEA-12068Add ability to go to matching brace/parenthesis/bracket
BugIDEA-178621Join Lines does not add whitespace at the end of lines if they are indented
BugIDEA-149641Scrolling pane horizontal position does not follow the caret if Live Template variable placeholder is active
BugIDEA-96781Quick Documentation: after closing pinned Documentation window it doesn't open when the caret is in documentation comments
BugIDEA-166498Incorrect border effect in editor with new hidpi
BugIDEA-172026No cursor when switching to another window.
BugIDEA-162004Rich copy produces wrong foreground color at the start of copied fragment
BugIDEA-144876Dragging breakpoint produces text selection
BugIDEA-43257When several JDKs are used in project modules, "Overridden in subclasses" list includes classes from every JDK
BugIDEA-111328Move caret to matched brace works incorrectly
BugIDEA-154763Ligature for "[]" doesn't work in C/C++ for arrays with FiraCode
BugIDEA-152063IntelliJ fails to use encoding from project settings for files containing breakpoints when project is opened
BugIDEA-161056In column mode, after pressing Shift-PageDown to efficiently extend the column to the bottom of the page, Shift-UpArrow stops working.
BugIDEA-165577Sibling multi-cursors are merged into one
BugIDEA-166581Incorrect font rendering in vcs change preview (new hidpi)
BugIDEA-159282When commenting with line comment Hebrew text is placed on the left side of the comment
BugIDEA-159281In .rb files when commenting with line comment Hebrew text is inverted
BugIDEA-166059Corrupted zero latency typing with the new hidpi
BugIDEA-160423Caret#selectLineAtCaret(and others) operate on a different caret instance
BugIDEA-150296java.lang.IllegalArgumentException: line must be non negative: -1
BugIDEA-170583"Reformat Code" leads to weird scrolling in the editor window
BugIDEA-158635Toggling Ligatures does not update font preview
BugIDEA-146566Live Templates seem to be ignoring in-line @ symbols
BugIDEA-151013"Move statements right and left" works unreliably in XSLT
BugIDEA-149995Folded code foreground not inherited from default text
BugIDEA-161105Breakpoints move unexpectedly on editing
BugIDEA-159399Selection gets broken for multi clicking Alt+Shift+Middle Mouse Button
BugIDEA-177564Status bar of Console window does not update the "Column" field
BugIDEA-157196Regression: mouse wheel scroll doesn't work while highlighting editor text
BugIDEA-171695Intention bulb blocks cursor placement
BugIDEA-155936Incorrect width of cyrillic letters in editor.
BugIDEA-168069Join Lines throws array index out of bonds on an empty file
BugIDEA-149817IntelliJ: Cannot navigate from usage to declaration of method because documentation overlay hides usage
BugIDEA-158038Multi-caret typing of a text where some characters are inserted automatically results to different content of the first and other lines
BugIDEA-150505Underlines characters invisibles
BugIDEA-158439Newline in FoldingBuilder.getPlaceholderText is displayed differently cross-platform
BugIDEA-159929# in custom File templates in WebStorm are marked as errors
BugIDEA-140614Find action search field doesn't respect editor's keymap for 'paste' and 'cut up to line end' actions
BugIDEA-77306Expand Abbreviation showing red placeholder rectangle and needs to confirm by pressing Tab/Enter/Esc second time (CSS, JS) when caret is in it
BugIDEA-150440Soft-Wrap should wrap at the configured code width
BugIDEA-172241Uncomment of multiple blocks in properties file does removes too many characters
BugIDEA-165853Unable to save settings: Failed to save settings. Please restart IntelliJ IDEA
BugIDEA-150819Keymap - multiple identical shortcuts for the same action
BugIDEA-177979Impossible to enter zero width non-joiner character on Windows 10
BugIDEA-110029documentation window disappears immediately
BugIDEA-161293Console Font preview - gutter is not updated on font size change
BugIDEA-150132When selecting and dragging text to "watches" most of the time the editor will start scrolling down and marking the whole text automatically.
BugIDEA-173263"Auto-Indent Lines" does not move to the next line when caret is inside a string with injected language
BugIDEA-76883The yml file has more code folding outline, and it position is error. (Have picture)
BugIDEA-159777ObjectNotDisposedException on project close with opened evaluate window
BugIDEA-158559Drag in annotations area starts selection
BugIDEA-172912Garbled characters in quick documentation
BugIDEA-167611Default printer font size is big on HiDPI display
BugIDEA-168209Quick doc window is not closed from the first attempt
BugIDEA-162245Auto-import is aggressively importing non-existing symbols
BugIDEA-166403Backspace does not remove indents and new lines in scratch files
BugIDEA-161409Folded imports region opens when imports are added
BugIDEA-167937Documentation window gets focus on second Smart Type completion
BugIDEA-170997Multi-caret: A character is deleted despite empty selection
BugIDEA-150208Text selection is shifted / wrong text selection
BugIDEA-161410Quick Documentation: double opening angle brackets are printed as single brackets
BugIDEA-160904Semantic highlighting setting isn't saved between restarts
BugIDEA-151182AWT freeze after git pull
BugIDEA-161968Multiselection cursor location is unexpected
BugIDEA-167630Backspace > Unindent to nearest indent position option doesn't work as expected beyond the line end
BugIDEA-98074Line spacing makes cursor oversized
BugIDEA-165306Multiple caret Copy and Paste gives inconsistent results
BugIDEA-159638scratch buffers generate errors in undo
BugIDEA-165337Copy-paste from IDEA to TextEdit and back loses line breaks
BugIDEA-173190"Show Breadcrumbs" item in breadcrumbs bar context menu does nothing
BugIDEA-106950Incremental selection doesn't work in android logcat
BugIDEA-157592Move text through drag'n'drop on line numbers doesn't work. It copies the text instead
BugIDEA-156530Trailing whitespace being stripped only from the file which editor tab is active
BugIDEA-160978'Quick Documentation' doesn't work in modal dialogs
BugIDEA-154312IDE becomes unresponsive on file save/sync.
BugIDEA-168452Backspace does not change cursor position
PerformanceIDEA-157963Editor search leak when closing the editor
PerformanceIDEA-157087Issue with Xml with Ligature
PerformanceIDEA-156978LineSet should handle typing in large lines more efficiently
PerformanceIDEA-164157Editor lags on typing 'Tab'
PerformanceIDEA-166747Freeze after calling duplicate action repeatedly
PerformanceIDEA-135620Multiple selections are extremely slow in edge cases
PerformanceIDEA-154272Editor opening should do heavy operations in background
UsabilityIDEA-159851External documentation doesn't jump to method, only top of the file on OS X
UsabilityIDEA-156760'Non-project files protection' dialog is had to use with a keyboard
UsabilityIDEA-97406If user choose bigger edtior font, text effects (underlining, underwaving, strikeout) are still 1 pixel wide
UsabilityIDEA-156759Add an option to 'Non-project files' protection dialog to edit files in a folder
UsabilityIDEA-156758Disable non project files writing protection, when file is opened explicitly
UsabilityIDEA-126952Scratches should have an extension
UsabilityIDEA-158519Property files containing RTL strings and tokens (Arabic and Hebrew) are not rendered correctly
UsabilityIDEA-87318Backspace should delete whitespace to chosen indent level, or be configurable
UsabilityIDEA-115413UI hang on Regex evaluation
UsabilityIDEA-150389Remove the term "Platform" from the UI
UsabilityIDEA-167366When you enter Ctrl-Ctrl Down arrow to enter column mode, then while holding ctrl do shift right arrow, does not move to next word boundary
UsabilityIDEA-173273Renaming a parameter with a hint looks weird
UsabilityIDEA-111169Selecting lines using tap-drag (not click) on macbook forgets last line of selection.
UsabilityIDEA-167931"Quick Evaluate Expression" with default mouse shortcut adds multiple carets on Linux
UsabilityIDEA-156510Action "Toggle case" doesn't change capitalization of characters preceded by escaped backslash
UsabilityIDEA-171904Parameter hints exclude dialog should remember the selected language
UsabilityIDEA-159092Middle mouse double click does selection in editor
UsabilityIDEA-152763Javadoc attached to library made by Doclava doesn't show due to attribute difference
UsabilityIDEA-151393Changed order of intentions
UsabilityIDEA-121829Disallow editing of framework/third-party files
UsabilityIDEA-149632Display editor notification for library class sources that don't match bytecode
UsabilityIDEA-127845Select logical line rather than visual line if an action which requres selection is invoked
CosmeticsIDEA-148843A letter may appear on both sides of the caret
CosmeticsIDEA-170592Choose Content to Paste Dialog (Ctrl+Shift+V) only highlights the first match per line
CosmeticsIDEA-67480Font baseline is shifted for Consolas font
CosmeticsIDEA-178723Non expandable foldings are always selected
TaskIDEA-149785Add an option in editor settings to disable adding carets on double-Ctrl+arrows
ExceptionIDEA-159106TraceableDisposable$DisposalException at at com.intellij.openapi.util.TraceableDisposable.throwDisposalError()
ExceptionIDEA-159934java.awt.HeadlessException is thrown while building searchable options in headless mode
ExceptionIDEA-160466Throwable at com.intellij.openapi.editor.impl.SoftWrapModelImpl.getRegisteredSoftWraps
ExceptionIDEA-172324IndexOutOfBoundsException in SegmentArrayWithData
ExceptionIDEA-160596Transaction assertion from daemon createPasses
Editor. Error HighlightingBugIDEA-144686Inconsistent coloring in Maven pom.xml/Spring config.xml files
BugIDEA-161890Kotlin unused symbol highlighting is not updated after adding/removing single usage in another file
UsabilityIDEA-160408Quote not recognized as an end to String
ExceptionIDEA-160814IndexNotReadyException
Editor. Intention ActionsFeatureIDEA-150587Ability to click on links from inspections above the Editor using keyboard
CosmeticsIDEA-151324Not all actions in Generate menu have description in Status Bar
External ToolsBugIDEA-164380External tool is not invoked after Git commit
BugIDEA-110240Auto select run tool after commit
File SystemBugIDEA-166879IDE cannot handle 2GB+ jars
BugIDEA-166870The IDE cannot access filesystem on AArch64
BugIDEA-56577Report situation when user.home is pointing to an UNC path
BugIDEA-150199cannot create file with non-ascii characters in name
BugIDEA-159022Gradle project doesn't see the updated jar file after sibling Maven module artifact rebuilt
BugIDEA-166196Modules cannot be loaded error when loading a project containing iml reference outside of project dir.
BugIDEA-160580When symlink target changes to another with different content but the same length, content is not reloaded
BugIDEA-151155Standalone inspections fails on Windows
BugIDEA-161568UI Freezes after maven build ends
BugIDEA-162327Recognize NTFS junctions
BugIDEA-157840Save Document action doesn't work during indexing
PerformanceIDEA-165859Pycharm freezes when open a folder with recursive symbolic link
TaskIDEA-103559File sync issues on paths containing non-ASCII characters
ExceptionIDEA-156660at com.intellij.openapi.vfs.impl.local.NativeFileWatcherImpl$MyProcessHandler.notifyTextAvailable
ExceptionIDEA-137695Pycharm was working fine, however i restarted my computer and tried to open it and I got a java.lang.runtime exception
Find, Replace, Find UsagesFeatureIDEA-147920Make Find in Path result previews editable
FeatureIDEA-156611Find/Replace toolbar: Escape now clears the replace lineedit which also clears the lineedit history entry
FeatureIDEA-150915Find in Path Dialog: Preview tab does allow F4 to jump to source when focus in code preview pane (lower half)
FeatureIDEA-166464Be able to merge usage from the same line in the "find in path" preview pane dialog
FeatureIDEA-85093Find in files preview: allow to edit source file
FeatureIDEA-157910Find in path should be able to search in several threads
FeatureIDEA-171606Show VCS change marks in the search results preview editor gutter
BugIDEA-161214Find in Path: Preview editor does not abide by option "Allow placement of caret after end of line"
BugIDEA-155972Find in Path: preview shows wrong position
BugIDEA-112749Find field unicode support
BugIDEA-160080Find query lost when switching between "find in path" and "replace in path" dialogs
BugIDEA-170963Mnemonics shortcuts in new Find in path dialog is a mess
BugIDEA-168276"Find in path" doesn't change the directory to the selected one
BugIDEA-120891PhpStorm stuck after trying to cancel find in path
BugIDEA-157575Unexpected Cursor Behavior in Search
BugIDEA-160785Selection in a find/replace field is broken
BugIDEA-160192Seach and replace inconsistency started from Seach dialog
BugIDEA-167436Rerun 'Find Usages' empties first tab
BugIDEA-167096'Too Many Occurrences' window appears too early
BugIDEA-167546Find/Replace nonfunctional when newlines are embedded in the Find textbox
BugIDEA-170038Find in Path dialog does not close automatically when clicking the code area
BugIDEA-161826Find and Replace keeps previous data in Replace field but it looks cleared
BugIDEA-157351Replace in Path: When next file is opening, code editor is blank (hangs) with "Loading" spinner
BugIDEA-146150Page up/down in preview mode of find in path
BugIDEA-14042910s hang on changing groupping in show usages
BugIDEA-159341Replace in file: Regex for start of line matches twice on empty lines
BugIDEA-68160Find & Replace: preserve case bug
BugIDEA-156921Find In Path toolwindow - focus is stolen by "Preview Occurrences" editor
BugIDEA-166240Unordered line numbers in the "Find" panel
BugIDEA-104681Regex Find always case-sensitive with non-english characters
BugIDEA-159829when editing in find result previews the cursor jumps some number of characters after insertion
BugIDEA-149094Show usages popup speed search issues
BugIDEA-165473Find Usages results tool window scrolls erratically when removing result items and Group by usage type option enabled in view
BugIDEA-160975Find Usages does not search in library sources when there are several JDKs in the project
BugIDEA-150931Find in Path dialog: Preview tab doesn't show file path anywhere.
BugIDEA-144570Regex search freezes due to Preview tab
BugIDEA-120868Usage search "No Results" popup too small
BugIDEA-172370Find in path "Searching..." when nothing found
BugIDEA-150928The regex search dosent work sometimes.
BugIDEA-156850find preview ignores app settings ("soft wraps": off, "indent guides": on)
BugIDEA-140074Find in Path not working in jar file paths - Directory scope not working as before
BugIDEA-167872Find results from different files are merged
BugIDEA-169849Can't undo in Find in Path
UsabilityIDEA-172283'Select All Occurrences' not available in replace mode
UsabilityIDEA-156629No replacement hint for the second and further occurrence in regex replace
UsabilityIDEA-167955Find: `Ctrl+F` on selected word doesn't pre-select text in search field if Find bar is open
UsabilityIDEA-61493Find Usages: Separate "Use soft wraps" option for the preview panel
UsabilityIDEA-80778Folding - provide an option to NOT automatically unfold when user performs Find.
UsabilityIDEA-73115"Show Usages" action should be more smart and detect on which usage it's invoked
UsabilityIDEA-157440No space between line number and code when exporting found occurences to text file
UsabilityIDEA-139310"Find Usages" should report source usages before usages in generated code
UsabilityIDEA-87037Usability: Find in Path -- NOT in Whole project
CosmeticsIDEA-172116Module dropdown in find window is too narrow, not resizable or scrollable
ExceptionIDEA-167571Argument for @NotNull parameter 'scope' of com/intellij/psi/search/LocalSearchScope.<init> must not be null
ExceptionIDEA-171668NPE at com.intellij.usages.impl.UsageViewImpl.doAppendUsage(UsageViewImpl.java:1060)
GWTFeatureIDEA-138721Show module for bundled CSS files
BugIDEA-170329IDEA 2017.1 NoClassDefFoundError: com/intellij/javascript/debugger/sourcemap/SourceMapHelperKt$createResolver$1$1$1$1 when debugging GWT
BugIDEA-157674"Unresolved references in JSNI methods" inspection not detecting anything
HTMLBugIDEA-157251Wrong autocomplete for opening tags
BugIDEA-151185Thymeleaf namespace declaration not recognised in script tag
IDE ConfigurationFeatureIDEA-171540Template Explorer like in Resharper
FeatureIDEA-165592Bring back opening files from CLI in new window as option
FeatureIDEA-158388Add 'fromIDE' to all URLs that are opened from updates dialog
FeatureIDEA-108023Add "mouse wheel up" and "mouse wheel down" to mouse shortcuts
FeatureIDEA-159520Different color for lambda parameter
BugIDEA-172847On restart Intellij keeps clearing my font settings
BugIDEA-156772Some Live Templates lost their "applicable context" IntelliJ 2016.2 EAP
BugIDEA-166807IntelliJ does not recognize and deletes project shared file templates
BugIDEA-167444Deletion of css dialect or template data language left an artefact and causes an IOOBE
BugIDEA-150830Edit Custom VM Options propose to create idea64.vmoptions file instead of idea.vmoptions on OSX
BugIDEA-166732JetBrains IDEs do not restart if IDE is in a directory containing '.app' in it's name on Mac
BugIDEA-156742Save problem for Code Style Setting on Windows
BugIDEA-160459Nothing happens after 'Check for Updates...'
BugIDEA-160474File Templates: 'Enable Live Templates' checkbox is cleared on restart
BugIDEA-166892NullPointerException on startup
BugIDEA-166362Show warning notification concerning outdated boot java runtime
BugIDEA-151560Map help button to the specified id
BugIDEA-155871Page 'http://localhost:63342/m?jar/resources/inherit.gif' requested without authorization popups
BugIDEA-166179Font size is not preserved after updating to EAP build
BugIDEA-157865Lots of 'Already disposed' from 'UpdateChecker.checkForUpdate' when IDE is closed
BugIDEA-165515'Edit Custom VM Options' action should edit file defined by IDEA_VM_OPTIONS environment variable if it's set
BugIDEA-167619I can not add another import to Java|Imports
BugIDEA-166402incorrect warning
BugIDEA-159360Custom file type: inconsistent highlighting of symbols added as keywords
BugIDEA-158422Keymap: for non-QWERTY keyboard layouts Ctrl is processed as Ctrl+Alt (Windows) or Alt (Mac OS) when combined with symbols
BugIDEA-173324Some Code Style settings are applied on Cancel
BugIDEA-160935Could not initialize class com.intellij.codeInsight.template.impl.TemplateContext$ContextInterner in presence of Database Navigator plugin
BugIDEA-151084'Gradle' and 'Maven' items are always shown in results of searching in Keymap by shortcut
BugIDEA-130605Import Settings: "Select Components to Import" dialog has some unreadable items
BugIDEA-162050Show in files does not work in Debian Linux 8
BugIDEA-156990Keymap: for non-QWERTY keyboard layouts semicolon is treated as colon in keyboard shortcuts
BugIDEA-173342Some non-URL paths in IDEA settings are stored with system-dependent separator
BugIDEA-156986Keymap: "English layout support" option gets disabled after reopening Preferences
BugIDEA-134815File templates: can't create templates from file without extension
BugIDEA-153585File Templates can't be exported/imported via Export/Import settings
BugIDEA-159323Custom file type: hex prefix configuration has no effect (no number highlighting)
BugIDEA-157128IDE loses Live Template "Applicable in" status on restart
BugIDEA-153597Settings > Appearance > "Override default fonts" should display current font when unchecked
PerformanceIDEA-173601File synchronization makes the UI freeze for half a minute
UsabilityIDEA-160418Settings search: don't start search when only 1 character was typed
UsabilityIDEA-149673"Update channel switched to Early Access Program" notification is shown even on the first start-up
UsabilityIDEA-165796remove perm gen options from OutOfMemoryDialog
UsabilityIDEA-142986Settings / Colors and Fonts: hyperlink near "Use inherited attribute" could be always enabled
UsabilityIDEA-166720Please sort lines in Settings - Editor - General - Console - "Fold console lines that contains"
UsabilityIDEA-143998Provide direct link for issue creation when an internal error occurs
UsabilityIDEA-177422Remove default shortcut for 'Rerun' action in Visual Studio keymap
CosmeticsIDEA-167421SQL Dialects Settings: the path to specific file/folder uses incorrect slashes on windows
CosmeticsIDEA-148604White box in Keyboard Shortcut dialog in Preferences | Keymap
TaskIDEA-158229Disable "VM options file path missing" warning in headless mode (offline inspections/duplicates)
TaskIDEA-149458Support for parallel update campaigns in a single channel
ExceptionIDEA-159849NPE at com.intellij.openapi.components.impl.ComponentManagerImpl.registerComponentInstance(ComponentManager Impl.java:449) on startup
ExceptionIDEA-148289NPE at com.intellij.ide.passwordSafe.config.PasswordSafeConfigurable.isModified
ExceptionIDEA-158917Exception on startup
IndicesBugIDEA-155918Trying to save settings when everything seems to be already disposed.
BugIDEA-156849Modal indexing
BugIDEA-161307ShutDownTracker#ensureStopperThreadsFinished deadlock
BugIDEA-173382EDT is blocked on start
BugIDEA-166470Deadlock
BugIDEA-156411UI lockup on updating indices
PerformanceIDEA-158106FileContentQueue leaked after indexing and closing all projects
PerformanceIDEA-148981Index rebuild doesn't complete after idea start
PerformanceIDEA-167372Building the stub tree for a file loads its contents twice in a row
PerformanceIDEA-167934Out of memory dialog on IntelliJ IDEA start/open project
UsabilityIDEA-170114"Indexing paused during Power Save mode" shows forever and IntelliSense issues on Power Save mode
ExceptionIDEA-165396Don't start indexing after the project is disposed
JSPBugIDEA-158708JSP code completion not working in IDEA 2016.2
BugIDEA-149951Reformatting JSP does not recognize HTML; flattens everything
Java. InspectionsFeatureIDEA-173177Inspection: Comparing 'compareTo()` or 'Comparator.compare()' result with 1 / -1
FeatureIDEA-159678Warn about possible NullPointerException on throw
FeatureIDEA-163460Recognize patterns convertible to Arrays.setAll()
FeatureIDEA-165942Inspection to replace method call in a loop with bulk operation
FeatureIDEA-165108Objects.requireNonNull with argument of primitive type should be reported as warning
FeatureIDEA-165766Add inspection for explicit calls to no-argument super constructor
FeatureIDEA-160448Simplify groupingBy-collectingAndThen-Optional.get Collectors chain
FeatureIDEA-172417Dataflow analysis: track that loop is visited if and only if array/collection is non-empty
FeatureIDEA-166888Report useless Stream or Optional intermediate operations
FeatureIDEA-146716Add inspection for "Iteration over entrySet() can be replaced with forEach"
FeatureIDEA-171813Inspection to verify parameters of MethodHandle.invoke method
FeatureIDEA-172358Inspection to verify parameters of VarHandle.get(), VarHandle.set(), and similar methods
FeatureIDEA-167318MethodHandle/VarHandle signatures inspection
FeatureIDEA-170892Inspection: Suspicious Arrays.fill() call
BugIDEA-148688"Variable assigned to itself" inspection quickfix breaks code
BugIDEA-172636"Inspect Code" results are closed immediately for "HTML problems in Javadoc"
BugIDEA-172529False positive: "Variable can have 'final' modifier" on code which will be final in byte code
BugIDEA-162106"default package" shown as "<default>" in inspection results after exporting and importing
BugIDEA-173021@SuppressWarnings("JavadocHtmlLint") doesn't work
BugIDEA-166449'Unused declaration' inspection doesn't work for local variables in some cases
BugIDEA-166602Duplicate Structural Search Inspection breaks feature in IDEA 2016.3.2 and 2016.3.3EA
BugIDEA-160991Returning null should result in a warning in @TypeQualifierDefault notnull method
BugIDEA-118095unused field annotated with @Mock not marked as unused
BugIDEA-160298Unused declarations inspection redesign - grouping in tool window affects showed problem
BugIDEA-154071Confusing UnusedParameters inspection result
BugIDEA-160046Unused declarations inspection - FQN of unused class not properly shown on preview pane
BugIDEA-160870Unused declarations inspection - preview pane counts only unused parameters and local variables
BugIDEA-156403JavaDoc inspection false positive for @see with external link
BugIDEA-155863'Missing 'package-info.java' inspection doesn't provide proper quick fix actions and their description
BugIDEA-159674"Constant conditions & exceptions" false positive in GeneralCommandLine.MyTHashMap.putAll()
BugIDEA-173522"Java | Java 9 | Java module naming conventions" inspection has wrong name
BugIDEA-151423Replace all anonymous with lambda does not replace all on first invocation
BugIDEA-148069Declaration can have final modifier reports false positive on @Parameter and @Mock in JUnit tests
PerformanceIDEA-166140Code cleanup is too slow and needs too much memory
UsabilityIDEA-160537Unused declarations inspection - conflicting mnemonics when 'Run inspection by name'
UsabilityIDEA-168244Group inspections in 'Java language level migration aids' by Java version
UsabilityIDEA-160300Unused declarations inspection redesign - unused parameter node also contains quifixes for method
ExceptionIDEA-160735Throwable after adding two custom severities, completing analysis and editing
ExceptionIDEA-160043Unused declarations inspection - exception closing inspection result tool window
ExceptionIDEA-161366Throwable and hangs when try to rename JUnit class name with inspection quickfix
Java. Intention ActionsFeatureIDEA-178774Unroll loop intention action
FeatureIDEA-165428Intention // Inline "else" code branch
BugIDEA-148839Unbounded generic code generated
BugIDEA-157973Create method quickfix delete body of another method if caret is moved to another method body when template is working
BugIDEA-147577Expression type action slightly broken
JavaEE. Deployment and RunBugIDEA-144313Redeploy "null" message
JavaEE.WebLogicBugIDEA-167857Weblogic: log line is marked as a red error while contains a text '<info>'
JavaScript. DebuggerBugIDEA-160102JavaScript Debugger: "Copy Watch"creates buggy code
Language InjectionBugIDEA-119612Settings / Language Injections: duplicate of bundled entry is bundled and not saved on restart
Local HistoryBugIDEA-171946local history revert a dot is inserted in first char of file
BugIDEA-172561Local history diff is not properly rendered unless dialog is resized
Packaging and InstallationFeatureIDEA-155466Make Default Configurations for GNU/Linux's First-Run Wizard Adjustable During Packaging
BugIDEA-170328Command-line launcher does not work on Python 3
BugIDEA-157346/usr/local/bin/idea cannot startup after idea is force killed
BugIDEA-172677MacOS: idea community: incorrect idea installer window opens on .dmg
BugIDEA-160738Update and restart fails after patch is applied with "Patch update is not supported"
BugIDEA-156078"Open recent project" from Windows taskbar does nothing
BugIDEA-151793IDEA failed to restart after plugins activation
BugIDEA-161183Update and Restart still fails in the latest EAP
BugIDEA-161180Installation update: "background task running" dialog; patch is not applied if restart is postponed
BugIDEA-156503Can't update PhpStorm
BugIDEA-161223Patch is not applied (Linux, macOS)
UsabilityIDEA-147676Produce user-friendly error message on attempt to run IDE/Inspections/Duplicates under incompatible JDK
UsabilityIDEA-160700Allow users to update via patch even if restarting isn't supported
CosmeticsIDEA-145376MacOS: "[Errno 2] No such file or directory" error on attempt to open folder with command-line launcher
TaskIDEA-141023Bundle JRE with minor IDEs
ExceptionIDEA-159824Restart failed with exception
Password SafeBugIDEA-159455Can't reset / change the master password or select not to store passwords
BugIDEA-159606Appearance&Behavior | System Settings | Passwords settings page: change the text
BugIDEA-159737Clear message to user about old password db migration
BugIDEA-160375Exception on attempt to connect to db with passwords converted from idea 2016.2
Platform APIFeatureIDEA-177906Extension points for HelpManager
FeatureIDEA-173600Provide public API to get changed document lines
BugIDEA-157691ConversionService fails to show dialog
BugIDEA-164902PersistentStateComponent does not preserve order of 'Set' fields.
BugIDEA-157491Using ParameterInfoHandler not parameterized by PsiElement results in ClassCastException
BugIDEA-166029Another backward-incompatible plugin SDK change in WebBrowserUrlProvider
BugIDEA-160143java.lang.NoSuchMethodError: com.intellij.util.containers.ContainerUtil.intersection(Ljava/util/Collection;Ljava/util/Collection; )Ljava/util/Collection;
BugIDEA-173198EAP 172.2103.15 causes some tests to deadlock (regression from 172.1909.2)
PerformanceIDEA-154453Every PSI change causes full reparse of all other trees in the same multiple-tree view provider
UsabilityIDEA-159584Please add javadoc to FilteredTraverserBase and JBTreeTraverser
TaskIDEA-156609StubBasedPsiElementBase.getParent should choose itself, whether to use stubs or AST
Meta IssueIDEA-121713Locale environment variables are empty on Mac
Plugin DevelopmentFeatureIDEA-156232Show warning for explicit big build numbers in 'until-build' attribute in plugin.xml
Plugin ManagementBugIDEA-151593Cannot run platform tests in plugin project
BugIDEA-164497IntelliJ 2016.3 hangs at startup with message "Scanning files to index"
BugIDEA-164464fileOpened should be executed in a write-safe context
TaskIDEA-171552Allow using methods with Kotlin interfaces in signatures from plugins with their own version of kotlin-runtime library
ExceptionIDEA-155455PPEIE at ExtensionComponentAdapter.getComponentInstance() on project loading
Project ConfigurationFeatureIDEA-27471Temporarily disabling a module
FeatureIDEA-162102Allow including into module directory located under excluded folder
FeatureIDEA-127753Ability to exclude files from indexing in a path by their names (full paths) or by pattern
FeatureIDEA-176860"Load/Unload Modules" modal dialog: double click to load/unload a module
BugIDEA-135096unable to include source folders under an excluded directory
BugIDEA-171776Default settings for copyright not copied into a new project
BugIDEA-161645Module: adding local JAR file uses file: instead of jar: prefix
BugIDEA-166461Cannot revert module language level to 1.8
BugIDEA-159125intelij crashes and deletes whole project
BugIDEA-167087Pressing cancel in Project Structure|SDKs|Sourcepath|'+' file chooser dialog results in confusing dialog box
BugIDEA-167092ConcurrentModificationException while opening another project
BugIDEA-150345Invalidate Cache / Restart doesn't delete unused libraries' cache from .IntelliJIdea16\system\jars
BugIDEA-151029Project Structure: "Invalid item in the dependencies list" tooltip has &lt &gt html entities instead of < >
BugIDEA-147530ModifiableModuleModel#newModule should always create a new module from scratch
BugIDEA-149675Diplicate sources roots on first project import
BugIDEA-157933"More settings" option doesn't reappear if I unchecked "Create Project from Template"
BugIDEA-166580Change made to project library declaration is not stored
PerformanceIDEA-144865ModuleManager#findModuleByName should be O(1)
UsabilityIDEA-149366The error message that is shown on attempt to download library if connection fails should be wrapped
Project ViewBugIDEA-170381Hide empty middle packages bug
BugIDEA-171965Module group nodes with errors aren't marked in Packages View
BugIDEA-143457Project View presentation of a module looses bold font face when there is an error inside
BugIDEA-152049Project view collapses in unpinned mode after some time and changes in editor
BugIDEA-157379'Project Files Tree', copy references doesn't output same content with single or multiple files
BugIDEA-106807Project View: "Folders always on top" option is always enabled after IDE restart
BugIDEA-160131Consider adding roots provided by AdditionalLibraryRootsProvider to External Libraries
BugIDEA-160450"Select Target -> Project View" doesn't work if Project View has mul