Skip to end of metadata
Go to start of metadata

RubyMine 2017.1.5 (build 171.4694.62) Release Notes

No subsystemBugRUBY-19689Creating a new project hangs for ever in indexing
No subsystemBugIDEA-170494InaccessibleObjectException: Unable to make field accessible in DebugReflectionUtil on JDK 9 (java.base does not open java.util.concurrent.atomic/jdk.internal.misc)
Editor. Editing TextBugIDEA-161586Intermittent Intellij hangs with 2016.2.4 on Linux
TerminalBugIDEA-172594Terminal session takes long time to initialize in EAP 2017.2
User InterfaceBugIDEA-174304Editor background image hides editor gutter (VCS) marks
IDE GeneralBugGO-3989Nightly plugin and EAP 9 IDE don't seem to agree on which to install
Test RunnerBugPY-23820unittest generates a bunch of empty lines with no reason
BugPY-23821nose generates a bunch of empty lines with no reason

RubyMine 2017.1.5 RC (build 171.4694.52) Release Notes

No subsystemBugRUBY-19689Creating a new project hangs for ever in indexing
TerminalBugIDEA-172594Terminal session takes long time to initialize in EAP 2017.2

RubyMine 2017.1.4 (build 171.4694.21) Release Notes

IDE PreferencesBugOC-15550Tab closing Policy is not persisted

RubyMine 2017.1.4 EAP (build 171.4694.16) Release Notes

No subsystemBugRUBY-19368Always indexing after upgrading to RubyMine 2017.1
Code InsightBugRUBY-19454Broken completion in inherited classes
CucumberBugRUBY-19370Cucumber: Go to implementation from feature files doesn't work
DebuggerBugRUBY-19046Cannot attach to native SDK processes on Linux
EditingBugRUBY-19625RubyMine can't open some files
IDEBugRUBY-19481New Rails application wizard: Rails version is changed back to the default after changing the project's location
MarkdownBugRUBY-19494NPE disabling Markdown "Apply CSS from URI" setting
BugRUBY-19489Markdown preview scaling on HiDPI Linux (+win) is lost
BugRUBY-19487Markdown: Custom CSS is not applied
ExceptionRUBY-19488MaliciousURLOpenedException when clicking on the link inside document
ParsingBugRUBY-19348Division operator is interpreted as beginning of regular expression
BugRUBY-19116Emoji character breaking the syntax highlighting in Ruby
BugRUBY-19470Some emoji symbols cause error highlighting
Plugin ReportsBugRUBY-18558Ruby plugin doesn't recognise quoted symbols as keys. Rubymine works fine
PuppetBugRUBY-19476Puppet: Can't resolve namespace
BugRUBY-19486Puppet Plugin missing withpath for notify
BugRUBY-19280Puppet Plugin: Incorrect format with empty curly braces
BugRUBY-19197Puppet related gems installation link is never expired
UsabilityRUBY-19228No hot keys for Puppet settings in the Puppet new module dialog
CosmeticsRUBY-19276Suggestion for module and user names doesn't fit in create new project dialog
CosmeticsRUBY-19203Make dialog for add new Puppet module wider
RailsBugRUBY-19555Support form_with
BugRUBY-19556remove warning "This version is not fully supported" for Rails 5.1
UsabilityRUBY-19070Don't show reload generators/rake tasks warnings in RM
Remote InterpretersBugRUBY-19352Can't add Docker SDK from existing container
Ruby Version ManagersBugRUBY-19446New created RVM gemset is not detected by gems checkbox
Ruby. FormatterFeatureRUBY-11833Differentiate hash curly braces from block curly braces in formatting options and color scheme
BugRUBY-19354bad indent for chained ternary expressions
BugRUBY-19471align multiline list items failure
BugRUBY-19468wrong indent for private def method_name (when indent relative to expression start is on)
BugRUBY-17584Comment confuses "align right parts of assignment" setting for ruby formatter
SlimBugRUBY-17443New hash syntax doesn't work in Slim
BugRUBY-18215slim syntax highlighting incorrect when tag attribute starts with ':' or '@'
No subsystemBugIDEA-1721075+ minutes synchronize after remove of 11k files
BugIDEA-169209Sometimes search (Ctrl + F) stops working
BugIDEA-171455Possible code smell in GitRepoInfo.java
BugIDEA-170221Download Sources not working after 2017.1 update
BugIDEA-171010Idea doesn't close properly some project windows
BugIDEA-170579IllegalAccessException in com.intellij.util.text.StringFactory.createShared on JDK 9
BugIDEA-170005InaccessibleObjectException: Unable to make field accessible in ReflectionUtil on JDK 9 (java.base does not open java.util)
PerformanceIDEA-167733High CPU usage due to Component.setCursor
Code Analysis. InspectionBugIDEA-170959Inspection false positive: Spring @Value field incorrectly assumed to be non-null
DebuggerBugIDEA-171252Debugger doesn't evaluate watches on breakpoint
Diff_MergeBugIDEA-170849Differences in (decompiled) .class files are not highlighted
DockerBugIDEA-171235NumberFormatException when running a dockerfile
Editor. Code CompletionFeatureIDEA-171779Make default size of code completion popup configurable
Editor. Editing TextBugIDEA-171119Colors & Fonts: Console background is overridden by Default Text Backround
BugIDEA-172026No cursor when switching to another window.
Find, Replace, Find UsagesBugIDEA-170295Find function is not working - it opens blank window
BugIDEA-171135Find in path: no horizontal scrollbar in the preview pane
UsabilityIDEA-157440No space between line number and code when exporting found occurences to text file
GWTBugIDEA-170329IDEA 2017.1 NoClassDefFoundError: com/intellij/javascript/debugger/sourcemap/SourceMapHelperKt$createResolver$1$1$1$1 when debugging GWT
IDE ConfigurationBugIDEA-153597Settings > Appearance > "Override default fonts" should display current font when unchecked
Java. InspectionsFeatureIDEA-167790not support Mockito annotation @Mock
BugIDEA-170490A minor bug in checks
JavaEE.WebLogicBugIDEA-167820Weblogic shutdown fails is password contains "@"
JavaScriptPerformanceIDEA-170517IDE 2017.1 using too much CPU and slow
Packaging and InstallationBugIDEA-170328Command-line launcher does not work on Python 3
Project ConfigurationBugIDEA-170993Delete in "Attach Files or Directories" removes wrong directory
Run | Debug configurationBugIDEA-40962Can't pass single "*" character as command line argument in run configuration
BugIDEA-171990Run/Debug configuration - Logs broken
BugIDEA-149344Program arguments in application run configuration are expanded
Settings RepositoryBugIDEA-170795Intellij freezes completely everytime on startup
Structural Search and ReplaceBugIDEA-172046Replacing/removing a modifier removes all other modifiers
TerminalBugIDEA-169111Fish user functions not loaded
User InterfaceBugIDEA-172066Toolwindow activates in another project
BugIDEA-172571IntelliJ IDEA won't start on Mac OS Sierra
BugIDEA-171299IDE is closed even I canceled exit
BugIDEA-172166[linux] editor font size in Settings may decrease after restart
BugIDEA-172136Search text area has an improper height
BugIDEA-170910Diagram printing prints empty
CosmeticsIDEA-168758Tabs of debugger tool window are cut from below with 4K resolution
Version ControlBugIDEA-171478Spelling is not checked on first commit dialog invocation
UsabilityIDEA-170456Unable To Compare Two Commits in File History for a Folder
UsabilityIDEA-171150"Show Diff with Local" Is always greyed out in "Git"->"Show History" pane shown for a folder
Version Control. GitBugIDEA-54753Git: Unstash changes: Apply and pop actions fail.
ExceptionIDEA-170463Throwable on authentication failure in case both login and password asked
Version Control. MercurialBugIDEA-170411hg4idea always tries to load too much data sometimes completely filling Java heap
BugIDEA-171338Mercurial: the HEAD mark disappears after pulling new changes
No subsystemBugWEB-25225Unable to save settings
BugWEB-24820React: creating react application as a submodule of existing IDEA project fails
BugWEB-26528Webstorm does not recognise awaited async-function as parameter for JSDoc
BugWEB-26787Can't download d.ts file for paper
DebuggerBugWEB-22749Breakpoints not clearing
JavaScriptBugWEB-25796Function expressions with binding identifiers in assignment statements contribute to local scope
BugWEB-26161This valid Flow type syntax for generics confuses the IDE thoroughly
BugWEB-26328"Element is not exported" warning for React Native package
BugWEB-25446Webstorm adds parentheses when requiring functions using destructuring
JavaScript. FormatterBugWEB-26441Disabling 'spaces in union types' breaks code in keyof, typeof
BugWEB-26522wrong reformat of es6+react
JavaScript. FrameworksBugWEB-26418Resolve types from React 'prop-types'
BugWEB-26324Menu element showing as deprecated in JSX
BugWEB-23154JSConstructorReturnsPrimitive and React stateless functional component
BugWEB-26258JSX components are incorrectly marked as deprecated HTML tags
LintersBugWEB-26393can not get result of ESlint annotation
BugWEB-26653Standard Code Style: wrong highlighting in the Editor
Node.jsBugWEB-26576runConfiguration npm type - first argument override
BugWEB-26508NodeJS support cannot be enabled for Node 8
REST ClientBugWEB-24584Test REST Client can't delete pramertes or headers anymore
StylusBugWEB-21360Wrong indentation in Stylus files
TypeScriptFeatureWEB-26431Support auto-imports for modules provided by module augmentation
FeatureWEB-26425Support for await in TypeScript 2.3
BugWEB-26641TypeScript service doesn't work with typescript@2.3.0-dev.20170420
BugWEB-27028Typescript: StackOverflowError on recursive generic types
BugWEB-26284Use relative path not directory import when auto-importing module under same directory
BugWEB-26434TypeScript: Nested array in generic argument causes '] expected' error
Unit TestsBugWEB-26048Running and debugging Jest tests with Create React App
DebuggerFeatureCPP-9477debugger: Add registry value to control number of composite value children
No subsystemBugPY-23925Pycharm 2017.1.1 sftp remote deployment not working
DockerBugPY-23715Can not set up docker-compose remote interpreter: mv: can't rename '/usr/bin/docker-compose': No such file or directory
IDEBugPY-23930"Add to currently open projects" not working
Interpreters SettingsBugPY-22319Activate virtualenv doesn't work with conda environments when zsh is the default shell
Remote InterpretersBugPY-23731Cached password is used for remote interpreters connections
BugPY-23653Ssh console hangs on connecting to vagrant box
VagrantBugPY-23997Remote CLI Interpreter using Vagrant Instance can not find vagrant settings.

RubyMine 2017.1.3 (build 171.4424.69) Release Notes

No subsystemBugRUBY-19368Always indexing after upgrading to RubyMine 2017.1
DebuggerBugRUBY-19046Cannot attach to native SDK processes on Linux
IDEBugRUBY-19572'Install Rails gem' label remains in the field after Rails installation instead of set installed version
BugRUBY-19481New Rails application wizard: Rails version is changed back to the default after changing the project's location
ParsingBugRUBY-19348Division operator is interpreted as beginning of regular expression
PuppetBugRUBY-19486Puppet Plugin missing withpath for notify
BugRUBY-19280Puppet Plugin: Incorrect format with empty curly braces
BugRUBY-19197Puppet related gems installation link is never expired
UsabilityRUBY-19228No hot keys for Puppet settings in the Puppet new module dialog
CosmeticsRUBY-19276Suggestion for module and user names doesn't fit in create new project dialog
CosmeticsRUBY-19203Make dialog for add new Puppet module wider
RailsBugRUBY-19555Support form_with
BugRUBY-19556remove warning "This version is not fully supported" for Rails 5.1
BugRUBY-19566Allow to choose webpack libraries in Rails new
Ruby. FormatterBugRUBY-19471align multiline list items failure
BugRUBY-17584Comment confuses "align right parts of assignment" setting for ruby formatter
BugRUBY-19468wrong indent for private def method_name (when indent relative to expression start is on)
BugRUBY-19354bad indent for chained ternary expressions
SlimBugRUBY-17443New hash syntax doesn't work in Slim
BugRUBY-18215slim syntax highlighting incorrect when tag attribute starts with ':' or '@'
No subsystemBugIDEA-1721075+ minutes synchronize after remove of 11k files
BugIDEA-170221Download Sources not working after 2017.1 update
DockerBugIDEA-171235NumberFormatException when running a dockerfile
Editor. Editing TextBugIDEA-172026No cursor when switching to another window.
JavaScriptPerformanceIDEA-170517IDE 2017.1 using too much CPU and slow
Run | Debug configurationBugIDEA-171990Run/Debug configuration - Logs broken
Structural Search and ReplaceBugIDEA-172046Replacing/removing a modifier removes all other modifiers
TerminalBugIDEA-169111Fish user functions not loaded
User InterfaceBugIDEA-172166[linux] editor font size in Settings may decrease after restart
No subsystemBugWEB-24820React: creating react application as a submodule of existing IDEA project fails
BugWEB-26787Can't download d.ts file for paper
BugWEB-26528Webstorm does not recognise awaited async-function as parameter for JSDoc
DebuggerBugWEB-26794Can't debug node 8 nightlies
JavaScriptBugWEB-25446Webstorm adds parentheses when requiring functions using destructuring
BugWEB-25796Function expressions with binding identifiers in assignment statements contribute to local scope
BugWEB-26328"Element is not exported" warning for React Native package
BugWEB-26161This valid Flow type syntax for generics confuses the IDE thoroughly
JavaScript. FormatterBugWEB-26441Disabling 'spaces in union types' breaks code in keyof, typeof
BugWEB-26522wrong reformat of es6+react
JavaScript. FrameworksBugWEB-26324Menu element showing as deprecated in JSX
BugWEB-23154JSConstructorReturnsPrimitive and React stateless functional component
BugWEB-26418Resolve types from React 'prop-types'
BugWEB-26258JSX components are incorrectly marked as deprecated HTML tags
LintersBugWEB-26653Standard Code Style: wrong highlighting in the Editor
Node.jsBugWEB-26576runConfiguration npm type - first argument override
BugWEB-26508NodeJS support cannot be enabled for Node 8
TypeScriptFeatureWEB-26431Support auto-imports for modules provided by module augmentation
BugWEB-26284Use relative path not directory import when auto-importing module under same directory
BugWEB-26641TypeScript service doesn't work with typescript@2.3.0-dev.20170420
BugWEB-26434TypeScript: Nested array in generic argument causes '] expected' error
Remote InterpretersBugPY-23653Ssh console hangs on connecting to vagrant box
VagrantBugPY-23997Remote CLI Interpreter using Vagrant Instance can not find vagrant settings.

RubyMine 2017.1.3 RC (build 171.4424.48) Release Notes

No subsystemBugRUBY-19368Always indexing after upgrading to RubyMine 2017.1
RailsBugRUBY-19555Support form_with
BugRUBY-19566Allow to choose webpack libraries in Rails new
BugRUBY-19556remove warning "This version is not fully supported" for Rails 5.1
Ruby. FormatterBugRUBY-17584Comment confuses "align right parts of assignment" setting for ruby formatter
No subsystemBugIDEA-1721075+ minutes synchronize after remove of 11k files
No subsystemBugWEB-26787Can't download d.ts file for paper
Node.jsBugWEB-26508NodeJS support cannot be enabled for Node 8
No subsystemBugPY-23925Pycharm 2017.1.1 sftp remote deployment not working
VagrantBugPY-23997Remote CLI Interpreter using Vagrant Instance can not find vagrant settings.

RubyMine 2017.1.3 EAP (build 171.4424.33) Release Notes

Code InsightBugRUBY-19454Broken completion in inherited classes
CucumberBugRUBY-19370Cucumber: Go to implementation from feature files doesn't work
DebuggerBugRUBY-19046Cannot attach to native SDK processes on Linux
IDEBugRUBY-19481New Rails application wizard: Rails version is changed back to the default after changing the project's location
ParsingBugRUBY-19470Some emoji symbols cause error highlighting
BugRUBY-19348Division operator is interpreted as beginning of regular expression
BugRUBY-19116Emoji character breaking the syntax highlighting in Ruby
Plugin ReportsBugRUBY-18558Ruby plugin doesn't recognise quoted symbols as keys. Rubymine works fine
PuppetBugRUBY-19476Puppet: Can't resolve namespace
BugRUBY-19486Puppet Plugin missing withpath for notify
BugRUBY-19280Puppet Plugin: Incorrect format with empty curly braces
BugRUBY-19197Puppet related gems installation link is never expired
UsabilityRUBY-19228No hot keys for Puppet settings in the Puppet new module dialog
CosmeticsRUBY-19276Suggestion for module and user names doesn't fit in create new project dialog
CosmeticsRUBY-19203Make dialog for add new Puppet module wider
RailsUsabilityRUBY-19070Don't show reload generators/rake tasks warnings in RM
Remote InterpretersBugRUBY-19352Can't add Docker SDK from existing container
Ruby Version ManagersBugRUBY-19446New created RVM gemset is not detected by gems checkbox
Ruby. FormatterFeatureRUBY-11833Differentiate hash curly braces from block curly braces in formatting options and color scheme
BugRUBY-19471align multiline list items failure
BugRUBY-19354bad indent for chained ternary expressions
BugRUBY-19468wrong indent for private def method_name (when indent relative to expression start is on)
SlimBugRUBY-17443New hash syntax doesn't work in Slim
BugRUBY-18215slim syntax highlighting incorrect when tag attribute starts with ':' or '@'
No subsystemBugIDEA-170221Download Sources not working after 2017.1 update
DockerBugIDEA-171235NumberFormatException when running a dockerfile
Editor. Editing TextBugIDEA-172026No cursor when switching to another window.
GWTBugIDEA-170329IDEA 2017.1 NoClassDefFoundError: com/intellij/javascript/debugger/sourcemap/SourceMapHelperKt$createResolver$1$1$1$1 when debugging GWT
JavaScriptPerformanceIDEA-170517IDE 2017.1 using too much CPU and slow
Run | Debug configurationBugIDEA-171990Run/Debug configuration - Logs broken
Structural Search and ReplaceBugIDEA-172046Replacing/removing a modifier removes all other modifiers
TerminalBugIDEA-169111Fish user functions not loaded
User InterfaceBugIDEA-172166[linux] editor font size in Settings may decrease after restart
No subsystemBugWEB-24820React: creating react application as a submodule of existing IDEA project fails
BugWEB-25225Unable to save settings
BugWEB-26528Webstorm does not recognise awaited async-function as parameter for JSDoc
JavaScriptBugWEB-25446Webstorm adds parentheses when requiring functions using destructuring
BugWEB-26328"Element is not exported" warning for React Native package
BugWEB-25796Function expressions with binding identifiers in assignment statements contribute to local scope
BugWEB-26161This valid Flow type syntax for generics confuses the IDE thoroughly
JavaScript. FormatterBugWEB-26441Disabling 'spaces in union types' breaks code in keyof, typeof
BugWEB-26522wrong reformat of es6+react
JavaScript. FrameworksBugWEB-26324Menu element showing as deprecated in JSX
BugWEB-23154JSConstructorReturnsPrimitive and React stateless functional component
BugWEB-26418Resolve types from React 'prop-types'
BugWEB-26258JSX components are incorrectly marked as deprecated HTML tags
LintersBugWEB-26393can not get result of ESlint annotation
BugWEB-26653Standard Code Style: wrong highlighting in the Editor
Node.jsBugWEB-26576runConfiguration npm type - first argument override
TypeScriptFeatureWEB-26431Support auto-imports for modules provided by module augmentation
FeatureWEB-26425Support for await in TypeScript 2.3
BugWEB-26284Use relative path not directory import when auto-importing module under same directory
BugWEB-26641TypeScript service doesn't work with typescript@2.3.0-dev.20170420
BugWEB-26434TypeScript: Nested array in generic argument causes '] expected' error
Unit TestsBugWEB-26048Running and debugging Jest tests with Create React App
Remote InterpretersBugPY-23653Ssh console hangs on connecting to vagrant box

RubyMine 2017.1.2 (build 171.4249.48) Release Notes

Code InsightBugRUBY-19454Broken completion in inherited classes
CucumberBugRUBY-19370Cucumber: Go to implementation from feature files doesn't work
MarkdownBugRUBY-19487Markdown: Custom CSS is not applied
BugRUBY-19489Markdown preview scaling on HiDPI Linux (+win) is lost
BugRUBY-19494NPE disabling Markdown "Apply CSS from URI" setting
ParsingBugRUBY-19470Some emoji symbols cause error highlighting
BugRUBY-19116Emoji character breaking the syntax highlighting in Ruby
PuppetBugRUBY-19476Puppet: Can't resolve namespace
RailsUsabilityRUBY-19070Don't show reload generators/rake tasks warnings in RM
Rails. DiagramsCosmeticsRUBY-19089Replace Default node with the project's name in Gem Dependency Diagram
Remote InterpretersBugRUBY-19352Can't add Docker SDK from existing container
Ruby Version ManagersBugRUBY-19402Detect rbenv-gemset plugin installed via Homebrew
BugRUBY-19446New created RVM gemset is not detected by gems checkbox
Ruby. FormatterFeatureRUBY-11833Differentiate hash curly braces from block curly braces in formatting options and color scheme
No subsystemBugIDEA-171160[macos] progress indicator in AppIcon consumes CPU
BugIDEA-170579IllegalAccessException in com.intellij.util.text.StringFactory.createShared on JDK 9
BugIDEA-171148In Settings > Colors & Fonts, I cannot change "Underscored" to "Underlined" unless I pick another option first
BugIDEA-169209Sometimes search (Ctrl + F) stops working
BugIDEA-170005InaccessibleObjectException: Unable to make field accessible in ReflectionUtil on JDK 9 (java.base does not open java.util)
Diff_MergeBugIDEA-170909Sync with Deployed Forgets Last Used "Compare By" Method
DockerBugIDEA-171013Docker: Defining DOCKER_HOST env var to anything but URI renders Docker integration useless
BugIDEA-167730docker-compose: TLS error when 'Certificates folder' is misconfigured in docker account
BugIDEA-170679Docker: new account dialog should not suggest default boot2docker certificates folder on mac / windows
BugIDEA-167369Jackson UnrecognizedPropertyExceptions when authenticating at Sonatype Nexus Docker Registry
UsabilityIDEA-171000Docker: The list of the docker configurations should be available at once in the Docker view.
Editor. Code CompletionBugIDEA-170558Custom File type: unfiltered completion popup appears on typing a punctuation char
Editor. Editing TextBugIDEA-171119Colors & Fonts: Console background is overridden by Default Text Backround
Find, Replace, Find UsagesBugIDEA-171135Find in path: no horizontal scrollbar in the preview pane
BugIDEA-170295Find function is not working - it opens blank window
IDE ConfigurationBugIDEA-152335Selecting "Underscored" from "Bold Underscored" doesn't work in Settings>Editor>Colors&Fonts>somelanguage
IndicesUsabilityIDEA-170114"Indexing paused during Power Save mode" shows forever and IntelliSense issues on Power Save mode
User InterfaceBugIDEA-170024Checkboxes are broken
CosmeticsIDEA-168758Tabs of debugger tool window are cut from below with 4K resolution
Version Control. PerforcePerformanceIDEA-170991Repository/Incoming changes refresh takes long time
No subsystemBugWEB-25225Unable to save settings
DebuggerBugWEB-22749Breakpoints not clearing
JavaScriptBugWEB-25919Code folding folds wrong block in switch case with block statement
BugWEB-26355TypeScript create field inspection for constructor generates them incorrectly (in the same line)
JavaScript. FormatterBugWEB-25936pressing enter on multiple declarations no longer preserves correct indent
BugWEB-26150'For statement' wrap option should have higher priority than 'var declaration' wrap when statement contains multiple declarations
BugWEB-25742Formatter messes up type annotations
JavaScript. InspectionsBugWEB-26158Incorrect description of second option in "equality operator may cause type coercion"
BugWEB-26339Getting error "Standard Code Style: Error"
LintersBugWEB-26393can not get result of ESlint annotation
Node.jsFeatureWEB-26201can not configure yarn
BugWEB-24200Can't use yarn installed using brew
TypeScriptFeatureWEB-26425Support for await in TypeScript 2.3
Unit TestsBugWEB-25932"Run icon on the gutter" shows for Karma tests, but clicking on it shows "Nothing Here"
BugWEB-26048Running and debugging Jest tests with Create React App
BugWEB-26310Run buttons inside mocha test-files run as node.js process instead of Mocha
BugWEB-26377Jest has IDE integration warning with addTestSuiteChild
No subsystemBugPY-23925Pycharm 2017.1.1 sftp remote deployment not working
DockerBugPY-23715Can not set up docker-compose remote interpreter: mv: can't rename '/usr/bin/docker-compose': No such file or directory
Interpreters SettingsBugPY-22319Activate virtualenv doesn't work with conda environments when zsh is the default shell
Remote InterpretersBugPY-23731Cached password is used for remote interpreters connections
RunBugPY-17816PyCharm drops "/usr/local/bin" from PATH
Plugin: Deployment _ FTP..BugWI-27179Do not browse server tree from root in places other than choosing root path
BugWI-29847Mappings for single file doesn't work

RubyMine 2017.1.2 RC (build 171.4249.23) Release Notes

ParsingBugRUBY-19470Some emoji symbols cause error highlighting
PuppetBugRUBY-19476Puppet: Can't resolve namespace
RailsUsabilityRUBY-19070Don't show reload generators/rake tasks warnings in RM
Remote InterpretersBugRUBY-19352Can't add Docker SDK from existing container
Ruby. FormatterFeatureRUBY-11833Differentiate hash curly braces from block curly braces in formatting options and color scheme
No subsystemBugIDEA-169209Sometimes search (Ctrl + F) stops working
Editor. Editing TextBugIDEA-171119Colors & Fonts: Console background is overridden by Default Text Backround
Find, Replace, Find UsagesBugIDEA-171135Find in path: no horizontal scrollbar in the preview pane
BugIDEA-170295Find function is not working - it opens blank window
User InterfaceCosmeticsIDEA-168758Tabs of debugger tool window are cut from below with 4K resolution
No subsystemBugWEB-25225Unable to save settings
DebuggerBugWEB-22749Breakpoints not clearing
TypeScriptFeatureWEB-26425Support for await in TypeScript 2.3
Unit TestsBugWEB-26048Running and debugging Jest tests with Create React App
Interpreters SettingsBugPY-22319Activate virtualenv doesn't work with conda environments when zsh is the default shell
RunBugPY-17816PyCharm drops "/usr/local/bin" from PATH

RubyMine 2017.1.2 EAP (build 171.4249.6) Release Notes

Code InsightBugRUBY-19454Broken completion in inherited classes
CucumberBugRUBY-19370Cucumber: Go to implementation from feature files doesn't work
BugRUBY-19416Cucumber failed scenario is green with a small red exclamation
ParsingBugRUBY-19116Emoji character breaking the syntax highlighting in Ruby
Rails. DiagramsCosmeticsRUBY-19089Replace Default node with the project's name in Gem Dependency Diagram
Ruby Version ManagersBugRUBY-19402Detect rbenv-gemset plugin installed via Homebrew
BugRUBY-19446New created RVM gemset is not detected by gems checkbox
No subsystemBugIDEA-171160[macos] progress indicator in AppIcon consumes CPU
BugIDEA-171148In Settings > Colors & Fonts, I cannot change "Underscored" to "Underlined" unless I pick another option first
Diff_MergeBugIDEA-170909Sync with Deployed Forgets Last Used "Compare By" Method
DockerBugIDEA-171013Docker: Defining DOCKER_HOST env var to anything but URI renders Docker integration useless
BugIDEA-167369Jackson UnrecognizedPropertyExceptions when authenticating at Sonatype Nexus Docker Registry
BugIDEA-167730docker-compose: TLS error when 'Certificates folder' is misconfigured in docker account
BugIDEA-170679Docker: new account dialog should not suggest default boot2docker certificates folder on mac / windows
UsabilityIDEA-171000Docker: The list of the docker configurations should be available at once in the Docker view.
Editor. Code CompletionBugIDEA-170558Custom File type: unfiltered completion popup appears on typing a punctuation char
IDE ConfigurationBugIDEA-152335Selecting "Underscored" from "Bold Underscored" doesn't work in Settings>Editor>Colors&Fonts>somelanguage
IndicesUsabilityIDEA-170114"Indexing paused during Power Save mode" shows forever and IntelliSense issues on Power Save mode
User InterfaceBugIDEA-170024Checkboxes are broken
Version Control. PerforcePerformanceIDEA-170991Repository/Incoming changes refresh takes long time
JavaScriptBugWEB-25919Code folding folds wrong block in switch case with block statement
BugWEB-26355TypeScript create field inspection for constructor generates them incorrectly (in the same line)
JavaScript. FormatterBugWEB-25936pressing enter on multiple declarations no longer preserves correct indent
BugWEB-25742Formatter messes up type annotations
BugWEB-26150'For statement' wrap option should have higher priority than 'var declaration' wrap when statement contains multiple declarations
JavaScript. InspectionsBugWEB-26339Getting error "Standard Code Style: Error"
BugWEB-26158Incorrect description of second option in "equality operator may cause type coercion"
Node.jsFeatureWEB-26201can not configure yarn
BugWEB-24200Can't use yarn installed using brew
REST ClientBugWEB-26307REST Client: VirtualFile: restClient/response21.html is invalid
Unit TestsBugWEB-25932"Run icon on the gutter" shows for Karma tests, but clicking on it shows "Nothing Here"
BugWEB-26310Run buttons inside mocha test-files run as node.js process instead of Mocha
BugWEB-26377Jest has IDE integration warning with addTestSuiteChild
Plugin: Deployment _ FTP..BugWI-27179Do not browse server tree from root in places other than choosing root path
BugWI-29847Mappings for single file doesn't work

RubyMine 2017.1.1 (build 171.4073.39) Release Notes

No subsystemBugRUBY-19054Provide 'new RVM gemset' on welcome screen in Ruby plugin
ExceptionRUBY-19153"Write access is allowed from write-safe contexts only" in Ruby Console runner
CucumberBugRUBY-19416Cucumber failed scenario is green with a small red exclamation
IDEBugRUBY-19128Adding new Ruby SDK in the Create New Project wizard always asked path several times on Windows
InspectionsBugRUBY-19160Cannot install RuboCop via error notification after running inspection by name
BugRUBY-19271RuboCop inspection may react twice after open new project
MarkdownFeatureRUBY-19358RTL support in markdown files
PuppetBugRUBY-19158Unexpected heredoc indentation after reformat
BugRUBY-19340Once selected not suitable SDK for Puppet module not refreshes value of Puppet version
BugRUBY-19288librarian-puppet downloads empty folders while installing dependencies
Remote InterpretersBugRUBY-19412Docker integration plugin should be bundled with Ruby docker
Ruby Version ManagersBugRUBY-18895Can't see gem docile installed into rbenv gemset while generate coverage report
Ruby. FormatterBugRUBY-16931"keep line break" option doesn't reflect to `case` condition.
BugRUBY-19073Ruby: 'Spaces around curly braces' isn't honored for code blocks
TestsBugRUBY-19106rspec context detection is buggy in 2017.1 EAP 3,4
No subsystemBugIDEA-169345Inspection results on directories are not handled correctly
BugIDEA-169105IDE first start: zero size font is allowed
BugIDEA-170271Can't open file in PhpStorm from Finder if file directly under the project root
BugIDEA-165879Unguarded section in DocumentCommitThread that leads to spontaneous assertion
BugIDEA-170619No "Project Files" scope in "Find in Path" dialog
Code Analysis. DependenciesBugIDEA-169532Type Hierarchy doesn't handle next/prev correctly, it doesn't change editor
ConsoleBugIDEA-169065ANSI Colors in the console : some escape codes are not interpreted correctly
DebuggerBugIDEA-169993Breakpoint remove by drag is not available in breakpoints dialog
DockerBugIDEA-169385Docker: don't show inspection errors for *, ., : in the attached Dockerfile
BugIDEA-169383Docker: inspection error for one # on the line and after two # on different lines in the Dockerfile
BugIDEA-169237Docker: wrong blue-marked part of the key in the attached Dockerfile
UsabilityIDEA-169251Docker: Make strings in "" or in '' green as it was before.
Editor. Editing TextBugIDEA-169157Right-to-left bug
BugIDEA-169380Buggy caret position shown in status line
Editor. Error HighlightingBugIDEA-163829Cannot save 'Use Inherited attributes' for C++ language inside 'Semantic highlighting'
Editor. Intention ActionsUsabilityIDEA-168917"Do not show hints for current method" is unclear
Find, Replace, Find UsagesBugIDEA-169992Different results in the results panel of the "Find in Path" window in comparison to the preview (specific Regex)
BugIDEA-170768Search stopped working
BugIDEA-169331File mask field keyboard behaviour inconsistent with search field
BugIDEA-169685Regexes inserted into "Find" field are replaced with the value of its selection if "replace" mode is invoked
UsabilityIDEA-170049"Find in path" dialog: find anywhere/in comments/... doesn't have a shortcut
GWTBugIDEA-170329IDEA 2017.1 NoClassDefFoundError: com/intellij/javascript/debugger/sourcemap/SourceMapHelperKt$createResolver$1$1$1$1 when debugging GWT
IDE ConfigurationFeatureIDEA-165592Bring back opening files from CLI in new window as option
BugIDEA-163039Editor > General > Auto Import settings should really be per project
BugIDEA-169803Cannot modify existing rule for parameter hints
BugIDEA-170230Message "Unable to save settings: Failed to save settings. Please restart IntelliJ IDEA" when leaving the IDEA window of a big project
BugIDEA-169926Changing application font size impact on code font size after restart
JavaEE.WebLogicBugIDEA-167820Weblogic shutdown fails is password contains "@"
Plugin Support. APIBugIDEA-169570Any test fails when LightPlatformCodeInsightTestCase.getTestDataPath() returns relative path in IJ 2017.1 EAP(171.3780.15)
Project ConfigurationBugIDEA-168933Moving source folder breaks project
Project ViewBugIDEA-169461Scroll from source inside a scope changes scope to "Project Files"
RefactoringBugIDEA-170159Pasting in a directory to overwrite most of the files inside it, there is no "skip all" or "overwrite all"
User InterfaceBugIDEA-169672FindInPath popup: keyboard focus can't be moved to results list after some control selecting or moving focus to preview
BugIDEA-169270Tab key doesn't bring you into General Tab in Datasource Properties window
BugIDEA-169925'Import Color Scheme' is broken (scheme is reset to Default after IDE restart)
CosmeticsIDEA-169688Buttons Yes/No in "Add file to Git" dialog lost their position
Version Control. LogFeatureIDEA-168629Let reorder columns shown in the VCS Log and new File History
BugIDEA-169336Show affected files in file history has no preselection
PerformanceIDEA-170443Indexing git log takes too long on repositories with big (in terms of changes count) commits.
ExceptionIDEA-169831Adding duplicate element ref to the set containing otherref
No subsystemFeatureWEB-24502Allow to expand text into an empty tag
BugWEB-26160Typescript community stubs can't be downloaded from Settings | Languages & Frameworks | JavaScript | Libraries
BugWEB-26079Creating a new "Node.js Express App" fails
BugWEB-26052Emmet: implicit tag names don't work in Vue templates
BugWEB-26093JavaScript Standard Code style support does not seem to apply the settings from package.json
Build toolsBugWEB-26018in 2017.1 EAP node run configuration runs before without file changes resulting from pre-build task
CSSBugWEB-25710CSS3 Grid Layout: `grid-column-gap`, `grid-row-gap` and `grid-gap` are marked as unknown CSS properties
BugWEB-25938Square brackets syntax for defining Grid line (row, column) names is seen as error.
DartBugWEB-25900Webstorm Dart "pub serve" proxy is slow
BugWEB-25974WebStorm opens wrong file when debugging in Dartium
JavaScriptBugWEB-25758webpack.conf.js: do not provide completion inside quotes for options names
BugWEB-25752webpack.conf.js: recognize exporting multiple configurations
BugWEB-25337Commenting in TSX Components (within render())
BugWEB-26041JQuery-CSS: Incorrect "an identifier expected" error with jQuery constructor with expression as argument
BugWEB-25806Don't provide completion from Webpack 2 schema when using Webpack 1
BugWEB-25903webpack.config.js: update built-in schema
BugWEB-25753webpack.conf.js: do not validate content of the new instance of webpack plugin
ExceptionWEB-26231JSON Schema: IllegalArgumentException when no value is set for property covered with oneOf validation
JavaScript. FormatterFeatureWEB-25899Suggestion: use 'smart' indents for multiline destructuring parameters.
FeatureWEB-25019"New line after (" in JS function calls should ignore multiline parameters and take into account only line breaks *between* parameters
FeatureWEB-25860JavaScript Code style: Space between async and () => {} should not be merged with Before parentheses" -> "In function expression"
BugWEB-25842Typescript Code Style. Place ')' on new line in method declarations.
BugWEB-26040Trailing comma option removes necessary commas with ES6 spread operator
BugWEB-25815'Annotate injection with comment' breaks formatting
BugWEB-25819Wrapping style of Typescript is broken, especially `Chop down if long`
BugWEB-25783Javascript: Reformat incorrectly adds semicolon after default exported class/function
JavaScript. FrameworksFeatureWEB-25937Emmet in JSX, support self closing tags for user defined components
BugWEB-24432PhpStorm lost its way when moving a file imported with alias (System.config)
BugWEB-22667React: don't show 'Attribute is not allowed' for 'data-' attributes in JSX
BugWEB-25184Angular2: method used in interpolation in external template is marked as unused
BugWEB-25802Resolve platform-specific imports with .android.js and ios.js file names
JavaScript. InspectionsFeatureWEB-25896Enable tslint to scan .js files
BugWEB-25487ESLint: wrong linebreak-style
BugWEB-25890method in default module is not reported to be unused
BugWEB-25659Invalid warning "inconsistent return types" only on "async" methods (ES 2017)
BugWEB-25417JSLint setting not persisted for projects
BugWEB-25864ESLint does not warn of missing eslint-babel for ES6
BugWEB-26057Regression "JSCS: Node interpreter file is not found" in 2017.1
BugWEB-25884ESLint crashes when versions are not the latest
BugWEB-25882Vue.js: "Missing import statement" inspection should respect parent quotes type
BugWEB-25809Unused inspection works incorrectly
JavaScript. PredefsBugWEB-25784Node.js Core: add `Buffer.alloc()` to node-buffer-stub.js
JavaScript. RefactoringBugWEB-26056Convert to const/let is broken
BugWEB-25684'Create field' doesn't work with export default, class expressions.
BugWEB-18157Wrong change of references when rename files from source root
BugWEB-26090"Replace with template string" intention produces incorrect result for expression in parenthesis
Node.jsBugWEB-26117Some Buffer methods missing in node-buffer-stub
BugWEB-16926NodeJS: "find usages" not finding index.js when requiring a directory
UsabilityWEB-25955Node.js: try to check npm prefix even when invalid npm path is set
REST ClientBugWEB-26307REST Client: VirtualFile: restClient/response21.html is invalid
TypeScriptFeatureWEB-24838TypeScript: Add code style for spaces in Intersection and Union Types
FeatureWEB-25902TypeScript: Import blacklist
BugWEB-26046Tslint not working on Webstorm 2017.1
BugWEB-26039TSLint wrongly reports invalid line endings
Unit TestsBugWEB-25593Jest: Win: tests running sometimes hang after changes made for configuration
BugWEB-26029Can't run Jest with a custom setupTestFramework script file
IDE PreferencesBugOC-15196'Import scheme' popup is misplaced in AppCode
PHP project configurationBugWI-35344New Project dialog reuses previous state instead of default project settings
Plugin: Deployment _ FTP..CosmeticsWI-33565File Transfer tab capitalizes "k" for kilobit prefix

RubyMine 2017.1.1 RC (build 171.4073.36) Release Notes

IDEBugRUBY-19128Adding new Ruby SDK in the Create New Project wizard always asked path several times on Windows
InspectionsBugRUBY-19160Cannot install RuboCop via error notification after running inspection by name
BugRUBY-19271RuboCop inspection may react twice after open new project
PuppetBugRUBY-19340Once selected not suitable SDK for Puppet module not refreshes value of Puppet version
BugRUBY-19158Unexpected heredoc indentation after reformat
BugRUBY-19288librarian-puppet downloads empty folders while installing dependencies
Ruby. FormatterBugRUBY-16931"keep line break" option doesn't reflect to `case` condition.
BugRUBY-19073Ruby: 'Spaces around curly braces' isn't honored for code blocks
Find, Replace, Find UsagesBugIDEA-170768Search stopped working
Version Control. LogPerformanceIDEA-170443Indexing git log takes too long on repositories with big (in terms of changes count) commits.
No subsystemBugWEB-26093JavaScript Standard Code style support does not seem to apply the settings from package.json
CSSBugWEB-25938Square brackets syntax for defining Grid line (row, column) names is seen as error.
BugWEB-25710CSS3 Grid Layout: `grid-column-gap`, `grid-row-gap` and `grid-gap` are marked as unknown CSS properties
JavaScriptExceptionWEB-26231JSON Schema: IllegalArgumentException when no value is set for property covered with oneOf validation
JavaScript. RefactoringBugWEB-26090"Replace with template string" intention produces incorrect result for expression in parenthesis
BugWEB-26056Convert to const/let is broken
REST ClientBugWEB-26307REST Client: VirtualFile: restClient/response21.html is invalid

RubyMine 2017.1.1 EAP (build 171.4073.18) Release Notes

No subsystemBugRUBY-19319Stuck in Indexing loop
BugRUBY-19054Provide 'new RVM gemset' on welcome screen in Ruby plugin
ExceptionRUBY-19153"Write access is allowed from write-safe contexts only" in Ruby Console runner
IDEBugRUBY-19015JRuby versions selector doesn't work well with clear settings
BugRUBY-19322After enabling or disabling an rbenv gemset for a project, cursor scrolls continuously down until ESC is hit
MarkdownFeatureRUBY-19358RTL support in markdown files
BugRUBY-18559Markdown plugin, JavaFX preview should open links in default browser
PuppetBugRUBY-19182Missing word in the title bar
Remote InterpretersBugRUBY-19308Cannot run tests with Docker Remote sdk
Ruby Version ManagersBugRUBY-18895Can't see gem docile installed into rbenv gemset while generate coverage report
TestsBugRUBY-19106rspec context detection is buggy in 2017.1 EAP 3,4
No subsystemBugIDEA-169345Inspection results on directories are not handled correctly
BugIDEA-169105IDE first start: zero size font is allowed
BugIDEA-170271Can't open file in PhpStorm from Finder if file directly under the project root
BugIDEA-165879Unguarded section in DocumentCommitThread that leads to spontaneous assertion
BugIDEA-170619No "Project Files" scope in "Find in Path" dialog
Code Analysis. DependenciesBugIDEA-169532Type Hierarchy doesn't handle next/prev correctly, it doesn't change editor
ConsoleBugIDEA-169065ANSI Colors in the console : some escape codes are not interpreted correctly
DebuggerBugIDEA-169993Breakpoint remove by drag is not available in breakpoints dialog
Editor. Editing TextBugIDEA-169157Right-to-left bug
BugIDEA-169380Buggy caret position shown in status line
Editor. Error HighlightingBugIDEA-163829Cannot save 'Use Inherited attributes' for C++ language inside 'Semantic highlighting'
Editor. Intention ActionsUsabilityIDEA-168917"Do not show hints for current method" is unclear
Find, Replace, Find UsagesBugIDEA-169992Different results in the results panel of the "Find in Path" window in comparison to the preview (specific Regex)
BugIDEA-169331File mask field keyboard behaviour inconsistent with search field
BugIDEA-169685Regexes inserted into "Find" field are replaced with the value of its selection if "replace" mode is invoked
BugIDEA-169060Find in path: Home+End keys not working in text field
UsabilityIDEA-168982New Find/Replace in tab dialog: Add spacing to checkbox list
UsabilityIDEA-170049"Find in path" dialog: find anywhere/in comments/... doesn't have a shortcut
GWTBugIDEA-170329IDEA 2017.1 NoClassDefFoundError: com/intellij/javascript/debugger/sourcemap/SourceMapHelperKt$createResolver$1$1$1$1 when debugging GWT
IDE ConfigurationFeatureIDEA-165592Bring back opening files from CLI in new window as option
BugIDEA-163039Editor > General > Auto Import settings should really be per project
BugIDEA-169803Cannot modify existing rule for parameter hints
BugIDEA-170230Message "Unable to save settings: Failed to save settings. Please restart IntelliJ IDEA" when leaving the IDEA window of a big project
BugIDEA-169926Changing application font size impact on code font size after restart
ExceptionIDEA-169363Internal error on stating RubyMine EAP
JavaEE.WebLogicBugIDEA-167820Weblogic shutdown fails is password contains "@"
Plugin Support. APIBugIDEA-169570Any test fails when LightPlatformCodeInsightTestCase.getTestDataPath() returns relative path in IJ 2017.1 EAP(171.3780.15)
Project ConfigurationBugIDEA-168933Moving source folder breaks project
Project ViewBugIDEA-169461Scroll from source inside a scope changes scope to "Project Files"
BugIDEA-169292Infinite loading in "Project" view
RefactoringBugIDEA-170159Pasting in a directory to overwrite most of the files inside it, there is no "skip all" or "overwrite all"
Run | Debug configurationBugIDEA-168864Run Configuration - dirty state is not changed after adding any action to Before launch section
BugIDEA-168777"Debug" button disabled forever
User InterfaceBugIDEA-169672FindInPath popup: keyboard focus can't be moved to results list after some control selecting or moving focus to preview
BugIDEA-169270Tab key doesn't bring you into General Tab in Datasource Properties window
BugIDEA-169925'Import Color Scheme' is broken (scheme is reset to Default after IDE restart)
CosmeticsIDEA-169688Buttons Yes/No in "Add file to Git" dialog lost their position
Version Control. LogFeatureIDEA-168629Let reorder columns shown in the VCS Log and new File History
BugIDEA-169336Show affected files in file history has no preselection
ExceptionIDEA-169831Adding duplicate element ref to the set containing otherref
No subsystemFeatureWEB-24502Allow to expand text into an empty tag
BugWEB-26160Typescript community stubs can't be downloaded from Settings | Languages & Frameworks | JavaScript | Libraries
BugWEB-26079Creating a new "Node.js Express App" fails
BugWEB-26052Emmet: implicit tag names don't work in Vue templates
BugWEB-22819ESLint and .vue files
Build toolsBugWEB-26018in 2017.1 EAP node run configuration runs before without file changes resulting from pre-build task
DartBugWEB-25629Source Maps not working when opening Dart project in Browser
BugWEB-25900Webstorm Dart "pub serve" proxy is slow
BugWEB-25974WebStorm opens wrong file when debugging in Dartium
DebuggerBugWEB-25717Docker debug does not work on Mac
JavaScriptBugWEB-25752webpack.conf.js: recognize exporting multiple configurations
BugWEB-25337Commenting in TSX Components (within render())
BugWEB-26041JQuery-CSS: Incorrect "an identifier expected" error with jQuery constructor with expression as argument
BugWEB-25806Don't provide completion from Webpack 2 schema when using Webpack 1
BugWEB-25903webpack.config.js: update built-in schema
BugWEB-25758webpack.conf.js: do not provide completion inside quotes for options names
BugWEB-25753webpack.conf.js: do not validate content of the new instance of webpack plugin
CosmeticsWEB-25738Module dependency diagram: do not show closing quote on the imported element
JavaScript. FormatterFeatureWEB-25899Suggestion: use 'smart' indents for multiline destructuring parameters.
FeatureWEB-25019"New line after (" in JS function calls should ignore multiline parameters and take into account only line breaks *between* parameters
FeatureWEB-25860JavaScript Code style: Space between async and () => {} should not be merged with Before parentheses" -> "In function expression"
BugWEB-25815'Annotate injection with comment' breaks formatting
BugWEB-25842Typescript Code Style. Place ')' on new line in method declarations.
BugWEB-26040Trailing comma option removes necessary commas with ES6 spread operator
BugWEB-25819Wrapping style of Typescript is broken, especially `Chop down if long`
BugWEB-25783Javascript: Reformat incorrectly adds semicolon after default exported class/function
JavaScript. FrameworksFeatureWEB-25937Emmet in JSX, support self closing tags for user defined components
BugWEB-24432PhpStorm lost its way when moving a file imported with alias (System.config)
BugWEB-22667React: don't show 'Attribute is not allowed' for 'data-' attributes in JSX
BugWEB-25184Angular2: method used in interpolation in external template is marked as unused
BugWEB-25802Resolve platform-specific imports with .android.js and ios.js file names
JavaScript. InspectionsFeatureWEB-25896Enable tslint to scan .js files
BugWEB-25487ESLint: wrong linebreak-style
BugWEB-25890method in default module is not reported to be unused
BugWEB-25659Invalid warning "inconsistent return types" only on "async" methods (ES 2017)
BugWEB-25417JSLint setting not persisted for projects
BugWEB-25864ESLint does not warn of missing eslint-babel for ES6
BugWEB-26057Regression "JSCS: Node interpreter file is not found" in 2017.1
BugWEB-25884ESLint crashes when versions are not the latest
BugWEB-25882Vue.js: "Missing import statement" inspection should respect parent quotes type
BugWEB-25809Unused inspection works incorrectly
JavaScript. PredefsBugWEB-25784Node.js Core: add `Buffer.alloc()` to node-buffer-stub.js
JavaScript. RefactoringBugWEB-25684'Create field' doesn't work with export default, class expressions.
BugWEB-18157Wrong change of references when rename files from source root
Node.jsBugWEB-26117Some Buffer methods missing in node-buffer-stub
BugWEB-16926NodeJS: "find usages" not finding index.js when requiring a directory
UsabilityWEB-25955Node.js: try to check npm prefix even when invalid npm path is set
TypeScriptFeatureWEB-24838TypeScript: Add code style for spaces in Intersection and Union Types
FeatureWEB-25902TypeScript: Import blacklist
BugWEB-26046Tslint not working on Webstorm 2017.1
BugWEB-26039TSLint wrongly reports invalid line endings
PerformanceWEB-25450Losing or very slow TypeScript type information after some time
Unit TestsBugWEB-25593Jest: Win: tests running sometimes hang after changes made for configuration
BugWEB-26029Can't run Jest with a custom setupTestFramework script file
Interpreters SettingsBugPY-21787Cannot add symlinked Python/virtualenv as interpreter, e.g. created with venv
Remote InterpretersBugPY-23070Cannot start ssh session after previous session was terminated by server
VagrantExceptionPY-23061Exception on Run Ssh Console action
IDE PreferencesBugOC-15196'Import scheme' popup is misplaced in AppCode
PHP project configurationBugWI-35344New Project dialog reuses previous state instead of default project settings
Plugin: Deployment _ FTP..BugWI-26878Cannot connect to pure IPv6 host from Mac OS X Yosemite 10.10
CosmeticsWI-33565File Transfer tab capitalizes "k" for kilobit prefix
Debugger: GDBBugCPP-8872GDB: Add internal property to control timeout values

RubyMine 2017.1 (build 171.3780.96) Release Notes

No subsystemBugRUBY-19319Stuck in Indexing loop
BugRUBY-18989Better align 'create RVM gemset' checkbox
BugRUBY-19198Notification with Rollback action after controller creation is about Test generation
BugRUBY-18027Double click on instance variable while editing view does not select the @
EditingFeatureRUBY-1983Offer "Create method" quickfix for unresolved methods
IDEBugRUBY-19146Browser settings does not apply changes
BugRUBY-19015JRuby versions selector doesn't work well with clear settings
BugRUBY-19322After enabling or disabling an rbenv gemset for a project, cursor scrolls continuously down until ESC is hit
BugRUBY-18958Ruby SDK by default is not sorting by postfix
UsabilityRUBY-19234No hot keys in the create RVM gemset dialog
CosmeticsRUBY-19235Align RVM gemset name field the same way as previous filed
CosmeticsRUBY-19244Left frame in create New Project dialog is not fitted by names
MarkdownBugRUBY-19155[Markdown] No caret when opening file
BugRUBY-18559Markdown plugin, JavaFX preview should open links in default browser
BugRUBY-18936markdown indentation failure when using tabs
Plugin ReportsBugRUBY-19109Cannot add new Ruby Module with JRuby SDK
PuppetBugRUBY-19182Missing word in the title bar
BugRUBY-19231Puppet settings are not aligned on the wizard
BugRUBY-19226Cannot use new RVM Gemset checkbox for Puppet module if gem is already installed into root SDK
Remote InterpretersBugRUBY-19308Cannot run tests with Docker Remote sdk
BugRUBY-19242Can't add more than one Remote SDK from Docker Image
ExceptionRUBY-19241Adding Docker SDK may throw exception
Ruby Version ManagersFeatureRUBY-10373Create RVM gemset from SDK configurable
YAMLBugRUBY-19104Tag is not handled properly in YAMLQuotedTextImpl
BugRUBY-19105Invalid parsing on nested sequences
No subsystemBugIDEA-168919Deadlock on startup
BugIDEA-164734Update screen is too big
BugIDEA-169288Resource Bundle Editor: Cannot edit text
BugIDEA-148242External SSH Tools: Remotely executed command name is missing
UsabilityIDEA-168866Shelf settings: on ChangeShelvesLocation dialog opening the Cancel button should be selected at once
TaskIDEA-168385Widen Balloon API for new error selection feature
ExceptionIDEA-168411PluginManager StartupAbortedException
ExceptionIDEA-169114NPE at first Idea Community start (in ComponentSettings.isTrueSmoothScrollingEligibleFor(ComponentSettings.java:63))
AntBugIDEA-167905Ant task hangs
Code Analysis. DependenciesBugIDEA-169530Type Hierarchy refresh button doesn't work and causes nodes to disappear
Code Analysis. InspectionBugIDEA-168531Weird behavior of cursor in Inspection Settings
CosmeticsIDEA-162907Inspections settings: wrong font color for selected top level nodes
Code Formatting and Code StyleBugIDEA-124868@formatter:off/@formatter:on markers are not respected in injected code
BugIDEA-167218When importing Code Style for Java, pressing the OK button on the dialog does not do anything.
Code NavigationBugIDEA-165329Can't copy class reference by hitting Ctrl+C in Navigate/Class list
DebuggerUsabilityIDEA-152214Xcode like way to disable/remove breakpoints
Diff_MergeUsabilityIDEA-168873Line endings when comparing with clipboard
Editor. Editing TextBugIDEA-164345IDEA strips trailing spaces even in the line under caret
BugIDEA-168666ImmediatePainter works incorrectly with emoji input
CosmeticsIDEA-164888Please keep up with FiraCode updates
CosmeticsIDEA-168931Add live template for 'prsf'
Editor. Error HighlightingBugIDEA-168667Disabling warning stripe mark causes gray warning colors
External ToolsBugIDEA-164380External tool is not invoked after Git commit
File SystemBugIDEA-166879IDE cannot handle 2GB+ jars
PerformanceIDEA-169698VirtualFIle.findChild() is slow on negative lookups
Find, Replace, Find UsagesBugIDEA-168259`Find in path` highlights all file in preview window
BugIDEA-167546Find/Replace nonfunctional when newlines are embedded in the Find textbox
BugIDEA-169060Find in path: Home+End keys not working in text field
UsabilityIDEA-167955Find: `Ctrl+F` on selected word doesn't pre-select text in search field if Find bar is open
UsabilityIDEA-168982New Find/Replace in tab dialog: Add spacing to checkbox list
ExceptionIDEA-168857Find usages preview throws exception: java.lang.Throwable
IDE ConfigurationBugIDEA-169647Font family is not preserved after upgrade to 2017.1 RC
ExceptionIDEA-169363Internal error on stating RubyMine EAP
JavaScriptBugIDEA-163612Deadlock on startup
Plugin Support. APIBugIDEA-166029Another backward-incompatible plugin SDK change in WebBrowserUrlProvider
Plugin Support. ArchitectureBugIDEA-164497IntelliJ 2016.3 hangs at startup with message "Scanning files to index"
Project ConfigurationBugIDEA-168764modules.xml is not updated if module path is changed
Project ViewBugIDEA-168175Infinite loading spinning wheel in "Project files" view in project tool window
BugIDEA-160450"Select Target -> Project View" doesn't work if Project View has multiple selection in it
BugIDEA-169292Infinite loading in "Project" view
RegExpBugIDEA-165426Regexp check is not working in new language injection dialog
Run | Debug configurationBugIDEA-168864Run Configuration - dirty state is not changed after adding any action to Before launch section
Structural Search and ReplaceBugIDEA-168119Structural Search dialog can change it's width to be unusable (because of long Status: text)
Unit Testing. JUnitBugIDEA-168745Red notification for passed tests
BugIDEA-163309JUnit outputs result of @BeforeClass after test excution
CosmeticsIDEA-168996Improve progress message in test toolwindow
User InterfaceBugIDEA-169587Welcome Screen unusable small
BugIDEA-163532Speed search in popups preselects the last match instead of the first
BugIDEA-166759The cursor while over one ToolWindow sees another border toolwindow, located behind
UsabilityIDEA-168293Disable parameter hints for series of "of" methods
UsabilityIDEA-153193Tooltips for toolbars block clicks to buttons
UsabilityIDEA-65636I can't copy text from tooltip, though I can select it
CosmeticsIDEA-168345Gutter misaligned to document contents when scrolling to the end of the file
User Interface.DarculaBugIDEA-169540Current tab indicator for vertical splits is shown for each split instead of one with current focus
Version ControlBugIDEA-168993Single Git root removing doesn't work from the first attempt if it is mapped to <Project>
BugIDEA-168572No dialog for adding files to git is shown when a directory added to project
BugIDEA-163428Lost Shelf
UsabilityIDEA-50642No way to specify shortcut for 'Commit file'
UsabilityIDEA-132033Shelve Changes To Profile Dir
ExceptionIDEA-168750Throwable at com.intellij.openapi.command.impl.UndoManagerImpl.undoableActionPerformed
Version Control. GitBugIDEA-135368Git: error when trying to resolve conflict in submodule via Accept Theirs/Yours
BugIDEA-168690IDEA doesn't allow to remove a single Git root mapping
BugIDEA-156249GitLogParser fails if there are both \u0001 and \u0003 in the commit message
BugIDEA-123397Git: History for file doesn't show anything before the move if there were too many changes in the commit that moved the file
UsabilityIDEA-75590Don't autodelete directory after delete last file if this directory is a source root.
UsabilityIDEA-90550'Push rejected' yellow notification popup stays even after second succesful push
Version Control. LogUsabilityIDEA-168370File history: columns sizes/positions are not restored
Version Control. MercurialBugIDEA-164692Only one instance of password is saved
XMLBugIDEA-164679Intellij IDEA 2016.2/3 ignores <xsd:sequence> validation
BugIDEA-162824"Resource registered by this uri is not recognized" spuriously triggers for "http://www.w3.org/2001/XMLSchema-instance" running tests
No subsystemBugWEB-22307Live Template generated wrong code.
BugWEB-22819ESLint and .vue files
BugWEB-25724Missing completion for current property in package.json
BugWEB-24760Project Tool Window: CSS source maps (gulp-generated) not grouped under the same name, but JS does.
UsabilityWEB-25617Module Dependency Diagram: indicate which elements are imported/exported from a module
CSSFeatureWEB-25528Missing default file template for CSS File
BugWEB-23054CSS: incorrect old name of animation in rename dialog
BugWEB-24700Stylelint 7.7.0 support
DebuggerBugWEB-25717Docker debug does not work on Mac
HTMLBugWEB-11711Different coloring in namespaced attribute with error in html vs php
JavaScriptBugWEB-25567'Inject with comment' does not work for object literals, class members,etc.
BugWEB-25568Language injection comment applies too eagerly
BugWEB-25709Module Dependencies Diagram: require statement is not shown as child element
BugWEB-25453Module Dependencies Diagram: provide "Jump to ..." action for the listed imports
BugWEB-25731.babelrc doesn't recognise plugin options given as array
BugWEB-25439Module Dependencies Diagram: no icon for the specific require statement
BugWEB-25462Module Dependencies Diagram: HTML: recognize image included via "img" tag
BugWEB-25456Module Dependencies Diagram: correctly recognize raw imports
BugWEB-25451Module Dependencies Diagram: imports from TS definition are shown differently from ES imports in JS file
BugWEB-25463Module Dependencies Diagram: HTML: recognize CDN link if it's resolved via External library
BugWEB-25464Module Dependencies Diagram move/drag redraws it for the whole project context
BugWEB-25693Module Dependencies Diagram: no icon for element for specific import statement
PerformanceWEB-25647An inspection causes JS project CPU usage at ~300% (looks like its caused by com.intellij.lang.javascript.modules.ES6ModulesSuggester.findFixes)
UsabilityWEB-25438Module Dependencies Diagram: hide "Diagrams" action for excluded folder and it's content
UsabilityWEB-25466Module Dependencies Diagram: make shorter the shown path to minimize width of the tab size
CosmeticsWEB-25560Module dependency diagram with Darcula
CosmeticsWEB-25738Module dependency diagram: do not show closing quote on the imported element
ExceptionWEB-25703Module Dependencies Diagram: NPE is thrown on invoking diagram
JavaScript. FormatterBugWEB-25637code formatting of class member properties breaks TypeScript rule TS7008 ( when noImplicitAny is true )
UsabilityWEB-25551Show HTML code style when you search for JSX
JavaScript. FrameworksBugWEB-25739Setting some ARIA attribute values dynamically in JSX generate errors in Webstorm 2017 EAP.
BugWEB-25616Missing type introspection inside *ngFor
BugWEB-25757JSON schema completion issues (tsconfig.json)
JavaScript. InspectionsBugWEB-25712Invalid Inspection / Unable To Suppress - Selector matches unknown element
BugWEB-24887False 'missing module dependency' violation
BugWEB-25735False 'Missing import statement' shown for React-native core components
BugWEB-24615Wrong JSHint error highlight for JavaScript
BugWEB-25605Eslint warnings stopped working in 2017.1 EAP
BugWEB-25611eslint does not work on windows
BugWEB-25721"Missing import statement" warning for existing import statement in JavaScript
BugWEB-25221'Convert parameters to object' in coffee file causes ClassCastException
BugWEB-25750Intentions: restore "Check RegExp" action
ExceptionWEB-25520"Can not get result of ESLint annotation"
ExceptionWEB-25686PsiInvalidElementAccessException when call 'Insert import' inspection
Node.jsBugWEB-22230Node.js: correctly check path to the global npm packages installed into the not default location
ExceptionWEB-25679NodeModulesDirectoryManager - Recursion prevented when computing FileIndex extension
TypeScriptBugWEB-25550this typing is ignored when used for object property
PerformanceWEB-25450Losing or very slow TypeScript type information after some time
Unit TestsBugWEB-25599Jest: always detect appropriate package.json with jest options
BugWEB-25582Jest:RC: no validation for empty "Jest package" field
BugWEB-25583Jest: failed test output differs from the result in console
BugWEB-25587Jest: RC: "Configuration file" list is not propagated with the new added value until RC reopening
CosmeticsWEB-25596Align labels to the left in Jest and Mocha run/debug configurations
Interpreters SettingsBugPY-21787Cannot add symlinked Python/virtualenv as interpreter, e.g. created with venv
Remote InterpretersBugPY-22699Debug run with remote interpreter sometimes causes "RemoteSdkException: Error obtaining remote socket"
BugPY-23070Cannot start ssh session after previous session was terminated by server
VagrantExceptionPY-23061Exception on Run Ssh Console action
Plugin: Deployment _ FTP..FeatureWI-21111Support copy (with copy-paste and drag'n'drop) in RemoteHost
BugWI-35179Support drag'n'drop between Remote Host and Project Files/Test tabs of Project View
BugWI-26878Cannot connect to pure IPv6 host from Mac OS X Yosemite 10.10
BugWI-35183Log to File Transfer toolwindow remote to remote transfers
BugWI-35190Remote Host panel is not refreshed on D'n'D operations
BugWI-34349Can't rename deployment configurations if they're not default
UsabilityWI-22133dragging files from remote host to project folder removes them on the server
UsabilityWI-35191Remove, creation, renaming and permission change of folders and files are not logged.
TaskWI-35178Remove dialogs from drag'n'drop and copy-paste between Project View and Remote Host
Debugger: GDBBugCPP-8872GDB: Add internal property to control timeout values
No subsystemUsabilityRIDER-4427Select Solution Path window assistive text is too small on High DPI displays

RubyMine 2017.1 RC2 (build 171.3780.57) Release Notes

EditingFeatureRUBY-1983Offer "Create method" quickfix for unresolved methods
IDEBugRUBY-19015JRuby versions selector doesn't work well with clear settings
BugRUBY-19322After enabling or disabling an rbenv gemset for a project, cursor scrolls continuously down until ESC is hit
MarkdownBugRUBY-18559Markdown plugin, JavaFX preview should open links in default browser
PuppetBugRUBY-19182Missing word in the title bar
IDE ConfigurationExceptionIDEA-169363Internal error on stating RubyMine EAP
User InterfaceBugIDEA-168924JDK switcher does not show bundled jdk
No subsystemBugWEB-22819ESLint and .vue files
DebuggerBugWEB-25717Docker debug does not work on Mac
JavaScriptCosmeticsWEB-25738Module dependency diagram: do not show closing quote on the imported element
TypeScriptPerformanceWEB-25450Losing or very slow TypeScript type information after some time
Interpreters SettingsBugPY-21787Cannot add symlinked Python/virtualenv as interpreter, e.g. created with venv
Remote InterpretersBugPY-23070Cannot start ssh session after previous session was terminated by server
VagrantExceptionPY-23061Exception on Run Ssh Console action

RubyMine 2017.1 RC1 (build 171.3780.26) Release Notes

No subsystemBugRUBY-18989Better align 'create RVM gemset' checkbox
BugRUBY-19198Notification with Rollback action after controller creation is about Test generation
BugRUBY-18027Double click on instance variable while editing view does not select the @
IDEBugRUBY-18958Ruby SDK by default is not sorting by postfix
No subsystemBugIDEA-168919Deadlock on startup
UsabilityIDEA-168866Shelf settings: on ChangeShelvesLocation dialog opening the Cancel button should be selected at once
TaskIDEA-168385Widen Balloon API for new error selection feature
ExceptionIDEA-169114NPE at first Idea Community start (in ComponentSettings.isTrueSmoothScrollingEligibleFor(ComponentSettings.java:63))
Code Analysis. InspectionBugIDEA-168531Weird behavior of cursor in Inspection Settings
Code Formatting and Code StyleBugIDEA-124868@formatter:off/@formatter:on markers are not respected in injected code
BugIDEA-167218When importing Code Style for Java, pressing the OK button on the dialog does not do anything.
DebuggerUsabilityIDEA-152214Xcode like way to disable/remove breakpoints
Diff_MergeUsabilityIDEA-168873Line endings when comparing with clipboard
Editor. Editing TextBugIDEA-168666ImmediatePainter works incorrectly with emoji input
CosmeticsIDEA-168931Add live template for 'prsf'
Editor. Error HighlightingBugIDEA-168667Disabling warning stripe mark causes gray warning colors
Find, Replace, Find UsagesBugIDEA-169060Find in path: Home+End keys not working in text field
UsabilityIDEA-168982New Find/Replace in tab dialog: Add spacing to checkbox list
JavaScriptBugIDEA-163612Deadlock on startup
Project ViewBugIDEA-168175Infinite loading spinning wheel in "Project files" view in project tool window
Run | Debug configurationBugIDEA-168864Run Configuration - dirty state is not changed after adding any action to Before launch section
Unit Testing. JUnitBugIDEA-168745Red notification for passed tests
CosmeticsIDEA-168996Improve progress message in test toolwindow
User InterfaceUsabilityIDEA-168293Disable parameter hints for series of "of" methods
CosmeticsIDEA-168345Gutter misaligned to document contents when scrolling to the end of the file
Version ControlBugIDEA-168993Single Git root removing doesn't work from the first attempt if it is mapped to <Project>
BugIDEA-168572No dialog for adding files to git is shown when a directory added to project
BugIDEA-163428Lost Shelf
UsabilityIDEA-50642No way to specify shortcut for 'Commit file'
UsabilityIDEA-132033Shelve Changes To Profile Dir
Version Control. GitBugIDEA-135368Git: error when trying to resolve conflict in submodule via Accept Theirs/Yours
BugIDEA-168690IDEA doesn't allow to remove a single Git root mapping
BugIDEA-156249GitLogParser fails if there are both \u0001 and \u0003 in the commit message
UsabilityIDEA-90550'Push rejected' yellow notification popup stays even after second succesful push
Version Control. LogUsabilityIDEA-168370File history: columns sizes/positions are not restored
No subsystemBugWEB-22307Live Template generated wrong code.
BugWEB-25724Missing completion for current property in package.json
CSSBugWEB-23054CSS: incorrect old name of animation in rename dialog
HTMLBugWEB-11711Different coloring in namespaced attribute with error in html vs php
JavaScriptBugWEB-25709Module Dependencies Diagram: require statement is not shown as child element
BugWEB-25731.babelrc doesn't recognise plugin options given as array
BugWEB-25693Module Dependencies Diagram: no icon for element for specific import statement
ExceptionWEB-25703Module Dependencies Diagram: NPE is thrown on invoking diagram
JavaScript. FormatterBugWEB-25637code formatting of class member properties breaks TypeScript rule TS7008 ( when noImplicitAny is true )
JavaScript. FrameworksBugWEB-25757JSON schema completion issues (tsconfig.json)
JavaScript. InspectionsBugWEB-25712Invalid Inspection / Unable To Suppress - Selector matches unknown element
BugWEB-25735False 'Missing import statement' shown for React-native core components
BugWEB-24887False 'missing module dependency' violation
BugWEB-25721"Missing import statement" warning for existing import statement in JavaScript
BugWEB-25221'Convert parameters to object' in coffee file causes ClassCastException
BugWEB-25750Intentions: restore "Check RegExp" action
ExceptionWEB-25686PsiInvalidElementAccessException when call 'Insert import' inspection
Node.jsBugWEB-22230Node.js: correctly check path to the global npm packages installed into the not default location
ExceptionWEB-25679NodeModulesDirectoryManager - Recursion prevented when computing FileIndex extension
TypeScriptBugWEB-25550this typing is ignored when used for object property
BugWEB-25682Typescript does not use tsconfig.json for lint
Debugger: GDBBugCPP-8872GDB: Add internal property to control timeout values
Plugin: Deployment _ FTP..BugWI-26878Cannot connect to pure IPv6 host from Mac OS X Yosemite 10.10
UsabilityWI-35191Remove, creation, renaming and permission change of folders and files are not logged.

RubyMine 2017.1 EAP9 (build 171.3691.15) Release Notes

IDEUsabilityRUBY-19234No hot keys in the create RVM gemset dialog
CosmeticsRUBY-19235Align RVM gemset name field the same way as previous filed
CosmeticsRUBY-19244Left frame in create New Project dialog is not fitted by names
MarkdownBugRUBY-19155[Markdown] No caret when opening file
PuppetBugRUBY-19231Puppet settings are not aligned on the wizard
BugRUBY-19226Cannot use new RVM Gemset checkbox for Puppet module if gem is already installed into root SDK
YAMLBugRUBY-19104Tag is not handled properly in YAMLQuotedTextImpl
BugRUBY-19105Invalid parsing on nested sequences
No subsystemBugIDEA-148242External SSH Tools: Remotely executed command name is missing
AntBugIDEA-167905Ant task hangs
Project ConfigurationBugIDEA-168764modules.xml is not updated if module path is changed
Version ControlExceptionIDEA-168750Throwable at com.intellij.openapi.command.impl.UndoManagerImpl.undoableActionPerformed
Version Control. GitBugIDEA-123397Git: History for file doesn't show anything before the move if there were too many changes in the commit that moved the file
UsabilityIDEA-75590Don't autodelete directory after delete last file if this directory is a source root.
No subsystemUsabilityWEB-25617Module Dependency Diagram: indicate which elements are imported/exported from a module
CSSFeatureWEB-25528Missing default file template for CSS File
JavaScriptBugWEB-25463Module Dependencies Diagram: HTML: recognize CDN link if it's resolved via External library
BugWEB-25462Module Dependencies Diagram: HTML: recognize image included via "img" tag
BugWEB-25464Module Dependencies Diagram move/drag redraws it for the whole project context
BugWEB-25567'Inject with comment' does not work for object literals, class members,etc.
BugWEB-25568Language injection comment applies too eagerly
BugWEB-25453Module Dependencies Diagram: provide "Jump to ..." action for the listed imports
BugWEB-25456Module Dependencies Diagram: correctly recognize raw imports
BugWEB-25451Module Dependencies Diagram: imports from TS definition are shown differently from ES imports in JS file
BugWEB-25439Module Dependencies Diagram: no icon for the specific require statement
UsabilityWEB-25438Module Dependencies Diagram: hide "Diagrams" action for excluded folder and it's content
UsabilityWEB-25466Module Dependencies Diagram: make shorter the shown path to minimize width of the tab size
CosmeticsWEB-25560Module dependency diagram with Darcula
JavaScript. FormatterUsabilityWEB-25551Show HTML code style when you search for JSX
JavaScript. FrameworksBugWEB-25616Missing type introspection inside *ngFor
JavaScript. InspectionsBugWEB-25605Eslint warnings stopped working in 2017.1 EAP
BugWEB-25611eslint does not work on windows
ExceptionWEB-25520"Can not get result of ESLint annotation"
Unit TestsBugWEB-25599Jest: always detect appropriate package.json with jest options
BugWEB-25582Jest:RC: no validation for empty "Jest package" field
BugWEB-25583Jest: failed test output differs from the result in console
BugWEB-25587Jest: RC: "Configuration file" list is not propagated with the new added value until RC reopening
CosmeticsWEB-25596Align labels to the left in Jest and Mocha run/debug configurations
Remote InterpretersBugPY-22699Debug run with remote interpreter sometimes causes "RemoteSdkException: Error obtaining remote socket"
Plugin: Deployment _ FTP..FeatureWI-21111Support copy (with copy-paste and drag'n'drop) in RemoteHost
BugWI-35190Remote Host panel is not refreshed on D'n'D operations
BugWI-35183Log to File Transfer toolwindow remote to remote transfers
BugWI-35179Support drag'n'drop between Remote Host and Project Files/Test tabs of Project View
UsabilityWI-22133dragging files from remote host to project folder removes them on the server
TaskWI-35178Remove dialogs from drag'n'drop and copy-paste between Project View and Remote Host
No subsystemUsabilityRIDER-4427Select Solution Path window assistive text is too small on High DPI displays

RubyMine 2017.1 EAP8 (build 171.3566.31) Release Notes

DebuggerBugRUBY-19046Cannot attach to native SDK processes on Linux
IDEBugRUBY-19194Methods with named arguments are not overridden correctly
Plugin ReportsBugRUBY-19109Cannot add new Ruby Module with JRuby SDK
Remote InterpretersExceptionRUBY-19241Adding Docker SDK may throw exception
Ruby Version ManagersFeatureRUBY-10373Create RVM gemset from SDK configurable
No subsystemBugIDEA-167627Reference search doesn't work for files added via AdditionalLibraryRootsProvider
BugIDEA-143263Find In Path is not autopopulating a selection from Find Preview window
UsabilityIDEA-168138Apply button on changing color scheme doesn't lead to full rehighlighting
TaskIDEA-168385Widen Balloon API for new error selection feature
ExceptionIDEA-168411PluginManager StartupAbortedException
ExceptionIDEA-168538NPE at com.intellij.ui.popup.PopupComponent$DialogPopupWrapper.<init>
Code Analysis. InspectionBugIDEA-168240Rename 'Import Scheme' to 'Import Profile' and 'Add/Edit description'
BugIDEA-168254Inspect.sh(bat) doesn't work
BugIDEA-168237Unnecessary popup when import/export inspection settings
BugIDEA-168235"Edit Settings" in inspection result toolbar opens Settings for all inspections, but not for specific one
CosmeticsIDEA-162907Inspections settings: wrong font color for selected top level nodes
ConsoleBugIDEA-146228IntelliJ does not respond when searching SQL History
Diff_MergeBugIDEA-160945Inspection highlighting in the Merge dialog does not work
Editor. Editing TextBugIDEA-167937Documentation window gets focus on second Smart Type completion
BugIDEA-168209Quick doc window is not closed from the first attempt
BugIDEA-168069Join Lines throws array index out of bonds on an empty file
BugIDEA-168452Backspace does not change cursor position
UsabilityIDEA-167931"Quick Evaluate Expression" with default mouse shortcut adds multiple carets on Linux
CosmeticsIDEA-148843A letter may appear on both sides of the caret
Find, Replace, Find UsagesBugIDEA-168276"Find in path" doesn't change the directory to the selected one
BugIDEA-146150Page up/down in preview mode of find in path
IDE ConfigurationBugIDEA-167619I can not add another import to Java|Imports
JavaEE.WebLogicBugIDEA-167857Weblogic: log line is marked as a red error while contains a text '<info>'
RefactoringFeatureIDEA-54664Improve refactoring feedback for long operations
ExceptionIDEA-167482Throwable when rename vue file
Run | Debug configurationBugIDEA-139688Shortcut for terminating (CMD+F2 on mac) multiple runs doesn't work
Structural Search and ReplaceBugIDEA-168119Structural Search dialog can change it's width to be unusable (because of long Status: text)
User InterfaceBugIDEA-155088Double click on tree's expand icon triggers double click listener
BugIDEA-168315Component.getGraphics() should not be used to get scale for the HiDPI API
BugIDEA-168194Huge gutter icons in latest 2017.1 EAP
PerformanceIDEA-168535Concurrent access to tree set leads to hang
UsabilityIDEA-148218Show contents of multiline pastlets in one line
Version ControlBugIDEA-168143Branch popup: expanded state of the Repositories section is not saved
BugIDEA-168483Show Diff from new file history not available during indexing
UsabilityIDEA-168473Enable Store on shelf base revision texts for files by default
CosmeticsIDEA-131099VCS: "Do you want to add.." wording
CosmeticsIDEA-116699Cancel button in the wrong location on Mac TODO sheet
Version Control. GitBugIDEA-168257Deadlock in vcs
BugIDEA-164512"New Branch..." keyboard shortcut does not work
PerformanceIDEA-167688Git Update Project via Rebase and Stash performs stash-unstash procedure even if there are no local changes
UsabilityIDEA-149886Let create branch without checking it out
CosmeticsIDEA-165570When there are no remote heads, the git remotes dialog looks weird
No subsystemFeatureWEB-24551Add ability to run ESLint for the TypeScript sources files
BugWEB-23754Missing type introspection inside *ngFor
BugWEB-22819ESLint and .vue files
CSSTaskWEB-25427Incorrect CSS inspection warning "should be integer" on decimal letter-spacing
JavaScriptBugWEB-17099CommonJS: module functions not available when re-exporting module instance
BugWEB-25449ES6 Import Code Completion does not match CommonJS
UsabilityWEB-25455Module Dependencies Diagram: provide separate popup shown for the empty context
JavaScript. FormatterFeatureWEB-25019"New line after (" in JS function calls should ignore multiline parameters and take into account only line breaks *between* parameters
FeatureWEB-22612"Reformat code" is unopinionated on TypeScript generics
FeatureWEB-19523No 'Wrapping and Braces' alignment code-style options for JavaScript 'new' expressions
BugWEB-22446JS Alignment of multi-line parameters doesn't work if it's an object instantiation
ExceptionWEB-25477JS: Throwable when formatting injection in template strings with escaped spaces (\n, \t)
JavaScript. FrameworksBugWEB-25479Vue.js: child component appears as 'unknown HTMl tag' in parent template
JavaScript. RefactoringBugWEB-25481'Compute constant value' doesn't support ES6 template strings
LESSBugWEB-25471Autocomplete for less
Node.jsFeatureWEB-25514Support for n (virtualenv for Node.JS)
BugWEB-25154[node][es6] Using quickfix to import exported function fails when import is present
ExceptionWEB-25507IllegalStateException is thrown on opening JSCS settings
TypeScriptBugWEB-21299Typescript Formatter for property with "type", "namespace" (and more) name (with included JSDoc)
BugWEB-23369Formatting chained methods in Typescript
Code InsightBugPY-22449Breadcrumbs are incorrect when caret placed after the last character of the block
PackagingUsabilityPY-6398Hide "Package successfully installed" notification when you start installing another package

RubyMine 2017.1 EAP7 (build 171.3224.24) Release Notes

No subsystemBugRUBY-19198Notification with Rollback action after controller creation is about Test generation
Code InsightBugRUBY-19177Incorrect call argument count inspection doesn't recognize keyword arguments
RailsFeatureRUBY-19151Cannot rollback generator action
No subsystemFeatureIDEA-164176Delete old thread dumps in the IDE log folder
BugIDEA-168010Editor notification should be updated on the file extension change
BugIDEA-167719Test Runner: missing info about skipped tests in results popup
BugIDEA-167799HiPDI menu arrows are too small for Darcula/IntelliJ themes on Windows and Linux
BugIDEA-167694Live Templates: order of default values are reversed
BugIDEA-167050After cut+paste some methods from class to new-created one the pasted code is shown as duplicate
BugIDEA-167880Dump data to file adds / to filename
UsabilityIDEA-167531During code completion, Home/End keys navigate the menu not the code editor
CosmeticsIDEA-167361Tip of the day, goto-message, missleading.
TaskIDEA-165322External annotator inspection
Compiling ProjectBugIDEA-166909Compiling 1.5 with JDK9 problem
ConsoleBugIDEA-167431Console filters can no longer change foreground text color
BugIDEA-167094Can't remove first char in user input
DebuggerUsabilityIDEA-152214Xcode like way to disable/remove breakpoints
Diff_MergeFeatureIDEA-167631Open all files which are modified in the current branch
Find, Replace, Find UsagesBugIDEA-167872Find results from different files are merged
UsabilityIDEA-167955Find: `Ctrl+F` on selected word doesn't pre-select text in search field if Find bar is open
ExceptionIDEA-167571Argument for @NotNull parameter 'scope' of com/intellij/psi/search/LocalSearchScope.<init> must not be null
IndicesPerformanceIDEA-167934Out of memory dialog on IntelliJ IDEA start/open project
Java.InspectionsFeatureIDEA-146716Add inspection for "Iteration over entrySet() can be replaced with forEach"
User InterfaceBugIDEA-167782Details in EventLog only clickable once
BugIDEA-167825Active project window is hidden under already opened projects
CosmeticsIDEA-167612strange highlight of settigns > appearance & behavior > notofications
ExceptionIDEA-167624Find Action popup can not be closed on Welcome Screen; NPE at com.intellij.ide.util.gotoByName.ChooseByNamePopup.dispose
Version ControlFeatureIDEA-162845Allow openning commit window when only unversioned files present
Version Control. SubversionBugIDEA-113567Subversion1.8: cleanup invoked from file context menu fails with error
XMLBugIDEA-167726PyCharm's XSD does not resolve the extension base when base schema does not have a namespace
No subsystemBugWEB-25382Cannot make eslint to work
JavaScriptFeatureWEB-25303name property of package.json should default to the name of the directory it is created in not "application-name"
BugWEB-17483ES6 import resolve error
BugWEB-24976CommonJS: exported properties are not available in completion after module re-export
BugWEB-25336'Create field' quick-fix produces invalid code
JavaScript. InspectionsBugWEB-20726ES6 destructured assignment warns assigned to variables may not be initialised when being assigned!
BugWEB-24268Imprecise highlight of unused value in ES6 destructuring assignment
BugWEB-25309convert to template string produces invalid code if contains a string argument with newline character.
BugWEB-25398Throwable when inline variable
Node.jsBugWEB-25372Do not suggest packages in devDependencies that are already listed in dependencies
SASSBugWEB-25094Error-marker in SCSS file
Remote InterpretersFeaturePY-22600Support SSH Key Pair (or Password) + OTP authentication for Python remote interpreters
BugPY-1873820+ prompts upon PyCharm startup with remote interpreter
Plugin: Deployment _ FTP..BugWI-33253Download project files will trigger "auto upload external changes"
Project ModelBugCPP-8824No more error/warning highlighting in CMake console
STE - Stack Trace ExplorerExceptionRIDER-4390IndexOutOfBoundsException: Wrong line: -1. Available lines count: 0

RubyMine 2017.1 EAP6 (build 171.3019.14) Release Notes

No subsystemBugRUBY-19033New Rails API 'create rvm sdk' combo isn't properly updated
CucumberFeatureRUBY-18956Cucumber 3 support
IDEFeatureRUBY-19129Parameter Hints for Ruby
BugRUBY-18983Font style in create new project wizard is different for plain ruby application
BugRUBY-19040'No SDK selected' in Create new Project wizard
MarkdownFeatureRUBY-18536Structure view of markdown plugin should show actual structure in terms of headers, sub-headers and so on
SlimBugRUBY-19141Slim file with JS causes exception
TestsUsabilityRUBY-18992Suggestion to create test should not be dependent on installed gems
No subsystemBugIDEA-166321Setting 'reopen last project on startup' doesn't work
BugIDEA-167541Font baseline is shifted down for default font settings
UsabilityIDEA-165863new live template causes unlabeled yellow warning triangle
UsabilityIDEA-166959Can't see full path to project in welcome screen
Diff_MergeExceptionIDEA-167185AE at com.intellij.util.xmlb.MapBinding.deserializeList
DockerBugIDEA-162764Docker: wrong item is selected when trying to configure server
Editor. Editing TextBugIDEA-167630Backspace > Unindent to nearest indent position option doesn't work as expected beyond the line end
UsabilityIDEA-167366When you enter Ctrl-Ctrl Down arrow to enter column mode, then while holding ctrl do shift right arrow, does not move to next word boundary
Find, Replace, Find UsagesBugIDEA-167546Find/Replace nonfunctional when newlines are embedded in the Find textbox
BugIDEA-167436Rerun 'Find Usages' empties first tab
IndicesPerformanceIDEA-167372Building the stub tree for a file loads its contents twice in a row
Java. RefactoringBugIDEA-167501Cannot open refactoring dialog 'Extract Constant' by hitting Ctrl-Alt-C twice
BugIDEA-160648Extract constant fails with an exception
Plugin Support. APIBugIDEA-164902PersistentStateComponent does not preserve order of 'Set' fields.
Project ViewBugIDEA-160131Consider adding roots provided by AdditionalLibraryRootsProvider to External Libraries
RefactoringBugIDEA-167011Rename refactoring: delete/backspace of the selection stops renaming
Settings RepositoryBugIDEA-167284Settings repository: unstable sorting order in live template causes unnecessary commits
TerminalFeatureIDEA-136672Terminal should have clickable URLs
User InterfaceFeatureIDEA-167606Add utility drawSelection method for component's outline
BugIDEA-167003Git branches popup reverts to default size every time it is shown
BugIDEA-167459[windows] balloons text are cut in multi-dpi-monitor env w/ new hidpi
BugIDEA-167579After popup resizing first click on items inside doesn't work
BugIDEA-167485When both platform and plugin updates are available, unchecking all plugins makes it impossible to update platform
Version Control. GitUsabilityIDEA-167023Menu «Git branches» became worse
Version Control. PerforceBugIDEA-163966Merge P4CONFIG files in all parents, if Perforce 2015.2 is used
No subsystemBugWEB-25284Sass partials starting with double underscore cannot be resolved
BugWEB-25244Throwable when open color picker
CosmeticsWEB-25204Missing colon in new project wizard (IDEA)
CSSBugWEB-25193Add support for "::placeholder" and ":placeholder-shown" pseudo selectors
ExceptionWEB-24917Throwable when choose color
JavaScriptFeatureWEB-24675Support `import()` function
BugWEB-25231False error "expected =>" for Flow typecast
BugWEB-21617JSX: Line Comment breaks code inside ternary condition
BugWEB-25223Arrow function and object - Parsing errors for correct code
BugWEB-25251JSDoc is converted to parameter's type when call 'Split into declaration and init'
JavaScript. FormatterFeatureWEB-19143Remove last comma in json or js arrays/object automatically
FeatureWEB-12581New JavaScript formatter option: split variable declarations in lines
BugWEB-25312Incorrect indentation in JSX using ternary operator
BugWEB-25218'Use semicolon to terminate statement' is not applied inside 'script' tag in html file
BugWEB-25247'Align parameters when multiline' ignores destructuring parameters
BugWEB-25222es6 destructuring indentation issue
BugWEB-24643Problem with indentation after updating to 2016.3.2
BugWEB-25235destructured parameter defaults do not obey the alignment formatting options
JavaScript. FrameworksBugWEB-25212Vue + Typescript: export is not recognized
JavaScript. InspectionsBugWEB-25234"Content of collection is never updated" is wrongly reported on Sets
BugWEB-25140ESLint highlights incorrect line when line is too long
BugWEB-24938ESLint command line error messages are not shown properly
JavaScript. PredefsBugWEB-25241Buffer.from pointing to wrong method Array.from
LESSBugWEB-20921Add support for valid HTML syntax for including LESS/SCSS in <style> tags
Node.jsBugWEB-25219Improve behavior of Express generator when offline
SASSBugWEB-19351SASS: 'unexpected whitespace' error shown if there is a space after variable name in interpolation
IDE integrationBugALL-1311Clicking on an project which is already open does not bring that project to foreground
Plugin: Deployment _ FTP..BugWI-34851Empty password ignored (sftp)
No subsystemBugRIDER-4349Featured plugins are not uploaded in Init configuration wizard

RubyMine 2017.1 EAP5 (build 171.2822.20) Release Notes

Plugin ReportsBugRUBY-19122New slim file creation throws ClassNotFound exception
No subsystemBugIDEA-167089MacOSX: support tcsh shell for loading environment variables
BugIDEA-163567FileChooserFactoryImpl.createSaveFileDialog doesn't use native file chooser
BugIDEA-67763tabs in split window view
UsabilityIDEA-155075Why file template settings are marked as per-project?
UsabilityIDEA-133381drag and drop file from project view tool window
Code Analysis. InspectionBugIDEA-163702No quick fix button on inspection preview at inspection level after the first run
Code Formatting and Code StyleBugIDEA-166923Reformat code before commit doesn't pick up code style settings
Code NavigationUsabilityIDEA-163865"Enter class name" popup showing distant matches first
Compiling ProjectBugIDEA-167069Auto-make: after deleting some characters file is not saved and Problems is not up-to-date
DebuggerUsabilityIDEA-167143Invalid focus switching in variables window
Editor. Editing TextBugIDEA-161409Folded imports region opens when imports are added
BugIDEA-150505Underlines characters invisibles
CosmeticsIDEA-67480Font baseline is shifted for Consolas font
Find, Replace, Find UsagesBugIDEA-166240Unordered line numbers in the "Find" panel
BugIDEA-167096'Too Many Occurrences' window appears too early
IDE ConfigurationBugIDEA-167444Deletion of css dialect or template data language left an artefact and causes an IOOBE
BugIDEA-166892NullPointerException on startup
CosmeticsIDEA-167421SQL Dialects Settings: the path to specific file/folder uses incorrect slashes on windows
Java. Code CompletionBugIDEA-116181Code completion should prefer imported type by default
UsabilityIDEA-163049"= ..." on selected item in completion list is confusing
JavaEEBugIDEA-159769JBoss jBPM plugin is reported as not loaded due to missing required dependency on Ubuntu and is missing on Windows
Project ConfigurationBugIDEA-157933"More settings" option doesn't reappear if I unchecked "Create Project from Template"
BugIDEA-166580Change made to project library declaration is not stored
BugIDEA-167087Pressing cancel in Project Structure|SDKs|Sourcepath|'+' file chooser dialog results in confusing dialog box
BugIDEA-147530ModifiableModuleModel#newModule should always create a new module from scratch
BugIDEA-167092ConcurrentModificationException while opening another project
User InterfaceBugIDEA-162119Configuration wizard UI theme IntelliJ is not corresponding with IDE theme Default on Mac
BugIDEA-167018Cannot drag-and-drop in a just opened project until no files are opened in editor
UsabilityIDEA-166252Horizontal scrollbar is not shown when needed
CosmeticsIDEA-166908Speed search border has no antialiasing
CosmeticsIDEA-165564Breadcrumbs do not use ligature setting
User Interface.DarculaExceptionIDEA-135796Cyclic component initialization: com.intellij.ide.ui.LafManager
XMLBugIDEA-163906Incorrect XSD validation result in editor
BugIDEA-156292In XmL Editor view Idea does not accept a seemingly valid XML
No subsystemBugWEB-24269The underscore in node_modules is interpreted as a shortcut key
JavaScriptFeatureWEB-25101Colors and Fonts: provide separate option for the arrow function sign
BugWEB-25129JavaScript Intellisense is useless
JavaScript. FormatterFeatureWEB-24357JavaScript Code style: Space between async and () => {}
FeatureWEB-22782Add formatting options to insert/remove trailing commas in Object Literals, Function Declaration Parameters, Function Call Arguments, ES6 Imports/Exports
FeatureWEB-14310Add support for Google JavaScript style guide
BugWEB-24126Flow: provide correct formatting for union and intersection types
BugWEB-24389Flow: Some flow type syntax confuses the formatter
BugWEB-24853Formatter doesn't follow the formatting rules when formatting Flow type annotations, also reports valid Flow type as "error"
JavaScript. FrameworksBugWEB-25128React native debugger: template app can't be debugged
BugWEB-22855aria-attributes are not recognized in JSX
JavaScript. InspectionsFeatureWEB-25172Provide import suggestion from .jsx to .js
BugWEB-25162ESLint: 'Fix ESLint problems' action is missing in .jsx file right-click menu
BugWEB-22931Inspections: "Remove unnecessary parenthesis": do not suggest it for Flow syntax
BugWEB-25104Wrong warning about usage of reserved word in destructuring
JavaScript. RefactoringBugWEB-24920ES6 - not correct actions in the Action Menu for Arrow functions with Destructuring objects as function parameters
StylusBugWEB-13543Stylus: Red code: Dot is not recognized as unexpected term
BugWEB-13549Stylus: Red code: support @supports at-rule
TypeScriptFeatureWEB-24838TypeScript: Add code style for spaces in Intersection and Union Types
BugWEB-24740IDEA fails to properly link classes imported using modules in Angular 2 project
BugWEB-9583TypeScript: Code Style: wrappings for Extends/Implements don't work
RunFeaturePY-22487Emulate terminal in python output console
Test RunnerExceptionPY-22376No entries about running tests in context menu for files with test: java.lang.ClassCastException

RubyMine 2017.1 EAP4 (build 171.2613.16) Release Notes

IDEBugRUBY-18809Support changing language level for JRuby and Rubinius sdks
InspectionsBugRUBY-19086Run RuboCop inspection by name throws exception
CosmeticsRUBY-19066RuboCop is used without CamelCase
ParsingBugRUBY-19036Rubocop is not available in Run Inspection by name option
UsabilityRUBY-19052Rubocop's inspection 'too long' class or method makes is very agressive
TestsBugRUBY-19012rspec context detection is weaker in 2017.1 EAP compared to previously
No subsystemBugIDEA-166669FileTypeRegistry.FileTypeDetector should not be skipped for large files
UsabilityIDEA-165002Can't Disable Message: Remote desktop detected, Animation disabled
CosmeticsIDEA-166907Duplicate caption for button
Code Analysis. InspectionFeatureIDEA-164129Jigsaw: provide quickfix when module exported to itself
Code NavigationBugIDEA-165329Can't copy class reference by hitting Ctrl+C in Navigate/Class list
UsabilityIDEA-161069Show special gutter icon for 'implemented via sub-class' methods
DebuggerUsabilityIDEA-156493"Evaluate Expression" – underlined character conflicts with "Paste from History"
Editor. Code CompletionBugIDEA-165880Out of date psi in completion API
Editor. Editing TextBugIDEA-166403Backspace does not remove indents and new lines in scratch files
BugIDEA-165853Unable to save settings: Failed to save settings. Please restart IntelliJ IDEA
BugIDEA-166059Corrupted zero latency typing with the new hidpi
BugIDEA-166498Incorrect border effect in editor with new hidpi
BugIDEA-166581Incorrect font rendering in vcs change preview (new hidpi)
PerformanceIDEA-166747Freeze after calling duplicate action repeatedly
File SystemBugIDEA-166879IDE cannot handle 2GB+ jars
Find, Replace, Find UsagesBugIDEA-166862Find/Replace: Do Refactor button disappears
IDE ConfigurationBugIDEA-166807IntelliJ does not recognize and deletes project shared file templates
BugIDEA-166870IDE version 2016.3 doesn't work on AArch64
BugIDEA-166732JetBrains IDEs do not restart if IDE is in a directory containing '.app' in it's name on Mac
UsabilityIDEA-166720Please sort lines in Settings - Editor - General - Console - "Fold console lines that contains"
UsabilityIDEA-165796remove perm gen options from OutOfMemoryDialog
IndicesExceptionIDEA-165396Don't start indexing after the project is disposed
Java. Code CompletionBugIDEA-81775Track auto-complete "preferred" values for longer time/per prefix
Java. Error HighlightingUsabilityIDEA-166734Code folding should unfold when I hit F2 to find the next error/warning
Java. RefactoringBugIDEA-166853'Finds conflics' preview pane is empty
Java.InspectionsFeatureIDEA-166888Report useless Stream or Optional intermediate operations
FeatureIDEA-163460Recognize patterns convertible to Arrays.setAll()
FeatureIDEA-160448Simplify groupingBy-collectingAndThen-Optional.get Collectors chain
BugIDEA-166602Duplicate Structural Search Inspection breaks feature in IDEA 2016.3.2 and 2016.3.3EA
TerminalFeatureIDEA-136672Terminal should have clickable URLs
User InterfaceBugIDEA-166152Forced IDEA update
BugIDEA-166759The cursor while over one ToolWindow sees another border toolwindow, located behind
BugIDEA-164211The <Click to see difference> link is not active sometimes
UsabilityIDEA-153193Tooltips for toolbars block clicks to buttons
Version ControlBugIDEA-166714Wrong shelf background color sometimes
XMLBugIDEA-162824"Resource registered by this uri is not recognized" spuriously triggers for "http://www.w3.org/2001/XMLSchema-instance" running tests
No subsystemFeatureWEB-23847Add support for command line parameters for react-native-cli
BugWEB-24885Cannot download javascript libraries. Languages&Frameworks > Javascript > Libraries > Download > Typescript Community Stubs > webaudioapi
BugWEB-24504JSX comments are still not working
DebuggerFeatureWEB-23955debugging react native always attempts to run react-native run-android
BugWEB-25061Node 7: Stopping at breakpoint opens a new read-only editor (Windows)
BugWEB-25012Node 7: React native debugger does not work
JavaScriptFeatureWEB-23511Fix action 'Split into declaration and initialization (and move to scope start)' for destructuring
FeatureWEB-22120Missing parameters when generating abstract method bodies
BugWEB-25041Exception when extracting variable used in decorator
BugWEB-25033Troubles with JS libraries in multimodule project
BugWEB-17651Split into multiple declarations removes comment
BugWEB-21426JSX: block comment is not undone on comment action re-invocation
JavaScript. FormatterBugWEB-24786Wrong indent after 'Extract++'
UsabilityWEB-24704ES6: Preserve order of imports and empty lines between them
JavaScript. FrameworksBugWEB-24095Add option to pass environment variable in React native configuration
JavaScript. InspectionsBugWEB-24926Standard Code Style: correctly setup rules from preset
BugWEB-22864False positive "Element is not exported"
TypeScriptBugWEB-24945incorrect warning msg
BugWEB-24711Fix 'Split into multiple declarations' for enum
Plugin: Deployment _ FTP..BugWI-34796Download from... in ProjectView always uses default server

RubyMine 2017.1 EAP3 (build 171.2455.2) Release Notes

No subsystemFeatureRUBY-13536Make "New Ruby Class" module-aware
IDEExceptionRUBY-19025Open application throws assertion
Custom JREBugIDEA-166384provide a utility method in IDEA to support JRE-166
Diff_MergeFeatureIDEA-166528Window "Difference between master and ... (Local) versions in ...
Editor. Editing TextBugIDEA-165577Sibling multi-cursors are merged into one
External ToolsBugIDEA-164380External tool is not invoked after Git commit
IDE ConfigurationBugIDEA-166179Font size is not preserved after updating to EAP build
BugIDEA-166362Show warning notification concerning outdated boot java runtime
BugIDEA-166402incorrect warning
IndicesBugIDEA-166470Deadlock
Java. RefactoringUsabilityIDEA-159142Extract interface in a different package enforce to rename
Java.InspectionsBugIDEA-166449'Unused declaration' inspection doesn't work for local variables in some cases
Plugin Support. ArchitectureBugIDEA-164497IntelliJ 2016.3 hangs at startup with message "Scanning files to index"
Project ConfigurationBugIDEA-166461Cannot revert module language level to 1.8
RefactoringBugIDEA-166346gap rename the block variable when on the "Show parameter name hints"
Run | Debug configurationBugIDEA-162766EnvironmentVariablesTextFieldWithBrowseButton doesn't fire change event when env variables changed.
BugIDEA-166448Missing '&', '_' characters in Rerun/Stop buttons' tooltips
User InterfaceBugIDEA-161023Hide exception notification balloon when clicking on exception submitter blinking icon
Version ControlUsabilityIDEA-166532Branch popup: auto-resize popup on changing number of favorites
UsabilityIDEA-166510Branch popup: do not show empty space on vertical resize if there are branches to be shown
UsabilityIDEA-166504Branches popup: make more... element expandable with Enter from keyboard
UsabilityIDEA-166649Branches popup: cut tracking branch name before local name if they don't fit to the popup width
UsabilityIDEA-166503Branches popup: show only favorite local branches if there are too many of them
CosmeticsIDEA-154756Allow the user to choose a branch as default or to appear at top of the branch list
Version Control. GitBugIDEA-1659032017.1 EAP - Cleanup block the commit to Git
Version Control. SubversionBugIDEA-129671OK/Cancel actions switched on warning of Subversion move of "trunk"
No subsystemBugWEB-24911Strange errors when using flow-typed with flow
BugWEB-24874'var' JS inspection suggests replace 'var' with 'const' in for loops
DebuggerBugWEB-24960MessageError when 'Copy JSON'
JavaScriptBugWEB-24969Unexpected warning "Element is not exported"
BugWEB-24881Extend Selection doesn't support javascript es6 "``" syntax
BugWEB-24930JsDoc @augments ignored
JavaScript. FormatterFeatureWEB-24556Reformatting option to add, remove, or leave alone (default) semicolons
BugWEB-24927'Make static' breaks code or highlighting depending on settings
BugWEB-24789Globally installed Standard always shown in the UI
JavaScript. InspectionsFeatureWEB-24517Inspection: '==' operator is used instead of '==='
Node.jsBugWEB-24963Bower.json completion hangs IDE due to not installed bower package on Unix/Mac
TypeScriptBugWEB-24767Typescript now reporting != as poss type coercion when comparing two numbers
ExceptionWEB-24739Typescript: exception is thrown on the first new TS file creating in the project
Plugin: Deployment _ FTP..BugWI-34600Download From ... server selection popup has label for upload
BugWI-34601Deployment popup doesn't have Download From ... option

RubyMine 2017.1 EAP2 (build 171.2272.16) Release Notes

No subsystemBugRUBY-18943Rails missing on create new Application
ExceptionRUBY-18975Spring customization may be failed when project has already disposed
Code InsightBugRUBY-18900inspection of frozen string fail
CucumberBugRUBY-18947Cannot find cucumber step reference when the \h metacharacter is used
IDEBugRUBY-19024Gems are not installed into just created gemset
BugRUBY-19018Cannot create any new project if any project is already opened in the Editor
BugRUBY-18809Support changing language level for JRuby and Rubinius sdks
MarkdownBugRUBY-19001Underscore now treated as word break in Markdown files regardless of settings
PuppetBugRUBY-18963No quick-fix to install librarian-puppet from IDE
BugRUBY-18972Gem Manager trying to install missing gems from dependent modules
UsabilityRUBY-18973Null in puppet project name in the project view if version is not specified
Run ConfigurationsBugRUBY-18957JRuby icon is displayed for Use other SDK field in Run/Debug configuration
TestsBugRUBY-18929running single rspec results in failure to load project correctly ("cannot load such file -- rails_helper)
No subsystemBugIDEA-165879Unguarded section in DocumentCommitThread that leads to spontaneous assertion
BugIDEA-165949[hidpi-jdk] IDEA main frame doesn't restore its bounds on the second monitor when reopened
ExceptionIDEA-164698Throwable at com.intellij.openapi.fileEditor.impl.EditorsSplitters.a
DockerExceptionIDEA-158428Throwable: Dockerfile detection is already registered
Editor. Editing TextBugIDEA-165306Multiple caret Copy and Paste gives inconsistent results
BugIDEA-165337Copy-paste from IDEA to TextEdit and back loses line breaks
File SystemBugIDEA-162327Recognize NTFS junctions
PerformanceIDEA-165859Pycharm freezes when open a folder with recursive symbolic link
Find, Replace, Find UsagesBugIDEA-165473Find Usages results tool window scrolls erratically when removing result items and Group by usage type option enabled in view
IDE ConfigurationFeatureIDEA-165592Bring back opening files from CLI in new window as option
BugIDEA-165515'Edit Custom VM Options' action should edit file defined by IDEA_VM_OPTIONS environment variable if it's set
TaskIDEA-158229Disable "VM options file path missing" warning in headless mode (offline inspections/duplicates)
Java. RefactoringFeatureIDEA-88476Inline Method should have additional options for choosing which invocations to inline and whether to keep/remove the method
BugIDEA-165748'Safe delete' finds usages in IDEA config files
Java.InspectionsFeatureIDEA-165766Add inspection for explicit calls to no-argument super constructor
FeatureIDEA-165942Inspection to replace method call in a loop with bulk operation
PerformanceIDEA-166140Code cleanup is too slow and needs too much memory
JavaScript. DebuggerBugIDEA-160102JavaScript Debugger: "Copy Watch"creates buggy code
Plugin Support. APIBugIDEA-166029Another backward-incompatible plugin SDK change in WebBrowserUrlProvider
Project ViewBugIDEA-160450"Select Target -> Project View" doesn't work if Project View has multiple selection in it
UsabilityIDEA-160381Project Tool Window sorts case insensitive: folders starting with capital letters at the top
RefactoringUsabilityIDEA-166117Copying a file asks for file type even if "Open copy in editor" is unchecked
Run | Debug configurationBugIDEA-157989"Stop" button does not work when the IDE is launched as a background task
Settings RepositoryBugIDEA-138631Read-only sources of settings
BugIDEA-144052When "Settings repository" is enabled changes in 'Path Variables' aren't saved to default path.macros.xml file causing errors in build process
BugIDEA-153381Settings Repository:NPE com.intellij.openapi.actionSystem.CommonShortcuts.shortcutsById during Overwrite Local
UsabilityIDEA-163756SettingsRepository: dialog prompting to enter authentication token is shown on IDEA closing unexpectedly
ExceptionIDEA-166041IllegalArgumentException when open the project
Unit Testing. JUnitFeatureIDEA-162336JUnit Ant XML test results report can only be viewed as plain XML - Eclipse has a graphical viewer
BugIDEA-164232"Import Test Results" shows only the last 50 lines
BugIDEA-166331"JUnit4 test can be JUnit5" shows empty Find Refactoring preview
BugIDEA-163388org.junit.ComparisonFailure does not show full right side
UsabilityIDEA-165455Navigate to next test when sorted
User InterfaceBugIDEA-165448[hidpi-jdk] windows: sized text "floats" under kbd cursor on 200% scale
BugIDEA-163839Editor's tabs D'n'D ignores drop position
BugIDEA-149734About Dialog: link from "VM by Oracle" leads to Jetbrains.com site
BugIDEA-166279null message on cancelled updated
BugIDEA-165837Analyze dependencies dialogs are too wide
UsabilityIDEA-164817Analyze|Inspect code window does not remember last selected profile
Version Control. GitTaskIDEA-166094Git.Application.Settings — do not save detected path to git as user setting
Web ServicesBugIDEA-165641IDEA 2016.3.1: Wrong unused import recognition in xml files
No subsystemBugWEB-24702Respect "Use semicolon to terminate statements" Code Style option when "Add braces to arrow function statement"
BugWEB-19429Fat arrow after function() does not produce error
BugWEB-24475External annotators for a base language are ignored when another external annotator exists for a more specific flavor
BugWEB-24768Indexing a large .js file causes IDE to run out of memory
BugWEB-23441Suggest inserting 'use strict' / Syntax Error not being caught
BugWEB-24760Project Tool Window: CSS source maps (gulp-generated) not grouped under the same name, but JS does.
PerformanceWEB-24880ES6ExportDefaultReferenceSearcher unstubs declaration's file on highlighting usages in a current file
CSSFeatureWEB-4585Consider CSS selectors used if they show up in string literals
BugWEB-24700Stylelint 7.7.0 support
DebuggerBugWEB-15998Karma JS debugger does not suspend on breakpoints with the browserify + istanbul preprocessor
BugWEB-24721Angualr2 with Angular-cli (Webpack) VERY often break points are missed and the only way to fix is use ;debugger keyword
HTMLBugWEB-17897Line of HTML disappears when moving other lines
UsabilityWEB-7947Tags whose contents are functional shouldn't be broken on "Move block"
JavaScriptFeatureWEB-24675Support `import()` function
FeatureWEB-23096Support JavaScript generic/template types in autocomplete
BugWEB-24862JavaScript parsing fails with "0xffe1" (testfile attached)
BugWEB-24915Unable to change color from gutter if multiple colors are defined on the same line
BugWEB-3407JS: Smart Enter fails to add closing parentheses
BugWEB-24266Flow: comma (`,`) and plus (`+`) in generics are marked as bad characters
BugWEB-23996Flow language level syntax highlighting error
BugWEB-3763Context info for extended JavaScript objects
BugWEB-2967"Select Word" (Ctrl-W) feature misses comma in members of variable declarations
BugWEB-19495JSDoc: This type string _sometimes_ causes an error
BugWEB-22398Wrong redundant character escape in ECMAScript 2015 unicode mode
BugWEB-23332Carriage return within JSX string value mistakenly marked as error
BugWEB-23841Flow checking gives wrong warning & errors in interface files
JavaScript. FormatterBugWEB-24787Use semicolon to terminate statement option with for loops
JavaScript. InspectionsFeatureWEB-24074Add eslint-compatible suppression options
BugWEB-24672Inspections: "Convert 'for..in' to 'for..of'" is shown twice for each code construct in Inspection Results
BugWEB-24686Inspections: do not suggest "Convert 'for..in' to 'for..of'" in case of conflicting error with "Unfiltered for..in loop"
BugWEB-24630Convert to class intention loses getters and setters
BugWEB-23920Magic Number inspection should not apply to JavaScript Object key/value pairs
BugWEB-24736Potentially invalid usage of this in getters/setters inside constructor
BugWEB-19149Warning about "Potentially invalid usage of this" when accessing property in ES6 generator
BugWEB-24748JSCS: 'Fix current file with JSCS' doesn't work from Inspections Results toolwindow
BugWEB-24754Warning with async functions and no return value
BugWEB-24609'Convert to let' adds redundant export modifier
PerformanceWEB-24567Editing is slow because of 'missing Import' inspection
JavaScript. RefactoringBugWEB-24742ES6: convert to class with a commented function property: null assertion
TypeScriptFeatureWEB-12611Enforce types in TypeScript
FeatureWEB-13214Request: improve TypeScript code style flexibility
BugWEB-23613Typescript, JSX, Generics - invalid report issue
BugWEB-11466Typescript: "super" keyword syntax checks are incomplete
BugWEB-24895typescript format enum incorrect if adding auto semi colon
BugWEB-24728Applying postfix template to `await` expression breaks the code
BugWEB-24745AssertionError is thrown on caret position at the exponential operator
BugWEB-18733TSX: single quote or double quote causes ") expected" error
IDEBugPY-17836Project Opening options are ignored, confirmation window is shown regardless of settings
InspectionsBugPY-14381Wrong "Empty group" warning for regex
Plugin: Deployment _ FTP..FeatureWI-5276"Download from..." option for deployment
BugWI-34664SFTP authentication fails because of unsupported request format
BugWI-34427Sync with deployed encoding problem
UsabilityWI-33783Remove Anonymous option from sftp as nonexistent
CosmeticsWI-34396after commit: Upload files to
No subsystemExceptionRIDER-1675IllegalArgumentException Comparison method violates its general contract!

 

  • No labels