Skip to end of metadata
Go to start of metadata

RubyMine 2016.3.4 (build 163.15529.19) Release Notes

Version Control. GitBugIDEA-140196Built-in SSH: does not support strong security ciphers - Cannot negotiate, proposals do not match

RubyMine 2016.3.3 (build 163.15529.6) Release Notes

RubyMine 2016.3.3 EAP (build 163.15529.2) Release Notes

No subsystemBugRUBY-18911opened singleton class nodes in find usages results (grouped by file structure) are labeled "self"
Code InsightBugRUBY-18889"Navigate > Class" cannot understand "::" in 2016.3
BugRUBY-18878Create property quick fix is missing
CucumberBugRUBY-18914Cucumber undefined steps in case of regexp
RailsBugRUBY-15349Type 'references' isn't completed for the model's field
Ruby Version ManagersBugRUBY-18896Coverage can't be used with rvm SDK
TestsBugRUBY-18929running single rspec results in failure to load project correctly ("cannot load such file -- rails_helper)
No subsystemBugIDEA-164734Update screen is too big
ExceptionIDEA-168411PluginManager StartupAbortedException
Code Analysis. InspectionCosmeticsIDEA-162907Inspections settings: wrong font color for selected top level nodes
Code NavigationBugIDEA-165329Can't copy class reference by hitting Ctrl+C in Navigate/Class list
Editor. Editing TextBugIDEA-164345IDEA strips trailing spaces even in the line under caret
BugIDEA-150505Underlines characters invisibles
CosmeticsIDEA-164888Please keep up with FiraCode updates
CosmeticsIDEA-67480Font baseline is shifted for Consolas font
External ToolsBugIDEA-164380External tool is not invoked after Git commit
File SystemBugIDEA-166879IDE cannot handle 2GB+ jars
Find, Replace, Find UsagesBugIDEA-167546Find/Replace nonfunctional when newlines are embedded in the Find textbox
UsabilityIDEA-167955Find: `Ctrl+F` on selected word doesn't pre-select text in search field if Find bar is open
Java. InspectionsPerformanceIDEA-166140Code cleanup is too slow and needs too much memory
Plugin Support. APIBugIDEA-166029Another backward-incompatible plugin SDK change in WebBrowserUrlProvider
Plugin Support. ArchitectureBugIDEA-164497IntelliJ 2016.3 hangs at startup with message "Scanning files to index"
Project ViewBugIDEA-160450"Select Target -> Project View" doesn't work if Project View has multiple selection in it
RegExpBugIDEA-165426Regexp check is not working in new language injection dialog
Structural Search and ReplaceBugIDEA-168119Structural Search dialog can change it's width to be unusable (because of long Status: text)
Unit Testing. JUnitBugIDEA-163309JUnit outputs result of @BeforeClass after test excution
User InterfaceBugIDEA-166759The cursor while over one ToolWindow sees another border toolwindow, located behind
BugIDEA-163532Speed search in popups preselects the last match instead of the first
UsabilityIDEA-153193Tooltips for toolbars block clicks to buttons
UsabilityIDEA-65636I can't copy text from tooltip, though I can select it
Version Control. MercurialBugIDEA-164692Only one instance of password is saved
XMLBugIDEA-164679Intellij IDEA 2016.2/3 ignores <xsd:sequence> validation
BugIDEA-162824"Resource registered by this uri is not recognized" spuriously triggers for "http://www.w3.org/2001/XMLSchema-instance" running tests
No subsystemBugWEB-24760Project Tool Window: CSS source maps (gulp-generated) not grouped under the same name, but JS does.
BugWEB-26160Typescript community stubs can't be downloaded from Settings | Languages & Frameworks | JavaScript | Libraries
CSSBugWEB-24700Stylelint 7.7.0 support
JavaScript. FrameworksBugWEB-24101create-react-app does not work in IntelliJ IDEA
JavaScript. InspectionsBugWEB-24491Code analysis throws ClassCastException exception for Flowtype
BugWEB-24615Wrong JSHint error highlight for JavaScript
BugWEB-23107"Missing import statement" for JSON.stringify suddenly with WS-163.5219 (EAP)
IDEBugPY-17836Project Opening options are ignored, confirmation window is shown regardless of settings
PS specificBugWI-34109Can't open the link in the "PHP interpreter is not configured" popup
Plugin: Deployment _ FTP..BugWI-34349Can't rename deployment configurations if they're not default
Project ModelBugCPP-8120CLion doesn't reload Cmake project after import project from Welcome screen or when missing CMakeLists is restored

RubyMine 2016.3.2 RC (build 163.10154.57) Release Notes

No subsystemBugRUBY-18911opened singleton class nodes in find usages results (grouped by file structure) are labeled "self"
Code InsightBugRUBY-18878Create property quick fix is missing
CucumberBugRUBY-18914Cucumber undefined steps in case of regexp
IDEBugRUBY-18809Support changing language level for JRuby and Rubinius sdks
Plugin ReportsBugRUBY-19038Can't create new gem application with new type of wizard
No subsystemBugIDEA-162000Create ability for void formatting blocks
Code Analysis. InspectionBugIDEA-163879Code cleanup takes too much time and memory
BugIDEA-164850Unable to save settings: Failed to save settings. Please restart IntelliJ IDEA
File SystemBugIDEA-165018Gradle project doesn't see the updated jar file after sibling Gradle module artifact is rebuilt and stored in local m2 repo
Java.InspectionsBugIDEA-164896Exception in IDEA core - inspections not running for certain files
RegExpBugIDEA-165010False positive: "Unclosed group reference" for backreference to a named group in regex
Version Control. GitBugIDEA-163941Git cherry-pick with commit-dialog shows diff for the cherry-picked commit instead of the real diff of local changes
JavaScript. FrameworksBugWEB-24101create-react-app does not work in IntelliJ IDEA
JavaScript. InspectionsBugWEB-24491Code analysis throws ClassCastException exception for Flowtype
BugWEB-23107"Missing import statement" for JSON.stringify suddenly with WS-163.5219 (EAP)
IDEBugPY-17836Project Opening options are ignored, confirmation window is shown regardless of settings
Plugin: Deployment _ FTP..BugWI-34264Create New Project from Existing Source doesn't work for a new server
Project ModelBugCPP-8120CLion doesn't reload Cmake project after import project from Welcome screen or when missing CMakeLists is restored
BugCPP-7959CMake console: Incorrect link in the warning/error when directory contains spaces
UsabilityCPP-7531CMake tool window is activated and error icons updated only after all generation finishes
UsabilityCPP-7974CMake Output: Make CMake errors more visible
UsabilityCPP-8004Set CLion's project name from CMake's ${PROJECT_NAME}

RubyMine 2016.3.2 EAP (build 163.10154.48) Release Notes

No subsystemBugRUBY-18911opened singleton class nodes in find usages results (grouped by file structure) are labeled "self"
CucumberBugRUBY-18914Cucumber undefined steps in case of regexp
RailsBugRUBY-15349Type 'references' isn't completed for the model's field
No subsystemBugIDEA-162000Create ability for void formatting blocks
Code Analysis. InspectionBugIDEA-163879Code cleanup takes too much time and memory
BugIDEA-164850Unable to save settings: Failed to save settings. Please restart IntelliJ IDEA
File SystemBugIDEA-165018Gradle project doesn't see the updated jar file after sibling Gradle module artifact is rebuilt and stored in local m2 repo
Java.InspectionsBugIDEA-164896Exception in IDEA core - inspections not running for certain files
RegExpBugIDEA-165010False positive: "Unclosed group reference" for backreference to a named group in regex
Version Control. GitBugIDEA-163941Git cherry-pick with commit-dialog shows diff for the cherry-picked commit instead of the real diff of local changes
JavaScript. FrameworksBugWEB-24101create-react-app does not work in IntelliJ IDEA
JavaScript. InspectionsBugWEB-23107"Missing import statement" for JSON.stringify suddenly with WS-163.5219 (EAP)
BugWEB-24491Code analysis throws ClassCastException exception for Flowtype
IDEBugPY-17836Project Opening options are ignored, confirmation window is shown regardless of settings
Plugin: Deployment _ FTP..BugWI-34264Create New Project from Existing Source doesn't work for a new server
Project ModelBugCPP-8120CLion doesn't reload Cmake project after import project from Welcome screen or when missing CMakeLists is restored
BugCPP-7959CMake console: Incorrect link in the warning/error when directory contains spaces
UsabilityCPP-8004Set CLion's project name from CMake's ${PROJECT_NAME}
UsabilityCPP-7531CMake tool window is activated and error icons updated only after all generation finishes
UsabilityCPP-7974CMake Output: Make CMake errors more visible

RubyMine 2016.3.1 RC (build 163.9166.34) Release Notes

Code InsightBugRUBY-18889"Naviagate > Class" cannot understand "::" in 2016.3
Remote InterpretersExceptionRUBY-18566Closing project with Remote Interpreter after bundle install may throw exception
Editor. Editing TextBugIDEA-164094Horizontal scrolling with SHIFT key is no longer working
No subsystemBugWEB-24520HTML5 boilerplate v5+ uses wrong structure
Node.jsBugWEB-24200Can't use yarn installed using brew

RubyMine 2016.3.1 EAP (build 163.9166.17) Release Notes

IDEBugRUBY-17977Cannot create 'Gem' application on Windows
RailsBugRUBY-15349Type 'references' isn't completed for the model's field
Rails. Code InsightBugRUBY-18213RubyMine uses wrong class in evaluating belongs_to associations, when class inherits from another class, which inherits from ActiveRecord::Base
Rails. Project ViewBugRUBY-18834Mailer views should appear under mailers
RefactoringsBugRUBY-18016"Convert concatenation of strings to substitutions" quick-fix confused by double quotes inside single
BugRUBY-17652Rename refactoring doesn't rename alias subject
BugRUBY-18130Rename refactoring doesn't rename assets corresponded for controller
Remote InterpretersBugRUBY-17587Cannot add another gemset of the remote Ruby SDK that is already in list
Ruby Version ManagersBugRUBY-17641Can't use gem simplecov from gemset
UsabilityRUBY-18569Warn user if rbenv-gemsets plugin is not installed
RubyGemsBugRUBY-18218Prevent module libraries entries referring to vendored gems within project IML file
TestsBugRUBY-18850Rubymine can't run all minitest spec in folder
BugRUBY-18364Cannot run minitest - cannot load such file -- test_helper
TaskRUBY-18847Do not add option I with empty list of folders
YAMLUsabilityRUBY-18677YAML code folding leaves too little context
No subsystemBugIDEA-163903Current file todos are not shown in 'Scope Based' tab with selected 'Current file' scope
BugIDEA-160578IDEA hangs on start with inactive Proxy Authentication dialog
Code NavigationFeatureIDEA-162418Enhanced go to file formats
BugIDEA-163673IntelliJ was frozen for 3 minutes without obvious reason
ConsoleBugIDEA-163771Lots of logging to the console -> memory leak
Editor. Editing TextBugIDEA-163578IntelliJ IDEA can't edit a specific line
BugIDEA-163905Zero Latency Typing is excruciatingly slow with 20 carets and unusable with 50.
ExceptionIDEA-162595`Wrong offset` exception when start typing on the first line of any file if there're >1 lines [#171.78]
Find, Replace, Find UsagesBugIDEA-163346error stripe position is wrong when find replace is active
BugIDEA-163710Going from Find to Find & Replace changes the input value
BugIDEA-164440Find in path does not show path of currently active file in Directory field
BugIDEA-164574Find In Path dialog no longer finds selected text
UsabilityIDEA-152060Auto select find/replace field on focus.
UsabilityIDEA-162903find ccurences window doesn't switch into panel after enter key
IDE ConfigurationBugIDEA-163920NPE when saving proxy settings
BugIDEA-161375What is Pin Active Tab doing here?
Plugin Support. APIBugIDEA-164420Backward-incompatible changes in plugin SDK in 2016.3
Settings RepositoryBugIDEA-155623Loading settings from settings repository fails to import live template
TerminalFeatureIDEA-147703Support fish shell to use as terminal
BugIDEA-118848Pos1/End don't work in the terminal if zsh ist used
BugIDEA-163063It's impossible to deactivate auto-activated virtualenv on zsh and fish
BugIDEA-115276Local Terminal did not accept German Keyboard Layout
BugIDEA-162571Terminal does not read zshrc from ZDOTDIR defined in .zshenv
User InterfaceBugIDEA-147640Switcher dialog: up and down keys are not working
BugIDEA-162580Tool Windows show/hide state is not memorized
UsabilityIDEA-93637Hide cursor while typing
User Interface.DarculaBugIDEA-163377Darcula scheme: Expired entry in Log Console should have foreground color
Version Control. GitBugIDEA-164369can't create git tag
PerformanceIDEA-163335Memory leak
XMLBugIDEA-84959Billion laughs XML pasting/clipboard & create 100% CPU
No subsystemBugWEB-24262No types are being suggested when using flow
BugWEB-24490EAP 2016.3.2: Settings | Directory dialog is empty
BugWEB-24468Add support for <script type="es6"> to support RiotJS >= v3
BugWEB-24310Source map for less not grouped
BugWEB-24240Update bundled JSHint version to 2.9.4
BugWEB-21418JSON Schema: if file under the schema is placed in the split Editor tab update comes later than should be
PerformanceWEB-24253High Usage of CPU
UsabilityWEB-23971In Typescript, multiple choices proposed by "Choose declaration" are of no help
CSSBugWEB-24275Live Template: Fix inconsistency
BugWEB-24465False "Mismatched parameters <angle>"
BugWEB-24353Incorrect CSS/SCSS comment formatting
DebuggerBugWEB-24149React Native Debugger Exception With React Native V0.37.0.
BugWEB-21216Debugger should show contents of Map/Set
BugWEB-14233Add property of object to watches fails
BugWEB-24182Debugger: no console output when using Chromium v. < 54 for debugging
BugWEB-24297"Smart step into" doesn't work
ExceptionWEB-24091IllegalArgumentException when inspect closure
ExceptionWEB-24089TypeCastException within debug session
ExceptionWEB-23676Debugger: IOE: File is not writable: LightVirtualFile exception
File WatchersBugWEB-24482file watcher doesn't work if 'Trigger watcher regardless of syntax errors' is off
JavaScriptBugWEB-24065Auto import and redundant comma
BugWEB-23588Flow checking does not support exact object types
BugWEB-244152016.3: large increase in javascript "unresolved function or method" warnings
BugWEB-23518'resolve using flow when possible' messes up unused import checking
BugWEB-24058Bad analysis: lambda argument breaks method resolution type inference in method chain
BugWEB-21977async function always returns a Promise - incorrect jsdoc generation
BugWEB-24219JSDoc: The type of non-nullable properties is not correctly propagated
PerformanceWEB-24472IDEA 2016.3 Locks Up
PerformanceWEB-24177Files never finish indexing
UsabilityWEB-16210ExtJS 'class for xtype' not found' warning should be suppressible
UsabilityWEB-23873Setting JavaScript language version to "ECMAScript 6" shows description text outside of visible area
ExceptionWEB-24108AssertionError when call 'Choose color'
JavaScript. FormatterBugWEB-24067Some bugs with reformat code
BugWEB-12942Bad continuation indent on JS ternary expression on return statement
BugWEB-21532TypeScript intent format error in .tsx files
JavaScript. InspectionsFeatureWEB-16380No error is shown for -> used instead of => in javascript
BugWEB-23343Inspections: "require() is used instead of import": correctly stuck imports taken from the inner scopes
BugWEB-23791ES6: Incorrectly ignoring duplicate LET declaration in same SWITCH
BugWEB-23882Intentions: Convert to Class: Hierarchy: preceding comment is cut on converting
BugWEB-24110Stylelint: select package automatically
BugWEB-21978async function always returns a Promise - incorrect inspection error
BugWEB-23670Inspections: "require() is used instead of import": comments with destructing misplaced variables on Fix all
BugWEB-23772Convert to import: do not add above the block comment
PerformanceWEB-23826Inspections: 'Convert to let/const': improve performance for batch mode
CosmeticsWEB-23438Update ESLint icon
JavaScript. PredefsBugWEB-24024Incorrect warning when using symbol[Symbol.iterator] to define object property
JavaScript. RefactoringFeatureWEB-23763Implement extract method for async functions
BugWEB-24100ES6 "Replace with template string" reports incorrectly on ternary operator
BugWEB-18178Invalid inlining of awaited variables
Node.jsBugWEB-24246Yarn: support yarn installed with Windows msi installer
BugWEB-21976Node.js Core: http.ServerResponse.setHeader(name, value) not resolved
BugWEB-243592016.3 Run configuration stops by SIGKILL instead of SIGINT on Windows
UsabilityWEB-23926The toolwindow "react-native start" doesn't have running indicator and stop button
TypeScriptFeatureWEB-14077Inherit JSDoc from imported items
FeatureWEB-24151require await inspection
BugWEB-23116incorrect 'extract method' refactoring
BugWEB-24201Typecript Service: Cannot read property 'fileName' of undefined in ts-session.js
BugWEB-23761Typescript: generated setters for array type have general Array type istead of speficic array type
BugWEB-24267Need nodejs parameter options for TypeScript compiler
BugWEB-17361Convert parameters to object introduces unnecessary variables and loses type information in TypeScript
BugWEB-21832Typescript: export nested modules breaks autocompletion in some cases
BugWEB-23106the create field quick fix does not determine a type of created variable
BugWEB-24306TypeScript config fails after moving file
BugWEB-19916TypeScript or Flow + destructing no autocompletion
BugWEB-8016TypeScript: Quick Definition/Quick documentation don't work for interface field preceded with doc comment
BugWEB-24354TypeScript: 'Implement all members' generates corrupted code for method with varargs
BugWEB-6892TypeScript: Method separators rendering above lines of code that aren't methods.
BugWEB-23678JSDoc on interface property breaks PSI reference
PerformanceWEB-24040Large array in typescript causes webstorm to freeze
UsabilityWEB-23725Typescript: Go to class IDE action should shows a file, where class located
SQL HighlightingBugDBE-3492Infinite indexing of project because of language substitution GenericSQL->MySQL->GenericSQL
Remote InterpretersCosmeticsPY-21237Align fields in Configure Remote Python Interpreter dialog
ExceptionPY-21386StackOverflowError trying to add Vagrant Remote Interpreter (Win 10)
IntelliJ PlatformBugWI-33637Attach to the current project asks additional question
PHP InterpretersExceptionWI-33843Exception is thrown during editing of Remote Interpreters
PHP debugBugWI-33168Application no longer takes focus when hitting a breakpoint in 2016.3 EAP during PHP Debug
PS specificBugWI-33077Directories page in Settings is empty if more than one project is opened
Plugin: Deployment _ FTP..BugWI-33919Passphrase is not saved for a new SFTP server
BugWI-33753Password saved as passphrase
BugWI-34058Server disappears after Testing connection with Remember checkbox enabled
BugWI-33840Server with the name of removed server won't work till PhpStorm restart
BugWI-33929Visible only for this project checkbox can't be set
BugWI-33930Application level copy of deployment server loses username and password settings
BugWI-33836Error about missing passphrase is not updated when "anonymous" checkbox is selected
BugWI-33527Save password checkbox can't be applied
BugWI-34097Open in Editor action doesn't work
BugWI-33777Anonymous login still uses previous saved password
ExceptionWI-33916NPE is thrown on connection testing
ExceptionWI-33837ClassCastException is thrown on Upload to and Sync to actions
No subsystemBugVIM-1007Enabling zero latency typing introduces visual artifacts in normal mode
Project ModelBugCPP-7964CLion doesn't open a folder that contains CMakeCache.txt file as project when using File | Open
UsabilityCPP-7910Changing compiler in CMake settings resets CMAKE_BUILD_TYPE (among others)

RubyMine 2016.3 RC2 (build 163.7743.60) Release Notes

No subsystemBugIDEA-164049'Export Settings' option exports broken settings.jar
Project ViewBugIDEA-164074Exception using "Select Target" popup menu
TerminalBugIDEA-163474Terminal shell path can't be changed (falls back to default value): IntelliJ IDEA 2016.3 (builds 163.7342.3, 163.7743.17 and 163.7743.37)
TypeScriptExceptionWEB-24229StackOverflowError in JS code

RubyMine 2016.3 RC (build 163.7743.40) Release Notes

IDEBugRUBY-18608Automatic numeration of default project's name 'untitled' is not increased
IDE ConfigurationBugIDEA-161375What is Pin Active Tab doing here?

RubyMine 2016.3 BETA (build 163.7743.27) Release Notes

PuppetBugRUBY-17055When a new branch is detected, the "Sync environment with VCS branch name" setting is lost
Rails. Code InsightBugRUBY-18213RubyMine uses wrong class in evaluating belongs_to associations, when class inherits from another class, which inherits from ActiveRecord::Base
Remote InterpretersBugRUBY-17587Cannot add another gemset of the remote Ruby SDK that is already in list
No subsystemBugIDEA-163365IDEA hangs after reverting many files
UsabilityIDEA-162904Default "Editor colors and fonts" is "All hallow's eve"
ExceptionIDEA-162601AE at org.xmlpull.v1.XmlPullParserFactory.<init>(XmlPullParserFactory.java:43)
Code NavigationBugIDEA-163234SelectIn... | Favorites doesn't work if the toolwindow hasn't been opened yet
DebuggerBugIDEA-163301Remove watch: backspace doesn't remove
Debugger. Memory ViewBugIDEA-163378JVM Memory View Crashes
Editor. Code CompletionBugIDEA-162605'Plan' in plural 'Plen' (autocomplete)
Editor. Editing TextBugIDEA-163356There is not attributes composition between semantic highlighting colors and original parameters/local variables.
BugIDEA-163429Editor strips trailing spaces no matter what the settings are in preferences and ignores
File SystemBugIDEA-161151Import code style: file chooser: Show hidden files button click changes nothing
IDE ConfigurationBugIDEA-162371Duplicate "Editor Colors" entry in export settings
Java. RefactoringCosmeticsIDEA-163480Wrong plural renaming for variables/parameters
Password SafeBugIDEA-163385Cannot erase password on macOs
Project ConfigurationBugIDEA-162634Copyright settings from Template/Default Project not present in new projects
TerminalBugIDEA-163059PyCharms ignores `.bashrc` file when starting terminal session
BugIDEA-162497"copy to clipboard on selection" for terminal is not working
BugIDEA-163064Allow custom rcfiles in terminal settings
UsabilityIDEA-116221Escape doesn't moves focus back to the Editor from Terminal tool window
Version Control. LogBugIDEA-162944commit detail does not show as expect
No subsystemCosmeticsWEB-24030Update browser icons
JavaScriptBugWEB-23705Optionally use Flow completion and navigation
BugWEB-24019Suggest `default` after `break` statement
BugWEB-23588Flow checking does not support exact object types
Node.jsFeatureWEB-23820yarn: yarn tasks
TypeScriptBugWEB-24014A lot of IDE errors when typescript compilation
BugWEB-24031TypeScript: slow update for the simple import statement on changes in tsconfig.json file
Unit TestsUsabilityWEB-23591Use 'test file' icon for .jsx test files
PHP debugBugWI-33168Application no longer takes focus when hitting a breakpoint in 2016.3 EAP during PHP Debug
Plugin: Deployment _ FTP..BugWI-33798Passphrases are not imported from 2016.2
BugWI-33777Anonymous login still uses previous saved password
UsabilityWI-33752Invisible characters in host field leads to invalid host without any hints

RubyMine 2016.3 EAP (build 163.7342.19) Release Notes

DebuggerFeatureRUBY-18486Attach to local process
No subsystemFeatureRUBY-9666In the "View as: Rails" interface, Mailers and their views should be treated same way as controllers
PerformanceRUBY-18679High CPU usage for code inspections
Plugin ReportsExceptionRUBY-18574RailsApps samples creation throws an exception
Rails. Code InsightBugRUBY-17897invalid "extra call arguments" for User.includes(:posts, comments: :sub_comments)
Rails. DiagramsBugRUBY-18008Ruby class diagrams displays duplicate methods
Remote InterpretersExceptionRUBY-18566Closing project with Remote Interpreter after bundle install may throw exception
Ruby Version ManagersBugRUBY-18673Quick Search results in the Gem list should be reset by ESC
BugRUBY-18595.ruby-gemset file provides useless completion for rvm sdks
UsabilityRUBY-18611Selected sdk should be still selected after Esc search results
No subsystemBugIDEA-163155SelectIn | ProjectsView doesn't navigate to element if tool window has been previously closed
BugIDEA-163038The "PHP Code Sniffer" and "PHP Mess Detector" fail due $PROJECT_DIR$ not resolved/used
BugIDEA-161933Command Line launcher always opens new window
UsabilityIDEA-105927java packages named "rcs" are ignored per IDE setting
Code Analysis. InspectionBugIDEA-163355Inspection profile cannot be copied
Diff_MergeBugIDEA-162409OpenInBrowser controls use focused editor as context, not the editor they belong to.
BugIDEA-130854Copy revision number in git diff window
Editor. Editing TextBugIDEA-115424Editor scrolls immediately after switching to its tab after project opening
Find, Replace, Find UsagesBugIDEA-99773Find usages CTRL-ALT-F7 does not have scope Project & Libraries anymore
Google App EngineBugIDEA-162974Suggest to disable 'Google App Engine' plugin when user wants to install 'Google Cloud Tools' plugin
Project ConfigurationBugIDEA-160564multiple .ipr files on same project cannot open multiple frames
BugIDEA-135096unable to include source folders under an excluded directory
Project ViewBugIDEA-163371IntelliJ project view stops working: "null keys not supported:
Run | Debug configurationBugIDEA-151115Compound Run/Debug Type does not trigger Single Instance Only indication
CosmeticsIDEA-162800Run indicator missing from run and debug popups
Structural Search and ReplaceBugIDEA-162805Structural Search - private methods problem while extending the behavior
TerminalBugIDEA-147227Use my default shell preference on Mac
BugIDEA-157148Local terminal settings are saved globally, not per-project
UsabilityIDEA-125383Choose terminal starting directory
User InterfaceBugIDEA-133087Maximize action is available for floating tool window, but does nothing
No subsystemFeatureWEB-23522Import flow types from *.flow files first
BugWEB-23907Multiple levels of inheritance gives "type Derived is not assignable to parameter BaseBase"
BugWEB-23658Missing module dependency: don't show when resolved in the project
DebuggerBugWEB-17316Debugger: "invoke getter" results in TypeError: Illegal invocation
BugWEB-23769Chrome 54.0.2840.59 m: errors are not logged to debugger console
JavaScriptBugWEB-23933Invalid "Missing import statement" for ES6 class
BugWEB-19761ES6: Create getter/setter intentions are not available for class fields in constructor body
BugWEB-23644Support shortcut JSDoc annotations for @property @const @type @name, etc.
BugWEB-23863Code Style: "Use semicolon to terminate statements" respect in all auto completions
UsabilityWEB-23873Setting JavaScript language version to "ECMAScript 6" shows description text outside of visible area
JavaScript. FormatterBugWEB-23872JavaScript Indentation Problem with "var" over multiple lines
JavaScript. FrameworksFeatureWEB-23831Creating React Native projects
FeatureWEB-21046Support foo.android.js / foo.ios.js of React Native in IDE
BugWEB-20249React should not be marked as unused if any JSX code is used
JavaScript. InspectionsBugWEB-23885Intentions: Convert to Class: Hierarchy: correctly show conflict when both defineProperty and defineProperties are set for same property
BugWEB-23883Intentions: Convert to Class: Hierarchy: "Select targets" dialog doesn't show multiple function arguments correctly
BugWEB-23882Intentions: Convert to Class: Hierarchy: preceding comment is cut on converting
BugWEB-23881Intentions: Convert to Class: Hierarchy: wrong formatting for the converted property
BugWEB-23880Intentions: Convert to Class: Hierarchy: show conflict when several inheritances types are defined for the same elements
BugWEB-23897Intentions: Convert to Class: Hierarchy: export keyword is lost
JavaScript. RefactoringBugWEB-23918Convert to class: do not show refactoring preview if there are no other members, just constructor function
BugWEB-23928Convert require to import: the fix produced incorrect result if the name of the module contains '-' symbols
BugWEB-23889Convert var to let/const inside export statement eats export keyword
TypeScriptBugWEB-23993TypeScript: "Compile main file only" option: main file is treated as unreferenced
BugWEB-23838Incorrect code formatting
PerformanceWEB-23899TypeScript code completion performance has dropped significantly
Unit TestsBugWEB-23662Protractor: support navigable links in the console
ConsoleBugPY-21125Docstring displaying in Python console lacks of visual indentation
DockerBugPY-21268NPE on displaying exception without a message in Docker option of Remote Interepters dialog
Plugin: Deployment _ FTP..BugWI-33753Password saved as passphrase
BugWI-33701Can't connect with SSH using Deployment Settings
Code: RefactoringsFeatureCPP-7453Support user-defined literal renaming

RubyMine 2016.3 EAP (build 163.6957.23) Release Notes

IDEBugRUBY-18737Empty shortcut list for Default for Gnome on Linux
MarkdownBugRUBY-18313Markdown Plugin - Table Support
BugRUBY-18371Support completion in markdown links
BugRUBY-18690markdown not highlighted correctly
PuppetFeatureRUBY-15321Provide code folding for the puppet code
FeatureRUBY-18717Show facts location in completion popup
FeatureRUBY-18111Puppet formatting improvements
BugRUBY-17951IntelliJ Puppet plugin: variable $title is unknown
BugRUBY-18731Data types are not completed and resolved in case block
BugRUBY-17097Puppet build in variables are not resolved
BugRUBY-18493Puppet plugin: incorrect highlighting of the *unless* parameter of an *exec* resource
BugRUBY-18112Puppet: completion in class doesn't work unless it's called after at least one statement
BugRUBY-17045Can't create Live Templates for Puppet
BugRUBY-17193"Find Usages" should work on Puppet variables
BugRUBY-16876Can't see variables in completion
BugRUBY-18718code folding don't work in some cases
No subsystemBugIDEA-162179Element of NavBar is not re-enabled on closing NavBar popup
BugIDEA-153539Supplied Dark Themes define parent_scheme as 'Default' instead of 'Darcula'
BugIDEA-163040Iml files marked as modified on perforce on project open
CSSBugIDEA-162422CSS Autocomplete issues
Code Analysis. InspectionBugIDEA-145902Setting.Inspection.Profile - chosen profile does not "glue" to project
Code Formatting and Code StyleBugIDEA-156001Code Style Import doesn't recognise project-specific .idea/codeStyleSettings.xml
ConsoleBugIDEA-162449Showing progress in console hides mouse cursor leading to mouse cursor blinking when it's being moved
Diff_MergeBugIDEA-162398Merge dialog: confusing behavior while using Diff for merged changes
BugIDEA-160499Cannot use "Find" in 3-way conflict resolution merge window
CosmeticsIDEA-162742'Close Merge' dialog shows mnemonics of buttons in the message text
Project ViewBugIDEA-162376Compact Empty Middle Packages, Flatten Packages options in the Project toolwindow don't work any more
BugIDEA-162888NPE in ProjectViewImpl.changeViewCB
Unit Testing. JUnitBugIDEA-163025[regression] Run selected tests from test results only runs one
User InterfaceBugIDEA-162770Can't manually enter the path in the FileChooser
BugIDEA-162558Completion lookup's focused row not expending
BugIDEA-162885Diff window is not showing selections with background image enabled
Version ControlBugIDEA-114799idea.max.vcs.loaded.size.kb not taking effect
BugIDEA-162678Version Control Local Changes (Git) does not grab focus when opened
BugIDEA-162691Shelving multiple PNG files with the same name (but different folders) only stores one file
Version Control. GitBugIDEA-148376Canceling Git operations shouldn't leave index.lock.
No subsystemFeatureWEB-22699JSX/Flow: XML tag has empty body -> change to bodyless
BugWEB-23856Inspector incorrectly identifies unused constant in JSX
BugWEB-23757Webstorm consumes lot of cpu and freezes on Linux CentOS 7
BugWEB-23839JSDoc: Unresolved variable when using @function tag
BugWEB-23312JSX/TSX: wrong closing tag is inserted on completion when creating tag in front of some text
Build toolsBugWEB-21484Ability to pass --silent option to npm when running script
DebuggerFeatureWEB-23720React Native: show log
CosmeticsWEB-23708Mark invalid React Native run/debug configuration
CosmeticsWEB-23722React Native: add default value to 'Working directory' field
JavaScriptBugWEB-23297JavaScript: Invalid syntax validation within objects defined within a class method ("unresolved variable [methodName]")
BugWEB-23766Template string conversion bug
BugWEB-23753Autocomplete doesn't work in ObjectExpression with computed property
BugWEB-23751React autocomplete doesn't work with Flow prop types
BugWEB-23727Find usages for async functions does not work when cursor is placed on the function keyword (it works on the async keyword)
BugWEB-23192Incorrect warnings when using optional React props
JavaScript. FormatterBugWEB-22858incorrect indentation for arrow functions with implicit return
BugWEB-22044Shorthand object property names are formatted incorrectly
JavaScript. FrameworksFeatureWEB-23829Support React Native StyleSheet
BugWEB-23611React-Native: Strange message for "View" element
BugWEB-22651WebStorm characterizes React components that are nested functions as unused
BugWEB-23728React Native: path to react-native is not always detected automatically
BugWEB-23798Autocomplete doesn't work in "magic props name" open
JavaScript. InspectionsBugWEB-23810Incorrect inspection warning for parameter types when creating an instance of RegExp
Node.jsFeatureWEB-23737Support Yarn
BugWEB-23712Validate script name in npm run/debug configuration
BugWEB-23700Node package field misaligned on Mac
BugWEB-23669'ReferenceError: v8debug is not defined' when debug Electron main process
PerformanceWEB-23802Deadlock when configuring node_modules library
Unit TestsBugWEB-23663Protractor:Tests tree: show selected failed test's content
Remote InterpretersFeaturePY-14036Ability to create django project with remote interpreter
PHP langBugWI-33629Categorization of constant in Find Usage depends on the code location
Plugin: Deployment _ FTP..BugWI-33574Authentication popup doesn't appear in case password is missing
BugWI-33576Switching Auth type in anonymous mode is not saved
BugWI-33528Password and user name are saved on tab switching
BugWI-33529Login as anonymous checkbox doesn't force password field to be uneditable
BugWI-33534"Login to..." dialog doesn't work without "Save password" checkbox enabled
BugWI-33531Impossible to save just user name without password
BugWI-33542SSH Deployment server can't be used for Remote Tools
CosmeticsWI-33655Deployment - "User name not specified" error with local folder
User InterfaceUsabilityCPP-7481Merge CMake Problems and Output tool windows

RubyMine 2016.3 EAP (build 163.6110.36) Release Notes

No subsystemBugRUBY-18659Exception on attempt to add Ruby on Rails facet to java module
InspectionsBugRUBY-18615'Unless' statement quickfix message has a typo
Plugin ReportsBugRUBY-18672JRuby submodule in Java project uses old configurable interface
BugRUBY-18622Checking node of rbenv SDK doesn't show gems from all checked gemsets
BugRUBY-18614Ruby SDK may not deleted
PuppetFeatureRUBY-17069Puppet hashrocket alignment
BugRUBY-18678ElementDescriptionProvider shows internal info
ExceptionRUBY-18676CompletionProvider throws exception while hit Enter after variable inside of resource definition
RailsFeatureRUBY-3654Treat contents of Rails' javascript_tag as javascript
BugRUBY-17655'get available generators script executes with errors:' warning is shown without errors
Remote InterpretersBugRUBY-18712Remote gems are not downloaded
TestsBugRUBY-18171Rspec tests failing
BugRUBY-18364Cannot run minitest - cannot load such file -- test_helper
No subsystemBugIDEA-162032Sonarqube results are not getting displayed in the Inspections Tab.
BugIDEA-162067Cannot create plain-text scratch file
BugIDEA-161948CheckRegExp action: the results are not updated on sample or expression editing
UsabilityIDEA-85255Tool window options like a "Autoscroll to Source", 'sort by type' etc. should be stored globally, not per-project
Code Analysis. InspectionBugIDEA-162159Inconsistent inspection results when "Group by directory" enabled/disabled
BugIDEA-55394'Condition always true' inspection sometimes incorrect when variable modified in finally block
BugIDEA-156394Incorrect control flow that reports a condition always true
Diff_MergeFeatureIDEA-115600Advanced syntax coloring not working properly in 'Show Diff' window
ExceptionIDEA-162307Cannot open Diff of SQL file anymore: UnsupportedOperationException: Should not be called directly
Editor. Editing TextBugIDEA-161968Multiselection cursor location is unexpected
BugIDEA-162245Auto-import is aggressively importing non-existing symbols
IDE ConfigurationBugIDEA-162050Show in files does not work in Debian Linux 8
Java. RefactoringBugIDEA-162154Removing library attached to a module caused IDE hangs (freezed 'Remove redundant imports' dialog)
ExceptionIDEA-162070Exception when refactor decompiled .class file
Java.InspectionsBugIDEA-162106"default package" shown as "<default>" in inspection results after exporting and importing
Project ConfigurationFeatureIDEA-162102Allow including into module directory located under excluded folder
BugIDEA-135096unable to include source folders under an excluded directory
RegExpExceptionIDEA-161946Throwable at com.intellij.openapi.application.impl.ApplicationImpl.assertIsDispatchThread
TerminalBugIDEA-157927com.jediterm.terminal.ui.TerminalPanel leaks Timer Object
BugIDEA-162329Cannot set shell path options in Terminal settings
BugIDEA-162282built in terminal doesn't work with zsh
UsabilityIDEA-156885.bashrc is not sourced in IntelliJ IDEA terminal
Unit Testing. JUnitUsabilityIDEA-161952Misleading number of passed tests in repeated test runs
User InterfaceFeatureIDEA-149545Force touch go to declaration
BugIDEA-154724Code lens (Scroll Preview) is buggy if there are no ToolWindow on the left edge
BugIDEA-162171File > Open points to "C:\" directory
BugIDEA-162103"Show Log in Explorer" does't work on 163.5726
UsabilityIDEA-162076Selection highlighting hidden behind fully opaque background image
Version ControlBugIDEA-162135Diff from commit dialog: backspace in commit message editor removes characters from the code
Version Control. GitBugIDEA-56814Non-ASCII characters display incorrectly in git annotate
Version Control. LogBugIDEA-159852Git Log is opened in the minimized window when invoked via VCS | BrowseVCSRepository | ShowGitRepositoryLog in project with no VCS
ExceptionIDEA-161650IAE at com.intellij.ui.ColorUtil.toHex
Version Control. PerforceBugIDEA-162033Exception during perforce operations
Version Control. SubversionFeatureIDEA-133398support svn 1.8 automatic reintegration merge
No subsystemFeatureWEB-40Custom folding regions should be visible in structure view (CSS)
Build toolsBugWEB-23589Jump to source and Debug shortcuts are hardcoded for build tools tool window
CSSBugWEB-23601PostCSS: bad inspection CssNegativeValue
File WatchersBugWEB-23553File Watcher Macros Ignore System Directory Delimiter
JavaScriptBugWEB-23565Support await postfix completion
JavaScript. InspectionsBugWEB-23295Inspections: "require() is used instead of import": comments breaks converted import
BugWEB-23595wrong types recognition by function parameter named as 'props'
BugWEB-23315Inspections: "require() is used instead of import": destructing of require is not converted correctly
BugWEB-21789False 'missing module dependency' violation for 'express-sessions' module
BugWEB-23574Missing import statement: for modules having both jsnext:main and main, incorrect import results are suggested
UsabilityWEB-23570Intentions: "Convert to Class": correctly sort generated set/get attributes
JavaScript. PredefsFeatureWEB-3371Fully implement the Console API
BugWEB-11805Incorrect DHTML.js, resulting in incorrect inspection
BugWEB-8821Unresolved variable or type 'HTMLSpanElement'
BugWEB-18967Incorrect Event prototype definition makes inspection fail
BugWEB-21011Incorrect type annotation on HTMLDocument.prototype.activeElement in DHTML.js
JavaScript. RefactoringBugWEB-23598Convert require() to import: does not work at the moment with relative paths
BugWEB-23623Convert to class: when constructor defined as variable, not converted duplicate properties are not shown after refactoring
BugWEB-23455refactoring object property
Node.jsBugWEB-23597"Missing module dependency" inspection "Install module" fix installed previously typed module-name
UsabilityWEB-18399node.js: record package into package.json quick fix: ask where to create package.json
TypeScriptBugWEB-23344Typescript Compiler "Cannot start language service process"
BugWEB-23614TypeScript: implementing method can not be static
BugWEB-23604Auto import modules in typescript
BugWEB-23580TypeScript: IntelliSense fails to suggest definitions from global declaration
BugWEB-23640generated files still shown after hiding 'excluded files'
BugWEB-23079Typescript won't suggest or import namespaces using ES6 style imports
BugWEB-23446Typescript autocomplete with nested templates broken without 'use typescript service' and painfully slow with it.
Unit TestsBugWEB-23664Protractor: Tests tree: provide "Jump to Source" action
ConsoleFeaturePY-13498Copying from PyCharm console to a python file
BugPY-20617Multi-line commands: remove inappropriate inspections
BugPY-20619Multi-line commands: incorrect syntax error for return statement in functions
BugPY-20618Problems with multi-line commands in Python console
BugPY-15727IPython Console: do not show input prompt until previously entered command is executed
BugPY-15731IPython Console: not able to pass subsequent lines as arguments: UsageError: %% is a cell magic, but the cell body is empty.
CosmeticsPY-20615Multi-line commands: remove double empty lines
Plugin: Deployment _ FTP..BugWI-33400deployment: username and password forgotten after phpstorm restart

RubyMine 2016.3 EAP (build 163.5644.17) Release Notes

No subsystemBugRUBY-18604Remove Docker options from Remote Interpreters configuration
Ruby Version ManagersBugRUBY-18610Escape of quick search results reset current SDK selection
No subsystemBugIDEA-159940Wrong default location for new jdk mac open dialog
CSSBugIDEA-151772Angular2 CSS not highlighted even when being used in template
Code Analysis. InspectionBugIDEA-161871Deadlock when running batch inspection and editing
Code Formatting and Code StyleBugIDEA-156914Allow indent options provider to override language specific indents for data language in templates
DebuggerBugIDEA-130822Special Java/Swing widget to enable/disable breakpoints does not hide when active tab changes during debugger session
UsabilityIDEA-120087Debugger: changed state of a breakpoint is not visible, until applied
UsabilityIDEA-142098Multiple breakpoints in a single line: don't display the whole method body in toggle breakpoint drop-down
UsabilityIDEA-124497Debugger: "Resume/Pause Program" in menu "Run" is active active
CosmeticsIDEA-103215Add automatic word wrap to conditional breakpoint expression modification popup
Diff_MergeBugIDEA-161976Resolve merge conflicts window too small on hidpi screen
Editor. Editing TextBugIDEA-161410Quick Documentation: double opening angle brackets are printed as single brackets
BugIDEA-162004Rich copy produces wrong foreground color at the start of copied fragment
Editor. Error HighlightingBugIDEA-161890Kotlin unused symbol highlighting is not updated after adding/removing single usage in another file
Find, Replace, Find UsagesBugIDEA-161826Find and Replace keeps previous data in Replace field but it looks cleared
BugIDEA-160785Selection in a find/replace field is broken
Java. Code CompletionBugIDEA-161810Typing the letter t in a comment will trigger completion
Java. RefactoringBugIDEA-161690Incorrect selection after unwrapping a field access
Packaging and InstallationBugIDEA-157346/usr/local/bin/idea cannot startup after idea is force killed
TerminalFeatureIDEA-142926Shortcuts for scrolling in terminal.
BugIDEA-120046Built in terminal uses wrong clipboard on Ubuntu
BugIDEA-160742Ctrl+Shift+F12 doesn't work in Terminal tool window.
BugIDEA-161309Terminal view doesn't work if Fish is used as a shell
User InterfaceBugIDEA-161886Inspection Results tool window ignores range
BugIDEA-161804VCS toolwindow button blinks when project without VCS roots is opened
Version ControlExceptionIDEA-161905Show VCS Log and Show Local Changes actions cause NPE if Version Control toolwindow was not opened since project start
Version Control. MercurialExceptionIDEA-161831Throwable at com.intellij.openapi.application.TransactionGuardImpl.assertWriteActionAllowed
File WatchersBugWEB-23527Babel File Watcher predefined options problems
JavaScriptFeatureWEB-23359Detect .babelrc or babel package and set JS version to the ECMAScript 6 for the new project
FeatureWEB-23357Detect .flowconfig and set JS version to the Flow for the new project
FeatureWEB-23358Detect react or react-dom packages and set JS version to the React JSX for the new project
BugWEB-23540Flow: Project Errors need Jump to Source possibility and grouping by files
BugWEB-22927Flow: provide Live Template for @flow comment
BugWEB-23020Flow: Settings: correctly detect when "Resolve..." option should become available
BugWEB-23456JSDoc folding (first empty line)
PerformanceWEB-23255Major editor slowness when Flow turned on
ExceptionWEB-23507ClassCastException When update JSDoc
JavaScript. FormatterBugWEB-23475Optimizing imports in javascript/ES6 modules ignores inspection controls
BugWEB-9146Embedded javascript should be indented according to Javascript settings for indent/continuation indent
JavaScript. InspectionsBugWEB-23205Flow: improve "Coverage errors" inspection
BugWEB-23479Intentions: "Convert to ES6 class": when defineProperties() has writable: false do not generate setter
BugWEB-23132Missing module dependency inspection shouldn't work independently from library scope
BugWEB-23464Inspections: "require() is used instead of import" put imports to the end of file when both normal and inner requires are present
BugWEB-23480Convert to ES6 class: suggest only if source function has prototype assignments or this assignments, or defines static methods
ExceptionWEB-23463Inspections: exception is thrown on attempt to process multiple comments with "Convert to let" Fix all
JavaScript. PredefsBugWEB-6766setTimeout/setInterval inspection expects fixed signature
JavaScript. RefactoringBugWEB-23484ES6 convert to class: pseudo-class method definition, expressed as created object's member, should be converted to member function
BugWEB-23483Refactor->Move does not work with Javascript functions from structure tab
TypeScriptBugWEB-21207TypeScript Import Optimization messes up inspection statements like "//noinspection"
BugWEB-23538TypeScript compiler fails to compute relative output paths
ExceptionWEB-23499TypeScript: exception is thrown on Auto-import invocation

RubyMine 2016.3 EAP (build 163.5219.14) Release Notes

No subsystemUsabilityRUBY-18583Speed searching should expand SDKs if gemsets are matched
UsabilityRUBY-17782Navigation gutter to Channel from coffee template to show possibility of navigation
IDEUsabilityRUBY-16860Project name and other options are reset if change project type in Create new Project dialog
CosmeticsRUBY-18359Different layouts causes 'fields jumping' in the Create new Project wizard
Plugin ReportsBugRUBY-18576Ruby SDK added in the SDKs global list are available in the Modules settings after reopen Settings
Ruby Version ManagersBugRUBY-18582Quick Search results should be reset by ESC
BugRUBY-18585rbenv gemset deletion removes the entire SDK
BugRUBY-18592Remote rvm gemset is not shown in the SDKs list
No subsystemBugIDEA-160461Sort fonts case-insensitively
BugIDEA-161604Deadlock on startup in Promises
UsabilityIDEA-114099Strip white space left of caret on manual save
Code Analysis. InspectionPerformanceIDEA-161598AnalysisScope uses and retains a lot of memory
ConsoleBugIDEA-152620Move Filter#applyFilter from EDT to the pooled thread
BugIDEA-161123Saving console output to file produces an empty file
DebuggerBugIDEA-161754Terminate process on exit choice is not preserved
CosmeticsIDEA-57838Different breakpoint icon for conditional breakpoints
DockerBugIDEA-161488Docker terminal should be available in dumb mode
Editor. Editing TextBugIDEA-159399Selection gets broken for multi clicking Alt+Shift+Middle Mouse Button
BugIDEA-161105Breakpoints move unexpectedly on editing
BugIDEA-161056In column mode, after pressing Shift-PageDown to efficiently extend the column to the bottom of the page, Shift-UpArrow stops working.
BugIDEA-98074Line spacing makes cursor oversized
BugIDEA-161293Console Font preview - gutter is not updated on font size change
BugIDEA-160978'Quick Documentation' doesn't work in modal dialogs
File SystemBugIDEA-161568UI Freezes after maven build ends
Packaging and InstallationBugIDEA-161180Installation update: "background task running" dialog; patch is not applied if restart is postponed
Project ViewBugIDEA-157379'Project Files Tree', copy references doesn't output same content with single or multiple files
Settings RepositoryBugIDEA-141891Custom keymaps not getting cloned/merged
User InterfaceFeatureIDEA-160391Add "copy relative path" or make "copy path" configureable
BugIDEA-161519java.lang.IllegalStateException: The DialogWrapper can only be used in event dispatch thread.
BugIDEA-161504HiDPI Linux: Plugins repository: wrong icon rendering
BugIDEA-161665LayeredIcon offsets are not scaled on hidpi
PerformanceIDEA-154560Find Action should populate the results in background
Version ControlBugIDEA-161662VersionControl toolwindow should not be available for project with no VCS enabled
BugIDEA-161753Adding VCS root to a project which didn't have any doesn't make the VCS toolwindow to appear
BugIDEA-161752VCS toolwindow is not available if the project has <Project> mapping
Version Control. GitFeatureIDEA-60389Need GUI to configure remote repository and branch
FeatureIDEA-87099Provide ability to add remote repositories to local git repository
FeatureIDEA-76454Ability to change URL of git repository
No subsystemBugWEB-23186JavaScript - Invalid Inspections - Implicitly declared global JavaScript variable & Unused JavaScript / ActionScript local symbol
BugWEB-23073"to template string" quick helper generates invalid output
BugWEB-23386ES6 convert require() -> import: make inner scopes option only for "Fix all" mode
BugWEB-23380Object destructuring assignment expression with default value reports incorrect warning
JavaScriptBugWEB-23176JSDoc and destructuring: Works without type definition but not with a type
JavaScript. FormatterBugWEB-1206JS formatting problem after if statement
JavaScript. InspectionsBugWEB-23316Inspections: disable "require() is used instead of import" for TypeScript files
BugWEB-23210No-variable declaring destructuring assignment not recognized as valid
BugWEB-23374Links do not work in Documentation expression popup
BugWEB-22684Inspections: "Convert to let" eats preceding block comment
BugWEB-22824Inspections: disable "Convert to class" intention inside Typescript classes/interfaces
ExceptionWEB-23076Inspections: AssertionError for "Missing module dependency" group shown in Inspection Results
JavaScript. PredefsFeatureWEB-6574Add matchMedia to DHTML.js
BugWEB-13840WebGL constants are defined on WebGLRenderingContext, rather than WebGLRenderingContext.prototype
BugWEB-6783JavaScript Math.atan2 signature seems incorrect
Node.jsBugWEB-23381Fix the English in the $NODE_DEBUG_OPTION message
BugWEB-23100Show library folder icon for node_modules marked as "library root"
TypeScriptTaskWEB-23465TypeScript: bundle TypeScript 2.0
Project ModelUsabilityCPP-5908Unstable contents of iml file inside sourceFolder
No subsystemBugPY-20602Line numbers displayed incorrectly in "Initial configuration" preview

RubyMine 2016.3 EAP (build 163.4830.21) Release Notes

IDEBugRUBY-18458Speed search doesn't work in the list of SDKs and gemsets
MarkdownFeatureRUBY-17962Markdown Preview in Scratch files with md extension
BugRUBY-18120Markdown preview does not update image references when the underlying image changes
Plugin ReportsBugRUBY-18564Node on the top of the list is not a currently selected gemset
RefactoringsFeatureRUBY-13313Unable to rename a file
Remote InterpretersUsabilityRUBY-18497Add synchronise button to the SSH tab in Configure Remote Ruby Interpreter dialog
UsabilityRUBY-15010Clicking "Cancel" for remote SDK doesn't cancel
Ruby Version ManagersBugRUBY-18562Buttons Expand all and Collapse all are useless on Windows
BugRUBY-18560RVM global gemset is not checked by default when rvm sdk is checked
No subsystemBugIDEA-161165Per Project Modality: when Commit or Push dialog is shown in one IDEA window, Code Analyzing hangs with 99% completed in the other window
BugIDEA-161155Per Project Modality: when Commit or Push dialog is opened in one IDEA frame, it's impossible to hide or show tool windows in the other frame
UsabilityIDEA-123307Squashed tree widget on Windows theme on HiDPI monitor
ExceptionIDEA-159111IAE at com.intellij.openapi.components.ServiceManager.getService
Code Analysis. InspectionBugIDEA-160955Inspection Results: inspections not enabled "In All Scopes" are confusingly marked as "Disabled"
BugIDEA-161358"Cannot load .idea. The file does not exist" error is shown if .idea folder is removed between offline inspection runs
ConsoleUsabilityIDEA-63980Make idea.cycle.buffer.size configurable in IDEA GUI / IDEA settings
DebuggerBugIDEA-161086Add to Watches from "Evaluate" dialog should evaluate only once
Find, Replace, Find UsagesBugIDEA-161214Find in Path: Preview editor does not abide by option "Allow placement of caret after end of line"
BugIDEA-159341Replace in file: Regex for start of line matches twice on empty lines
BugIDEA-160192Seach and replace inconsistency started from Seach dialog
BugIDEA-146150Page up/down in preview mode of find in path
BugIDEA-104681Regex Find always case-sensitive with non-english characters
BugIDEA-159829when editing in find result previews the cursor jumps some number of characters after insertion
BugIDEA-112749Find field unicode support
IndicesBugIDEA-161307ShutDownTracker#ensureStopperThreadsFinished deadlock
Java. RefactoringBugIDEA-161203Inline Method: "All invocations in project" should be enabled even for methods in library
BugIDEA-159199Moving package fails to update package statement for moved classes
Java.InspectionsBugIDEA-160991Returning null should result in a warning in @TypeQualifierDefault notnull method
ExceptionIDEA-161366Throwable and hangs when try to rename JUnit class name with inspection quickfix
Plugin Support. ArchitectureExceptionIDEA-155455PPEIE at ExtensionComponentAdapter.getComponentInstance() on project loading
Project ViewBugIDEA-152049Project view collapses in unpinned mode after some time and changes in editor
Unit Testing. JUnitFeatureIDEA-161184Cannot invoke "run test" action from "Recent files" popup
BugIDEA-161181JUnit5 - strange output formatting after run of the tests class
User InterfaceBugIDEA-161330Scheme drop-down becomes empty on deleting
BugIDEA-148877Ctrl + Button3 not captured
BugIDEA-156648Tree view is compacted in 2016.2 EAP
UsabilityIDEA-25635Change display behavior during background indexing: disable/remove content of tool windows instead of hiding windows
UsabilityIDEA-102869Automatically create a copy of default scheme for chaging
ExceptionIDEA-161318"Write access is allowed from write-safe contexts only" when quickly switching pin mode of QuickDoc
User Interface.DarculaUsabilityIDEA-115892Restore previous editor colour scheme when switching to Default LaF
Version Control. GitBugIDEA-161332Description of "Checkout with Rebase" action is misleading
BugIDEA-161352Link in detached HEAD warning is unclickable
BugIDEA-160606"undo commit" action incorrectly revert addition under vcs
CSSFeatureWEB-23345Stylelint: provide parsing for rc file
BugWEB-23373Stylelint: correct name of the property used in the package.json
TaskWEB-23340Stylelint: WS does not find path to stylelint
ExceptionWEB-23350Stylelint: Provide icon for rc file
JavaScriptBugWEB-23252"Parameter info" is wrong when using an inner arrow function without braces
BugWEB-22883IDE UI locks up when clicking on 'var' keyword in Javascript file
BugWEB-23211'Expression statement is not assignment or call' shown for Chai expectations
JavaScript. PredefsBugWEB-23265document.domain is defined as a const
BugWEB-18251Function is not treated as instance of Function
TypeScriptFeatureWEB-22938TypeScript editor should include typings from tsconfig.json lib property
FeatureWEB-23285Autoformat arrow functions like in js
FeatureWEB-23306TypeScript: import can be shortened inspection + quick fix
BugWEB-19185TypeScript: Refactor/Rename for class property should also rename properties of class instances
BugWEB-23244Decorators make class the jsdoc comment inaccessible
BugWEB-23130Cannot find tsconfig.json in angular-cli generated project
BugWEB-21670Angular2: no completion for @angular module inside import statement
BugWEB-6819TypeScript Rename Refactoring too Aggressive
BugWEB-23217"Cannot resolve symbol" for 3rd party imports using ES6
BugWEB-23352Wrong 'Unresolved function or method deserialize()'
Unit TestsBugWEB-23304Karma stacktrace not clickable after updating to karma 1.2.0
Project ViewBugOC-13411Name of selected target in "Manage targets" disappears

RubyMine 2016.3 EAP (build 163.4396.20) Release Notes

No subsystemBugRUBY-18242RubyMine won't recognice Rails 5 Models
IDEBugRUBY-18291Installing Rails gem doesn't refresh Create New Project dialog after finish
UsabilityRUBY-18391Notification 'Cannot save settings' of Ruby SDK and Gems should list modules names without SDK in case of multiple projects
CosmeticsRUBY-18262Sorting order for Rails 5.0.0 and 5.0.0.racecar1 is incorrect
InspectionsBugRUBY-18175Inspection about replace double quoted string with single quoted is shown twice for Channel name in coffee template
MarkdownBugRUBY-18504Completion for languages in code fences
UsabilityRUBY-18462Markdown: hard to type triple-back-tick
ParsingBugRUBY-18525Parentheses around empty arguments list error if a method's parameter decelerated in a new line
Plugin ReportsBugRUBY-18468Ruby Plugin can't recognise gem project
Ruby Version ManagersBugRUBY-18538Current selection is reset if new Ruby SDK is added
BugRUBY-18492Rbenv gemsets selection resets after switch to other SDK and return to previous settings during one session
BugRUBY-18490Project SDK selected in Create New Project wizard is not selected in the Project Settings
BugRUBY-18516RVM sdk is selected instead of gemset
BugRUBY-18512Gems of non-rvm/rbenv SDK can't be detected in new configurable
BugRUBY-18515SDK settings reset if gemset is configured via .ruby-gemset file
UsabilityRUBY-18545View of the SDK may be scrolled to the right after opening if remote sdk is selected
TaskRUBY-18473Measure SDK and gemsets statistics
TestsFeatureRUBY-10777support for MiniTest::Spec
No subsystemBugIDEA-160967Endless loop of "JetBrains Account authentication failed. Do you want to try again?" even if pressing No
BugIDEA-131012Support "delete word left" command in quick search
BugIDEA-160763IDEA hangs on startup, during splash screen
BugIDEA-160926Backspace doesn't join empty lines in JTextArea
UsabilityIDEA-160816Search by abbreviation in Keymap configurable
UsabilityIDEA-126373File Structure could have less indenting
ExceptionIDEA-160790Unable to save settings: Failed to save settings. Please restart PyCharm
Code Analysis. InspectionBugIDEA-160655Inspection profile settings - empty line in Profile list after Resetting settings
BugIDEA-160657Inspection profile settings - cannot apply changes right after rename inspection profile
ExceptionIDEA-160668Inspection profile settings - NPE after importing inspection settings
Code Formatting and Code StyleBugIDEA-160426Export of Code Style does not include JavaDoc configurations
BugIDEA-160389Manage Code style setting | Copy to project doesn't update settings editor until settings dialog is reopened
Code NavigationBugIDEA-160567"Navigate to next highlighted error" is broken
DebuggerUsabilityIDEA-151857Field "tooltip delay" is active when the check box is disabled
Diff_MergeBugIDEA-147700Diff view opens new window in smallest window possible only showing close, min, max buttons
BugIDEA-160646External Diff Tool: file extension is empty for files with unknown file types
UsabilityIDEA-141671Filenames used in external merge are not immediately self-documenting
Editor. Editing TextBugIDEA-159638scratch buffers generate errors in undo
ExceptionIDEA-160596Transaction assertion from daemon createPasses
ExceptionIDEA-160466Throwable at com.intellij.openapi.editor.impl.SoftWrapModelImpl.getRegisteredSoftWraps
Editor. Error HighlightingUsabilityIDEA-160408Quote not recognized as an end to String
ExceptionIDEA-160814IndexNotReadyException
File SystemBugIDEA-160580When symlink target changes to another with different content but the same length, content is not reloaded
Find, Replace, Find UsagesBugIDEA-160975Find Usages does not search in library sources when there are several JDKs in the project
BugIDEA-14042910s hang on changing groupping in show usages
IDE ConfigurationBugIDEA-160935Could not initialize class com.intellij.codeInsight.template.impl.TemplateContext$ContextInterner in presence of Database Navigator plugin
UsabilityIDEA-160418Settings search: don't start search when only 1 character was typed
Java. Error HighlightingBugIDEA-160495Adding a new severity completely breaks the editor
Java.InspectionsBugIDEA-160870Unused declarations inspection - preview pane counts only unused parameters and local variables
BugIDEA-160298Unused declarations inspection redesign - grouping in tool window affects showed problem
UsabilityIDEA-160537Unused declarations inspection - conflicting mnemonics when 'Run inspection by name'
UsabilityIDEA-160300Unused declarations inspection redesign - unused parameter node also contains quifixes for method
ExceptionIDEA-160735Throwable after adding two custom severities, completing analysis and editing
Packaging and InstallationBugIDEA-160738Update and restart fails after patch is applied with "Patch update is not supported"
BugIDEA-161183Update and Restart still fails in the latest EAP
BugIDEA-161223Patch is not applied (Linux, macOS)
UsabilityIDEA-160700Allow users to update via patch even if restarting isn't supported
Project ViewExceptionIDEA-160654'Write access is allowed from write-safe contexts only' switching between files and applications during project opening
Settings RepositoryBugIDEA-160565Do not accept your login and password by Atlassian for bitbucket.org
BugIDEA-160367Settings Repository: login dialog should get focus when appears
Task ManagementBugIDEA-136797GitHub integration ignores 'no proxy for' setting
TerminalBugIDEA-114126terminal tab launches a login shell
Unit Testing. JUnitBugIDEA-160397System.out is not created as expected when running JUnit 5 Tests
User InterfaceBugIDEA-160800Decompiler progress shown under AWT lock leads to deadlock
BugIDEA-160588Transaction assertion from Swing lightweight request processing
TaskIDEA-160777Incorrect background in lists with new scrollbars
Version ControlFeatureIDEA-157911Drag'n drop to shelve
BugIDEA-158157Vcs Log: some nodes in tree are not selectable during speedsearch
BugIDEA-158554Unversioned file is moved to wrong change list
UsabilityIDEA-80668Move changes to Active Changelist - usability
CosmeticsIDEA-156342Commit popup: inconsistent triangle usage (browser vs Details)
Version Control. GitBugIDEA-159283Unversioned files dialog is not refreshed after changes made from this dialog
Version Control. SubversionBugIDEA-160693Active windows could be not showing
No subsystemFeatureWEB-23134ES6 refactorings: convertion require() -> import
BugWEB-15602Ctrl + F11 does not re-run app
BugWEB-23153Generated source files should not be edited message for init.js files that are created by me
TaskWEB-22183Enable 'var' used instead of 'let' or 'const' inspection
Build toolsBugWEB-22859Restart task from Task run window (Alt+F11)
CSSBugWEB-23095Choosing severity level doesn't work for 'Invalid CSS pseudo-selector' inspection
JavaScriptBugWEB-23051'use strict' statement breaks flow highlighting
BugWEB-18593Broken hint and autocomlete for destructured parameters
BugWEB-23036ES intention "Convert anonymous function to arrow function": wrong result
BugWEB-23016Flow: disable Suppress for statement in Inspection results
BugWEB-16923Javascript: Cannot jump to declarations of destructured variables
BugWEB-22998ES6 Destructuring in require statement completely broken
UsabilityWEB-18070ES6: Find usage of default export
CosmeticsWEB-23101Flow errors tool window: improve UI
JavaScript. FrameworksFeatureWEB-22524Add integrations with Create React App for creating new projects
JavaScript. InspectionsFeatureWEB-20310Missing import inspection: add symbols from the same module in one statement
BugWEB-21051Missing module dependency: should add a package.json file to the project
BugWEB-22642Convert to let/const inspection messes up the comments
BugWEB-23044Code analysis after most recent update is very slow
JavaScript. RefactoringBugWEB-22611Shorthand property inline adds no key
LESSBugWEB-21601String concatenation inside cals in Less files is not recognized
BugWEB-12012LESS: '~' in calc() function causes 'unexpected term' error
BugWEB-14251Less editor incorrectly shows an error when using tilde ~""
Node.jsBugWEB-23009File .idea/jsLibraryMappings.xml is created automatically when opening a new project with node_modules
TypeScriptBugWEB-23166Syntax Highlighting broken for functions defining the type of this
UsabilityWEB-22428TS: Prefer importing from index.ts & omit 'index' from source path
PS specificBugWI-33147Project templates: Sometimes iml of an attached project can't be found
ExceptionWI-33073Save project template doesn't work

  • No labels