Skip to end of metadata
Go to start of metadata
No subsystemBug WI-42695 Silent.config file can't be downloaded from web help
HTTP ClientFeature WI-20560 Restful Web Service Tester: Add Option to not Follow Redirects
Feature WI-43332 Implement completion for @no-redirect doc tag
Feature WI-43351 Implement quick documentation for @no-redirect doc tag
Feature WI-42095 Create run-configuration for HTTP Requests
Feature WI-43335 Add request with `@no-redirect` to HTTP Requests Collection
Bug WI-43685 Running request via gutter updates saved configuration if file names collapses
Bug WI-42436 Basic authorization should be preemptive
Bug WI-42005 REST Client: Content-Type is case sensitive
Bug WI-43729 Files created outside the project after creating HTTP Request scratch not "visible" to IDEA / Webstorm
Bug WI-40496 RESTful webservices: REST client: parameters are not sent for POST methods
Bug WI-43689 Collections doesn't work (file can't be found)
Bug WI-42311 response handler scripts: Multiple headers with same name
Exception WI-42641 HTTP Client doesn't save responses if large
Exception WI-43981 Exception when invoke quick documentation on http response processing script
Injections in PHPFeature WI-39271 Provide \%\w as default user parameter applicable to PHP
PHP CompletionFeature WI-38925 Ctrl+Dot completion should insert an arrow instead of a dot
Bug WI-37594 Static variable is not shown if constant with the same name exists
Bug WI-42864 CTRL+Dot completion breaks code if invoked after self
Bug WI-27132 Variable completion (replace) inside string too aggressive
Bug WI-36282 Completion of members should take a scope into account
Bug WI-42469 Completion does't suggest constants without `self::`
Bug WI-33163 Overridden methods completion: Plural parameter type in @method annotation lead to broken code
Bug WI-33172 Overridden methods completion: doesn't show methods if there are multiple base classes
Bug WI-42856 Ctrl+Dot completion: don't insert arrow in case of primitive type
Bug WI-43679 Autocompletion on self does not include properties inside static method
Bug WI-42659 Completion incorrectly inserts static field in non-static context
Performance WI-42350 Autocompletion became very slow in 2018.2 (FQCN completion)
Usability WI-43637 Overridden methods completion: drops nullabe type from parameter type
Usability WI-42865 CTRL+Dot show completion popup after the action
Usability WI-42949 Ctrl+Dot completion: don't insert arrow in case function/method returns primitive value
Usability WI-30362 Autocomplete: don't suggest superglobals first
PHP ComposerFeature WI-42809 Detect default configuration types for test frameworks
Feature WI-43331 Add extension to composer.json should add extension to require-dev section if extension is used inside tests
Feature WI-42739 Detect phpcs.xml and phpmd.xml in the project root
Bug WI-44063 Don't require require-dev dependency if one exists in require section
Bug WI-43538 mismatch between PhpStorm and composer naming
Usability WI-43575 Set caret to line with added extension in composer.json when extension was added via quick-fix
Usability WI-43403 Composer: Installed require-dev packages should be marked as well
PHP DebugFeature WI-22751 Search variables in debug
Bug WI-43358 Search matches value and name together in Variable view
Bug WI-43535 PhpStorm freezes on closing
Bug WI-6792 Debug: fields/methods autocomplete does not work for Breakpoint Condition
Usability WI-42851 'Do not step into library scripts' for JavaScript only
Exception WI-43622 PHPStorm XDebug Errors out: remoteFileUrl is listed as null in xDebug.onBreak
PHP FormatterFeature WI-42591 Autodetect a path to PHP CS Fixer from composer.json
Bug WI-31960 PHPDoc PSR-5 <generic> collection type hints formatting & parsing
Bug WI-42782 Additional spaces inserted for multiple type separator in @method
PHP InspectionsFeature WI-43054 Auto-detect custom ruleset of PHP CS Fixer from composer.json and project root folder and turn the corresponding inspection on
Feature WI-42936 Support custom PHP CS Fixer rulesets
Feature WI-43473 Enable and set up non-PSR based on composer dependency
Feature WI-34406 Simplify settings of quality tools
Feature WI-26325 Expand PHP_CodeSniffer support to JS/CSS files
Feature WI-43320 PHPCS: Autodetect non-PSR coding standards like Wordpress, Drupal
Feature WI-17372 There is no ability to add files to "ignored files" list manually (PHP CodeSniffer)
Feature WI-9524 Warn if parameters count doesn't match placeholders count in sprintf call
Feature WI-43028 Allow the specification of PHPCS 'installed_paths'
Bug WI-27738 Improper type checking of type-hinted parameter when default value is set
Bug WI-43135 PhpStorm saves PHPMD config related to remote interpreter with $PROJECT_DIR$ macro
Bug WI-42651 'Add method' quick-fix doesn't add type hint for nullable parameter
Bug WI-43139 PhpStorm saves PHP CS Fixer config related to remote interpreter with $PROJECT_DIR$ macro
Bug WI-44030 PHPCS: Batch inspection doesn't analyse files other then PHP
Bug WI-26948 PHPCS (CodeSniffer) requires to press "Update" to get Coding standards
Bug WI-42227 Parameter type: default value forces the caller to have the same type
Bug WI-41940 Can't import class from php short echo tags
Bug WI-42644 Added parameter type hint brakes code when parameter is anonymous class
Bug WI-42623 Declaration should be compatible false positive (stub issue)
Bug WI-43423 File is not updated after applying PHP CS Fixer quick-fix
Bug WI-43341 Extension is missing inspection warns about extension existing in require-dev section
Usability WI-44103 Import class doesn't insert new line after use statement
Usability WI-25562 Undefined method quick fix must place cursor between curly braces
Usability WI-42836 PHP Composer | Composer.json | Notification about missing extension in composer.json doesn't disappear after adding extension to it
Cosmetics WI-40710 PHPCS inspection description seems a little dated
Exception WI-33687 Exception is thrown if parameter produces hierarchy warning and then becomes commented
PHP IntentionsFeature WI-43784 New intention: change class member visibility
Feature WI-43815 New intention to inline aliases (reverse of Replace with Alias intention)
Bug WI-43853 "Change visibility" does't warn about fields visibility conflicts
Bug WI-43868 Change visibility: Intention doesn't warn about usage of field
Bug WI-43889 Inline alias: doesn't check name conflict in declarations
Bug WI-43849 Change visibility intention doesn't change visibility of constant with default visibility
Bug WI-43854 Change visibility: does't add "public" keyword to methods with default visibility
Bug WI-43706 Import class: don't check existence of uses with different flavors while generating the error
Bug WI-43838 "Change visibility" intention changes overridden methods without warning
Cosmetics WI-43850 "Change visibility" intention description misses a/an articles
PHP InterpretersFeature WI-43456 Use Macros in arguments for PHP Script run-configuration
Bug WI-44033 Remote interpreters became local interpreters on project reopening
Bug WI-42578 Pull permission denied for phpstorm_helpers
Bug WI-41060 Update vagrant interpreter presentation in command line
PHP LangFeature WI-24957 [Tools -> Analyze Stacktrace] not working with Vagrant (Different Paths)
Feature WI-43798 Show aliases references with italic font
Feature WI-12767 Multiline todos
Bug WI-43756 Implement method creates broken code in case vararg is a reference
Bug WI-43787 Resolve doesn't differentiate class, constant and function aliases and based on order
Bug WI-43536 Exception is thrown on file openning (due to multiline comments)
Bug WI-43071 Structurally search work incorrect when use regexp.
Bug WI-43692 SSR: can't find "define" call
Bug WI-41948 Deadlock on com.jetbrains.php.lang.psi.elements.impl.PhpClassAliasImpl.getOriginalClass
Bug WI-43965 Structural Search - $indirect function calls are always matched
Bug WI-43906 Broken autocomplete for classes with both PhpDoc and methods
Bug WI-43755 Implement method: Nullable type is lost for varargs
Bug WI-43691 SSR: doesn't find semicolon namespaces
Bug WI-42268 SSR: use const $expr$ finds all sort of use statements
Bug WI-43678 Implement method code generation creates incorrect method stub for vararg
Bug WI-43985 Support of sprintf doesn't work inside namespace
Performance WI-43453 lots of relative namespace references - Indexing takes 50x times for the single 2m file in comparison to the same code in 128 files
PHP Lib StubsFeature WI-43773 Add stubs for PDFlib
Bug WI-44153 @throws ReflectionException is missing for ReflectionClass::getMethod()
Bug WI-10662 Undefined variable: Undefined variables after index 0 in sscanf
Bug WI-43867 PHP stubs: missing extension mysql_xdevapi
Bug WI-43476 Class \MongoDB\Driver\Session missing in default stubs
Bug WI-43350 MongoDB\ObjectId is a bit outdated
Usability WI-43998 bcmod definition is not right
PHP ParserFeature WI-42889 Support for trailing comma function calls
PHP RefactoringFeature WI-23596 Add refactoring: rename imports to alias import
Feature WI-22302 Introduce field could suggest to initialise the field in the setUp method in a Test
Feature WI-43700 Support inplace rename for use statements
Bug WI-37243 Refactor->Move for static methods does not update calls with class aliases
Bug WI-15860 Extract method: PHP: Extract Method Refactoring: add parameter's type if variable's type is known
Bug WI-31791 Preselect old name setting is not honored
Bug WI-43979 Disabled search in global scope leads to broken rename of protected field/methods in child classes
Bug WI-43713 Add method stubs creating mangled method & class
Bug WI-43701 No error is shown if alias with same name exists during rename
Bug WI-43771 Rename alias: renames fields with the same name
Bug WI-43859 Change visibility: don't show intention for constants for PHP < 7.1
Bug WI-43510 Don't suggest occupied names in constant introducing after keyword check
Bug WI-44119 Extract method: insert parameter type for anonymous class
Bug WI-43733 Implement method code generation loses pass by reference
Bug WI-43772 Rename alias renames sub-namespace if its name equals to alias name
Bug WI-43785 No error is shown if class with the same name exists during rename
Bug WI-42738 Can't initialize introduced field in class extending non-writable class constructor
Bug WI-43769 Rename alias work improperly when the alias is same as class name in group use
Bug WI-24104 Moved method use improper classname
Bug WI-32648 "Move Class" on Trait breaks Use Statements
Bug WI-39342 rename alias work improperly when the alias is same as class name
Bug WI-43725 Implement method code generation loses default value
Bug WI-41683 Extract field: brakes first method's PHPDoc annotation
Performance WI-18925 private member name refactoring does search accross all project
Performance WI-43960 Don't search across whole project while renaming alias
Usability WI-28915 Refactoring preview is always shown for methods
Usability WI-43760 Replace with alias adds alias to the original import in case invoked on another alias
Usability WI-30775 "Change signature" refactoring removes @throws tag
Usability WI-44118 Extract method: class parameter type is not inserted for PHP 5.6
Exception WI-43768 Replace with alias: assertion fails on invocation inside group use
PHP TestFeature WI-43534 Provide ability to edit corresponding code templates from context of test/setUp/tearDown PHPUnit generate actions
Feature WI-43517 New action: generate phpunit setUp method
Feature WI-43518 New action: generate phpunit tearDown method
Bug WI-43578 Options to generate phpunit setUp and tearDown methods aren't available for abstract classes
Bug WI-43196 PHPUnit: can't run test items from dashboard of the class with duplicate FQN
Bug WI-36291 PHPUnit test runner reports wrong elapsed time of tests
Bug WI-43349 PHPUnit: running single data set from data provider with parenthesis in name doesn't work
Cosmetics WI-42663 PS shows test icons for non-test classes
Cosmetics WI-43533 Remove 'PHPUnit' prefix from test/setUp/teardown generate actions label
Task WI-43417 PHPUnit create composite configuration when single dataset is selected instead of class
PHP Type InferenceBug WI-43503 Type[] lost after array_change_key_case()
Performance WI-38126 PhpStorm >= 2017.2.2 freezes after start with .phpstorm.meta.php
PHPDocUsability WI-38997 Auto generated annotation for nullable type is inconsistent
PS SpecificFeature WI-2096 Highlight variable and placeholder in sprintf()
Feature WI-42984 PHP CS Fixer: support remote interpreters
Feature WI-38820 Support PHP CS Fixer
Bug WI-43688 Run Anything doesn't work
Bug WI-42158 PHP Web Page run configuration doesn't select server from dialog
Plugin: DQLBug WI-44023 DQL parser error in IDENTITY function call
Plugin: Deployment _ FTP..Feature WI-909 Upload files on multiple (S)FTP servers at once (at least on VCS commit)
Feature WI-2171 Automatic upload should listen to file revert, update and delete [and external changes]
Bug WI-43386 SSH Passphrase not saving
Bug WI-43570 Could not connect to FTPS server: MalformedServerReplyException: Truncated server reply
Usability WI-43892 Servers from group are duplicated with the same name when duplicate group
Usability WI-43801 Failed uploading on a server inside group with closed File Transfer tab is hard to detect
Usability WI-42881 Enable "Details" logging for Deployment logging
Cosmetics WI-43277 New Project from Existing Files doesn't have the FTP port specified by default
Cosmetics WI-43804 Rewrite Server Removal dialog wording
SpellcheckerFeature WI-42897 Ini files spellchecking
Bug WI-42710 New spell errors in PHPDoc (in custom tags, in words with special symbols, in strings not prepended by *)
No subsystemFeature IDEA-98563 Run Configurations: provide a default option for 'Single instance only' setting under Defaults node.
Feature IDEA-198897 Parameter hints: Smart argument completion should insert comma if selected signature has more arguments
Feature IDEA-177345 Find in Path: make "Show filter popup" hotkey customizible in Keymap
Feature IDEA-68324 Add Cmd+1,2,3,4 for selecting tabs like in Chrome, Safari, Firefox
Feature IDEA-127245 Open all files from favorites list
Feature IDEA-196706 Multithread model for new SE
Feature IDEA-132487 External annotations for java third party libraries
Bug IDEA-198043 NoClassDefFoundError: Could not initialize class com.intellij.profiler.ultimate.async.UtilsKt exception on project creating
Bug IDEA-198289 make selecting node in NodeDescriptor-based AsyncTreeModel -ed tree less than quadratic (on tree depth)
Bug IDEA-202374 Cannot open files after import setting from previous release
Bug IDEA-199646 Input dialog should be displayed only when there is $Prompt$ in run configuration arguments
Bug IDEA-199415 UIDefaults completion inside IntelliJ theme files
Bug IDEA-197994 Yaml: unnecessary indentation inserted after completion of mapping node key value
Bug IDEA-200619 Maximized window state is not preserved
Bug IDEA-201286 Linux Native Menu bar: the order of actions in menu can change unexpectedly
Bug IDEA-200322 Project explorer empty
Bug IDEA-198794 "2 consecutive spaces in RegExp" when one is in brackets
Bug IDEA-194201 On switching JDK in run configuration, 'class not found' warning is displayed for main class
Bug IDEA-201279 ctrl-p ctrl-n not working as expected in Webstorm 2018.3 EAP OSX
Bug IDEA-195058 changelist rendering is blocked by some semistuporous locks
Bug IDEA-113988 Instance method call color cant be changed
Bug IDEA-198829 Can't open any files in the editor in master
Bug IDEA-197661 Tooltip appears on a collapsed code block
Bug IDEA-161033 Navigate to Type Declaration -- Opens a new window
Bug IDEA-201729 IntelliJ EAP keeps indexing the same files over and over
Bug IDEA-201312 Recompilation of several modules: compiler caches and output files are out-of-sync if compilation does not complete normally
Bug IDEA-201580 Infinite logging loop on IDEA shutdown if there's an exception during IDE close
Bug IDEA-200822 Opening any Markdown file freezes recent IntelliJ Ultimate EAP 183.3795.13
Bug IDEA-199785 CloudSettings plugin doesn't work with fresh versions of IDE
Bug IDEA-194273 NullPointerException on finding RemoteDesktopService
Bug IDEA-198853 Add description for `IntelliJ Configuration Script` plugin
Bug IDEA-200840 Exception appears for opened comment after TODO
Bug IDEA-181678 Fix colors on tip of the day welcome screen
Bug IDEA-198785 When Plugins dialog is opened using FindAction, attempt to search in it returns empty result always
Bug IDEA-177327 AltGr special characters don't work under Windows 10, instead hotkeys for Ctrl+Alt are initiated
Bug IDEA-127997 Gutter changed lines regions not shown when the changed lines are "folded"
Bug IDEA-197869 [Copyright Profiles] The hour24 property for the $file.lastModified object isn't interpreted in comments
Bug IDEA-84220 CTRL-F5 shortcut doesn't work in Hierarchy view
Bug IDEA-197960 No completion for Yaml file if caret behind ':'
Bug IDEA-197863 JSON scheme: yaml completion - always insert ": " after completing property name
Bug IDEA-194877 Search windows should sort results with closest match on top
Bug IDEA-199063 "Remove BOM" will destroy file, which has a "UTF-32 LE" encoding (where the BOM is mandatory)
Bug IDEA-199869 "Scope" dialog's "path" section cannot be made any smaller
Bug IDEA-147781 ColorChooser: Opacity changing doesn't affect the results
Bug IDEA-197011 Sibling Inherited Methods Provider should have an option in File | Settings | Editor | General | Gutter Icons
Bug IDEA-198409 Seems AsyncTreeModel delays showing node until its children are found
Bug IDEA-188262 Elements with the same content are underlined when only one of them is selected by mouse
Bug IDEA-202080 UI components are not shown in some RC
Bug IDEA-123363 Default project language level is ignored if project is created from template
Bug IDEA-59397 When caret is outside visible editor area, on Alt-Enter pressing intention bulb appears outside the editor frame
Bug IDEA-198611 Failed to save setting when install CLion from scratch
Bug IDEA-199433 Speed search on test is broken
Bug IDEA-130726 Configure global external annotations
Performance IDEA-198819 "Show affected tests" shouldn't traverse PSI in EDT
Performance IDEA-196408 Idea 2018.2 freezes while typing if bookmark is set in library (decompiled) class
Performance IDEA-194547 LossyEncodingInspection allocate a lot of objects on heap
Usability IDEA-108586 Launcher: can't open a project by relative path
Usability IDEA-192611 Debug test is harder to invoke via Alt+Enter menu
Usability IDEA-165834 Export settings to .zip by default
Usability IDEA-200263 [Run anything] Window can be resized too small
Usability IDEA-179037 Last Edit Location List: edits performed in the diff window are not appended to the list
Cosmetics IDEA-198288 [Run Anything] Incorrect tooltip for the icon in the navigation bar
Task IDEA-180939 Allow read-only mode for ExpandableTextField
Task IDEA-186044 Rework validation error popup from lightweight to heavyweight
Task IDEA-196883 Run anything: allow to provide completions variants based on the user input
Task IDEA-195201 Plugins: number of plugins on trending page
Task IDEA-195193 Plugins: implement search
Auto-reported Exception IDEA-191293 NPE in TrackingPathMacroSubstitutorImpl.invalidateUnknownMacros
Exception IDEA-141213 IllegalStateException: This function should be called while holding treeLock at java.awt.Component.checkTreeLock
Exception IDEA-194957 NPE on closing Project in IntelliJ IDEA
Exception IDEA-199439 ISE at com.intellij.ide.hierarchy.HierarchyBrowserBaseEx.$$$reportNull$$$0
Exception IDEA-199679 AE at com.intellij.ide.plugins.newui.RestartButton.lambda$null$0
Exception IDEA-149660 IAE at com.intellij.configurationStore.StateStorageManagerImpl.expandMacro
Exception IDEA-199825 IllegalArgumentException on 'Force Step Into'
Exception IDEA-200374 Throwable at com.intellij.openapi.wm.impl.GlobalMenuLinux.lambda$handleEvent$4
Exception IDEA-194581 NPE at com.intellij.psi.util.PsiUtilBase.findEditor
Exception IDEA-192088 Exception when starting IntelliJ
Exception IDEA-195973 NPE at com.github.markusbernhardt.proxy.selector.pac.PacProxySelector.findProxy
Exception IDEA-193478 cannot share data context between Swing events; initial event count = 4939619; current event count = 4943502
Exception IDEA-199921 com.intellij.util.Alarm - Assertion failed: Already disposed
Exception IDEA-195827 AssertionError caused by ReadAction on already disposed project
ArquillianBug IDEA-143282 JBoss Arquillian + IPR project format: IAE at StateStorageManagerImpl.expandMacros()
Code Analysis. DuplicatesFeature IDEA-198256 Show diff preview in inspection results for duplicate code inspection
Code Analysis. InspectionFeature IDEA-173248 Thread-blocking (I/O) calls detection
Feature IDEA-129836 "Run inspection by name" popup: allow access to full inspection description
Feature IDEA-142026 Add inspection for Math.min(a, a) and Math.max(a,a)
Feature IDEA-194409 Need way to map inspection class name to the inspection in the inspection configuration ui
Feature IDEA-151197 Apply (partial) "Redundant suppression" in the editor
Bug IDEA-152262 Don't report warning "private field is never assigned" for fields assigned via java.util.concurrent.atomic.Atomic*FieldUpdater
Bug IDEA-99444 IDEA condisers class used when it's not
Bug IDEA-194226 Reset inspection options in Settings isn't saved
Bug IDEA-181933 Single regex pattern replace to illegal and not equivalent to character class
Bug IDEA-196200 "Generate 'clone()' method which always throws exception" throws exception
Bug IDEA-55886 Wrong inspection and auto-fix for Arrays.asList
Bug IDEA-157566 NPE at applying quickfix 'Comment out' to unused class
Bug IDEA-199808 redundant suppression: support for merged tools
Bug IDEA-198686 Optional.get() without isPresent() on second nonemptylist.stream().min().get() or .max.get()
Bug IDEA-71133 Annotation method is incorrectly reported as unused when used in a same file where annotation declared
Bug IDEA-27535 Inspection, erroneous field "can be final"
Bug IDEA-144891 Good code is red: "Magic Constant" with Calendar.get()
Bug IDEA-200236 False positive: 'Redundant Suppression' warns for foreign suppressions
Bug IDEA-200207 InconsistentLineSeparators false positives on regexp values that have line-end values
Bug IDEA-89120 AccessToStaticFieldLockedOnInstance inspection incorrectly fires on final threadsafe fields
Bug IDEA-194381 Resolved inspection items deleted though 'Filter resolved items' disabled.
Performance IDEA-199413 Too much CPU time spent in UnnecessaryModuleDependencyAnnotator.onInitialize(RefElement) when opening offline inspection result
Usability IDEA-97605 Serializable/Deserializable/Cloneable class in secure context inspections shall have an option to ignore some class hierarchies
Usability IDEA-194541 Remove close button from inspection result toolwindow toolbar
Code CoverageBug IDEA-199411 Update JaCoCo to support Java 11
Bug IDEA-197615 Test with coverage suddenly reports "No coverage in 'all classes in scope'"
Usability IDEA-194483 Coverage file is not monitored
Exception IDEA-199696 Code coverage not working in IntelliJ 2018 running on JDK11
Code Formatting and Code StyleFeature IDEA-155090 File level indentation change
Feature IDEA-62161 Multiline TODO matchers would be nice
Feature IDEA-162495 Add Java Code Style setting for Spaces -> Within -> Enum braces
Bug IDEA-163103 Wrong static imports order
Bug IDEA-163459 Arrangement has different sorting based on anoymous inner class methods
Bug IDEA-200800 Configure indents action from the status bar should open JS code style for JS/JSX files
Bug IDEA-197819 Imported code-style-xml scheme is not applied to unclicked tabs
Bug IDEA-152798 Names count to use static import with '*' doesn't work as expected
Bug IDEA-127949 "Names count to use static import with '*'" setting off by one
Bug IDEA-180882 Code formatting doesn't remove invalid/empty Javadoc tags
Bug IDEA-190114 Impossible to configure Java code style for enums that uses spaces within enum constant definition braces
Bug IDEA-183296 Wildcard import for specific packages
Performance IDEA-200803 AWT EventQueue uses 100% CPU in idle when using EditorConfig
Code NavigationFeature IDEA-200584 Goto symbol should allow to navigate to method overrides
Bug IDEA-200980 Navigate / Last Edit Location opens Editor Pane in wrong IDEA instance window
Bug IDEA-196545 New "Go to" popup GUI: calling "Go to Class" while indexing silently shows empty list
Bug IDEA-199006 Export Type Hierarchy to text file doesn't work
Bug IDEA-165452 Recent files should preselect first item if no editor is open in tabless mode
Bug IDEA-198344 Editor back navigation not working as expected in TDD workflow
Bug IDEA-200312 UI freeze during Search Everywhere
Bug IDEA-197278 New SE: Increase search field font
Bug IDEA-200567 Recent edited files popup shows files from another project
Usability IDEA-198811 Quick search for classes (Ctrl-N) should prefer classes from the same module over classes in another module.
Code. GenerateFeature IDEA-194650 Do not use 'Objects.equals' for generated equals/hashCode
Bug IDEA-200057 IntelliJ IDEA Ultimate 2018.2 toString() code generation uses super class private fields instead of getters
Bug IDEA-194722 #macro does not work correctly in velocity templates for toString etc
Bug IDEA-196896 No code generation using 'implement methods' or 'override methods'
Bug IDEA-198090 Changes to velocity macro for generating equals/hashcode take effect only after restarting IDE
ConsoleFeature IDEA-164907 Run Configuration console does not support "file:///" URL
Bug IDEA-86669 Console: support ASCII backspace symbol in console view
DatabaseCosmetics IDEA-200581 Hide "Scroll from Editor" button on Database tool window toolbar when autoscroll from editor enabled
DebuggerFeature IDEA-194862 Support project-specific async stack traces in remote configuration
Feature IDEA-197886 Support attach to process for java 9+
Feature IDEA-194359 Support for for Async Stacktraces in Remote JVMs
Feature IDEA-199822 Create extension point to provide captured stack frames by e.g. evaluation expression in debugged jvm
Feature IDEA-168185 Allow to attach to java processes started without debug agent (SAPIDAttachingConnector)
Feature IDEA-196669 Allow to automatically restart remote debug server configuration
Feature IDEA-139757 Shortcut for removing all breakpoints
Feature IDEA-197758 Attach to this process action
Feature IDEA-186962 Allow user defined Async annotations
Bug IDEA-144955 Add Field Watchpoint context menu is missing
Bug IDEA-156500 Debugger does not stop at breakpoint in test with JMockit
Bug IDEA-198704 Debugger frames don't navigate to sources if they were added after session start
Bug IDEA-201267 Color icon is not correct for JBColor objects
Bug IDEA-196012 Compiling evaluator does not rename variables
Bug IDEA-199513 Attach to process (read only) does not work if it requires administrator privileges
Bug IDEA-198388 Dragging breakpoint clones it instead of moving
Bug IDEA-199545 Cannot re-attach to restarted process
Bug IDEA-201227 Unclear error reporting for sa-jdwp
Bug IDEA-195335 Incorrect rendering of partially visible lines in Debugger Variables window
Usability IDEA-198985 In Debugger view, the Filter button doesn't allow toggling multiple times
Usability IDEA-200959 Speed search in debugger Variables view expands nodes
Usability IDEA-121159 Pause Program improvement
Usability IDEA-200865 [Regression] No indication that PHPStorm is connected to XDebug in Debug Tool Window
Cosmetics IDEA-198903 [Floating debug tool window] when debugging run configuration, dropdown list with threads in Frame view is not shown at first step
Cosmetics IDEA-184429 Evaluate dialog: Evaluate button takes focus when code fragment is expanded to multi-line mode
Task IDEA-195192 Update debugger icons
Exception IDEA-201303 Exceptions are thrown when the process you are attached to is stopped
Diff_MergeFeature IDEA-101663 Allow option to ignore whitespace in three way merge
Bug IDEA-197927 VCS: Diff: Unified-viewer renders empty line in the wrong place if 'ignore imports and formatting' is enabled
Bug IDEA-195754 Wrong hint in diff window for function params
Usability IDEA-110057 Can't change keymap shortcut for "Compare Next File" in diff view
Usability IDEA-46059 Version control: the clickable area of "Deleted" editor mark is shifted
Usability IDEA-197588 Text in Comparison/files view does not wrap in narrow window ("Difference between current working tree ...")
Cosmetics IDEA-194881 Rename Files Merged with Conflicts as it is confusing to users
DockerFeature IDEA-194585 DockerCompose: Editor. Provide possibility to run service/services by keyboard actions and from the context menu
Feature IDEA-174228 Docker: Add Run and Build actions into the Editor Context menu for dockerfiles
Feature IDEA-192030 DockerCompose. Display auto-assigned ports for docker containers
Bug IDEA-178932 Docker: "dockerfile detection" description in event log/balloon: the link doesn't work
Bug IDEA-196083 docker-compose: wrong inspection at mem_limit option value in case of the string form instead of the integer
Bug IDEA-200116 Docker: it should be possible to run compose after "down" all the conflict apps with the same names.
Bug IDEA-193893 DockerCompose: can't choose services for the attached yaml
Bug IDEA-199274 DockerView: NPE at choosing a service without published ports
Bug IDEA-201513 Docker-compose: call `restart` instead of `up` when already running service is relaunched from the gutter
Bug IDEA-188077 DockerCompose: Stop doesn't work if node contains any container not from the deployed compose file
Bug IDEA-187414 DockerCompose: The parent docker-compose node has "container" icon in case of some deploys from one folder
Bug IDEA-200684 Docker: "Path to compose file required" at running services without established docker connection.
Bug IDEA-200763 DockerCompose: "Run" by click on service gutter doesn't work if there is no "docker" server
Bug IDEA-202435 Adding Docker requires email that has nowhere to enter
Performance IDEA-189747 Docker loads YAML file AST when computing icon
Usability IDEA-187260 DockerCompose. Yml. Display more usable information after folding a "service" and "services"
Usability IDEA-180791 Docker: improve UI for Run/Build actions from Dockerfiles
Editor. Code CompletionFeature IDEA-199722 Can I make the live template appear at the top of the code completion list?
Bug IDEA-180723 Parameter name hints completion: incorrect hints are shown in case of nested call (i.e. method call using as argument value)
Bug IDEA-198968 Idea smart completion suggests non-accessible constructor
Editor. Color SchemesBug IDEA-197528 Color scheme editor ConcurrentModificationException
Editor. Editing TextFeature IDEA-195733 Show parameter hints for enum constructor
Feature IDEA-196006 Link for files in JavaDoc generation output
Bug IDEA-190611 Unable to turn on parameter hint for all cases
Bug IDEA-193695 Quick Definition (Option+Space) writes a space character if it does not work
Bug IDEA-189671 Editor loses caret (thus focus) after closing one of the two splits using Close (Ctrl+F4)
Bug IDEA-199909 'Jump outside closing bracket/quote with Tab' not working for method call closing parenthesis when parameter info tooltip is displayed
Bug IDEA-197276 Adding external annotation into .class file breaks syntax highlighting
Bug IDEA-195416 Join lines over arithmetic operations should preserve order
Bug IDEA-194238 Custom file types comments conflicting
Bug IDEA-196929 Cannot copy text while IntelliJ is indexing
Bug IDEA-196674 Escape doesn't delete all carets in string literal with injected language
Bug IDEA-198767 Caret returns to wrong position at the end of the block in java code
Bug IDEA-194718 Column selection status text is incorrect when multiple window is open
Bug IDEA-194649 On navigation to a search result target location is not centered in editor
Bug IDEA-198595 Last edit location does not remember changes made in Find in Path
Bug IDEA-194473 Scope highlighting blinks terribly
Bug IDEA-197878 AssertionError when inserting several lines insted of the one in multiline TODO
Bug IDEA-200103 Overload switching doesn't work for vararg methods
Bug IDEA-171789 "Last edit location" does not honor changes been made on "Commit changes" window
Bug IDEA-198539 "underscored" and "strikeout" effects not rendering
Bug IDEA-202087 Broken indentation (scaling 250% or higher)
Bug IDEA-196967 External annotations not updated when I edit the file manually
Bug IDEA-194685 Add builtin soutv postfix template
Bug IDEA-192438 Underline is always bold underline
Bug IDEA-198893 Parameter info hints: exception on undo
Bug IDEA-198066 RegEx. Wrong selection with double click.
Bug IDEA-194100 Code folding state resets automatically
Bug IDEA-121060 Multiple carets: comment/uncomment works incorrectly
Bug IDEA-201625 Text jitter in editor when tabs are used for indentation (on a fractional-scale monitor on Windows)
Bug IDEA-196224 Parameter Info bubble (CTRL-P) disappears immediately if invoked after first dot
Bug IDEA-198113 File | Export to HTML: line numbers are displayed incorrectly when enabled
Usability IDEA-198598 "Split line" does not work for multiline TODOs
Usability IDEA-193635 Parameter hints react in a crazy way on incomplete expression
Usability IDEA-197915 Unable to set unix line separator for iml file
Cosmetics IDEA-186054 Text cursor is reset to position (1,1) when code editor tab is dragged from primary window to new 2nd window
Exception IDEA-193406 TraceableDisposable$DisposalException: Editor is already disposed
Editor. Error HighlightingBug IDEA-197802 Editor: highlighting for soft-wraps delimiter not always inherits background color from surrounding code
Bug IDEA-199466 Editor: Error highlighting isn't change on color scheme switch
Bug IDEA-195971 Library source soes not match the bytecode for java.util.regex.Pattern
Usability IDEA-178659 Parameter name hints: automatically inserted commas are highlighted as errors
Editor. Intention ActionsBug IDEA-144708 add static import adds import to inaccessible class
File SystemPerformance IDEA-201455 Less calls to File.isDirectory in CoreLocalVirtualFile
Usability IDEA-192665 Annoying "External file changes sync may be slow" notification
Find, Replace, Find UsagesFeature IDEA-69435 Search for Multi-line fragment
Bug IDEA-199986 Find/Replace in Path closes immediately
Bug IDEA-195122 Find / Replace: when the size of the search field is small, it is not autoscrolled on typing or on Right arrow key pressing; cursor just goes to the invisible area
Bug IDEA-189354 "Find in path" (old style) requires 2 "ESC" pressing to close
Bug IDEA-82930 Ctrl+R (Replace) doesn't always copy the text selected to "From" box
Bug IDEA-196638 Rows in usage view sometimes get cropped
Bug IDEA-193321 SearchEverywhere: on scope switching the 'include non-project items' checkbox loses its state
Bug IDEA-177766 Find In Path: regex search finds irrelevant matches if "In commets" selected in filter
Bug IDEA-198724 New SE: Duplicated results in "Recent files"
Bug IDEA-184743 Button in "Replace in path" old dialog is called "Find" instead of "Replace"
Bug IDEA-193455 Cannot go from Find to Replace if shortcut was changed to Ctrl+H
Performance IDEA-198369 89-second decompiler UI freeze
Usability IDEA-180366 Find in Path from VCS | Local Changes shall pre-select the selected change list or directory
Usability IDEA-167955 Find: `Ctrl+F` on selected word doesn't pre-select text in search field if Find bar is open
Usability IDEA-173010 Rerun is greyed out in Find Occurrences, results are collapsed by default
Exception IDEA-198437 NPE at com.intellij.structuralsearch.plugin.ui.filters.FilterPanel.initFilters
IDE ConfigurationFeature IDEA-146459 Provide a more convenient way of editing custom file type keywords
Feature IDEA-99671 Export Settings: plugin repositories settings are not exported
Feature IDEA-152848 Fresh IntelliJ IDEA 2016.1 installation doesn't recognize the the exported settings file
Feature IDEA-135447 Remember settings last exported
Bug IDEA-186794 "Reassociate" action to change a file type association
Bug IDEA-138366 Default file types configuration (extensions) is not preserved if custom plugin registers conflicting extension
Bug IDEA-200848 SDK: Don't add the same SDK some times
Bug IDEA-186551 HttpConfigurable#getJvmProperties ignores proxy exceptions
Bug IDEA-198818 'Annotations to copy' setting is not persistent
Bug IDEA-200626 File and Code Templates preferences section loads infinitely
Bug IDEA-196469 NPE error on startup with initial wizard
Bug IDEA-192064 "Remove from Sidebar" is not persisted across project re-opening
Bug IDEA-197838 Project leak via animated icon in PluginsGroupComponentWithProgress
Usability IDEA-198415 Option to turn off EAP channel updates entirely for stable releases
Cosmetics IDEA-142225 File template descriptions are wrapped when shouldn't + better padding in general description
Cosmetics IDEA-199540 Strange selection display when switching to "Other" tab in File and Code Template settings
IndicesBug IDEA-198452 Exception on Welcome screen -> Preferences -> Quit
Performance IDEA-185239 9 seconds freeze caused by non-interruptable Readlock
Performance IDEA-159590 File-based index stamp changes when the index returns equal results for modified file
Internal build scriptsBug IDEA-200994 Building distribution of IntelliJ-based IDEs fails on Windows because of incorrectly extracted JRE
Bug IDEA-200988 Building PHP plugin on Windows fails with "The filename or extension is too long" error
Bug IDEA-198772 Testings scripts fail to start a JUnit run configuration if it uses our UrlClassLoader
Task IDEA-198661 Bundle product information file with a product distribution
JSONFeature IDEA-185069 Kubernetes: Json. QuickHelp. Provide quick help for completion list items
Bug IDEA-198593 Errors reported by JSON annotator disappear only on typing
Bug IDEA-195340 bad JSON kills IntelliJ
Usability IDEA-195016 Kubernetes: Json. Completion for "integer" types should be with space before comma
Java. Code FormattingFeature IDEA-119282 Remove blank line between header and package declaration
Bug IDEA-192024 Java formatter breaks do ... while onto a new line if it exceeds the hard limit
JavaFXBug IDEA-200092 Java 11 + OpenJFX Support
Bug IDEA-200215 Warn the user if the JDK can't build JavaFX artifact
JavaScriptException IDEA-196599 JSUndeclaredVariableInspection quick fix AIOOBE on invalid code
JavaScript. DebuggerBug IDEA-187460 Nashorn debugger no longer works with Java 9
Exception IDEA-198791 IAE at com.intellij.javascript.debugger.nashorn.NashornObject.createValue
KubernetesBug IDEA-200606 Web view: useless "Kubernetes" item in the context menu
Exception IDEA-199970 Helm. java.lang.Throwable by calling "Helm template"/ "Helm Dependency update" via keyboard shortcut
Language InjectionBug IDEA-162596 Un-inject action works from the second attempt only
Bug IDEA-196513 java.lang.AssertionError at "undo" language injection
Bug IDEA-153981 Injected fragment editor: multiple instances can be opened for the same fragment, but their contents is not in sync
Performance IDEA-194117 @Language("RegExp") annotation doesn't scale to O(1000) expressions in a single file
Local HistoryBug IDEA-189367 Current version is not editable in the Local History of a directory.
Packaging and InstallationFeature IDEA-194011 Turn vcs.log.graph module into a healthy maven dependency
Feature IDEA-114307 'Create command line launcher' on Windows
Feature IDEA-184006 Add log for win installations.
Feature IDEA-198292 Bundle WSL plugin for Windows distribs of Idea Ultimate
Feature IDEA-199523 Listing of Error/Exit codes
Feature IDEA-170297 "Batch mode" for IDE updates
Feature IDEA-199192 Add "Open with Rider" action for files and folders to Windows context menu
Bug IDEA-138195 Uninstall progress bar animation doesn't represent the actual process state
Bug IDEA-201292 Several installations of one version IDE: Problems with Uninstall in Users folders
Bug IDEA-201027 Small UI issue in Installer
Bug IDEA-200369 Silent Installation: mode=user: if you have no permission to install in the specified folder, installation is finished in the different folder
Bug IDEA-170921 Can't uninstall IntelliJ IDEA Community Edition
Bug IDEA-197938 Windows installer: incorrect "64-bit launcher" label layout
Bug IDEA-199519 Uninstall: The IDE installation folder is not deleted after uninstallation
Bug IDEA-200342 Silent installation: There is no checking if the current version was already installed
Bug IDEA-166445 Add SVG icon file to IDE distribution
Bug IDEA-182484 IntelliJ IDEA restart fails on Windows because of company restrictions
Bug IDEA-190079 Installer doesnt close with finish button and nothing happens
Bug IDEA-168582 Windows setup stacks on 'Select Directory' wizard step for several seconds
Bug IDEA-199339 Incorrect installation folder.
Bug IDEA-200843 PATH can not be updated. The size is very big.
Bug IDEA-200784 Uninstall.exe couldn't be launched in some cases.
Bug IDEA-200274 Silent installation: installation to the wrong folder
Bug IDEA-198383 Duplicating libraries copied to 'lib' directory in IDE distributions
Bug IDEA-200781 Sometimes there is no message that this version already installed during the installation
Bug IDEA-165190 Uninstaller should not remove the files it didn't create
Bug IDEA-199522 Silent installation: There is no check if the installation folder already exists.
Bug IDEA-200776 Remove dependency from 'extensions' module to 'XStream' library
Usability IDEA-182601 Silent install could provide some error feedback
Usability IDEA-198858 Batch Mode for IDE updates: It will be usefull to mention which patch-file.zip is wrong when there is wrong jar file in chain.
Usability IDEA-197129 Kotlin compiler binaries miss executable permissions
Usability IDEA-200235 No option to disable "Open Folder as <IDE> Project" context menu.
Cosmetics IDEA-200363 Silent Installation: It is better to mention in log what was wrong in installation by specific words
Task IDEA-191884 Extract platform classes to separate JARs in IDEs distributions
Task IDEA-109935 Merge "Inspection Gadgets" and "Intention Power Pack" plugins into IDEA core
Task IDEA-189415 Bundle Kotlin 1.2.60 with IntelliJ IDEA
Task IDEA-200752 Remove dependency from java.psi.impl to java.resources.en
Task IDEA-192663 Provide special svg icons for EAP distributions
Task IDEA-196699 Bundle Kotlin 1.3 with IntelliJ IDEA
Task IDEA-193948 Publish modules which allows to read IDEA project configuration as Maven artifacts
Password SafeFeature IDEA-200611 Protect master key file using PGP key
Bug IDEA-200375 Idea doesn't save password in KeePass database
Bug IDEA-196508 On select custom location of keepass file, master password file should be checked also
Bug IDEA-200404 Idea change Password Safe option silently on "cancel" in case selected DB is unaccessible
Bug IDEA-200188 Password Safe: Set/ChangeMasterPassword actions cause significant delays on Ubuntu
Bug IDEA-165257 KeePass OVERWRITES existing database instead of appending or prompting!?
Bug IDEA-200401 Auth error on open DB file with [...] button
Bug IDEA-174581 KeePass storage is wiped if password token does not match.
Bug IDEA-164296 Unable to load library 'secret-1'
Bug IDEA-164786 ISE at com.intellij.credentialStore.kdbx.KdbxSerializerKt.a
Bug IDEA-187790 Passwords Inaccessible (in Settings->Appearance&Behavior->System Settings-> Passwords )
Bug IDEA-200849 Password Safe: incorrect reaction on custom location setting for the (not existing) KeePass database
Bug IDEA-200735 Password Safe: IDE freezes on opening Settings dialog on Ubuntu
Usability IDEA-163353 Not obvious when master password is set up
Auto-reported Exception IDEA-195101 Login to GitHub: exception on hitting Deny
Platform APIFeature IDEA-177378 make the registry entries extendible by plugins
Feature IDEA-183815 Capability to add a content between code lines in the editor
Bug IDEA-195319 `PsiSearchScopeUtil#isInScope(GlobalSearchScope, PsiElement)` returns true for every non-physical element
Bug IDEA-199797 ProgressDialog#myDisableCancelAlarm won't fire for a modal progress bar
Bug IDEA-199458 NPE in UnionScope creation
Bug IDEA-200807 NPE caused by NonClasspathClassFinder constructor leaking "this"
Bug IDEA-134387 CallHierarchyNodeDescriptor or HierarchyNodeDescriptor should implement equals method
Bug IDEA-199978 Support several find-usages-providers
Performance IDEA-181206 Unwarranted checks for type annotations at AnnotationUtil.isAnnotated() cause performance issues
Performance IDEA-197722 Instantiate stubs lazily within file
Task IDEA-195486 Expose JBTabs instance used by EditorComposite in its public API
Task IDEA-191331 Migrate to ASM 6.2
Task IDEA-158421 Document requirements for mac-builder agent
Plugin DevelopmentFeature IDEA-197617 Extension point for inferred annotations
Feature IDEA-197972 DevKit: add checks from PluginVerifier (plugins.jetbrains.com) to plugin.xml inspection
Feature IDEA-196383 DevKit: support <group> "use-shortcut-of"
Bug IDEA-194146 plugin.xml EP naming checks: tighten rules
Bug IDEA-194744 DevKit: extensionPoint declaration verification
Task IDEA-201464 Properly attribute exceptions happened during instantiation of plugin components to corresponding plugins
Exception IDEA-183233 Exception during offline inspections
Plugin ManagementFeature IDEA-186805 Rework plugin page for settings dialog
Bug IDEA-198219 New plugins page: stars are cropped
Bug IDEA-196430 New Plugins dialog: do not allow to install plugin from disk when it is already installed
Bug IDEA-194591 New plugin manager has incorrect window size
Bug IDEA-195202 Plugins: delete action
Bug IDEA-198136 New plugins page shows nothing after pressing Enter for empty search line
Bug IDEA-202018 Old plugin dialog is shown when click on the notification popup
Bug IDEA-193890 New Plugins dialog: Updates page does not suggest existent newer version of bundled plugin
Bug IDEA-193930 New Plugins dialog: visual garbage on the upper panel after clicking on different tabs
Bug IDEA-202017 Can't install plugin if it contains necessary dependence on another plugin
Bug IDEA-197950 It's confusing that one has to install new plugins using Trending section
Bug IDEA-198191 New plugins page takes 6-7 seconds to Show All plugins
Bug IDEA-194120 New Plugins Manager: cannot select text/version text in plugin details page
Performance IDEA-193969 Project leak via UIUtil$JBHtmlEditorKit
Usability IDEA-199435 Search field is focused when returning to plugins list
Usability IDEA-197334 Completion is not aligned with word start in plugin dialog
Usability IDEA-199434 Non-standard hotkey for uninstalling a plugin
Usability IDEA-199622 Updated plugins UI -- grey "Install" button for already installed plugins hard to read
Usability IDEA-199205 New Plugin manager: add hint for gear icon
Cosmetics IDEA-199197 Poor rendering of completion list in Search field on Plugins settings page
Project ConfigurationFeature IDEA-130730 Support per-project custom plugin repositories
Feature IDEA-193045 Repository libraries: add option to exclude only some of transitive dependencies
Feature IDEA-27486 Make file templates per-project
Bug IDEA-145808 Default File Encodings settings are ignored if project created from template
Bug IDEA-195433 Errors on updating sdk
Bug IDEA-192913 Stop updating misc.xml with test statistics
Bug IDEA-192893 Project file encoding settings: the 'BOM for new UTF-8 files' option settings are not preserved on project reopening
Bug IDEA-200525 ProjectRootManagerComponent does not react properly on roots update
Bug IDEA-199667 Maven lib versions updated daily
Performance IDEA-199732 Icons for downloadable library types are synchronously loaded on start
Performance IDEA-201304 IDEA hangs for ~20 sec when adding module to IDEA project
Usability IDEA-147807 Project Structure: Project language level is reverted from "SDK default" to lowest value, if SDK path does not exist anymore
Task IDEA-85546 Introduce constants for the persistent components macros
Quick DocumentationFeature IDEA-199882 Support JDK 11 external javadoc folders structure
Bug IDEA-199409 UI freezes: Documentation popup loads images from network on UI thread
Bug IDEA-200711 View | External Documentation doesn't work for Java11 classes if documentation url is provided
Bug IDEA-200855 SVG displayed in Quick Documentation popup ignore any size hint and are too large
Bug IDEA-202420 Opening offline external documentation for JDK 11 does not work
Cosmetics IDEA-163805 documentation jumps with ctrl down
Exception IDEA-199046 NPE at pressing edit in the quick documentation
Exception IDEA-199780 Quick Doc: Throwable on 'Edit source' in read-only files
RefactoringBug IDEA-199345 Change Signature is available from Structure view though not yet implemented for Go
RegExpBug IDEA-195628 Tab in "Check RegExp" should switch focus between lines
Bug IDEA-199135 Bad error recovery in regular expression parsing
Bug IDEA-195762 Single character alternation generates wrong replacement
Run | Debug configurationFeature IDEA-196611 redirect file to stdin for Java-based run configurations
Feature IDEA-74031 Variables in command line parameters of run configuration
Feature IDEA-197239 Report warning when test pattern name does not occur in project
Bug IDEA-199121 "Run anything" suggests groups, execution targets and then throws exception
Bug IDEA-198525 [Run Anything] when running saved configuration via run anything, it becomes unsaved
Bug IDEA-155610 ModuleBasedConfiguration.createInstance() may produce wrong custom 'cloning'
Bug IDEA-197127 Restart tests opens a new tab instead of reusing current tab
Bug IDEA-188962 "Before Launch" tasks are shared between Run Configuration and its copy
Bug IDEA-198940 Dark font color on dark background in 'run anything'
Bug IDEA-195693 Context help shows 404 page when invoked for a run configuration which don't have special help page
Bug IDEA-197466 JDK 11 doesn't have jaxb causing JShell not to load
Bug IDEA-195937 Disable classpath file shortener for java 9+
Usability IDEA-181444 Run dashboard: toolbar buttons like ShowConfigutations, Restorelayout, Help should be available when some group or deleted RC is selected
Usability IDEA-128651 Keep duplicate in same folder when duplicating a run configuration
SQLFeature IDEA-115461 SQL code style: Improve formatting for ON DUPLICATE KEY UPDATE
Bug IDEA-112933 Criminal autoindentation on SQL code
Structural Search and ReplaceBug IDEA-195278 Replacing an unqualified method call fails
Bug IDEA-194520 SSR: search template finds nothing if symbol with qualifier is used
Bug IDEA-195166 Finding same values does not work
Bug IDEA-198746 Search target dropdown does not set search target
Bug IDEA-199278 Can't search for default method
Bug IDEA-200398 Structural search doesn't find all constructor calls
Exception IDEA-198357 SSR: com.intellij.openapi.util.TraceableDisposable$DisposalException: Editor is already disposed
TapestryFeature IDEA-26518 Provide an easy way to navigate forth and back between a page/component class and its template
Feature IDEA-51032 Support Tapestry 5.1 features: Parameter Namespace and Library Namespace
Feature IDEA-125433 Tapestry tml editor does not recognize library components
Bug IDEA-90773 [Tapestry5 plugin] .tml editor doesn't know tags related to template inheritance
Bug IDEA-98955 Incorrect code highlighting because defaultPrefix on @Parameter is not supported
Bug IDEA-85170 Code Analysis Fails
Bug IDEA-100807 Tapestry 'parameter' namespace elements are incorrectly marked in error in TML editor
Bug IDEA-100346 Incorrect red squiggly error line below "-" (dash) characters in TML tag attributes
Bug IDEA-111859 Tapestry plugin breaks code analysis
Bug IDEA-128498 False warning about unresolvable properties for labels
Bug IDEA-145014 Tapestry project library download fails - codehaus repository is no longer accessible
Bug IDEA-25877 IDEA should not report warning "private field is never assigned" for injected fields
Bug IDEA-128473 Value of "class" attribute in Tapestry components is always treated as an expression
Bug IDEA-107000 Renaming incorrectly appends "get" to property references in .TML files
Bug IDEA-181603 New > Tapestry > Component / Page operation does nothing - fails with NPE in AddNewComponentDialog.getName()
Bug IDEA-144473 Element inside t:content marked red
Bug IDEA-135752 Tapestry plugin does not support switching between page/component class and tml files in "base" package
Bug IDEA-106998 Tapestry loop 'value' elements are incorrectly marked as errors in TML editor
Bug IDEA-52763 Make IDEA understand @SupportsInformalParameters
Bug IDEA-100796 Properties file editor incorrect highlights keys as 'unused' when referenced in TML file as ${message:property-key}
Bug IDEA-103154 Good code is red: can't coerce the string to a DateFormat
Bug IDEA-143210 [Tapestry5 plugin] .tml editor doesn't recognize t:upload tag
Bug IDEA-152132 Tapestry templates: cannot cmd + click to navigate from CSS class name to its definition
Bug IDEA-124505 HTML5 attribute parsing throws errors in Intellij IDEA
Bug IDEA-52910 Autoinsert pairing brace when typing ${ in tml file
Usability IDEA-143514 [Tapestry5 plugin] Goto template (ctrl-shift-g) doesn't work for Scala classes
Usability IDEA-135741 Dialog window for menu New > Tapestry > Page/Component should focus on Name field
Exception IDEA-175988 Throwable at com.intellij.openapi.application.impl.NoSwingUnderWriteAction.a
Task ManagementFeature IDEA-199282 Pre-Select branch by task name in "Open Task" dialog
Feature IDEA-190710 Tasks plugin does not support time tracking for GitLab
Bug IDEA-168220 IDEA freeze up to 1 minute after open "open task" dialog
Bug IDEA-189251 Task management: name of newly created local task is not displayed in the toolbar and in the open task dialog
Bug IDEA-197824 Cannot type in "Switch to task" dialog
Bug IDEA-185092 Commit message is generated from active changelist not task
Bug IDEA-195862 [projectname].tasks.zip is not truncated
Usability IDEA-85270 Tasks: don't allow empty changelist name format
Cosmetics IDEA-199265 'Switch task' menu item is almost invisible when invoked from main pane
Exception IDEA-199388 Throwable at com.intellij.util.io.HttpRequests.process
TerminalFeature IDEA-191464 Add environment variable to terminal detect if running in IntelliJ IDES
Bug IDEA-200294 Context actions on terminal tabs not working consistently
Bug IDEA-200880 Terminal: resize mouse pointer when hovering over "New session" button
Bug IDEA-155071 TERM variable should not be set for windows (cmd) terminals
Bug IDEA-200839 Can no longer open specific directory in Terminal
Bug IDEA-201601 Sometimes terminal shows broken prompt on IDE startup
Unit Testing. TestNGFeature IDEA-94400 Cannot define TestNG using YAML file
Feature IDEA-195047 No way to change Expected file from Actual in diff window on <click to see difference> in testng
Bug IDEA-193318 Do not fold comparison results for SoftAssertions in console
Usability IDEA-196264 TestNG hijacks JUnit Run Configuration?
User InterfaceFeature IDEA-168887 Themes: Ability to customize "speedsearch matching results" color
Feature IDEA-197685 New SE: Also integrate (basic) "find in path"
Feature IDEA-90507 Need tab actions close all to the right/ to the left
Feature IDEA-192585 Use special icons for EAP builds at runtime
Bug IDEA-197801 ContextHelpLabel loses its tooltip after switching to another project type pane
Bug IDEA-196366 Add ability to customize changes browser toolbar in VCS log
Bug IDEA-196109 New Installed Plugin page's context menu actions are not DumbAware
Bug IDEA-197287 Holding shift makes it look like you can click on code you can't
Bug IDEA-199447 Can't select multiple files with [command]-click from Navigate files dialog (regression)
Bug IDEA-193789 Settings: Plugins: unable to search in installed plugins
Bug IDEA-23606 application Run/Debug Configuration main class chooser issue
Bug IDEA-94851 Icons: Griffon icons missing
Bug IDEA-151200 Ubuntu: Unity menu bar is not available for detached editor tabs and floating tool windows
Bug IDEA-199619 'Use dark window headers' doesn't affect the Welcome window
Bug IDEA-198135 Version control toolwindow is not displayed after Enabling VCS integration
Bug IDEA-193862 Hard crash macOS
Bug IDEA-201276 Linux Native menu: shortcuts disappeared from main menu panel
Bug IDEA-178692 AppServers View: splitter position is not persisted between sessions
Bug IDEA-200379 Native menu bar on Ubuntu Linux: the View menu actions have incorrect state
Bug IDEA-193872 New Plugins dialog: search field in "Updates" allows to select plugin that doesn't require update
Bug IDEA-197803 ContextHelpLabel becomes too wide in project type settings
Bug IDEA-169693 No Help Available In Cannot Save file dialog
Bug IDEA-195603 IDE crashes on startup
Bug IDEA-195177 Intermittent tests failure on MacBook with Touch bar in IntelliJ project
Bug IDEA-178171 intention settings: description editor is too small
Bug IDEA-198594 Input text box selection does not select to beginning of field if mouse pointer moves left of text box edge
Bug IDEA-198521 Preview diff in local changes Tab not always shown
Bug IDEA-194208 "Add Language Annotation" quickfix appearance depends on the position of mouse cursor
Bug IDEA-142839 ActionCallback.REJECTED.doWhenProcessed results in memory leaks
Bug IDEA-198321 Unable to create exception breakpoint
Bug IDEA-197853 CaptureConfigurable table has wrong cell/row height
Bug IDEA-194051 Wrong row height for com.intellij.codeInspection.ui.ListTable
Bug IDEA-200654 Search Everywhere not opening file on Linux
Bug IDEA-199585 Svg product icon isn't used when IDE is started from sources
Bug IDEA-197106 DesktopLayout ConcurrentModificationException on startup
Bug IDEA-197708 New SE: Include non-project items has no accelerator in "All" tab
Bug IDEA-196488 Live Templates -> Change Context: keyboard navigation is impossible.
Bug IDEA-194018 New Plugins dialog: "enable" link is not visible for a plugin with multiple dependencies
Bug IDEA-195589 Structure popup has weird initial size
Bug IDEA-197937 JDK9 - Wrong debugger toolwindow tab label rendering on HiDPI Linux
Bug IDEA-195253 Project Settings: Assertion Error exception on add+delete incorrect content root
Bug IDEA-200724 IntelliJ IDEA does not fully start after update, ends with window with menubar and nothing else
Bug IDEA-201446 NullPointerException during using 'FindUsages'
Bug IDEA-197862 No AA in a list (jre 9)
Bug IDEA-198051 Remove button in Recent project is overlapping the project path
Performance IDEA-178384 Too many events from ProgressDialog update (via FileTreeModelBuilder)
Performance IDEA-198160 Non-disposed HelpTooltip leaks disposed project
Usability IDEA-103803 Customize menus and toolbars - Choose action to add - Usability
Usability IDEA-166944 Reopen project: a way to save half a click
Usability IDEA-200298 Show the first unsubmitted error when clicking on the "Fatal Error" icon in the status bar
Usability IDEA-195300 "Copy relative path" should exist in the keymap, or somehow lead to "Copy reference"
Usability IDEA-191113 Don't show "Background tasks running" if we know the tasks can be safely resumed
Usability IDEA-198538 Search Everywhere / Find Action: on finding an entry in Plugins page the plugins list is not filtered and not scrolled
Usability IDEA-197645 Tools | 'Internal Actions' menu is too long
Usability IDEA-57019 Add support for drag-and-drop files in welcome screen.
Usability IDEA-153071 Settings > Version Control > Confirmation window resize issues
Usability IDEA-198129 Mac: impossible to switch to Diff Window with a shortcut after switching to the project
Usability IDEA-195309 Support Ctrl+Backspace in SpeedSearch
Usability IDEA-199392 Incorrect menu spacing on macOS
Usability IDEA-198537 Settings dialog search: on finding an entry in new Plugins page the plugins list is not filtered and not scrolled
Usability IDEA-197044 Run configuration doesn't fit the screen
Cosmetics IDEA-198742 Markdown "Auto-Scroll Preview" Button Looks Like "Download"
Cosmetics IDEA-134373 File type icon on windows title bar doesn't reload for non-physical files
Cosmetics IDEA-118069 Untidy one-pixel gap between border and toolbar buttons
Cosmetics IDEA-196183 TODO view: trim the ending spaces in the changelist name when displaying it in TODO view tab
Task IDEA-188160 Make terminal tabs the same as other tool window tabs
Task IDEA-194353 Change focus border for field and combo in table cell
Task IDEA-195244 Merge two 'Version' comboboxes in repository library settings dialog
Task IDEA-197166 Increase click and hover zones for the close button for Manage Recent Projects popup and Welcome Screen
Task IDEA-196095 Update icons for Build tool window statuses
Exception IDEA-200273 Exceptions: GlobalMenuLinux - Unable to register window and AppMenu-service can't register xid
Exception IDEA-199072 java.util.ConcurrentModificationException
Exception IDEA-191859 Using this EAP caused my Mac to hang twice today. I had to restart. It looks this version is completely broken.
Exception IDEA-200919 ClassCastException: java.base/jdk.internal.misc.Unsafe cannot be cast to jdk.unsupported/sun.misc.Unsafe
User Interface. AccessibilityBug IDEA-201167 File tree in Commit dialog and Revert changes are not accessible for Jaws
Bug IDEA-199219 tables in dialogs not accessible
Bug IDEA-201843 NavBar popups are closed on up/down/speed search
Bug IDEA-201273 Problem with User Agreement Accessibility
Bug IDEA-200351 can't escape diff dialog when screen reader is enabled
Bug IDEA-182960 Screen Reader Accessibility: Autocomplete
Usability IDEA-192637 NVDA: Debugger
Task IDEA-195260 UI element with line numbers and debugging graphic not accessible to screen readers
User Interface. Action SystemBug IDEA-197877 Throwable is thrown when switching files while Current File TODO Toolbar is opened
Bug IDEA-198166 `enter` key does not work in pycharm switcher
User Interface. ControlsBug IDEA-195717 Clicking directly on the arrow in the intention's menu has no effect unless it's done more to the right
Bug IDEA-197936 New SE: unable to use Ctrl/Cmd to expand selection
Bug IDEA-197998 Multiline TODOs: multiline values are not displayed in toolbar on macOS
Bug IDEA-201124 Linux native menu: main menu appears on a toolwindow in windowed mode
Bug IDEA-196606 Floating toolwindows can't be moved
Bug IDEA-195921 Toolbox buttons are cropped on hidpi displays with non-default UI font size
User Interface. FocusBug IDEA-199344 The "Find In Path" action throws TypeAheadTimeoutException
Bug IDEA-186820 Escape key often stops moving focus from a tool window back to the editor
Bug IDEA-196542 Exceptions from intentions are logged as info, not error
Bug IDEA-196291 IntelliJ is sometimes not persisting files to file system
User Interface. GraphicsBug IDEA-199416 IDEA startup NPE if no 'icons' specified in theme file
Bug IDEA-193488 Tool windows blur text when slide in/out
Bug IDEA-195981 Validation errors: bugs
Cosmetics IDEA-197371 Add down arrow in "Go To Changed Files" in diff dialog
User Interface. Look and FeelBug IDEA-200171 High Contrast Theme: Editor color scheme remains "High Contrast" after changing theme from "High Contrast" to "Darcula"
Bug IDEA-183573 printing a PHP source always encases the text in a background color (Darcula)
Bug IDEA-200845 Editor color scheme is not applied when switching between custom themes
Bug IDEA-200278 Background in editor doesn't change according to color scheme
Bug IDEA-200591 White editor for Darcula scheme by default
Bug IDEA-195856 IDEA fails to start on Java 10
Cosmetics IDEA-193982 Problem toolbar menu item's icon seems disabled when enabled
Task IDEA-198114 Remove GTK/Windows native LookAndFeel support
User Interface. NavigationFeature IDEA-198407 Add nullness annotations to base SearchEverywhereContributor class
Feature IDEA-184492 "File..." action is suggesting folders
Bug IDEA-199664 [Run config in the new SE] hints to run or to debug configuration are mixed with each other and should be vice versa
Bug IDEA-196401 Don't show "no classes / files /symbols found" when files are found
Bug IDEA-201937 Search Everywhere shortcuts: Ctrl/Shift+Tab shortcuts set for tabs switching do not work if Tab shortcut is set for "Select item" action
Bug IDEA-199768 New SE: remove duplicates on "All" tab
Bug IDEA-198579 Freeze while searching files by name during indexing
Bug IDEA-201051 New SE: Use "Tab" key for command autocomplete
Bug IDEA-195557 Cannot close splitted editor part after switching original editor
Bug IDEA-199517 Add Run Configurations to new SE
Bug IDEA-199757 Fuzzy search works with folders only if slash filled in
Bug IDEA-200462 New SE: Add statistics
Bug IDEA-199862 No selection until search is not finished
Bug IDEA-199403 New SE: skip other contributors results when search with command
Bug IDEA-201308 New SE: Actions descriptions is not shown in status bar
Performance IDEA-200920 Goto File is slow
Usability IDEA-198002 New SE: part of the popup is outside the screen
Cosmetics IDEA-199666 [Run config in the new SE] run config name and hints doesn't change a font color to white when is selected
Cosmetics IDEA-198030 New SE: Search item full name is overlapped by scrollbar
User Interface. Project ViewBug IDEA-196319 Non-project/excluded from custom scope folders are still visible in project view
Bug IDEA-189991 File changes external to project tree view cause collapse and reset
Exception IDEA-85169 PIEAE through ProjectViewTree.paintFileColorGutter() on pasting incomplete annotation inside another annotation
Version ControlFeature IDEA-66943 Add "Revert Commit" action to file history context menu for Git
Feature IDEA-52927 Version control: Unversioned Files: provide possibility to specify the amount of unversioned files that would be shown in separate view
Feature IDEA-160857 Unversioned Files in Commit Changes dialog: support delete shortcut (DEL)
Feature IDEA-63893 Show current branch on Commit Dialog
Bug IDEA-198676 TODO appears in list several times on 'Review TODO' with selected 'Check TODO'
Bug IDEA-194895 Git annotate: "Number of lines annotated by git is not equal to number of lines in the file ..."
Bug IDEA-188052 Tasks create branches with quotes
Bug IDEA-151064 Show Diff action is not available in annotations of an old revision
Bug IDEA-190095 File Mismatch When Unshelving Changes
Bug IDEA-106293 VCS gets confused if you revert changes quickly
Bug IDEA-191782 No tooltip for new button containing "ignore" actions in Changes view
Bug IDEA-183551 Copy As Patch to Clipboard enabled only on files
Performance IDEA-199583 Files affected by revision is slow when invoked from annotation markers
Usability IDEA-171261 Cannot delete last changlist
Usability IDEA-195922 Local changes: Focusing an empty changelist doesn't remove the preview diff
Usability IDEA-199471 Add Shortcut to open Diff from annotations without invoking contex menu
Usability IDEA-184616 'Reword commit" do not add/alter item in commit message history
Usability IDEA-198769 Provide better progress indication for the Show Affected Paths dialog
Usability IDEA-199656 Changelists should be expanded by default, and should retain the state
Usability IDEA-186415 Clear metadata associated with changelist after first successful commit
Usability IDEA-140866 Conflict in button's keyboard shortcuts in the Code analysis failed dialog
Usability IDEA-131325 VCS Commit Message box is using the caret foreground from "Generic" but background color is not inherited from "Generic"
Cosmetics IDEA-195248 Dialog Add File to Git, change Yes/No buttons to Cancel/Add File to Git
Cosmetics IDEA-197717 Edit Changelist should have default shortcut
Cosmetics IDEA-82955 Windows-specific setting name
Exception IDEA-200051 IllegalStateException: Cannot find content provider for vcs hg4idea
Version Control. GitFeature IDEA-95494 Copy some files from one branch to another branch
Feature IDEA-133270 (Git) Annotate should retain history through file renames.
Feature IDEA-88818 When creating .idea directory, automatically put inside a .gitignore containing workspace.xml and other files which have to be excluded from the VCS
Feature IDEA-160208 Git Fetch multiple roots in parallel
Feature IDEA-184293 Create a .gitignore on enabling VCS integration in new projects
Bug IDEA-199263 Confusing "Add file to Git" dialog choice
Bug IDEA-200107 Exception when invoke Default Settings from Welcome screen
Bug IDEA-197913 File History on a submodule folder shows the log of the submodule repository
Bug IDEA-198360 Git: built-in SSH: if the saved password doesn't match, allow to enter the new one
Bug IDEA-196117 Have not understood this message, there is a grammatical mistake
Bug IDEA-196449 IntelliJ tries to set git username and email for non-git vcs roots.
Bug IDEA-200448 VCS Git "Fetch" does not refresh the VCS "Log" view
Bug IDEA-168999 "History up to Here" for a submodule folder shows empty history
Bug IDEA-198264 Git: Native or built-in SSH: correctly process the invalid (empty) passphrase
Bug IDEA-170013 Git Native SSH with passphrase fails with Permission denied
Bug IDEA-199966 Git: .gitignore created on enabling git in project should not contain absolute paths
Bug IDEA-198951 Pushing main repo with submodule with reject leads to "not on branch" AssertionError
Bug IDEA-192771 Git commit partially causes change CRLF to LF.
Bug IDEA-199761 File names with trailing spaces break git diff
Bug IDEA-149060 Modified files in one of repositories are often moved to the active change list
Bug IDEA-198952 Rejected push in a submodule fails if "Update non-rejected repositories as well" is not selected
Bug IDEA-100075 Git submodule commit should make parent repository re-request Git status to show updates to the submodule folder itself
Bug IDEA-201054 Git: native SSH: confusing dialog on attempt to connect to (yet) unknown host
Bug IDEA-198723 Git Submodules: project update doesn't update submodule project if the submodule is on branch
Bug IDEA-198727 Git Submodules: Annotate is enabled in the Diff view for the submodule entry but returns 'fatal: bad object'
Bug IDEA-199969 Git: .gitignore is created in the project root on git repository creating in one of its subfolders
Bug IDEA-169002 Git submodules: Diff invoked for submodule entry shows 'fatal:bad revision...' message
Bug IDEA-194286 Continue rebase doesn't refresh file status
Bug IDEA-199003 git commit failed with "the following paths are ignored by one of your .gitignore files"
Bug IDEA-198271 Git: Native SSH: if password authentication is used, the password can't be remembered
Bug IDEA-172234 Git Branches Popup Menu does not pop up at all
Bug IDEA-200864 Update Project doesn't fetch submodules
Bug IDEA-199226 Git "Browse Repository at Revision" panel is not available in dumb mode
Bug IDEA-156454 No Unstash of uncomitted changes when cancelling Git Rebase
Performance IDEA-197868 Branch listings extremely slow with many remote branches
Usability IDEA-195155 Rebase Branch - Onto box should default to refs/heads/master if there is no tracked branch
Usability IDEA-144948 Branch list in Git Rebase dialog should include remote branches
Usability IDEA-197543 Native SSH doesn't allow to save the passphrase or the password
Usability IDEA-187320 "Show history for revision" action name is unclear
Usability IDEA-190367 Shortcut for git branch by default
Usability IDEA-83415 IDEA should "git commit" when possible instead of always calling "git commit --only" with paths
Usability IDEA-155587 Git action "Checkout with Rebase" has counter-intuitive name
Usability IDEA-194090 Protected branches do not prevent branch deletion
Usability IDEA-199926 Scanning for Git roots in a project should skip known third-party libs locations
Usability IDEA-183867 Ignore whitespace changes in annotations for git option
Usability IDEA-167671 No simple shortcut for Force push
Cosmetics IDEA-198989 Broken html in remotes dialog
Cosmetics IDEA-198272 Git: change the tooltip text for "SSH executable" option in Settings
Cosmetics IDEA-198247 Use smoother scaling for avatars in GitHub accounts panel
Exception IDEA-197947 ISE at git4idea.commands.GitNativeSshGuiAuthenticator.askKeyPassphraseInpu
Version Control. LogFeature IDEA-130845 Log: add action to go-to-parent and go-to-child
Feature IDEA-199867 Support Back and Forward navigation in VCS Log
Feature IDEA-170988 Add Diff Preview to File history view
Bug IDEA-198803 VCS log shows garbage in "author" field, looks like a corrupted index
Bug IDEA-199655 Unable to see git diff from file history for renamed file for commits made before rename
Bug IDEA-193814 com.intellij.openapi.vcs.VcsException: Index: 1, Size: 1
Usability IDEA-194808 Branch filter should take repository filter into account
Cosmetics IDEA-195976 Fix progress bar in VCS Log in darcula
Task IDEA-191611 Update toolbar in VCS Log
Version Control. MercurialFeature IDEA-187194 Add compare action to the branch popup menu for Mercurial
Cosmetics IDEA-187924 Mercurial: Project update - Cropped text
Version Control. SubversionFeature IDEA-75033 Add option to immediatly switch to a new branch when branching from repository location
Bug IDEA-198691 Version Control: Error updating changes: For input string: "UNDEFINED"
Task IDEA-197126 Remove "Update administrative information only in changed subtrees" option
Exception IDEA-198536 After upgrading to IDEA 2018.3 EAP - Subversion History fails with error
XMLFeature IDEA-199839 Support deprecation in xsd schemas
Feature IDEA-108183 XML: auto-popup completion for attribute values with enum
Feature IDEA-64075 Automatic XML Schema discovery
Bug IDEA-115240 Tags from scheme helptopic.xsd are not recognized
Bug IDEA-142045 XML attribute is highlighted with red but validation succedes (using xml schema with restriction xs:list > xs:enumeration)
Bug IDEA-78840 generate xml from xsd fails
Bug IDEA-151043 code completion sometimes does not suggest enumeration values when used with extension or union
Bug IDEA-199694 XML reformatting does not preserve line breaks when the comments are at the end of the file
Bug IDEA-197050 IntelliJ doesn't find my namespaces when using autocompletion in an XML Schema file
Performance IDEA-193127 DomFileIconProvider loads AST unnecessarily
Cosmetics IDEA-75432 Duplicate menu entries
i18nBug IDEA-179826 Refactor|Rename is unavailable for Resource Bundle in Project Tree
No subsystemBug DBE-4449 SQLite dialect does not understand vector valued updates
DB ConnectivityFeature DBE-5294 Auto-reconnect to db after "db timeout / disconnect / ssh timeout" feature
DB ConsoleFeature DBE-4949 Possibility to set default Isolation Level
Bug DBE-7298 IndexOutOfBoundsException occurs on opening "Parameters" dialog if there are no parameters in query
Bug DBE-7121 AbstractMethodError with Informix JDBC driver in Database Console
DB DiffBug DBE-7066 Migrate left right shouldn't synch both
DB IntrospectionFeature DBE-7198 DataGrip Should Provide Pattern to functionNamePattern in DatabaseMetaData.getFunctions() call.
Feature DBE-4366 Support for EXTENSIONS in PostgreSQL
Bug DBE-7201 Uninformative "Project Data Sources: re-sync required"
Bug DBE-7234 Unknown system variable 'storage_engine' when trying to connect to MySQL 5.7
Bug DBE-7150 Triggers not showing for MariaDB ver. 10.1.34
Bug DBE-6863 PostgreSQL 11 Stored Procedures incorrectly show as functions in the Database pane and cannot be deleted
DB RefactoringBug DBE-6616 Cannot delete database
Bug DBE-7103 Extra engine alteration
Bug DBE-7205 Default SQL value wrongfully becomes string in "modify table" dialog
Bug DBE-6663 MYSQL: Drop table command does not encapsulate table name
Data Import & ExportBug DBE-6312 Incorrect string parsing in batch script execution
Usability DBE-7015 Export to Database: do not re-execute the select query if possible
Data ViewsBug DBE-2444 Can't select total row count of PostgreSQL table while a column is being sorted
IDE GeneralFeature DBE-7036 DataGrip is missing "Report a Problem" menu item under Help.
Cosmetics DBE-4250 Inconsistent Invalidate Cache / Restart location
SQL CompletionFeature DBE-6989 Customisable aliases for tables when auto-completing SQL queries
Feature DBE-5940 don't suggest aliases for table names
Feature DBE-2242 Completion for sql select should show "all columns" as for insert into
Feature DBE-2854 Automatic alias
Feature DBE-4770 GROUP BY completion should offer non-aggregated columns from SELECT clause
Feature DBE-2282 'Create table definition' suggest bad type
Feature DBE-6411 MS SQL: INSERT INTO [TABLE] ([ALL COLUMNS SUGGESTION])
Feature DBE-2285 Completion for sum() and avg() functions
Feature DBE-850 Expand column list improvements
Bug DBE-4848 Code Completion: stored procedure with named parameters (Sql Server)
Bug DBE-2852 Setting to select table order in ON-clause
Bug DBE-5163 create index column autocomplete defaults to all columns
Bug DBE-6778 Code completion doesn't suggest column types in create table statement for sqlite console
Bug DBE-5591 Autocomplete for the FILTER (WHERE ...) clause of an aggregate function is not correct
Bug DBE-7049 Bad completion for avg() and sum() functions in Postgres
Bug DBE-7128 Duplicate "INTERVAL" completion suggestion
Bug DBE-5948 sql completion does not suggest distinct in count() on sql server
Bug DBE-6895 Autocomplete and changing join type
Bug DBE-4656 Bad completion for window functions
Bug DBE-4246 If inside brackets, on completion item selected dot is inserted incorrectly
Bug DBE-6954 Improper syntax completion for functions
Bug DBE-6536 Inapplicable autocomplete suggestions - table ailas after table alias
Bug DBE-5654 Duplicates in completion
Bug DBE-5981 suggested alias should not have hash sign for temp tables on sql server
Bug DBE-4981 REGEXP_COUNT is an unknown database function
Usability DBE-5660 Better completion in Modify Table for SQLite
Usability DBE-6450 Remove SELF argument from autocomplete prarmeter list of PLSQL Object type method
Usability DBE-6606 "NOT NULL" should be suggested before "NOT FOR REPLICATION"
Usability DBE-3518 Autocomplite default inside values
Usability DBE-7032 Improve completion for joins
Configuration Problem DBE-5511 Can't disable MySQL JOIN alias autocomplete
SQL Format and StyleFeature DBE-6798 Egypt style for INSERT and subqueries
Feature DBE-6801 Allow to specify elements place separately for each clause in query
Feature DBE-6819 Indent-only no-alignment code style (also C-like style)
Feature DBE-6678 Align JOIN under FROM
Bug DBE-7167 SQL code style format - Comment
Bug DBE-1376 SQL Formatting: line break before closing ")"
Bug DBE-6939 SQL formatter - lag and no effects in preview
Bug DBE-7220 Indent everything between BEGIN TRANSACTION and COMMIT statement MSSQL
Bug DBE-7236 MSSQL: Query hint formatting
SQL GeneralFeature DBE-7069 Multiline TODOs for SQL
Feature DBE-3275 Fold multiple values in IN operator
Bug DBE-7098 "ROWS FROM" join from_item is not recognized
Bug DBE-6314 limit 1 is not recognized as valid sytax in PL/PgSQL
Bug DBE-5750 TEXT datatype not in Code Completion
Bug DBE-2250 At symbol (@) causes spell checker to report false positive in SQL file
Bug DBE-5325 Code Folding > Expand All requires repeating the action two times
Bug DBE-6859 MSSQL: Table hint for MERGE breaks down
Bug DBE-7143 Auto-created folding regions are un-folded on file re-open
SQL GenerationFeature DBE-7025 Support SQL Generator `IF NOT EXISTS` option
Bug DBE-7180 Several PostgreSQL rule issues with the Source Editor
Bug DBE-7129 Query plan visualizer doesn't work
Bug DBE-6992 Reshift Generic: invalid SQL generation for routines
Bug DBE-7195 In "Database Changes" window, right-clicking on a single function/view and clicking on "revert" reverts all changed objects!
SQL HighlightingFeature DBE-1456 Show warning on DELETE FROM without WHERE clause
Feature DBE-6759 highlight if JOIN aren't paired with ON
Feature DBE-3109 Please add an inspection for unused field of subquery
Bug DBE-7065 Support schema qualification syntax in CREATE OPERATOR FAMILY
Bug DBE-7112 Incorrect error highlighting in HSQLDB mode
Bug DBE-4709 SQL statement parse error with slash at end of line
Bug DBE-6303 SQL integration: "AT TIME ZONE" not recognised for Microsoft SQL Server
Bug DBE-6975 Support 'or replace, materialized view, precomputed' syntax
Bug DBE-6862 Syntax for Oracle's sample.
Bug DBE-6830 'ON' is not treated as value
Bug DBE-6125 PostgreSQL support USING NEW INTO syntax
Bug DBE-5635 Redshift: support varchar(max) syntax
Bug DBE-6848 Unresolved reference for alias in Redshift
SQL RefactoringFeature DBE-636 SQL Intention: Introduce/inline table alias
Bug DBE-7178 Alias renaming in a view source editor fails to apply changes to all references
SQL ResolveBug DBE-6641 User table not properly parsed
Bug DBE-6947 Some MySQL 8 functions aren't resolved
User InterfaceBug DBE-2390 Data Statistic Error
No subsystemFeature WEB-15038 Support for media type suffixes (application/***+json)
Feature WEB-31391 Go to Angular component's HTML template from usage
Feature WEB-34619 Associate WebStorm with JSON files
Feature WEB-34686 XML intention to create tag from attribute value
Feature WEB-33932 Bundle markdown plugin
Feature WEB-33249 Typing quotes/backticks over selected text should wrap that text, not delete
Feature WEB-33334 Run spell check on the description property in package.json files
Feature WEB-29322 Webstorm doesn't support pluralization rules syntax in angular templates
Feature WEB-33928 Add intention to wrap xml value in cdata block
Feature WEB-25165 Provide ability to pass command line args to protractor
Feature WEB-29005 Add support of -webkit-image-set in CSS
Bug WEB-34740 Using new element action on navigation bar is broken
Bug WEB-34624 Argument for @NotNull parameter 'jestPackage' must not be null
Bug WEB-31037 Do not report spelling errors for values from bundled JSON schemas
Bug WEB-25681 Methods in Angular's *.component.ts falsely recognized as unused
Bug WEB-35223 Deadlock on indexing
Bug WEB-33543 Remove Web Starter Kit from the project wizard
Bug WEB-34578 Spelling 'mistakes' in variable names
Bug WEB-31040 Add to the dictionary
Bug WEB-34776 Angular. Make method private/protected leads to exception
Bug WEB-14589 multi-line todo in html
Bug WEB-34299 Closing tag is not changed when selecting an autocomplete option by mouse (not keyboard)
Bug WEB-34375 Live templates: surround with tag inserts superfluous line break
Bug WEB-34755 routerLink value should not resolve and be just a plain string literal
Bug WEB-20634 Highlighting problems with bundled WebStorm color schemes
Bug WEB-35425 "ActionScript/Flex" diagram is suggested for TypeScript file
Bug WEB-35054 Add words to default dictionary: monorepo, denormalize
Bug WEB-35363 ClassCastException when opening and setting focus to some js files
Bug WEB-32711 Prettier: support .prettierignore
Bug WEB-33786 Add "realtime" to the default dictionaries
Bug WEB-34085 Mac OS X keymap is selected if you skip the IDE configuration
Bug WEB-33753 'Convert class to functional component' loses defaultProps in TSX
Bug WEB-21704 Support qualified references in templateString JS language injection patterns
Bug WEB-10491 Add standard framework keywords to dictionary
Bug WEB-35098 Disabled library is enabled after applying changes in 'JavaScript - Libraries' dialogue
Usability WEB-34438 Typing dot or space in import path results in applying selected variant from completion list if module name is selected there
Usability WEB-35408 Disabling the webpack configuration shows a warning on project load
Exception WEB-35364 File processor exception on project close
Exception WEB-35460 IndexNotReadyException when trying to get qualified name while indexing
Build toolsFeature WEB-34701 Run Anything: add npm tasks
Exception WEB-34650 InvocationTargetException when debugging npm script with node 6.x
CSSFeature WEB-10307 Multiline TODOs for CSS/LESS/SCSS/Stylus/PostCSS
Feature WEB-35114 Stylesheet languages code style: add an option to control blank lines around nested selectors.
Feature WEB-6176 Add refactoring: "Move CSS ruleset to a different file"
Feature WEB-22 Code cleanup - sort CSS properties by name inside declaration
Feature WEB-34312 Add intention action: replace CSS var() function invocation with its fallback value
Feature WEB-19525 Add "Keep Maximum Blank Lines" to Settings -> Code Style -> CSS
Feature WEB-24381 Extract Ruleset intention action
Bug WEB-27101 ::slotted(*) css pseudo-element is highlighted red
Bug WEB-35230 CSS formatting: 'Keep single-lines blocks' option affects blank lines
Bug WEB-35249 'Rearrange Code' action messes up CSS file if it contains import
Bug WEB-61 CSS optimization bug
Bug WEB-35555 Some CSS pseudo-selectors are highlighted red in the editor
Bug WEB-10143 Code readability in css color preview
Bug WEB-34825 Emmet in stylesheet comments
Performance WEB-34434 "Unused CSS selector" inspection overloads CPU
Usability WEB-35153 Group code style pages for style sheet languages in Settings
Usability WEB-35013 Sort CSS properties: restore default custom order
Task WEB-35196 No reason to have different code style settings for CSS and PostCSS
Exception WEB-34806 Invalid comment range on file opening on comments searching
CoffeeScriptBug WEB-29109 CoffeeScript formatting of 'export default'
Bug WEB-32860 Local class properties/methods not being properly indexed
Bug WEB-31789 Coffeescript highlight OR= operator error
Bug WEB-14981 Existential Operator `?` on newline marked as invalid syntax, while invalid `?` usage is not marked
DartBug WEB-35159 'itar' live template works wrong in Dart if var i is already used
Bug WEB-35068 Dart completion prevents from typing a number literal
Usability WEB-28503 Possibility to specify Dart Dev Server port for a Web app to facilitate using local storage such as indexeddb
DebuggerBug WEB-35084 @angular/cli: duplicated AppComponent in variables | local | this
Bug WEB-34483 Run/Debug Configurations: .NET Project : Browser/Live Edit. Confusing button in the web address field
Bug WEB-34667 Debugger ignores breakpoints when debug grunt task
Bug WEB-34890 IDE can't connect to Chrome - 'Waiting for connection to localhost'
Bug WEB-35530 React Native build doesn't start with 'react-native' package
Bug WEB-33717 WSL: debugger ignores breakpoints when use babel-register
Bug WEB-34206 Webstorm 2018.2: "Debugger Console" view missing from Debug window with Node 6.x
Bug WEB-34786 Karma tests can't be debugged when they are not bundled with webpack but it's set up in karma config
Bug WEB-34783 Docker on Windows: ports are not bound automatically
Bug WEB-34605 Debugger stops on EVERY same-named source file while debugging Node JS remotely using "Attach to Node.js/chrome"
Bug WEB-35613 Can't run Node debug session if there mappings for 127.0.0.1 in /etc/hosts
Bug WEB-34520 Support BigInt type in Debugger
Bug WEB-33878 NodeJS debug breakpoint not working without server restart when using reconnect automatically Build #IU-182.3684.2
Bug WEB-34822 'this' is wrongly evaluated with sourcemaps in Variables view
Bug WEB-35448 JS debug is broken (183.3975.9)
Bug WEB-34407 Debugger controls do not work when debugging code executed within a VM
Bug WEB-35449 Debugger stops on first line in a file when debug with js.debugger.use.node.options turned on
Bug WEB-35218 Can't debug Node.js: path no program files is considered as incorrect
Bug WEB-34990 Debugger doesn't update breakpoints positions
Bug WEB-34895 Can' debug react native app with react-native@0.57.0
Bug WEB-14424 IntelliJ can't debug into node_module entries that are created by NPM Link
Bug WEB-35037 Variables from outer function appear in shorthand arrow function scope
Usability WEB-33956 Auto expanded object properties values make variables view noisy of there is too many object entries
Usability WEB-13852 Debugger: "Add to Watches" for multiple variables selected in Variables view adds the first variable only
Exception WEB-32925 Throwable: No last annotation when 'Run with coverage'
Exception WEB-34839 IllegalArgumentException: Argument for @NotNull parameter 'file'...
Exception WEB-34648 IllegalArgumentException: BIGINT when debug via node 6.X
File WatchersBug WEB-35498 Prettier file watcher: opening and closing file chooser changes Program path
Task WEB-34630 Update file watcher template for Babel 7
HTMLFeature WEB-20608 Unwrap tag should be available via Alt+Enter as a context action
Feature WEB-34959 Add inspection: an HTML tag should have a lang attribute
Feature WEB-34949 Add inspection: an HTML element has no alt attribute
Feature WEB-34756 data-* attribute "is not allowed here"
Feature WEB-8885 Reformat code after an "Unwrap/remove" in HTML
Feature WEB-34944 Add inspection: an HTML element has no title attribute
Feature WEB-5082 HTML: completion could suggest all valid closing tags
Feature WEB-35006 Add inspection: A head tag should contain a title tag with content
Feature WEB-33951 Make rearrange tag attributes available as an intention
Feature WEB-33921 Convert named entity to numbered one and vice versa intention
Bug WEB-7228 HTML5 Boilerplate breaks HTML completion in .html file
Bug WEB-34358 Unwrap html tag works wrong
Bug WEB-34356 Generate xml tag items displayed multiple times
Bug WEB-34754 Wrong unescaped characters inspection in html script section
Bug WEB-34737 Html tags are not resolved in angular project
Bug WEB-35033 HTML: "Unknown HTML tag attribute" inspection: allow "alt" attribute for the "applet" tag
Bug WEB-342 Surround with tag not indenting properly
Bug WEB-34566 Support 'Jump outside closing bracket/quote with Tab' feature for HTML files
Bug WEB-29360 Emmet preview is not working in JS injections
Bug WEB-34573 Remove Surround with CDATA intention
Bug WEB-34950 Add inspection: use <em> and <strong> for emphasized or special text
Bug WEB-13095 Element names are not spelling mistakes
Bug WEB-34363 Surround with CDATA item should only be available in XML
Bug WEB-35129 Add inspection. A table without summary attribute
Bug WEB-34361 Convert text to CDATA should not be available in JSX
Exception WEB-17902 NullPointerException when applying 'Form input without an associated label' quickfix
JSONFeature WEB-31879 Insert comma automatically with closing bracket / quote
Feature WEB-34368 Add completion for "required" properties in json schemes
Feature WEB-33212 Mechanism for providing completion for third-party webpack plugins via json schemas
Feature WEB-34898 Typing assist to insert quotes automatically when typing ":" after property name
Feature WEB-35148 Add comma when pasting lines into JSON
Feature WEB-24731 JSON Schema: implement completion for the contents of $ref reference
Feature WEB-35067 Auto-insert whitespace after typing ":" in JSON after property name
Feature WEB-35323 Add "Surround with > quotes / array literal" for JSON
Feature WEB-34748 Inject JS regexp into "pattern" property of JSON schema and "patternProperty" property names
Feature WEB-33308 JSON Schema inspections: smarter error selection and better targeted quick fixes
Feature WEB-35058 JSON: Support $id property properly (resolve $ref-s with id, navigate, etc.)
Feature WEB-24696 Paste into JSON could help with escaping quotes
Feature WEB-33746 Add completion/navigation for $schema property
Feature WEB-35463 Add a checkbox to prefer remote JSON schemas over bundled schemas
Feature WEB-34618 Duplicate JSON keys inspection should provide navigate to duplicate as a quick fix
Feature WEB-31891 Unescape when copying content of JSON string
Feature WEB-24726 JSON Schema: highlight unresolved $ref references
Bug WEB-34897 'anyOf'/'oneOf' with identical schemas leads to no or partial errors
Bug WEB-31876 JSON inspection tab character in strings
Bug WEB-34643 JSON: Validates against 'not' schema warning in package.json files
Bug WEB-33758 "Reformat Code" inserts an extra newline when the predecing element overlaps the right margin
Bug WEB-31894 Escaping backslash inside a string in JSON causes spellcheck underlines to appear at random
Bug WEB-35302 Incorrect type detection for TSLint 'rules' in JSON code completion
Bug WEB-34178 JSON Schema: Caret is out of the brackets after adding missing property
Bug WEB-35303 'rulesDirectory' in tslint has two possible type variants, but we suggest only array in code completion
Bug WEB-34928 JSON Schema reference breaks other references to JSON properties
Bug WEB-35121 JSON Schema: incorrect oneOf branch selection - at least one should be always selected
Bug WEB-26702 Add/remove commas when moving statement in JSON
Bug WEB-32453 JSON schema: #ref links are resolved incorrectly in several cases
Bug WEB-35493 JSON schema validation validates itself
Bug WEB-34915 LineWrapPositionStrategy is not implemented for JSON, leading to invalid splitting of string literals, etc.
Bug WEB-35358 JSON: "Surround with > quotes / array literal" doesn't surround several items inside array
Bug WEB-34888 Validation of 'allOf' condition is too weak
Bug WEB-34657 JSON Pointer escapes for '/' and '~' are treated incorrectly in $ref completion/resolve and in schema validation
Bug WEB-34538 Duplicating items in code completion
Bug WEB-34354 "type": "object" is not always correctly handled by "add missing properties" fix
Bug WEB-34369 Title from json schema is not used in documentation popup
Bug WEB-35318 JSON pointers do not follow proper URL encoding
Performance WEB-34304 Azure deployment JSON schemas are not properly evaluated and cause laggy code analysis
Usability WEB-33453 Collect all one-of branches / any-of when none is applicable and show smarter inspections / suggest smarter fixes
Usability WEB-35385 JSON: merge the user whitespace with whitespace auto-inserted by typed handler
JavaScriptFeature WEB-34932 Enable "Unsound 'typeof' type guard check" inspection for JS
Feature WEB-27961 Parameter hints (like in Typescript) in pure JavaScript
Feature WEB-33892 Check RegExp should support lookbehind
Feature WEB-34461 Completion for <this>.property in JavaScript classes
Feature WEB-32425 IDE is unaware of Flow utility types
Feature WEB-34683 Multiline TODOs for JavaScript/TypeScript
Feature WEB-35103 Completion for overrides with full bodies should work in object literals
Feature WEB-35564 Flow: better support for function generics
Feature WEB-33343 Copy path breadcrumbs to clipboard for JS/TS
Feature WEB-30855 No autocomplete for flow's $ReadOnly types
Feature WEB-29456 Completion for overrides should behave same as 'generate overrides' - insert parameters
Bug WEB-34314 Unresolved function or method hasOwnProperty() on JSON object
Bug WEB-33435 Imported class member not resolved when using singleton pattern
Bug WEB-34377 go to declaration for a imported (from a node module) function should take you to the function definition in the exporting module
Bug WEB-35550 Wrong links to MDN in documentation popup for React APIs
Bug WEB-21480 Referenced JS Library shows "OK" state after Library is Deleted (or name changed)
Bug WEB-24709 Move 'suppress for statement' into nested menu if error with quick fix is reported from JSAnnotator
Bug WEB-35141 Flow: CMD-hover type lookup does not work across files
Bug WEB-34347 JSdoc: named @typedef with type specified via @type not accepted
Bug WEB-35115 invalid "variable might not have been initialized" inspection for destructuring assignment, should be a syntax error
Bug WEB-34101 `for await` not shown as wrong when used outside `async`
Bug WEB-35356 JavaScript: enable base "navigate to source" for global @types libraries
Bug WEB-35136 Trailing comma in dynamic import gives spurious syntax error
Bug WEB-35243 Completion for overrides: place caret inside the method body
Bug WEB-34212 JS/ES6: Inspection issue: Contents of collection are updated, but never queried
Bug WEB-35191 "Type mismatch" inspection: false positive when using `return;`
Bug WEB-32337 Resolve for property assigned in other scope
Bug WEB-34337 index.js is added to the imports when moving files
Bug WEB-34702 "Contents of collection are queried, but never updated" when using ternary operator
Bug WEB-32396 Flow core library global type definitions are not exposed to the IDE
Bug WEB-35017 Autocomplete for class properties of templated data structures does not work if defined above 'class' declaration
Bug WEB-34745 Don't show 'forin' postfix template on array/iterable type
Bug WEB-34468 Make method static generates extra point in multiline class object
Bug WEB-30363 JQuery + RequireJS $.each() and $.ele.children() unresolved
Bug WEB-28566 Erroneous "missing import" statement for Flow type
Bug WEB-34922 'worker_threads' isn't resolved in require statement
Bug WEB-35113 'Generate' creates body with return in pure JS if implementing TS method with 'void' return type
Bug WEB-32522 JS: wrong function param styling
Bug WEB-34595 JavaScript: Duplicated options in Surround With action menu
Bug WEB-32933 Can't resolve sortBy import from lodash
Bug WEB-32584 Unresolved function or method error
Bug WEB-34687 Opening parenthesis immediately within a JSX tag cause parse error in flow js files
Bug WEB-35419 'Copy qualified name' doesn't work for tags in Flow & React projects
Bug WEB-34425 provide completion for object shorthand properties in function arguments
Bug WEB-34936 False "Method expression is not of Function type" type mismatch
Bug WEB-32458 Renaming variable changes same-named object property
Bug WEB-34282 Used parameter/variable/function shows unused in language injection (heredoc)
Bug WEB-34257 Flow: quick documentation doesn't show callback params
Bug WEB-30683 Add patterns to allow configuring language injection in JSX tags
Bug WEB-35327 Invalid code check warning (false positive): Type boolean is not assignable to type boolean
Bug WEB-34641 ES6: enable autoimports from node_modules if it contains ES6 modules
Bug WEB-35565 Code completion not working until type definition file is touched
Bug WEB-35253 Generating overrides doesn't respect generator methods
Bug WEB-30290 Some JS intentions break code formatting when invoked
Bug WEB-34341 Default export is marked as unused when using directory imports
Bug WEB-34315 Error in Javascript inspection and code completion
Bug WEB-34658 Do not show parameter hints for JSX expressions
Bug WEB-25867 Resolve webpack built-in plugins
Bug WEB-32119 Proper support for `@instance`
Bug WEB-34768 forEach to for...of intention bugs
Bug WEB-35274 Provide quick documentation for arrow function parameters, where referenced within the function
Bug WEB-34230 Support referencing non-existent files in JavaScript libraries
Bug WEB-34394 Show introduce variable intention only for the `class`/`function` keyword in `export default class/function`
Bug WEB-34996 Enable completion for object properties as keys inside square brackets in JavaScript
Bug WEB-35468 Support at least explicit substitutions for Flow generics in class constructors
Bug WEB-35384 Flow: class generic arguments are not supported properly
Performance WEB-35280 High memory usage while working with JS
Performance WEB-35390 2018.3 EAP6 crash
Performance WEB-30360 Code Analysis, Strange Lagging Bug
Usability WEB-35200 Unclosed comment ending with a new line is not highlighted with underwave
Usability WEB-34273 Changed colors of Monokai scheme in 2018
Usability WEB-34937 Very hard to type spread operator (...)
Usability WEB-34719 Autocomplete for `function` not working in some cases
Usability WEB-33854 Generate 'switch' cases action improvements
Cosmetics WEB-35075 Change merged gutter icons (they were replaced recently, and now the merged option doesn't look nice)
Task WEB-35079 Infer primitive type facts from initializer for javascript
Task WEB-34965 Merge "Unsound" inspections for typescript and javascript
Exception WEB-35047 periodic PsiInvalidElementAccessException when editing js
Exception WEB-35416 IllegalStateException: Calling invokeAndWait from read-action leads to possible deadlock
Exception WEB-35658 IllegalArgumentException: Argument for @NotNull parameter 'element'
JavaScript. FormatterFeature WEB-34976 Add option to align Typescript union/intersection Types
Feature WEB-7308 reformating JS else statment not in right position
Feature WEB-13488 JavaScript code style settings: Spaces within array literal
Feature WEB-32566 Formatting should adjust spaces in template string arguments
Feature WEB-28679 Add an option to treat lambda fields as methods when rearranging code
Bug WEB-34052 Exception when rearranging code
Bug WEB-34954 No alignment for Angular HTML attribute
Bug WEB-34535 The short React fragment syntax is reformatted differently than the longer one
Bug WEB-33844 TypeScript auto import corrupts existing imports when ES6 import/export 'Align "from" clauses' option also reformats code
Bug WEB-33625 Formatting for TSX tag generics
Bug WEB-35220 Wrong alignment of html attributes when [] are used
Bug WEB-17899 Braces for JavaScript Switch statement ignore "Brace Placement -> Other -> Next Line Shifted" setting
Bug WEB-34726 No option to set code style (JavaScript) for unary word operators
Bug WEB-33968 Formatting moves block comments to new line
Bug WEB-35501 No indent on a new line after if after line without semicolon
Bug WEB-34770 Newlines between opening brace and comment not removed
Bug WEB-35074 JSX state object misaligned
JavaScript. FrameworksFeature WEB-20676 AngularJS: 'controllerAs' reference is not resolved in templates
Feature WEB-35156 Language completion for script and style tags in Vue templates
Feature WEB-26886 Support controller variable for Angular 1.5 components
Feature WEB-26862 Add single step import for ES6 and TypeScript scripts in .vue files
Feature WEB-35435 Improve handling of Angular entities
Feature WEB-30064 Make 'Unwrap/Remove' work for JSX tags
Feature WEB-34828 Rename the pipe in the template
Feature WEB-32334 Vuex. Code completion is missing for store actions/states/mutations/getters
Feature WEB-30661 Angular. Provide resolve for # labels
Feature WEB-34596 Vuetify v-icon. add completion for icon names
Feature WEB-34798 Find usages doesn't work for Angular pipes
Feature WEB-34128 Create default run configuration for Vue.js app
Feature WEB-27290 Feature Request: more options creating Angular Cli project
Feature WEB-32549 Highlight unresolved references in JSX
Feature WEB-33489 Vuejs rename component name
Feature WEB-29412 Support resolve/completion for default angular pipes
Feature WEB-33912 Suggest webpack.config.ts files in settings
Bug WEB-34862 Angular: exception if ngFor contains duplicated keys
Bug WEB-23647 React: provide autocomplete for standard methods
Bug WEB-35716 Fix Vuetify 1.3.4 components
Bug WEB-34081 Highlight usages in file for Angular template reference variables
Bug WEB-34818 TypeScript: "Cannot resolve symbol" in .vue file but works fine in .ts file
Bug WEB-34522 WebStorm Angular "unused property myVar" on setter function even if its used for binding in template
Bug WEB-28405 closure library - code completion for 'goog.provide' symbols inside 'goog.module' is not working
Bug WEB-35670 @vue/cli project creation can't be finished
Bug WEB-23606 Angular2/Typescript properties created via private in constructor not recognized in templates
Bug WEB-35055 NPE in Angular2LangUtil.isAngular2ContextDir
Bug WEB-35297 Project template dropdown should be disabled when creating vue application via @vue/cli3
Bug WEB-34958 assert: JSTypeSerializer$NULLABLE_TYPE_SERIALIZER$.write
Bug WEB-34269 Type hierarchy not working for Google Closure classes in different namespaces
Bug WEB-33818 Handle TSX type context when converting class component to functional
Bug WEB-34857 Angular: support type evaluation of template references which bind to directives
Bug WEB-31647 Angular: no completion/resolving for custom directive bindings
Bug WEB-34899 Exclude build folder for CRA projects
Bug WEB-27467 Go to definition does not work for Angular 'async' pipe
Bug WEB-27731 parsing html in angular 2 template
Bug WEB-34911 Angular. Go to definition is broken in template when intermediate folder contains package.json
Bug WEB-35317 Space is removed before some attributes in Angular template
Bug WEB-35361 vue and blade conflict
Bug WEB-29827 Angular Material: material table structural directives are not recognized when using asterisk notation
Bug WEB-32886 Vuetify 1.1 typescript components not resolved
Bug WEB-31285 Unnecessary code completion within JSX tags (without braces)
Bug WEB-34703 Closing brackets are not colored in orange
Bug WEB-34471 Optionally add `.vue` extension when auto-importing Vue components
Bug WEB-33446 `@ViewChild()` decorator. Support find usages/rename
Bug WEB-34352 Angular: property with `$` name suffix is detected as "unused" when it's used with "async" pipe
Bug WEB-34079 Find usages for Angular template reference variables
Bug WEB-34076 Create default run configurations for React project (npm start, debug)
Bug WEB-34733 IDE refuses to render the file after some typings
Bug WEB-35672 Angular Material - Attribute dataSource is not allowed here
Bug WEB-34080 Rename for Angular template reference variables
Bug WEB-27337 Webpack: Not existing config file is chosen in settings
Bug WEB-22168 Angular2: no completion for component properties in non-inline templates if file names are different
Bug WEB-34732 "Invalid" word in the completion list in the angular template
Bug WEB-32129 Angular: `ng-zorro-antd` directives not resolved
Usability WEB-35481 Disable "Missing React import with JSX" inspection for .vue files
Task WEB-34873 Disable XML refactorings for everything other than XML
Exception WEB-35485 Throwable: Invalid file name 'package.json' - unsupported extension: json
Exception WEB-34842 @NotNull method com/intellij/lang/javascript/frameworks/react/ReactXmlExtension.getElementForResolve must not return null
JavaScript. InspectionsFeature WEB-34117 if (a = b) is not a warning
Feature WEB-34980 TypeScript and JavaScript: base nullability control flow analysis
Feature WEB-25768 support vuex mapGetters helper
Bug WEB-35461 Inspections: "Missing required 'alt' attribute" gives false positive in the Vue.js files
Bug WEB-35399 Incorrect inspection "Consecutive commas in array literal" in destructuring assignment
Bug WEB-35526 Typescript - wrong "remove unnecessary parentheses" warning
Bug WEB-35179 Rider suggests broken code fix.
Bug WEB-33846 Incorrect mismatched query and update of collection with JSX
Bug WEB-35426 < > are escaped in Flow when apply inspection
Bug WEB-34278 Object Shorthand Methods es6 syntax does not show as error in Webstorm when in Javascript language version set below 6.
Bug WEB-33833 False warning about type coercion with `!=` and `typeof`
Bug WEB-34384 JavaScript Redundant Local Variable inspection false positives on compound assignment
Cosmetics WEB-34829 Missing module inspection: show npm install quick fix first
JavaScript. RefactoringFeature WEB-12768 Convert function to method(variable holding function expression or arrow function) and vice versa
Feature WEB-35341 'Convert to named function' intention should work for arrow functions assigned to class fields
Feature WEB-33090 Move symbol from files without import/export
Bug WEB-29572 JavaScript "Convert to named function" intentions drops JSDoc comment
Bug WEB-35503 Typescript arrow function signature refactor loose types
Bug WEB-33986 'Replace ?: with if-else' intention should not be shown for const values
Bug WEB-35149 'Convert function to variable holding arrow/ function expression' should check and declare 'const' var if possible
Bug WEB-35543 Decorators changes their order after refactoring its method
Bug WEB-33831 'Move ES6 module member' shows error dialog if non-module file references moved element
Bug WEB-32734 Rename for class and file together should always search for the file references
Bug WEB-34717 'Inline local variable' when invoked as fix shouldn't show confirmation dialog
Bug WEB-34145 Field prefix is placed after renaming an interface member
Bug WEB-33646 Extract type alias should produce generic type if selection references generics
Bug WEB-34720 Refactoring "Inline function" should be aware of context when inlining async function
Bug WEB-34653 Click in conflicts view in 'Move module member' refactoring navigates to moved member, should navigate to usage
Usability WEB-34440 inline constant refactoring should default to removing the constant
Usability WEB-34109 [Javascript] Move refactoring triggered is not triggered when caret is at start or end of element
Exception WEB-34218 Changing signature of method in agular templates produces the exception
LESSBug WEB-34030 Less variable should be highlighted if cursor is before "@"
LintersFeature WEB-25014 Feature: TSLint: provide appropriate suppress actions
Feature WEB-25697 ESLint / TSLint does not respect Editor Inspection severity level color formatting
Feature WEB-29829 Add ability to use ESLint in TypeScript files without eslint-plugin-typescript
Feature WEB-34034 ESLint should have a 'Fix current error only' quick fix
Bug WEB-31134 ESLint: eslint-disable-next-line generated in wrong positions
Bug WEB-34634 JSHint: update the bundled version to 2.9.6
Bug WEB-29400 ESLint: do not import rules from the ESLint config in case the Standard linter is defined in the project
Bug WEB-30174 Standard code style suppression comments the line
Bug WEB-33883 .eslintignore lookup should not go outside of project
Bug WEB-33897 ESLint --ignore-pattern is not working if file .eslintignore is not exists
Bug WEB-32103 'Suppress' action for ESLint inspection sometimes generates invalid comments
Bug WEB-33619 ESLint: 'Suppress for file' action is shown twice
Bug WEB-22548 ESLint: use the severity specified in .eslintrc for offline inspections
Bug WEB-34689 Bundled tslint-schema.json has to be updated
Bug WEB-26709 ESLint/Standard: JSX content is not suppressed correctly
Bug WEB-33918 ESLint: Don't show quick fix for non-fixable linter rules
Bug WEB-31449 Stylelint error when file is in .stylelintignore
Usability WEB-31204 Add option to disable "Undo Reload From Disk?" after running 'Fix ESLint Problems'
Task WEB-34986 Update JavaScript Standard Code Style rules according to Standard 12
Live EditBug WEB-32345 Live Edit not working when <noscript> <header> <footer> tags combination is present
Bug WEB-34876 New content is shown only after moving to the new line after the tag
Bug WEB-34789 Live edit ignores changes in .html
Bug WEB-22518 LiveEdit ignores some changes in html
Bug WEB-33214 Support Live Edit without Chrome extension
Bug WEB-35736 'Elements' tab is empty when debug HTML
Node.jsFeature WEB-34226 Use NODE_OPTIONS for Node.js debugging
Feature WEB-33571 Add node_modules/.bin folder to PATH in Terminal for current project
Feature WEB-35143 Allow to use @types/node for Node.js coding assistance
Feature WEB-29975 Feature: completion for previous versions of npm packages in package.json
Feature WEB-35204 TypeScript: enable "navigate to source" for node core libraries
Bug WEB-33931 runnerw.exe cannot run Node.js script with WSL bash.exe
Bug WEB-22911 Node Remote Interpreter: Docker: "Stop" button should be in sync with remote server
Bug WEB-35462 Folder node_modules is not marked as library root if Data Source configured
Bug WEB-35496 Cannot enable Node.js coding assistance with IPv6 enabled
Bug WEB-34814 Detect npm package for Debian and Ubuntu based Linux distributions from the official repo
Bug WEB-35528 Can't run vue-cli-service scripts from @vue/cli project
Bug WEB-35412 Can't resolve app.use in express project
Bug WEB-35413 Stepping resumes execution after pause on first breakpoint
Bug WEB-34413 Detect all node_modules as libraries on startup
Bug WEB-34602 @Vue package is not resolved in the node.js package list
Bug WEB-35594 Can't enable Code assistance for Node.js if there mappings for 127.0.0.1 in /etc/hosts
Bug WEB-34791 'install and add to devDependencies' quick fix adds library to 'dependencies' (yarn specific)
Performance WEB-34416 Do not index symlinks inside node_modules targeting files inside project
Usability WEB-35031 Do not auto-exclude `dist` within node module folder if there are `module` or `esnext` keys referencing files from `dist`
Usability WEB-35568 WSL: ExecutionException when try to debug with incorrect interpreter
Product DocumentationBug WEB-33168 Move module members has no help
SASSFeature WEB-6006 Would like formatting options for SCSS
Feature WEB-20279 Better code style for .scss .sass files
Bug WEB-33505 SCSS code formatting breaks with nested namespaces
Bug WEB-35182 File Watchers: update default sass command
TypeScriptFeature WEB-33448 Intention actions to convert TypeScript parameter-property to field and back
Feature WEB-32271 Inspection for tsconfig.json
Feature WEB-35377 Support non-unit types in union discriminants (TS 3.2)
Feature WEB-34455 Support TS 3.1 mapped type changes
Feature WEB-34456 Support TS 3.1 property assignments in JS-like style
Feature WEB-35052 Support TS 3.2 callable/bindable functions
Feature WEB-34476 Merge multiple gutter icons for implementations into one
Bug WEB-35277 Private methods should not be in the completion list for inherited classes
Bug WEB-35549 Typescript formatter fails on object construction with cast
Bug WEB-25990 TypeScript: Contents of collection are updated but never queried (destructuring case)
Bug WEB-34622 TypeScript interface field renaming refactoring is ignored with object literals in anonymous functions
Bug WEB-35240 Add Import statement: missing "from" keyword when import path is already there
Bug WEB-35078 Wrong typeof check if the original type of value is 'any'
Bug WEB-35030 Wrong Redundant typeof check for nullable variables
Bug WEB-33285 Spread of 'any'/'unknown' should result in 'any'/'unknown'
Bug WEB-35125 StackOverflowError at JSTypeEvaluator.addTypeFromElementResolveResult()
Bug WEB-35178 Typescript: generate constructor omits optional parameter specifier when used with React
Bug WEB-30796 path completion in import doesn't work when using path mappings
Bug WEB-35410 "Make private/protected" intention should not be available for the parameters in the arrow functions
Bug WEB-34587 False positive "Abstract class constructor can be made protected"
Bug WEB-32021 Spell Checking Bug in object property names
Bug WEB-33907 Intellij highlights variable that has same name as other method as unused even when it was used in Angular template
Bug WEB-34100 False positive JSMismatchedCollectionQueryUpdate for object literal
Bug WEB-35345 TypeScript getter and setter generation should honor the "Use 'public' modifier" setting
Bug WEB-35505 Typescript "arrow to named function" prepend "public" modifier inside module
Bug WEB-34924 [VUEJS] tsconfig.json ignores by IDE
Bug WEB-33585 Remove "Make can be static" inspection for angular classes if they are used in html template
Bug WEB-34516 Autocomplete reporting incorrect type with mapped types
Bug WEB-29799 tsconfig.json paths don't work with Vue .vue single file components
Bug WEB-35523 Cannot generate props when contextually typed by an object literal.
Bug WEB-33572 Support ES2018 regexp features in TypeScript
Bug WEB-34463 "Cannot read property 'CommandTypes' of undefined" when starting angular service with non-bundled typescript 3.0.1
Bug WEB-35181 Unneeded 'Invalid instanceof check' warning when strictNullChecks enabled
Bug WEB-35278 Convert to field holding arrow function generates redundant access modifier
Bug WEB-35263 Typescript. Go to declaration broken for the field of union type.
Bug WEB-35459 Typescript exports not resolved for imports completion
Bug WEB-35252 Code completion for overrides shouldn't insert 'super.' when base type is an interface
Bug WEB-31543 vue-mixin-decorator doesn't work in Vue files with TypeScript
Bug WEB-35474 StackOverflowError on types resolving
Bug WEB-35254 Code completion for overrides should properly handle access modifiers
Bug WEB-34878 Red icon is shown on the TypeScript tool window name when there's no errors
Bug WEB-34554 Wrong tsx syntax inspection when comment has tag
Bug WEB-34663 Typescript: convert parameters to use object initializer - removes the optionals
Bug WEB-35551 Import are marked as error when overriding baseUrl in child config
Bug WEB-34945 Typescript: Invalid guard result for Map.
Bug WEB-34912 "Complete Current Statement" on "for .. of" loop breaks code
Bug WEB-35329 Improve suggestion Typescript Extract, Exclude types
Bug WEB-35400 Incorrect behaviour of "pull member up" refactoring on a method with a decorator
Bug WEB-35446 JSX Generics are not parsed when tag name is namespaced
Performance WEB-34174 IDE gets frozen on switching to another app and back
Usability WEB-34564 Parameter hints: not clear how to configure for TypeScript
Task WEB-35080 Update bundled TypeScript to 3.1
Task WEB-35105 TypeScript: check limit for completion result (for avoiding processing extra-elements)
Exception WEB-35567 Exception while disposing TypeScript service
Unit TestsFeature WEB-34691 Upload and display Jest coverage report in the IDE
Feature WEB-34119 Navigate to source at failure for failed tests (Karma, Jest, Mocha)
Feature WEB-33201 Rerun failed protractor tests
Feature WEB-35177 Single suite / test run with Protractor
Feature WEB-35142 Single test file run with Protractor
Feature WEB-24245 Ability to specify suite name when running protractor tests
Feature WEB-34826 Support running Jest with angular-cli
Bug WEB-34583 Cannot run karma tests from WebStorm because of invalid concatenation of paths to intellij.conf.js
Bug WEB-35512 Running Jest tests broken with Jest 24 alpha
Bug WEB-34651 Karma: re-run failed tests runs passed tests also
Bug WEB-34908 Jump to source for failed tests does NOT take me to the failure line
Bug WEB-35242 running tests assumes Jest supports --runTestsByPath
Bug WEB-35553 Jest RC: set working directory to the closest directory with jest.config.js or package.json
Bug WEB-34073 Mark tests in 'e2e' folder as protractor tests
Bug WEB-35083 @angular/cli: Karma tests are wrongly run by jest
Bug WEB-35484 Navigate to source at failure fails on 'test'
Bug WEB-31143 Jest package is set incorrectly if there are two node_modules folders in a project
Bug WEB-1699 Structure view shows nothing for JS test file
Bug WEB-34181 Karma: make it possible to run test file with multiple top level suites
Bug WEB-34734 Cannot run Jest unit tests with @vue/cli-service
Usability WEB-28401 Add --env=jsdom to Jest configuration in apps created with create-react-app
Usability WEB-35273 When changing run configuration for Jest tests, don't clear out file choice
Usability WEB-28498 "Mocha package" field does not persist for my shared Run Configurations
Usability WEB-34429 Jest test ran as file should be invoked directly
spy-jsBug WEB-33832 Spy-js for Node.js cannot be started on Node 9.11.0+
Bug WEB-34527 "Next call" not recognized as disabled until I arrow-down over them, toggling "filter disabled" won't make them disappear
  • No labels