• [PyCharm IDE]
 
Skip to end of metadata
Go to start of metadata
No subsystemBug PY-47247 Package's submodules and subpackages are not suggested in completion for not imported qualified names
Bug PY-47304 pytest.mark disappears from variants of completion for not imported qualified names
Code InsightFeature PY-44026 Automatically import modules and packages when completing their attributes
Feature PY-46321 Markdown: Add Python REPL (doctest) code fence
Feature PY-46668 Support matching all parameters with arguments in code completion
Bug PY-47307 Don't insert dot "." after completing not imported module name
Bug PY-47281 Fuzzy completion of not imported qualified names suggests definitions from internal modules (starting from underscore)
Bug PY-45368 "None" type isn't displayed in code completion inside function annotations / type hints
Bug PY-47905 Completion for module names and their attributes doesn't work properly in Python Console
Bug PY-46054 "from ... import ..." suggest irrelevant imports in case of same directory import
Bug PY-47253 Completion by fuzzy matching of transitive attributes should be disabled for known package aliases
Bug PY-46355 No completion for xml.dom.minidom
Bug PY-46229 No completion for "ast" classes
Bug PY-44548 Unresolved reference 'RawArray'
Bug PY-45206 Non-deterministic type inference for recursive instance attributes
Bug PY-48166 numpy 1.20.x stubs are breaking PyCharm code insight
Bug PY-46056 Import completion hint is inconsistent with the actual resolve
Usability PY-43889 Suggest "main" live template only when typed in the global scope at the beginning of the line
Task PY-48008 Pattern Matching: Parser, PSI, highlighting
Exception PY-46983 s.models.ZipBasedModelProvider - Failed to load model empty_module#python-names:empty_module:1.0.0
ConsoleBug PY-46500 Console opens two empty consoles after one was closed.
Usability PY-38421 Python Console displays "this view is read only" when attempting to paste in code
Cosmetics PY-47974 Single string literal in the Python console is highlighted as a docstring, not as a regular string
DebuggerUsability PY-48865 Can't attach to a Python process while indexing
DjangoBug PY-39831 Diagrams > Show Diagram > Django Model Dependency Diagram does not show
DockerBug PY-42932 Slow entrypoint results in premature timeout debugging with docker-compose-based interpreter
EditingBug PY-41312 Inconsistent "Move statement" behavior when applied to multiple statements
Exception PY-41375 Move Statement Up copies part of the moved block with exception
Exception PY-46178 Auto-conversion to f-string doesn't work in the middle of an URL
FormatterFeature PY-33060 Wrapping settings for function call arguments
IDEBug PY-39134 2 Resources in Project structure in PyCharm
Bug PY-46055 main.py welcome script is created for temporary single-file-projects
Bug PY-47795 Undo causes host to freeze - exception is Shared Indexes
Bug PY-46279 "Template Language Not Configured" popup doesn't lead to the corresponding settings page
Bug PY-12988 Pycharm does not use virtualenv pep8 for git-hooks
Bug PY-47697 main.py is opened instead of a given file on macOS from the welcome screen
Bug PY-48969 Go to file feature within the Productivity guide is not showing the correct information
Performance PY-48284 IDE incredibly laggy and slow for python files
InspectionsFeature PY-19917 Support "type: ignore" comments from PEP 484
Bug PY-45438 Support type hinting with callback protocols
Bug PY-46755 Duplicate Detection Highlight do not disappear
Bug PY-33265 Call to __init__ of super class is missed
Bug PY-48948 sys.stdlib_module_names is unresolved
Bug PY-48958 sys.orig_argv is unresolved
Bug PY-39262 False positive "Local variable might be used before assignment" when using assignment expression as part of and expression
Bug PY-39762 Unexpected arguments on logging.basicConfig
Exception PY-47435 java.lang.Throwable: Synchronous execution under ReadAction
Interpreters SettingsBug PY-47913 Code in VirtualEnvSdkFlavor.getDefaultLocation() leads to prompts about accessing Documents and other folders in Big Sur
Usability PY-45384 Suggest creating WSL-based interpreter after opening a project in \\wsl$
Jupyter NotebookBug PY-45112 Jupyter output view fails to update after a period of inactivity (probably after computer sleep)
Bug PY-47721 Debugger stops working after session interruption in external function
PackagingBug PY-34444 IDE fails to show the packages list after proxy configuration: MalformedJsonException
Exception PY-47789 Python Packages: clicking on packages in remote interpreter causes NPE
RefactoringBug PY-31369 Don't suggest "Add type hints for function .." and replace existing when function already has them
Bug PY-20675 Problem while renaming element in Inspection Results
Bug PY-47633 Pull Up/Pull Down does not insert necessary imports for complex properties
Exception PY-37765 Exception moving statement up
Exception PY-46099 "Extract Superclass" fails if the method contain a class initialization and its method invocation
Remote InterpretersBug PY-33397 PyCharm sets multiple deployment configurations as default
Bug PY-17352 Can't add remote interpreter for ipv6-only host
Usability PY-33981 PyCharm doesn't switch default deployment configuration
RestructuredTextBug PY-31110 Sphinx: "System Message: ERROR/3"
Scientific ViewBug PY-42673 Incorrect timezone information when displaying pandas DataFrame containing pd.Timestamp
Bug PY-47710 "Open in Editor Tab" in DataView produces exception
BuildFeature IDEA-263998 Show warning if gradle script uses gradle-bintray-plugin
Bug IDEA-264085 BindException: Cannot assign requested address error When trying to build any project on WSL 1
Cosmetics IDEA-269775 Maven: fix typo in the 'maven build scripts found' notification
Cosmetics IDEA-245204 Build tools: Maven/Gradle panel is opened after new project creation
Build. AntBug IDEA-269426 Ant plugin breaks IDE actions: "InvalidPathException: Illegal char <:> at index" error is thrown on com.intellij.lang.ant.dom.CustomAntElementsRegistry.collectUrls
Bug IDEA-266760 Cant perform ant tasks on WSL2
Build. Built-in (JPS)Feature IDEA-161641 Ability to produce JLink artefacts
Bug IDEA-266240 Build of a maven multi module project is broken
Bug IDEA-261683 Class containing lambda is not recompiled when corresponding SAM interface is changed
Bug IDEA-268372 External javac uses two different protobuf library versions due to "3rd-party.jar"
Bug IDEA-264138 NullPointerException on "Build Project" after upgrading to 2020.3.2
Bug IDEA-260359 WSL: All files are up-to-date when compiling modified project
Bug IDEA-263109 Marking method as "default" in Java SAM interface doesn't affect Java dependencies
Task IDEA-269422 Upgrade error-prone plugin to use error-prone 2.7.1
Task IDEA-266192 Upgrade error-prone plugin to use error-prone 2.6.0
Exception IDEA-262403 REWA at com.intellij.openapi.application.impl.ApplicationImpl.assertIsDispatchThread
Build. GradleFeature IDEA-264960 Show warning if Gradle script uses JCenter to resolve artifacts
Feature IDEA-235720 Support Gradle integration for projects in WSL2
Feature IDEA-265954 Don't allow to create Gradle project with unsupported JDK 16
Bug IDEA-264439 Gradle project on WSL: error message in the case of using the JDK located on Windows
Bug IDEA-249123 Android Studio 4.1 RC 1 UI freezes
Bug IDEA-266228 Test task classpath evaluated too early
Bug IDEA-265721 Gradle reload with a project containing a buildSrc directory fails if project is located in WSL2
Bug IDEA-261818 Cannot debug code in the gradle custom test sourceset if its name contains hyphens
Bug IDEA-264051 The specified Gradle installation directory '\\wsl$\Ubuntu-20.04\wsl$\Ubuntu-20.04\wsl$\Ubuntu-20.04\wsl$\Ubuntu-20.04\wsl$\Ubuntu-20.04\wsl$ ...
Bug IDEA-266429 Run icons default to run with Gradle although "Choose per test" is configured
Bug IDEA-263627 build.gradle file autosaves at every key stroke and cursors then jumps to a different position in file while you are still typing.
Bug IDEA-263777 Intellij Idea 2021.1 Beta (ideaIU-211.6305.21) WSL 2 gradle run does not stop when pressing stop button.
Bug IDEA-197469 Can't read resource files in Gradle Java 9+ project with module-info.java
Bug IDEA-266355 It is not fully supported to define distributionSha256Sum in gradle/wrapper/gradle-wrapper.properties in Idea
Bug IDEA-264107 Gradle groovy scripts debugging doesn't work for projects on WSL
Bug IDEA-269333 New JavaFX Project wizard: the Java+Gradle projects created by wizard fail to run
Bug IDEA-264336 Support using of Gradle installed on target environment
Bug IDEA-263776 Intellij Idea 2021.1 Beta (ideaIU-211.6305.21) WSL 2 gradle execution does not pass environment variables from Run Configuration when run is delegated to Gradle
Bug IDEA-263670 Gradle file syntax may be wrong or missing for projects on WSL2
Bug IDEA-254884 Tests not compatible with gradle configuration cache
Bug IDEA-262879 Gradle project sync never completes
Bug IDEA-175014 Rerun failed tests does not work with gradle test runner
Bug IDEA-263512 Failed creation of a Gradle project on WSL2
Performance IDEA-268201 Importing from Gradle may take a lot of time if many modules are unlinked
Usability IDEA-265953 Expand quckfix for gradle 7.0 and JDK 16
Usability IDEA-263144 Double confirmation when opening a new Gradle project and not trusting it
Usability IDEA-265203 Gradle run configuration might not use project dir as working directory for a task
Usability IDEA-260728 Gradle init script is not configuration cache compatible
Exception IDEA-266424 ClassNotFoundException: org.jetbrains.plugins.gradle.frameworkSupport.GradleFrameworkSupportProvider PluginClassLoader(plugin=PluginDescriptor(name=Java EE: Gradle Integration, id=com.intellij.javaee.gradle
Build. MavenFeature IDEA-205178 Support .mvn/jvm.config for defining JVM configuration for Maven builds
Feature IDEA-266750 IDE does not read settings.xml from maven 3.8.1
Bug IDEA-266058 Maven multi-module project: IDE creates many java child processes during indexing until the system runs out of memory and IDEA shuts down
Bug IDEA-246963 java.lang.RuntimeException: Cannot start maven service when incorrect JVM options are passed to IDE Maven process
Bug IDEA-261964 Maven run configuration creation is failed with NPE
Bug IDEA-267892 Maven project settings reset to defaults after adding new maven module
Bug IDEA-261679 WSL: Incorrect work with Maven projects that have space characters in their path
Bug IDEA-256694 Maven: exception on reimport OrderEntry LibraryDependency does not belong to modifiableRootModel
Bug IDEA-261462 Incorrect quick fix suggested to update Java Language Level in pom.xml
Bug IDEA-268495 NoSuchMethodError: ModelBuildingRequest.setRawModel() on 'Load Maven Changes' after update IDEA to 2021.1.1 when using local Maven installation
Bug IDEA-255594 Intellij keeps old dependencies
Bug IDEA-261414 Maven distribution installed via package manager does not supported on WSL
Bug IDEA-263481 java.lang.ClassNotFoundException: org.jetbrains.idea.maven.server.RemoteMavenServer36 when trying to open maven project located in WSL
Bug IDEA-262404 Can't import Maven Project in 212.17, Project is untrusted
Bug IDEA-169034 File paths are not clickable in the Maven tool output
Bug IDEA-201496 Maven: support maven.compiler.parameters property
Bug IDEA-266290 myWslDistribution.wslIp must not be null: Unable to find maven project for working directory specified in Maven configuration in WSL2
Usability IDEA-258602 Maven Dependencies not imported in 2020.2.4 because of the pom syntax issue with the 'version' property which is not shown in pom editor but only in log
Cosmetics IDEA-263855 Typos in preferences
Exception IDEA-267246 Throwable at com.intellij.workspaceModel.ide.impl.legacyBridge.module.roots.ModifiableRootModelBridgeImpl.removeO rderEntry
Build. Package SearchBug IDEA-265947 Prevent creating malformed URLs in PackageSearchService
Code Analysis. DependenciesFeature IDEA-194774 Analyze dataflow: track through Collections.unmodifiableList
Bug IDEA-268120 Inconsistent and wrong error from PWA
Bug IDEA-268417 PWA doens't properly work in power save mode
Bug IDEA-268414 Different number of errors from highlighting and PWA
Bug IDEA-268854 Java files in resources are processed by PWA
Bug IDEA-268859 PWA doesn't properly handle deletion of the folder
Bug IDEA-265832 com.intellij.testFramework.LightVirtualFile cannot be cast to class com.intellij.openapi.vfs.VirtualFileWithId
Bug IDEA-166964 'Group by nullness' button opens 'grouped by value' tab as well
Bug IDEA-268687 Included sources are not processed by PWA
Bug IDEA-154777 'Analyze data flow from here' on parameter from overriding method shows usages of parameter in the base method
Bug IDEA-268798 Unknown constructor error reported only once per file
Bug IDEA-269770 Throwable: Read access is allowed from inside read-action ... at com.intellij.analysis.pwa.analyser.PwaServiceImpl.
Bug IDEA-269673 Annotation problems are not detected by PWA
Bug IDEA-268133 Do not start PWA during editing
Code Analysis. DuplicatesBug IDEA-219100 "Duplicate code fragment" reported for symlinked files
Usability IDEA-260645 Duplicate finder sometime doesn't show file paths
Code Analysis. InspectionFeature IDEA-260954 Add option to highlight ambiguous elements in inspection "Java | Visibility | Access of inherited field looks like access of element in surrounding code"
Feature IDEA-207545 Convert `TestFailedLineInspection` to Uast
Feature IDEA-237242 "Unstable API Usage" inspection should work for sources as well as libraries
Bug IDEA-267847 Scoped inspection configuration is left in inspection profile XML upon scope deletion but not shown in the UI
Bug IDEA-192702 Clicking Edit Settings in Insepction Results does nothing
Bug IDEA-230802 Guava Verify.verifyNotNull receives incorrect inferred @Contract annotation
Bug IDEA-265304 "HTTP links are not secure" inspection in `xmlns` schema declaration
Bug IDEA-130333 Inspection settings: scopes order is not saved
Bug IDEA-261916 JetBrains analysis annotations do not work on annotation methods
Usability IDEA-259519 "No suspicious code found.. in <scope>" message is misleading
Usability IDEA-141260 Analyze Dataflow should have Expand-/Collapse-Buttons
Cosmetics IDEA-267115 Fix "hybrid" lists layout in inspections
Task IDEA-260048 Show Inspections results in Problems tool window
Code Analysis. Language InjectionFeature IDEA-214466 temporal language injection should support multi-line string literals with margins (Scala, Kotlin)
Bug IDEA-223039 Throwable when tab in text block injected as a language.
Bug IDEA-265653 Ctrl-F1 ('Show error description') doesn't work inside injected fragments
Code Analysis. Structural SearchFeature IDEA-265528 Support searching for java 16 records
Bug IDEA-266074 Improve switching between search and replace
Bug IDEA-259948 SSR inspection: false positives when the template language is not available
Bug IDEA-269555 Select sensible scope when opening structural search dialog
Bug IDEA-264212 Setting a different search target should not require setting count filter
Bug IDEA-265535 Support searching for Java 16 pattern matching
Bug IDEA-198425 New SSR: mnemonic for Search target doesn't work
Bug IDEA-263967 Filters shouldn't immediately disappear when they have a default value
CoreFeature IDEA-267076 Collect the "jbr_err" files when using the "Collect Logs and Diagnostic Data" action
Bug IDEA-258519 IDE fails to open a project from the command line if another project is already opened (perhaps Windows-only)
Bug IDEA-262426 com.intellij.serviceContainer.AlreadyDisposedException in EditorGutterComponentImpl
Bug IDEA-263296 Call all not-dumbaware EditorTabColorProvider instances just after indexes are built to update editor tabs background colors
Bug IDEA-261794 Throwing `ControlFlowException` on AWT thread may cause `AWT-EventQueue-0` to die and freezes the IDE's `AWT-EventQueue-1` thread
Bug IDEA-268140 IDEA fails to start, stuck at splash screen
Bug IDEA-268536 Throwable: Attempt to load key 'linux.row.height.disabled' for not yet loaded registry
Bug IDEA-269348 ImmediatePainterTest fails
Bug IDEA-270202 Background Process Indicator may remain visible after process finishes
Usability IDEA-229543 Command-line launcher should not ask which window it's supposed to open the project in
Exception IDEA-267034 Cannot init component state (componentName=FileTypeManager, componentClass=FileTypeManagerImpl)
Core. DebuggerBug IDEA-263683 Mouse cursor stuck as 'hand' symbol instead of the normal 'insert' in editor pane
Bug IDEA-266021 Alt+hover blinking on mouse move
Bug IDEA-260695 Inline values in debugger are shown in comments
Bug IDEA-262878 Click on toolbar button "Evaluate expression" no longer uses editor selected text
Bug IDEA-267725 There's no 'Layout Settings' action on toolbar in debugger TW
Bug IDEA-260478 Evaluate expression popup opens too small
Bug IDEA-263014 XLightBreakpointPropertiesPanel#myCustomPropertiesPanelWrapper uses wrong layout
Performance IDEA-262527 ValueLookupManager.showHint
Usability IDEA-269145 Debugger: Selection in frames view always rendered as focused
Usability IDEA-269151 Debugger: Make toolwindow more keyboard-friendly
Exception IDEA-264412 Cannot init component state (componentName=XDebuggerManager, componentClass=XDebuggerManagerImpl) [Plugin: com.intellij]
Core. DiagramsBug IDEA-264679 JSF Navigation diagram: no layout on diagram opening
Bug IDEA-263868 Spring Diagrams: with `Show neighbours of the selected nodes` option the results of selection change is ugly (no layout)
Bug IDEA-263877 Spring Application Context Dependencies Diagram: on Show Library Models action the layout is not applied
Bug IDEA-265035 UML diagrams: Kotlin: tooltip over package item shows wrong statistics
Bug IDEA-264695 CDI Dependencies diagram action appears outside the Diagrams menu group and causes exception only
Bug IDEA-265037 UML diagrams: Kotlin: constructor is shown for object
Bug IDEA-263119 JPA: ER Diagram opened not centered
Bug IDEA-263112 JPA: ER Diagram is not refreshed after adding the attribute
Bug IDEA-264690 Spring Beans toolwindow: the beans graphs appear without layout
Bug IDEA-264029 UML diagrams fonts are too big in 2021.1 Beta when comparing with 2020.3.2
Bug IDEA-264684 JSF Navigation diagram: on unchecking the ShowSelectedNodesWithDependencies the resulted diagram layout is incorrect
Bug IDEA-264697 CDI Dependencies diagram is always empty
Bug IDEA-211984 UML Diagrams: any action performed from diagram can't be Undone though Undo is shown enabled with correct last action name
Bug IDEA-264693 Java Enterprise toolwindow: CDI Dependencies diagram is opened without layout
Usability IDEA-264691 Add the ApplyCurrentLayout action to the context menu for the toolbar-less diagrams
Exception IDEA-264067 NPE at com.intellij.uml.java.dependency.JavaClassDependencyAnalyzer$MyDependencyCollectingVisitor.isCollect ion
Exception IDEA-263255 NPE at com.intellij.uml.java.JavaUmlDataModel.createEdge
Exception IDEA-222077 UML diagram: attempt to add note to diagram popup causes IOOBE
Exception IDEA-263489 IAE at com.intellij.diagram.presentation.DiagramState.restoreTo
Exception IDEA-263414 Throwable at com.intellij.psi.impl.file.impl.FileManagerImpl.checkHasNoOtherPsi
Exception IDEA-263561 ISE at com.intellij.spring.perspectives.diagrams.SpringDiagramNode.getIdentifyingElement
Exception IDEA-262492 CCE at com.intellij.uml.presentation.DiagramPresentationModelImpl.getNodeTooltip
Exception IDEA-262187 Throwable at com.intellij.psi.impl.file.impl.FileManagerImpl.checkHasNoOtherPsi
Exception IDEA-263875 ICSE at com.intellij.uml.UmlFileEditorImpl.getData
Exception IDEA-264064 NPE at com.intellij.openapi.graph.impl.view.FastNodeCellRendererPainter.paintNode
Exception IDEA-264685 Throwable: Read access is allowed from event dispatch thread or inside read-action only
Core. File SystemUsability IDEA-225699 IDE attempts to access samba shares without credentials
Exception IDEA-264492 Randomly failing tests due to VFS exceptions
Core. IDE SettingsBug IDEA-261869 Choose Runtime - polishing
Bug IDEA-266090 Property 'http://javax.xml.XMLConstants/property/accessExternalDTD' is not recognized on any HTTP Client call
Bug IDEA-264344 Pressing "Get more keymaps" link inserts search to a wrong textbox
Bug IDEA-267368 Tab and Indent settings refuse to save
Bug IDEA-191665 Duplicate copyright in META-INF/services files
Bug IDEA-265112 "Override file type" action shows duplicated and irrelevant file types
Bug IDEA-261026 Nothing here in Preferences | Editor | File and Code Templates
Bug IDEA-256106 WindowsLookAndFeel is not migrated to IntelliJLaf / JetBrainsLightTheme, defaults to Darcula
Bug IDEA-230267 File Association not working for some files
Bug IDEA-201853 Can't reload encoding inside jar file when use latest idea, 2018.2
Bug IDEA-262228 Code Style Settings are messed up
Bug IDEA-264893 [Choose Runtime dialog] there is no ability to add JBR if it isn't located in ~/Library/Java/JetBrainsRuntime/ folder
Usability IDEA-189694 OOME dialog usability; memory limits validation
Usability IDEA-216847 Add Save option to Low Memory heap configuration dialog
Usability IDEA-263845 Notify a user when shell environment loading has failed
Usability IDEA-267336 Registry editing actions: Edit and Revert aren't available while IDE is indexing
Usability IDEA-259872 After IDEA update: Propose to use bundled runtime if configured runtime is older
Cosmetics IDEA-227451 Settings > Editor > Code Style > Java > Arrangement items disappear or move on mouse hover
Cosmetics IDEA-251455 Some inspections' description texts starts with an extra empty line
Exception IDEA-269559 Advanced settings exception on opening IntelliJ IDEA
Core. IDE Settings. SharingBug IDEA-269456 UnsupportedOperationException when install custom UI theme + theme isn't installed
Bug IDEA-265169 Editor color scheme keeps getting switched to Darcula
Core. IndexingFeature IDEA-269094 Project shared index metadata use relative path to repository
Feature IDEA-267922 shared index: More information in indexing diagnostic
Bug IDEA-266171 Scala plugin not working after updating to 2021.1
Bug IDEA-263200 Shared index trying to attach non-existing chunk
Bug IDEA-268788 Indexing pausing might produce deadlock
Bug IDEA-269009 Indexing progress does not change
Bug IDEA-261754 JSDetectingProjectFileScanner makes the scanning executor starve
Bug IDEA-266495 Indexing is running forever
Bug IDEA-265212 IntelliJ IDEA 2021.1 beta 4 cannot resolves JDK classes
Bug IDEA-266989 Infinite indexing triggered in all open projects after opening another project
Bug IDEA-263504 Invalidate Caches dialog: reconsider the defaults
Bug IDEA-253188 poor performance on node_modules modifications
Bug IDEA-262428 Do not show public CDN URLs
Bug IDEA-264567 shared-indexes: add permanent token auth extension
Bug IDEA-264500 VFS cache can't recover automatically after content storage corruption
Bug IDEA-265753 Indexing diagnostics: file provider names may be too long because of batching several subsequent empty providers
Bug IDEA-262899 Can't find a file using Search Everywhere/Goto File
Bug IDEA-268926 PhpFieldNamesAssignedByTheConstructorIndex is unstable
Meta Issue IDEA-266391 Find in files not finding occurrences
Exception IDEA-262319 IDEA constantly throws exception blocking class introspection
Core. InstallationFeature IDEA-165872 Delete old config and system directories after upgrade to a new major version
Bug IDEA-262571 clion.sh doesn't allow symlinks
Bug IDEA-263043 Idea fails to start from path contains spaces on linux
Bug IDEA-261720 Error updating EAP version
Bug IDEA-261321 Mac Launcher does not request Rosetta 2 to be installed, if run with x86_64-only JBR on Apple Silicon/M1
Usability IDEA-252209 Avoid broken installation on Linux when distributive is unpacked into the same folder
Usability IDEA-263364 App started from IDEA cannot access Bluetooth on macOS Big Sur
Usability IDEA-264060 2021.1 update journey is broken as it requires multiple "check for updates" to produce a fully working installation
Task IDEA-168113 Include library sources to sources zip artifact
Task IDEA-266756 Get rid of Log4J usages in updater
Core. LicensingFeature IDEA-263678 License Panel: hide Evaluate radiobutton for CWM plugin
Bug IDEA-265529 "Licenses" dialog is constantly showing up
Bug IDEA-265183 Broken license dialog UI when user has several licenses
Task IDEA-263484 Docker Desktop causes wrong host name to be sent while obtaining floating license
Core. Navigation and SearchBug IDEA-250058 Call Hierarchy tab should have a collapse all button
Bug IDEA-259137 Indexing/Search sometimes prefers a bad match compared with an exact one
Bug IDEA-203657 Method name labels in call hierarchy are wrong for nested classes
Bug IDEA-268322 Freeze when Analyze Data Flow from Here
Bug IDEA-203328 "Expand all" on call hierarchy of a recursive method never terminates
Bug IDEA-261644 "Data Flow To Here" yields no results for record constructor parameters
Core. Password ManagementBug IDEA-261634 2021.1 EAP cannot connect to KDE Wallet: NoClassDefFoundError: org/freedesktop/dbus/errors/NoReply
Core. Platform APIFeature IDEA-207237 New API for ConsoleInputFilterProvider
Bug IDEA-264030 Backgrounding progress dialogs seems to have broken between Android Studio Versions 4.1 and 4.2
Bug IDEA-264897 A race condition that leaves daemon hanging
Bug IDEA-268191 JBPopupFactory.createConfirmation always runs "No" runnable
Bug IDEA-264418 Inlays don't work well with fractional font width
Task IDEA-269551 Replacement for GotoTargetRendererProvider
Core. Plugin ManagementBug IDEA-264429 IDEA suggests updating an uninstalled plugin
Bug IDEA-253978 "File type conflict found" on every IDEA start - 3rd party plugins
Bug IDEA-256101 Can't see installed plugin, can't uninstall plugin
Bug IDEA-235321 Vagrant plugin can suggest restart on disabling
Bug IDEA-266005 Unable to use the IDEA when installing the incompatible plugin
Bug IDEA-262343 Cannot unload a plugin due to leak: ToolWindowIcon in ActivateToolWindowAction
Bug IDEA-262732 Dynamic plugin and lost settings after unload & load
Bug IDEA-268227 Fail to load language plugin
Bug IDEA-233743 Restart of IDE is suggested on uninstall/disable of incompatible dynamic plugin
Bug IDEA-215678 "Enable plugins" link in PluginsAdvertiser does not work as intended
Bug IDEA-261981 Web Services settings infinite loading
Bug IDEA-269039 Fail to load descriptor from the downloaded plugin archive
Bug IDEA-270022 java.lang.IllegalArgumentException: com.intellij.openapi.fileTypes.NativeFileType on starting the IDE with 3d party plugins
Task IDEA-173176 Use the latest version of kotlin-runtime library for build process if several plugins depends on different Kotlin versions
Exception IDEA-262837 Plugin installation failure - StackOverflowError in findPluginExtensionPointRecursive
Core. Project SettingsFeature IDEA-265700 Provide a way to specify required minimum/maximum version of Kotlin plugin for a project
Bug IDEA-267010 Converting IPR to directory based project does not convert project libraries
Bug IDEA-265821 Trusted location "~/work" is being ignored
Bug IDEA-269594 Compare Gradle and Maven projects import at old and new project models
Bug IDEA-265659 Import module from existing sources is very, very broken
Bug IDEA-269787 The Modules and Facets dialogue cannot be opened if WebServices client facet is present
Bug IDEA-265594 If version of a Maven library is changed after updating project configuration, references to classes from that library are shown as errors
Bug IDEA-265610 New Trusted Host dialog is too small
Bug IDEA-267244 New Project Model: some files in facets configurations have urls pointing to not-existing paths in <caches>/external_build_system
Bug IDEA-266792 Automatic unloading of newly added modules doesn't work if modules are added on the fly
Bug IDEA-261800 java.lang.RuntimeException: Unable to get registered settings of #VueCodeStyleSettings when trying to open Code Style settings
Bug IDEA-268321 File-based (.ipr) IDEA project convertion to the directory-based format (.idea) fails
Bug IDEA-270137 Project Structure dialog: after changing name of a module-level library it's shown as 'Empty Library'
Bug IDEA-261802 java.lang.Throwable: Can't find the language with ID Vue when disabling Vue.js plugin
Bug IDEA-265194 Allow assertConsistency only in the EAP version of IDE
Bug IDEA-257175 IJ resets content root to the incorrect directory
Bug IDEA-260372 Maven projects can't be built after disabling the (not used) dependency
Bug IDEA-267199 IDEA may automatically unload all modules if some modules were unloaded in the past
Bug IDEA-269842 Can't delete the manually added facet in the project with ExternalStorageConfigurationManager=true
Bug IDEA-99596 Manifest file located under 'main/java' root in Maven module is shown in artifact editor even if it won't be really copied to artifact
Bug IDEA-264113 Cannot change library scope second time after clicking "apply" in project structure dialog
Bug IDEA-267620 It isn't possible to change custom SDK in module to 'Project SDK'
Bug IDEA-268589 SBT project doesn't update dependencies
Bug IDEA-174113 Excluded by pattern files are still compiled
Bug IDEA-222640 Library configured via Project Structure For New Project dialog appears incorrectly in the new projects preventing new project libraries configuring
Bug IDEA-264111 Failed to save settings. java.util.NoSuchElementException: Key Maven: com.sun:tools:1.8.0 is missing in the map.
Bug IDEA-267005 Removing modules with errors fails to remove module from project
Bug IDEA-266964 IDEA fails to save settings when switching from Eclipse based module storage to iml based storage
Bug IDEA-262274 Minimize usage of VirtualFilePointerImpl replace to VrtualFileUrlBridge
Bug IDEA-265327 "Persistent ID already exists" exception on opening IDEA project
Bug IDEA-262946 New EAP prints many errors to the log about duplicating LibraryIds
Performance IDEA-265068 IDE freezes due to long RootsChangeWatcher$1.prepareChange(RootsChangeWatcher.kt:93)
Performance IDEA-265149 Slow synchronization of project model for project with many modules after opening
Usability IDEA-269817 Project Structure dialog: on new facet adding via Facets tab re-select some module in the Choose Module dialog
Usability IDEA-116209 Allow to directly specify a jar's META-INF/MANIFEST.MF file
Usability IDEA-265597 Unnecessary .idea/libraries-with-intellij-classes.xml is created when I add gradle module to a project
Usability IDEA-267205 IDEA shows incorrect message if multiple modules were automatically unloaded
Usability IDEA-268573 Shorten default name for libraries downloaded from Maven repositories
Exception IDEA-262073 java.lang.RuntimeException: Unable to get registered settings of #VueCodeStyleSettings when enabling Vue.js plugin with opened .vue file
Exception IDEA-264052 Workspace model exceptions: "AddDiffException: addDiff: persistent id already exists. Removing old entity" and others
Core. Quick DocumentationBug IDEA-266963 Font variation selection doesn't affect quick documentation component
Bug IDEA-265396 Quick Documentation renders only the first one of a repeatable annotation
Bug IDEA-268158 Cannot display some Chinese characters on Quick Documentation action
Exception IDEA-256001 jpg, svg images aren't rendered in quick doc
Core. RefactoringsBug IDEA-264381 IDEA freezes when invoking Surround with Live Template
Bug IDEA-266884 Rename refactoring should renames occurrences only inside provided scope
Usability IDEA-186088 Display some "process" when paste/delete a big folder into/from a project
Usability IDEA-268558 Preview for Move class to other package do not show package name changing
Core. Run. ConfigurationsFeature IDEA-264181 Ability to start Remote JVM Debug configuration while indexing
Bug IDEA-266062 $FilePrompt$ as working directory in run configurations not working anymore
Bug IDEA-266223 Run Configuration validation doesn't work in Run/Debug Configuration dialog
Bug IDEA-265622 [new run config UI] Mnemonic tooltips appear above another dialog opened from the RC window
Bug IDEA-267309 Fork mode is reset to "method" on reopening of run configuration screen.
Bug IDEA-261276 [new run config UI] Logs - save console output to file - impossible to hide the option if it's not empty
Bug IDEA-261930 Run configuration's working directory disappeared after setting it to an empty value
Bug IDEA-264759 [new run config UI] Field hints render incorrectly when the fields are partially available after scrolling
Bug IDEA-261259 Alternative coverage runner option disappears at reopening
Bug IDEA-266369 Don't invoke `RunManagerListener#runConfigurationAdded` with RunManagerImpl write lock
Bug IDEA-255341 [new run config UI] Logs option adding and deleting is not saved
Bug IDEA-261718 Application run configuration: inner class is prefixed with dollar and is reported invalid
Bug IDEA-252159 Run / Debug Configuration $FilePrompt$ as working directory
Bug IDEA-267203 Run context configuration shortcut (Ctrl+Shift+F10) stopped working in the Run tool window console in 2021.1
Bug IDEA-266139 Kotlin run configuration doesn't support WSL
Bug IDEA-264143 The root node is configurable in the Run/Debug Configurations dialog
Bug IDEA-264763 [new run config UI] Hotkeys intermittently don't work
Bug IDEA-261090 [new run config UI] do not show Got It tooltip for classpath in jUnit
Bug IDEA-268436 No longer possible to set temporary configurations limit
Bug IDEA-264202 [new run config UI] invoking "command line" fields mnemonics don't move focus during indexing
Performance IDEA-261332 DefaultJavaProgramRunner.doExecute and GenericDebuggerRunner.doExecute
Usability IDEA-266477 "Modify Run Configuration" button in run/debug window is not present in 2021.1
Usability IDEA-249917 [new run config UI] Highlight error state near the field containing the error
Usability IDEA-266977 Run/Debug dialog / capturing console output to a file is confusing
Usability IDEA-263886 [new run config UI] Change 'modify option' hotkey on macOS to be Option-M
Usability IDEA-257348 "command line is too long" error message: hard to understand how to fix, especially with new run configuration UI
Usability IDEA-246087 [new run config UI] Improved keyboard navigation to fields
Cosmetics IDEA-261879 Edit configuration templates - configurations list is collapsed
Task IDEA-264761 [new run config UI] Add statistics for field hints
Exception IDEA-245958 Throwable: Directory index may not be queried for default project
Exception IDEA-262425 PluginException: Cyclic service initialization: RunManager
Core. Run. TargetsFeature IDEA-255763 Run Targets: provide browse button for jdk and maven for WSL target
Bug IDEA-261637 Run Targets: Can not download single file via SSH
Bug IDEA-268640 IJ cannot complete commands when the terminal is set to zsh and it needs to update
Bug IDEA-266438 Run Targets. Docker. "java.lang.Throwable: Command line hasn't been built yet" at re-debug in the Debug view
Bug IDEA-266437 Run Targets. Docker. Cannot load class com.intellij.quarkus.run.maven.QsMavenRunConfiguration by re-debug via the button on the Idea toolbar
Bug IDEA-267619 An exception on Run/Debug is shown to user without means to report it
Bug IDEA-255964 "Run on" combobox in run configuration editor should show WSL under "New target"
Bug IDEA-264934 Eternal throbber in target creation wizard
Bug IDEA-261178 Support introspection for WSL run target
Bug IDEA-253377 Run Targets: RSync for SSH target not detected in case windows-linux or wsl-linux
Bug IDEA-265916 Run targets. Quarkus. Debug doesn't work
Bug IDEA-262446 Run Targets: SSH: contents of coverageNargs file is not uploaded
Bug IDEA-264908 RunTargets. Docker. Exceptions in plugin Maven and thread dumps by creating a not-maven target for quarkus run consig
Bug IDEA-270299 Run Targets: RC with run on target excluded from pre-commit run RC list
Bug IDEA-262162 Run Targets: first introspection for WSL target fill JDK path incorrectly
Bug IDEA-264026 Run Targets: IDEA coverage/profiler stopped working on Docker target
Bug IDEA-269329 Docker. Run Targets. SpringBoot and Quarkus: runs on docker targets are absent in the Services view
Bug IDEA-264424 Run Targets: Can't run Gradle RC on WSL
Bug IDEA-262784 Run targets: SSH stops working after installing rsync on Windows
Bug IDEA-261979 SSH target startup is very slow because of files syncing
Bug IDEA-264928 RunTargets. Quarkus. It fails to run on docker target
Bug IDEA-262289 Run Targets: SSH: attempt to run with coverage fails
Performance IDEA-262457 Choose run configuration popup is slow on IntelliJ IDEA project
Usability IDEA-265188 Show popup `Please add /Applications/GoLand.app to Resources -> File Sharing` when GoLand runs from /Applications/ path on macOS
Usability IDEA-262430 Run Targets: SSH allow to select the Gradle home using the path chooser
Cosmetics IDEA-258266 Run Targets. Cosmetic UI bugs
Task IDEA-260008 Target tests for WSL
Task IDEA-258455 Run Targets: download files from target
Task IDEA-262277 Remote targets for Go Build: Introspection completed with error. Getting environment failed with exit value 1
Exception IDEA-259929 java.nio.file.NoSuchFileException in Docker plugin on pulling the image by creation a run target
Core. SSHFeature IDEA-120235 Support ForwardAgent option to forward SSH keys
Bug IDEA-267569 Public keys are asked before the password if auth type is set to password
Bug IDEA-261740 Incorrect ServerAliveInterval=1 and ServerAliveCountMax=0 that disconnects SSH session immediately
Bug IDEA-263286 SSH client should not try default keys if any IdentityFile is specified
Bug IDEA-267480 High CPU Usage and Decent amount of exceptions in log when importing new remote makefile project
Core. StatisticsTask IDEA-255671 Add information about array data type to generated scheme
Task IDEA-256920 Track Inspections Widget action
Exception IDEA-268572 ADE at com.intellij.serviceContainer.ComponentManagerImpl.doGetService
Core. Task ManagementBug IDEA-262805 First underscore in context name gone
Usability IDEA-254355 Provide an ability to assing shortcuts for "Start Timer" and "Stop Timer" actions
EditorFeature IDEA-268343 Add listeners for `Editor.setOneLine`
Feature IDEA-267726 Option to disable "advertise actions" on empty editor
Bug IDEA-268819 Text preview box under "Font" settings changes size when hovering over the "Current editor font" warning
Bug IDEA-258454 Reader Mode options are not applied for opened library file until reopening
Bug IDEA-262336 Font Settings: font value missing in dropdown after updating
Bug IDEA-264440 Wrong bold font is used in editor
Bug IDEA-267085 Light Edit: Enter button doesn't work when trying to open a file from Recent Files popup
Bug IDEA-267912 Changes in highlighting are not repainted after document changes
Bug IDEA-242875 NPE on clicking on Coverage results on gutter
Bug IDEA-262153 IJ requests indexes on caret shape changing
Bug IDEA-269075 Documentation link for an inaccessible symbol doesn't work with rendered documentaion turned off
Bug IDEA-262699 Wrong variant of Iosevka is used for italics
Bug IDEA-243023 .editorconfig: max_line_length=off disables visual guides
Bug IDEA-263938 Character moves a little when typing, looks like bounce effect
Bug IDEA-267339 Undo - does not restore selection after using an action via popup or menu, but works properly when using a shortcut
Bug IDEA-260496 Font Settings: dropdown uses wrong font when Monospaced selected
Bug IDEA-256658 Editor ignores font settings in 'reader mode'
Cosmetics IDEA-262330 Font Settings: adjust top of dialogue box (remove extra margins)
Cosmetics IDEA-260493 Add border to separate breadcrumbs and Font Settings
Task IDEA-262329 Font Settings: improve search within font dropdown
Task IDEA-260492 Font Settings: modify "Typography Settings" to a group that collapsed by default
Task IDEA-260495 Font Settings: add sample of bold font to preview
Editor. Code CompletionFeature IDEA-267743 Color Scheme: separate background option for quick doc and code completion
Bug IDEA-269699 Second completion shows duplicated file entries
Bug IDEA-260190 Lookup popup window is incorrectly sized when there is only one item
Bug IDEA-266626 My dark theme shows light code completion suggestions
Bug IDEA-268740 IDEA font display problem
Editor. Code Completion. MLBug IDEA-262094 Handle ignoring of matching case properly
Bug IDEA-262090 5 second freezes in completion in Java Files
Bug IDEA-261990 "Machine Learning Code Completion" plugin visits .class files
Performance IDEA-266091 Freezes in "ML completion. VCS feature calculation" with CVS plug-in
Editor. CopyrightFeature IDEA-150579 Add the ability to maintain multiple years in a copyright statement using the Copyright Plugin
Editor. Diff and MergeBug IDEA-257651 Diff view detects big diff but change was only small
Bug IDEA-262442 Diff detects changes incorrectly when add empty lines
Bug IDEA-261968 Diff-view in editor: toolbar may remain black when LaF theme is changed
Usability IDEA-270466 Go To Changed Files button doesn't appear when another changed file occurs in changelist
Usability IDEA-269735 Missing actions "Show Diff in Separate Window" and "Show Diff in Editor Tab" for Image Diff and binary file diff
Cosmetics IDEA-270307 Diff Unification: unify tooltip for settings gear button
Cosmetics IDEA-239121 diff viewer artefacts (reggression)
Editor. Editing TextFeature IDEA-166360 Caret placement after selection
Feature IDEA-119435 Keep caret position when commenting code
Feature IDEA-228556 Set field color based on access visibility
Feature IDEA-119451 Extend line selection via keyboard shortcut
Feature IDEA-80384 Different color and fonts style for public, protected and private methods.
Bug IDEA-264147 Chosen font variation is ignored in some dialogs
Bug IDEA-262434 Italic font is broken for Courier in 2021.1 EAP
Bug IDEA-166692 Unexpected result when selecting a line and then using shift + down arrow
Bug IDEA-264288 Join lines with comment on the second line produces red code
Bug IDEA-263980 Unexpected caret movement behavior in text with RtL fragments and a tab char
Bug IDEA-262221 Font ligatures do not get enabled in editor but are shown in the preview
Usability IDEA-260463 EditorTextFieldActionPromoter hides IdeaVim actions
Usability IDEA-138523 Allow new 14.1 AutoWrap Long Lines to be Disabled
Usability IDEA-227988 Add an option to change tab character rendering
Editor. Error HighlightingUsability IDEA-130373 Highlighting should not be paused during VFS refresh
Editor. FormatterBug IDEA-170699 Preview for Code Style goes crazy
Bug IDEA-157294 Exporting Code Style profile fails when name is not filesystem-friendly (e.g. it contains a slash in *NIX systems)
Bug IDEA-189817 Code format breaks long URLs in code comments
Bug IDEA-205999 "else" and "{}" indentation
Bug IDEA-226487 EditorConfig indent settings not applying to SQL file
Bug IDEA-218936 IDEA: Java code rearrangement may produce illegal forward reference
Bug IDEA-186208 Disabling "Code Style / Java / Chained method calls / Wrap first call" does not glue the method invocation to identifier
Bug IDEA-242506 .editorconfig automatic reformat inserts invalid space
Usability IDEA-260940 Can't generate .editorconfig entries after the .editorconfig file has been created
Exception IDEA-269375 FormattingModelInconsistencyException at com.intellij.formatting.FormatterImpl.validateModel
Editor. Intention ActionsFeature IDEA-263473 'Fix all' action for (at least some) compilation errors
Bug IDEA-264648 Nothing to show pop up is too big
Bug IDEA-263507 Line join silently changes semantics for nested ifs
Editor. TextMate BundlesBug IDEA-263847 Some log files not editable
GroovyFeature IDEA-255520 Local variable type hints
Bug IDEA-260855 Groovy Method pointer operator
Bug IDEA-268882 Line breaks in tuple assignment are not parsed
Bug IDEA-264994 [WSL] Groovy-rt.jar missing from build cache
Bug IDEA-261486 Groovy: implemente of trait
Bug IDEA-270114 Refactor - Convert to Java for Groovy files which contain method names with spaces results in an invalid Java file
Bug IDEA-256015 Wrong warning when using + method for Set created via List-literal assignment to a Set variable in Groovy
Bug IDEA-261246 The final method in Groovy's trait
Bug IDEA-263816 A line comment as last line in the "Evaluate" dialog with language Groovy breaks the compilation
Bug IDEA-263732 Render documentation comments feature does not work in Groovy files
Bug IDEA-260815 groovy: good code is red - parser confused by line break
Bug IDEA-26403 Maia 92.65 and 92.81 overwrite and destroy existing Grails run configurations on startup.
Bug IDEA-263820 Groovy generics, good code marked red
Bug IDEA-269907 Groovy editor does not insert pairs of braces or brackets anymore
Bug IDEA-261068 javadoc return tag is shown wrong on groovy
Performance IDEA-264593 Memory leaks when working with Groovy project
Usability IDEA-269874 Standard setup for Groovy results in discrepancy between Groovy bytecode and source code
Task IDEA-83519 Adding Groovy support to a project should be able to download Groovy
Support Request IDEA-267831 Chained method calls - groovy
Groovy. CompilerBug IDEA-269732 Groovy: incremental compilation fails if you modify a class and its transitive dependency reachable via annotation only
Groovy. InspectionsBug IDEA-255422 Groovy - Invalid warnings on @MapConstructor properties for @Immutable classes
Bug IDEA-261239 Groovy - valid code red in MapConstructor pre/post attributes
Lang. JSONFeature IDEA-264003 JSONL type for New Scratch
Feature IDEA-269430 JSONPath: add Evaluate JSONPath action to editor context menu
Bug IDEA-268856 Edit schema mappings shows an extracted version of settings
Bug IDEA-261817 JsonPath support: improve the colors for different types of literals
Bug IDEA-262273 JSONPath: operators are not correctly highlighted on incremental highlighting
Bug IDEA-261920 JsonPath: the strict (type safe) equals operators are not supported
Bug IDEA-261921 JsonPath: inject JSONPath language to com.jayway.jsonpath.WriteContext methods that accept jsonpath as parameter
Bug IDEA-261815 JsonPath support: operators completion doesn't work if it is partially typed
Bug IDEA-261811 JsonPath support: the slice operator [start:end:step] is error-highlighted
Bug IDEA-261813 JsonPath support: 'contains' operator is reported as error
Bug IDEA-268772 NCDFE: ParseException on Exception on attempt to evaluate JsonPath expression
Usability IDEA-262180 Evaluate JSONPath: the font used for the jsonpath expression field should be the same as the editor one
Usability IDEA-262172 JsonPath: provide completion by existing keys inside injected fragments
Lang. MarkdownFeature IDEA-261922 'Expand selection' in markdown should stop inside backtick-quoted code
Feature IDEA-210695 Export markdown to html
Feature IDEA-245576 Convert Markdown to Docx (import/export docx)
Feature IDEA-245577 Convert Markdown to Pdf
Bug IDEA-269403 Markdown: md file toolbar doesn't have the edit buttons
Bug IDEA-261987 Markdown plugin render blank page
Bug IDEA-260339 Formatting removes cpp code sections from Markdown files
Bug IDEA-255284 Markdown mermaid ClassDiagram annotations generate syntax error
Cosmetics IDEA-265692 Hide breadcrumbs for markdown files
Task IDEA-270479 Move Import/Export actions from File to Tools->Markdown Converter sub menu
Task IDEA-264671 "export to..." group for markdown with providers for converting to html, docx, and pdf
Lang. RegExpBug IDEA-262576 Wrong warning about redundant non-capturing group
Lang. Shell ScriptBug IDEA-263122 Wrong detection of the balanced string quotes in the shell script
Bug IDEA-262819 Syntax Highlighting issue with process substitution and process redirection
Bug IDEA-261684 bash: fails to resolve a function with a parens "()" body
Bug IDEA-261565 Every invocation of a shell script create a new terminal tab
Bug IDEA-267890 Code folding should not fold Shebang
Bug IDEA-261571 False "Typo" highlighting on certain `test` commands
Bug IDEA-267920 ShRunConfiguration access level
Bug IDEA-244342 Wrong syntax highlighting in shell script
Usability IDEA-252906 Support for running scripts without path
Lang. YAMLBug IDEA-267035 Syntax language hint no longer works in YAML files.
Bug IDEA-251692 YAML reformatting produces invalid syntax
Bug IDEA-264311 Fragment editor of injection YAML unexpectedly closed after ENTER
Tools. DockerFeature IDEA-227244 Docker: Provide Safe Delete UI for the Delete Image action
Feature IDEA-265630 [docker-compose editor] add validation for duration type
Feature IDEA-262658 Docker. Provide completion of stages names in case of multiple FROM statements in a Dockerfile
Feature IDEA-265307 buildkit support for compose
Feature IDEA-268003 Mark unquoted ports in a docker-compose.yml as a warning
Feature IDEA-193298 DockerCompose: provide possibility to navigate from alien nodes to the possible compose files
Feature IDEA-171328 Docker - allow for pausing/unpausing containers
Feature IDEA-251420 Docker: Implement start/stop for "alien" compose nodes
Feature IDEA-173760 Docker Compose: Allow operations on multiple services/containers (run, stop, etc)
Feature IDEA-268333 Dockerfile: add quickfix for not allowed spaces
Feature IDEA-265632 [docker-compose editor] add validation for ports mapping type
Feature IDEA-265631 [docker-compose editor] add validation for ip type
Feature IDEA-261892 Fold stages in multi-stage Dockerfile
Feature IDEA-159173 Docker integration: ability to restart containers
Feature IDEA-179935 Docker: provide completion for the environment variables in the Dockerfile
Feature IDEA-270075 add possibility to disable folding for Docker log console
Feature IDEA-185923 Docker: provide quick-help for keys in Dockerfiles, docker-compose.yaml files
Feature IDEA-171374 Docker: Provide completion for image names in the Dockerfile, DockerCompose files
Feature IDEA-262611 Support --platform command line option
Feature IDEA-270074 ask user before delete orphans services
Bug IDEA-265155 Docker run configuration: `--env-file` run CLI option does not work in 2021.1: "Can't read file at xxx" for any file
Bug IDEA-262501 Docker. Run Dockerfile with the pointed target fails
Bug IDEA-262654 Dockerfile, Editor, image tags completion: the result list contains many items which are out of scope
Bug IDEA-267498 Docker-compose. Wrong inspection error for `cpus` key value
Bug IDEA-262633 Dockerfile, Editor, images completion: remove `library/` at tags completion
Bug IDEA-262419 show running cli command in docker-compose deploy log
Bug IDEA-186080 Typed YAML: when keys are references, completion for them should not suggest existing sibling keys
Bug IDEA-266612 java.lang.NullPointerException: Parameter specified as non-null is null at adding build options
Bug IDEA-263164 Docker-compose. Impossible to run docker-compose on docker-machine
Bug IDEA-263039 Docker. WinOS. BuildKit: it fails to run a container
Bug IDEA-256721 Docker. Impossible to delete connections from the Services view.
Bug IDEA-263462 Docker. Remove docker.log file
Bug IDEA-263419 Docker. Dockerfile/Image Run configuration.`Bind mounts` field is not removed at removing the option.
Bug IDEA-268617 Docker Compose: port indentation is off for code completion
Bug IDEA-262349 Docker-compose run configuration: add an explaining tooltip over each option
Bug IDEA-269753 Docker: Image completion leads to FROM instruction replacement and exception java.util.NoSuchElementException: Array is empty.
Bug IDEA-267020 Docker-compose. Inspection error for "subnet" value from spec
Bug IDEA-263159 Docker. After an invalid connection all run configs fail until I re-connect to the Docker
Bug IDEA-263086 Options in Run section aren't persistent between Run configuration reopen
Bug IDEA-267093 Dockerfile. Quick help. Correct some descriptions
Bug IDEA-261768 Container log not visible if the execution of the container is too quick
Bug IDEA-267481 docker-compose run/debug configuration does not keep compose file ordering
Bug IDEA-267675 Since 2021.1 DOCKER_HOST environment variable cannot be overridden in Docker-Compose
Bug IDEA-263418 Docker. Dockerfile/Image run configuration. Publish all option doesn't work as CLI option
Bug IDEA-267124 Docker-compose. Duration type: wrong inspection errors for 2.5s format
Bug IDEA-268618 Docker: [windows] improve error thrown when attempting to connect to Docker when Docker isn't running
Bug IDEA-263058 Docker. BuildKit. Context folder always looks at the project folder
Bug IDEA-263457 Docker. Run hangs after adding "Run built image" section and re-run
Bug IDEA-264653 Docker. Before launch. Compose in compose parent task doesn't run
Bug IDEA-265519 Docker-compose run config: Tags for `remove images on down` show only values without any hint
Bug IDEA-262584 Docker. Dockerfile run configuration, Build options field: completion doesn't work after build options without arguments
Bug IDEA-263269 Docker. Support completion for ARGs in Dockerfiles
Bug IDEA-265140 Docker build fails to run on paths with spaces
Bug IDEA-266983 Docker-compose. Inspection errors for device_cgroup_rules values from spec
Bug IDEA-172645 Option to run only one stage or all stages of dockerfile
Bug IDEA-262619 Docker. Deploy Dockerfile with the pointed target never ends
Bug IDEA-262345 DockerCompose. Run configuration. Scale:`Select Service to Scale` link doesn't add the service into the table
Bug IDEA-267110 Docker-compose. Ports validation. Add validation errors in case of ports with spaces
Bug IDEA-263514 Rider does not work with docker rootless
Bug IDEA-222687 Support docker-compose compatibility option
Bug IDEA-267032 Docker-compose. Add validation for shm_size key values
Bug IDEA-262881 Docker. Build image creates a run configuration with the "run" section
Bug IDEA-269300 Docker: Don't download the container logs before the container is selected in the services view
Bug IDEA-267016 Docker-compose. Wrong inspection error for 'user' key
Bug IDEA-263044 Docker. Exclude the current build stage name from the names completion list after `--from`
Bug IDEA-267007 Docker-compose. Inspection errors by "list" presentation for `environment` key
Bug IDEA-234252 DockerCompose: image tags completion doesn't work
Bug IDEA-262324 Docker: when buildkit is enabled the image is always built on the Docker desktop, even if other connection is selected
Bug IDEA-267017 Docker-compose. Wrong inspection for `cpus` key
Bug IDEA-262568 Docker.Container Deploy log tab: Ctrl+C via keyboard doesn't work
Bug IDEA-267013 Docker-compose. Wrong inspection errors for start_period key
Bug IDEA-264257 Go test doesn't run after Dockerfile configuration
Bug IDEA-266117 2021.1: Some kind of JAXB-related classloader conflict when the Python, Docker, and Illuminated Cloud 2 plugins are installed and enabled
Bug IDEA-235007 No quotes autocompletion
Bug IDEA-266470 Docker compose: unable to put user input into the `Deploy Log`
Usability IDEA-262657 Dockerfile, Editor, images completion: auto-appeared completion list contains not correct items list
Usability IDEA-262806 Docker: recognize Dockerfiles for Quarkus example files
Usability IDEA-196666 Add --rmi flag support for docker-compose integration
Cosmetics IDEA-264539 Docker. Connection Settings: the url for Rootless socket on UNIX systems overlaps the option name
Exception IDEA-263927 Exception when open Docker settings on windows
Exception IDEA-262627 com.github.dockerjava.api.exception.BadRequestException at running FROM without arguments by disabled BuildKit
Tools. HTTP ClientFeature IDEA-267008 HTTP Usage Inspection: ignore local URL addresses by default and add an option
Feature IDEA-244878 Running test rest-api calls times out too quickly
Bug IDEA-261713 HTTP Usage inspection should not be reported for "http://schema.cloudfoundry.org/spring"
Bug IDEA-263645 HTTP Client: Incorrect URL inserted from URL inlay action for JAX-RS Path on class
Bug IDEA-265092 "Incorrect HTTP header" inspection should not warn for lowercase http header names
Bug IDEA-261711 HTTP Usage inspection should ignore "http://activemq.apache.org/schema/"
Bug IDEA-265850 SSLConfiguration appears in completion
Bug IDEA-239324 REST client JSON output limitation / truncated
Bug IDEA-257379 HTTP Client Dynamic Variables Not Working
Bug IDEA-264163 HTTP Client freezes IDE on big response
Bug IDEA-261717 HTTP Usage inspection should ignore localhost
Bug IDEA-261716 HTTP Usage inspection should not be reported for the standard JSP taglibs
Bug IDEA-265064 HTTP Client TLS: peer did not return a certificate
Bug IDEA-261937 HTTP Client Dynamic Variable $uuid Not Working
Bug IDEA-266294 HTTP Client doesn't use credentials specified in Proxy Authentication dialog in case of autodetected proxy
Bug IDEA-267601 HTTP Usage Inspection: more standard URLs to ignore
Bug IDEA-260741 HttpClient: Completion for SSLconfiguration on windows comes with wrong "/"
Bug IDEA-239228 REST does not work with manually configured ssh tunnel SOCKS5 proxy
Usability IDEA-265960 "Http is not safe" hint overlaps with underlined references in URL
Usability IDEA-269042 HTTP Client: should not mark regexp for URL as a insecure http link
Task IDEA-261957 Remove `com.intellij.ws` from HTTP Client plugin
Exception IDEA-261390 HttpClient: On run request with certificate get java.lang.AssertionError: Wrong line separators: '...y>\n</html>\r\n' at offset 254 exception
Tools. TerminalFeature IDEA-224561 API for custom highlighting of a found text in Terminal
Feature IDEA-118845 Allow configurable cursor shape in terminal
Feature IDEA-212446 Make opening external files from the embedded terminal configurable
Feature IDEA-268134 Allow to increase/decrease/reset font size in the built-in terminal using keyboard shortcuts
Feature IDEA-165184 Add "Use Option as Meta key" support to terminal
Feature IDEA-265342 Terminal Colors for custom commands should be configurable
Feature IDEA-198475 Powershell as a default shell on Win 10
Bug IDEA-267664 Open in Terminal open in wrong folder
Bug IDEA-267760 Outdated certificate for pty4j native (e.g. winpty-agent.exe)
Bug IDEA-264105 Using 2021.1 beta2, opening a terminal the mouse wheel scroll is not working. This used to work.
Bug IDEA-269214 Several keystrokes not recognized by embedded local terminal ( latest debian )
Bug IDEA-260165 Alt + F/B shortcuts do NOT work in Terminal
Bug IDEA-258409 Terminal pane must be opened manually in order for shell configurations to run in 2020.3
Bug IDEA-180923 Terminal. Scroll bounce
Bug IDEA-265230 "Open in terminal" is always opening root instead of the project file directory
Bug IDEA-266310 Typography settings not working in terminal
Bug IDEA-188414 Default powershell colors are barely visible in Intellij theme
Bug IDEA-238288 PhpStorm Terminal is not outputting ANSI formatting sequences correctly
Bug IDEA-259452 Too fast scroll in Terminal
Bug IDEA-170763 Some special characters cannot be typed in IDE terminal
Usability IDEA-182750 Darcula theme: unreadable errors in local and SSH terminals
Cosmetics IDEA-196703 IntelliJ terminal dosent match colors on iTerm ZSH theme
Task IDEA-228106 Provide API for getting Terminal cursor coordinates
Tools. Test ManagementBug IDEA-268204 TMS with local markdown files mixes scenarios
User InterfaceFeature IDEA-237881 Provide a way to group problems by type in Problems View
Feature IDEA-145837 Add left margin regulation for distract free mode
Feature IDEA-263488 Add a status bar widget for Power Save mode
Feature IDEA-259660 Add a shortcut to allow switching Big Sur tabs
Bug IDEA-191737 'Limit auto-loaded output to N lines' value not saved after editing using keyboard
Bug IDEA-255620 Modal alert boxes in Macos Big Sur are bright white even on a dark theme
Bug IDEA-236133 Window does not get to "normalize" state by double-click the transparent title bar
Bug IDEA-262284 Recent Projects popup doesn't remember it's width
Bug IDEA-263915 "Quick switch scheme" popup mnemonics display as "..." with larger appearance font sizes
Bug IDEA-263961 Certain combinations of bookmark icon colors are handled incorrectly
Bug IDEA-230649 Favorites and Maven tool windows are closed on project opening though they were opened on project closing
Bug IDEA-261853 JBTextField consumes space when invisible
Bug IDEA-262234 Native crash due to uncaught exception NSInvalidArgumentException on several modal dialogs on BigSur
Bug IDEA-262687 Some mnemonics are not visible in popups
Bug IDEA-264380 Exception on startup
Bug IDEA-262477 Submenu is not shown on mouse hover
Bug IDEA-265019 StackOverflowError on action update
Bug IDEA-266506 Issue with built-in preview feature on Idea 2021.1
Bug IDEA-265122 PHPStorm-EAP 2021.1 throw exception on welcome screen (com.intellij.util.ImageLoader.getResourceData)
Bug IDEA-253426 Implement "Show pinned tabs in a separate row" for single row layout
Bug IDEA-263072 Welcome screen grows every time on theme change
Bug IDEA-266204 Increase "what's new" loading timeout
Bug IDEA-256073 Black frame in selected ComboBox item
Bug IDEA-263393 Open In Browser action from the URL context action menu is invoked just on mouse hovering or navigating by arrays through the actions popup if Intentions Preview is enabled
Bug IDEA-261408 Submenu that is shown on the left disappears before the cursor gets there
Bug IDEA-191366 Text in file inspection header is unreadable due to wrong color
Bug IDEA-268606 Arrow buttons are not displayed in the image diff
Bug IDEA-262287 "Stretch to bottom"/"Stretch to top" does not work in "Search everywhere" anymore
Bug IDEA-236698 List items are not shown on Mac Touch Bar
Bug IDEA-267047 Frequent crashes at [libnst64.dylib+0x6be2] _setButtonData+0x142 in IDEA Nightly (no reproducer yet)
Bug IDEA-263928 Notification balloons do not appear when the corresponding status bar widget isn't displayed
Bug IDEA-263574 Choose Boot Runtime: "Failed to set boot JDK runtime" error on attempt to select JDK in Download JDK dialog
Bug IDEA-268182 Projects are opened as separate windows instead of tabs if transparent title bar is enabled
Bug IDEA-261155 Built-in HTML tab is opened as Preview tab if the *.html file is opened as Preview tab
Bug IDEA-260001 empty marketo form submits from License Activation dialog
Bug IDEA-261164 In Mac Messages the warning icon is always displayed as the general IntelliJ icon
Bug IDEA-227657 "Recent files" popup has UI glitches after removing file
Bug IDEA-265418 'Subpixel' mode is default for the Editor on macOS
Bug IDEA-267389 Icons appear for popup items without icons
Bug IDEA-113995 Jump list: can't open recent projects that have spaces in paths
Bug IDEA-263581 Add JDK: "com.intellij.openapi.roots.ui.configuration.SDKListItem$..." action items are displayed on touch bar
Bug IDEA-267670 Add an option key to call "Maximize Editor" with double-click on editor tab
Bug IDEA-261723 Welcome Screen size grows after each restart so that its frame doesn't fit the display
Bug IDEA-262987 Frame icon is small when in presentation mode
Bug IDEA-266540 Welcome screen increase size
Bug IDEA-267718 [BigSur alerts] Do not support HTML tags in options namees
Bug IDEA-266927 Plugins settings page steals the focus from search box
Bug IDEA-229803 "Recent changes" with "Show changed only" shows not changed files
Bug IDEA-239838 Duplicated file opened in split mode when we are paused on a breakpoint in debug mode (Tabs are disabled)
Bug IDEA-269313 Toolbar and navigation bar are hidden under project tabs if projects are opened in full screen
Bug IDEA-264566 "Updates available" icon disappears after IDEA restart
Bug IDEA-264529 Native crash when opening Trusted Dialog (macOS BigSur) KERN_PROTECTION_FAILURE at 0x0000000110c86008
Bug IDEA-261894 Editor tabs for modified files that contain errors have wrong text color
Bug IDEA-87703 Recent files doesn't close when floating Navigation bar appears
Bug IDEA-269107 "configure" action for conflicting changelists shows an extracted version of the settings
Bug IDEA-266854 IDE resets Windows File Explorer Recent Files list on start
Bug IDEA-262148 UI inspector shortcut triggers Alt+Click action on the inspected component
Bug IDEA-261958 Fix context hints in Run Options
Bug IDEA-236115 Mac title bar is empty in full screen mode
Bug IDEA-261715 Modal progress dialog is hidden on ESC, but Task is not cancelled
Bug IDEA-232632 "Mark modified (*)" works only if "Show file icon" is enabled for Editor tabs.
Bug IDEA-268307 Sort tool windows without mnemonics in Recent Files alphabetically
Bug IDEA-264220 Initial path under \\wsl$\ is not selected in file tree on opening file chooser dialog
Bug IDEA-268310 File icons are rendered differently for multiple-selection in VCS changes trees
Bug IDEA-266173 Undocked Git tool window keeps shrinking
Bug IDEA-267051 Sort icon is missing in table headers
Bug IDEA-239130 The IDE gets stuck after cancelling opening a project
Bug IDEA-236120 Transparent title bar is not hidden if a detached tab is opened in full screen mode
Bug IDEA-186369 Data sharing options screen unnecessary, appears repeatedly
Bug IDEA-269705 New Project wizard doesn't allow to select project type
Bug IDEA-261052 JDK Update should use the IDE/Plugin updates
Bug IDEA-270071 Quick Definition popup rendering
Bug IDEA-189731 Results preview of "analyze dataflow" is "empty" for all but first result inside one node
Bug IDEA-249791 Switcher cannot display all options
Bug IDEA-263404 EAP user agreement too small to read
Usability IDEA-265384 Make IDE and Project settings widget disablable
Usability IDEA-260462 Focus is moved to preview tab when opening HTML file in built-in preview
Usability IDEA-265158 Cannot dnd tab to pin when options 'One row' and 'Show pinned tabs in a separate row' are on
Usability IDEA-184944 Use words instead of symbols in shortcuts for OSX
Usability IDEA-187018 Make F2 "Go to next highlighted error" work in Recent Files/Recently Edited files popups
Usability IDEA-131137 Switcher - add settings to not show tool windows list
Usability IDEA-267294 "Stretch to Right"/"Stretch to Left": Ctrl+Shift+Arrow keys resize the dialog instead of text selection
Usability IDEA-270122 Only last component of root module group name is shown in Project Structure dialog
Usability IDEA-269111 "Customize menus and toolbars" action shows an extracted version of the settings
Usability IDEA-267926 Display project name in 'Open project' confirmation dialog
Usability IDEA-264770 [Choose Runtime dialog] Minimize button closes the Setting IDE boot runtime pop-up and IDE looks like frozen until downloading will be completed
Usability IDEA-262095 Pinned tabs in a separate row: don't stretch unpinned tabs
Usability IDEA-249597 "Copy" context menu now requires submenu navigation
Usability IDEA-269106 "Edit scopes" setting opens an extracted part of the settings
Usability IDEA-259451 Large "Got it" tooltip with a long text line
Usability IDEA-72536 Switcher shortcuts changing is confusing
Cosmetics IDEA-262729 cosmetic file watcher message
Cosmetics IDEA-262243 Mnemonics color in popups is not changed when the row is selected
Cosmetics IDEA-267398 "About" dialog is not well-aligned when shown in JetBrains Mono font
Cosmetics IDEA-262886 Move the "Open without Importing" button to the center
Cosmetics IDEA-270200 Broken selection color in New File dialog
Cosmetics IDEA-267732 "Browse icon for selection action (*.png)" doesn't reflect that .svg is also supported
Cosmetics IDEA-262259 Action text is not aligned with mnemonic in popups
Cosmetics IDEA-236119 Wrong font is used in title bar if transparent title bar is enabled
Task IDEA-268320 Tab drag out of the editor should open tab in a separate window
Task IDEA-252636 What's new in Editor
Task IDEA-265276 Improve wording in New Project Settings menu item
Task IDEA-234632 Make backgroundable tasks start in background by default
Task IDEA-261797 Popups: mnemonics style
Task IDEA-260101 Group headers for lists
Task IDEA-260948 Updates settings dialog redesign
Task IDEA-268511 ExpandableTextField#setMonospaced(true) should use editor font instead of system one
Exception IDEA-269240 'IllegalArgumentException: Can't find advanced setting' when call 'Reset Got it tooltip' action
User Interface. AccessibilityBug IDEA-261695 Choose Declaration list is no accessible
Bug IDEA-264923 On MacOS, the name of the IDE error icon is spoken with HTML tags
Bug IDEA-263910 Screen reader pronounces "text/html" for some notifications
Bug IDEA-257258 camplition popup is not voiced on macOS
Task IDEA-260436 Add an UI inspector to display the accessibility hierarchy
Task IDEA-261087 Make com.intellij.ui.TitledSeparator accessible
Exception IDEA-261841 java.lang.ClassCastException when try to run the UI Inspector
User Interface. Action SystemFeature IDEA-266279 Create dedicated Maximize Editor action
Bug IDEA-263127 Deadlock in ActionUpdater
Bug IDEA-264398 Empty menu item in Favorites tool window menu
Bug IDEA-265677 CloseNotificationAction is not available during indexing
Bug IDEA-267137 Keyboard navigation in popup menu causes duplication in submenu
Bug IDEA-264547 Clicking on the "Run Tests" gutter unexpectedly creates a breakpoint
Bug IDEA-263282 Toolbar jumps and popups resize due to that in async update mode
Bug IDEA-264299 Toolbar with browsers is no more visible in html files
Performance IDEA-264612 0.5 s delay when showing the branch list
Task IDEA-261330 Action names redefined in IdeUICustomization.projectMessage should be considered in goto action
Task IDEA-264768 Right click on a gutter unexpectedly creates a bookmark
Task IDEA-263205 Action Popups: Disable separate "next step" button
User Interface. Console ViewBug IDEA-261792 Cannot normally input in Run console
Bug IDEA-250608 Output automatically activates soft-wrap when a line is longer than 100000 characters
User Interface. ControlsFeature IDEA-212299 Implement Select parent node in UI trees
Bug IDEA-261687 Arrows separators are shown in Copy Path popup
Bug IDEA-250004 Big Sur: Context menu highlighting breaks if submenu invoked
Bug IDEA-260511 Combox with JBPopup closes on update
Bug IDEA-267068 Offset clickable area for the Resolve button in the Commit panel
Bug IDEA-260589 Press-release-hold Alt doesn't show tool window tabs
Bug IDEA-264027 Branch actions dialog is being closed immediately
User Interface. Embedded Browser (JCEF)Feature IDEA-265760 implement off-screen jcef render handler
Bug IDEA-269711 osr markdown is not painted when switching the view modes
Bug IDEA-262267 Built-in html preview is not rendered from time to time
Bug IDEA-269568 switch markdown viewer to lightweight OSR mode
Bug IDEA-244182 JCEF heavyweight popup closes too early or always stays on top [Linux]
Bug IDEA-261496 Cancelled Navigation in JCEF preview shows error page
Bug IDEA-264004 JCEF JBCefOsrHandlerBrowser failed to invoke JS when global registry value ide.browser.jcef.jsQueryPoolSize is not set.
Bug IDEA-269332 support JBR-3447 org.cef.browser.CefBrowserOsrWithHandler#createDevToolsBrowser is not implemented
Task IDEA-265333 allow per-browser off-screen rendering mode
Task IDEA-263753 provide ability to configure proxy server for jcef
Task IDEA-262952 allow JBCefBrowser to take focus on show/navigation
User Interface. Find, Replace, UsagesBug IDEA-243458 Find tool window: Pin search tab applies to what has focus, not what was clicked
Bug IDEA-264313 Find in Files: dots in empty text
Bug IDEA-242476 Filter icon becomes a line of checkboxes when the icon does not fit on the toolbar
Bug IDEA-268087 Fix cosmetics in search field in editor and in popup
Task IDEA-231364 Implement Find Usages tool window and dialog design updates
User Interface. FocusBug IDEA-209138 Entering/Exiting Full Screen Mode causes the IDE's window to lose focus
Bug IDEA-264005 Non-modal commit tool window isn't focused sometimes on 'Commit' action (when "Refreshing Local Changes" progress is shown)
Bug IDEA-267866 Structure window refreshes wrong Class tree when working with detached Editor
Bug IDEA-214538 UI freeze caused by java focus API, Ubuntu 18.04, two monitors
Bug IDEA-235818 Cmd+` (Command backtick) switches between windows in different workspaces
Bug IDEA-265676 Switching to another project using File -> Open Recent does not work if the other project is already opened and its window is minimized
Bug IDEA-251381 "git => compare branch" looses focus before list of branches can be displayed
Bug IDEA-268607 Some git actions (probably all) don't raise Git tool window focus when the tool window is in window mode
Bug IDEA-266195 Navigating to Definition not Focusing on Other Screen
Bug IDEA-250423 Wrong file selected in Project View when clicking it after working in detached Editor
Bug IDEA-249360 Project View scroll jumps down to the previously selected file with "Always select opened file" when switching from another app
Bug IDEA-261798 Modal progress dialog doesn't grab focus
Bug IDEA-263483 focus lost after Reformat code
User Interface. Keyboard InputBug IDEA-247432 Switcher popup window shortcuts conflict with Emacs Up/Down key mapping
Bug IDEA-198381 Modifiers from macro action invocation shouldn't affect macro execution
Bug IDEA-261309 Character is typed in the editor when invoking a dialog through shortcut
Bug IDEA-262375 Mouse Forward and Back buttons(side buttons) register as "Right Click" when setting a mouse shortcut to them.
Usability IDEA-177432 Switcher shortcut to navigate backwards does not work with combinations other than Shift
User Interface. Look and FeelBug IDEA-201293 Some colors are not changed on switching theme
Bug IDEA-256700 Different behaviour of JEditorPane for Darcula and IntelliJ Light themes
Bug IDEA-265581 Freeze at java.desktop@11.0.10/sun.awt.windows.WGlobalCursorManager
User Interface. NavigationFeature IDEA-269550 Debugger: Use Preview Tab for files opened for frame navigation and stepping
Bug IDEA-261860 Navigation to an open file reopens it in active group
Bug IDEA-264409 Cannot open a recent file in splitted window
Bug IDEA-264890 Recent Files / Switcher chooses the first item by default
Bug IDEA-216720 "Ctrl+E" shortcut is displayed in "Recent Files" popup if it was removed from the keymap
Bug IDEA-102409 Switcher with custom shortcut (e.g. Cmd-I) doesn't disappear when modifier released
Bug IDEA-269778 In Quick Definition popup, left/right arrow keys move a caret instead of switching overrides
Bug IDEA-211515 RecentFiles: displayed path is not correct for the first file selected on popup opening
Bug IDEA-207163 Recently Edited Files popup doesn't have shortcut for switching between RecentFiles and RecentlyEditedFiles
Bug IDEA-265505 Backspace doesn't update speed search results in recent files
Bug IDEA-263874 No mnemonics in Switcher opened with one-key shortcut
Usability IDEA-269923 Navigating Back/Forward should remember if the file was opened in Preview Tab
Usability IDEA-263890 "Recent Files": unexpected focus, does not only filter on files
Usability IDEA-197930 Recent Files mnemonic
Exception IDEA-262100 CME at com.intellij.ide.navigationToolbar.NavBarPanel.updateItems
User Interface. PluginsBug IDEA-267878 Update notification from a disabled plugin after the plugin was already updated (Rider, Azure DevOps plugin)
Bug IDEA-257729 java.nio.file.InvalidPathException: Illegal char <:> at index 4: file:\C:\Program Files\JetBrains\IntelliJ IDEA 211.3089\lib\icons.jar!\plugins\pluginLogo.svg
Usability IDEA-265998 Plugin update: modal error messages appear one on another
User Interface. Project ViewFeature IDEA-162454 Project View. Count selected items.
Feature IDEA-248876 Show horizontal scrollbar in trees only when visible area contains items wider than viewport
Bug IDEA-268305 Hide empty middle packages option disables correct tree view of parent and children packages
Bug IDEA-265441 Project tool window "copy path" context menu action copies wrong path (focusing issue)
Bug IDEA-257211 Can't navigate to package in external libraries
Bug IDEA-269161 Broken backward compatibility in PsiDirectoryNode
Usability IDEA-95456 Project View tool window gets wider after each open/close cycle
User Interface. Search EverywhereBug IDEA-266701 Search Everywhere: Wrong hint on All tab after switching from Actions tab
Bug IDEA-261863 "Make File Writable" action cannot be searched by "Writable"
Bug IDEA-261426 Empty line in Search Everywhere results when searching for "vcs"
Usability IDEA-263459 Support screen readers in search dialogs
Usability IDEA-265751 "Open recent" name in find dialog could be unintuitive
User Interface. Services ViewBug IDEA-267159 Can't unhide application server configuration in Services view
Cosmetics IDEA-265001 Services run configuration notification should have empty title
Version ControlFeature IDEA-57574 Ability to enable tests execution in "before commit" actions
Feature IDEA-241921 Branches panel should respect the Path filter
Bug IDEA-253961 Commit message auto completion from history doesn't work anymore
Bug IDEA-268108 Balloon notification does not escape html from jest output
Bug IDEA-264772 Tests before Commit: cannot run tests in gradle project
Bug IDEA-269314 Shift+Tab navigation is not working in Commit toolwindow
Bug IDEA-270337 Tests before Commit: Selected Tests configuration is not updated in Commit toolwindow if was changed in Settings
Bug IDEA-269629 Analyze Code before commit: latest added profiles are not shown as selected
Bug IDEA-267194 Settings Repository fails at clone due to incorrect upstream branch resolution
Bug IDEA-264996 Tests before Commit: infinite checks spinner if test configuration is not full
Bug IDEA-264758 Tests before Commit: code compilation is not started on tests run before commit
Bug IDEA-237029 Selecting text shortcut conflicts with toolwindow resize in Commit toolwindow
Bug IDEA-266367 i18n: Amend toolbar and Commit message section are not shown under non-modal commit interface under Chinese/Korean
Bug IDEA-265636 Clicking Help button in Remove Remote dialog throws an exception
Bug IDEA-264786 Tests before Commit: first underscore in configuration name turns into mnemonic
Bug IDEA-269829 Commit is done whereas pre-commit test task isn't successful
Bug IDEA-264651 Branches: "Expand/Collapse All" shortcuts do not work correctly when search filter is filled
Bug IDEA-245949 Incomplete Git history in "Show History" dialogue
Bug IDEA-264658 Branches: Missing Edit / Remove remote context menu items
Bug IDEA-260241 Ctrl + C copies editor line instead of previous changed chunk content
Usability IDEA-171261 Cannot delete last changlist
Usability IDEA-171873 Commit change dialog should show code cleanup profile
Usability IDEA-269749 Add "Run Tests" option in Version Control | Commit | Before Commit
Usability IDEA-268812 'Esc' no longer closes the diff window
Usability IDEA-264785 Pre-commit checks in background: hard to distinguish failed checks when many are shown
Cosmetics IDEA-264640 Branches: Add "Group By" tooltip
Cosmetics IDEA-269628 Analyze Code before commit: first underscore in profile name turns into mnemonic
Task IDEA-266238 Add "Fetch" icon to VCS main menu
Exception IDEA-266052 Tests before commit: IllegalStateException: Already resumed
Version Control. GitFeature IDEA-193572 Support git config core.hooksPath
Feature IDEA-259421 Add an action to call Ignored but not excluded check
Feature IDEA-232456 Branches: Allow grouping by repository
Feature IDEA-256885 Git Stage: Support committing different git roots separately
Bug IDEA-262223 Git Commit Template: respect relative paths
Bug IDEA-270207 WSL: IDE incorrectly autodetects git on windows after export/import wsl distro
Bug IDEA-264428 Git: pressing OK in "Define Remote" dialog does nothing
Bug IDEA-261593 Cherry-pick with dialog could miss some changes
Bug IDEA-263100 Compare with Branch functionality actually compares with tag if branch and tag have identical names
Bug IDEA-261638 Access from EDT is not allowed in GitVFSListener
Bug IDEA-261550 choose upstream path - Git Root cut - path partial visible
Bug IDEA-248343 Git Remote add unable to cancel.
Bug IDEA-264683 Unshelve puts the file in the active changelist ignoring selected one in the unshelve dialog when file is open in the editor
Bug IDEA-262301 Git Staging Area: don't group by repository changes in a single-root project
Bug IDEA-264088 Cannot add files/directories to .git/info/exclude
Bug IDEA-262518 Cherry-pick with conflict works incorrectly when conflicted file is open in the editor
Bug IDEA-259512 Automatic exclusion of files listed in .gitignore only recognizes files from 1 repository root.
Bug IDEA-248816 "Datasource local storage ignored files" path is generated glitched inside .gitignore
Bug IDEA-263695 Can't commit staged changes on the first Commit toolwindow opening
Bug IDEA-262265 Unshelve with drag and drop doesn't work inside commit tab
Bug IDEA-267252 Staging area: Commit tab name should refelect the branch
Bug IDEA-258993 Double clicking directories in commit window opens all files from the directory in diff view
Usability IDEA-268430 Git Commit Template: consider empty template as no template
Usability IDEA-262598 Commit message area in "Edit/Squashed commit message" dialogs is too small
Usability IDEA-257569 Cannot find Resolve conflicts... in the new Git menu
Usability IDEA-262307 Git Staging Area: allow commit without checking the checkbox when changes from the only one repo are staged
Usability IDEA-262282 Staging operations should not be in the document undo stack.
Support Request IDEA-254998 Failed to start Git process: Unknown WSL distribution (Pengwin - Wlinux)
Exception IDEA-267043 Exception and threadDump after merging via Git Merge dialog
Version Control. GitHubFeature IDEA-263015 Ability to start PR creation without opening the toolwindow first
Feature IDEA-247361 Support push workflow changes using GitHub OAuth
Feature IDEA-142717 GitHub pull request template
Feature IDEA-263016 Allow filtering branches when selecting one to create a PR
Bug IDEA-262621 GitHub Pull Requests: Cannot display item - Icon cannot be found in 'GithubIcons.Branch', class='org.jetbrains.plugins.github.GithubIcons' for events with branch icon in timeline
Bug IDEA-262590 GitHub Pull Requests: commits with PR links are displayed incorrectly
Bug IDEA-264499 "Create Pull Request" button does not appear until after "Pull Requests" pane has been opened
Bug IDEA-263227 GitHub Pull Requests: wrong branch is preselected in head branch on PR creation if branch checkout was performed while Pull Requests tool window was opened
Bug IDEA-263686 Pull Requests: changing metadata from no assignees to 1 moves the entire right block to the left
Bug IDEA-263361 GitHub Pull Requests: push is incorrectly recognized as successful when create PR without access to repo
Bug IDEA-263510 GitHub Pull Requests: wrong line separators error on editing PR description
Bug IDEA-260230 Loading Github branch protection rules not consistent
Bug IDEA-263925 GitHub Enterprise: can't view pull requests
Bug IDEA-265637 GitHub Sync Fork: sync fork doesn't work when upstream configured with ssh or http url
Bug IDEA-264961 Create Pull Request: remove plus and target icons for New Pull Request View
Bug IDEA-265152 Create pull request: show tooltip with full repo-branch spec on hover
Bug IDEA-264219 Github Pull Requests: file tree on Commits pane gets stuck in loading state on new pr creation
Bug IDEA-203276 Rebase My GitHub Fork and Create PR offers to select between origin and upstream
Performance IDEA-263978 IntelliJ consumes 100% of one core while being idle
Usability IDEA-263182 GitHub Pull Requests: add shortcut to Create Pull Request
Usability IDEA-262615 GitHub Pull Requests: sort alphabetically head branch list on PR creation
Usability IDEA-233137 GitHub Pull Requests: add tooltip to add comment
Usability IDEA-262835 GitHub Pull Requests: no focused item on "New Pull Request" tab opening
Usability IDEA-262613 GitHub Pull Requests: preselect head repo improvements on PR creation in project with multiple remotes
Usability IDEA-263390 GitHub Pull Requests: can't hit pencil button by keyboard
Usability IDEA-262857 GitHub Pull Requests: no way to switch between Title and Description inputs from keyboard
Usability IDEA-263396 GitHub Pull Requests: New Pull Request tab isn't focused when call Create Pull Request action without opening Pull Requests toolwindow
Usability IDEA-262864 GitHub Sync Fork: sync fork action returns "No suitable GitHub account found" notification instead of "Log In to GitHub" dialog when no github account is configured
Cosmetics IDEA-264070 GitHub Pull Requests: add project name on New Pull Request tab
Cosmetics IDEA-264072 GitHub Pull Requests: rename "Create Pull Request" action and button tooltip to "Create Pull Request..."
Exception IDEA-262607 GitHub Pull Requests: exception on successful PR creating after failed PR creation
Version Control. Local HistoryFeature IDEA-70015 Search Local History for file content and labels
Exception IDEA-248074 LocalHistoryLog - Assertion failed: not balanced 'begin/end-change set' calls
Version Control. LogBug IDEA-265042 git log user:me filter is not showing all commits
Bug IDEA-257628 Typo in git "committed date" when committer and author differ
Exception IDEA-269709 Stable 'java.io.IOException: Broken index maps' after reopening some projects in AppCode
No subsystemBug DBE-13148 Datasource color setting does not override children color settings
Bug DBE-12806 Jump to source not working correctly after updates
Usability DBE-13276 No way to create a data source from SQLite file using the context menu
AdministrationBug DBE-13019 Cannot add grant to user without any grants
Code CompletionBug DBE-12780 No completion for system procedures if they are unquaified
Bug DBE-2931 MSSQL: bad completion
Bug DBE-10650 Bad completion for table aliases in INSERT
Performance DBE-13164 Datagrip 2021.1 freezing when typing join statement. After re-indexing, issue keeps occurring several times per day
Usability DBE-10512 Add option to toggle suggestion of all objects from all schemas in completion drop-down
Exception DBE-12561 Throwable at com.intellij.sql.psi.impl.SqlImplUtil.quoteIdentifier
Code FormatterFeature DBE-8059 An option to treat the asterisk in the SELECT clause as a regular element
Feature DBE-759 Add options to wrap alter table statement
Code GenerationFeature DBE-6276 Support row security policies
Bug DBE-5615 Bug when set an existing column as auto increment primary key
Bug DBE-8654 Schema missing in generated code from "Run routine"
Bug DBE-12759 unable to get the comment information for the database view field. It's OK in version 2019.3.5.
Bug DBE-12810 SERAIL field type is incorrectly generated for not default sequence
Bug DBE-12934 No SQL generated when using INOUT parameter in procedure
Bug DBE-13327 IDE generates trigger chunk in view DDL
Bug DBE-12892 BigQuery: can't drop materialized view via UI
Code HighlightingBug DBE-13188 Resolving of PL/SQL record type fields does not work in most cases.
Bug DBE-12528 TODO comments ignored in procedure bodies for PostgreSQL
Bug DBE-13296 MSSQL dialect does not recognize Azure SQL command `CREATE DATABASE foo AS COPY OF bar`
Bug DBE-13084 Add support for [update|drop histogram on] statements for MySQL dialect
Bug DBE-9813 Add support for CREATE DICTIONARY on clickhouse dialect
Bug DBE-12492 Ambiguous column name isn't reported in qualified with CTE name
Bug DBE-12775 Outdated MariaDB dialect
Bug DBE-12833 Exasol: support FORCE/KERBEROS PRINCIPAL keywords for user creation
Bug DBE-13058 BigQuery: support BIGNUMERIC/BIGDECIMAL
Bug DBE-12517 False-positive "Unreachable code", PL/SQL
Bug DBE-9172 Inline/in-line PL/SQL Functions in SQL queries fail due to syntax-check
Bug DBE-1632 PostgreSQL: Accessing subfields from function returning composite type
Bug DBE-12693 Exasol QUALIFY clause
Bug DBE-12996 Add support for `exists (database | dictionary | view)` statements for ClickHouse dialect
Bug DBE-12500 Can't use type cast inside "PARTITION OF" clause
Bug DBE-12955 Missing Functions in Snowflake Dialect for Datagrip
Bug DBE-13185 Unsupported option in CREATE MATERIALIZED VIEW
Bug DBE-12960 Oracle SQL*Plus dialect does not support "create blockchain table" command in DB 19c (19.10.0) or 21c
Bug DBE-12556 'RESTART' is not recognized in PostgreSQL
Bug DBE-12993 Fix `create .. or replace` syntax for ClickHouse dialect
Bug DBE-12952 GROUP_CONCAT () does not accept LIMIT clause
Bug DBE-12553 Analytic functions are marked as error for H2
Bug DBE-12994 BigQuery dialect not up-to-date
Bug DBE-13092 CockroachDB SQL dialect doesn't understand partial UNIQUE indexes in CREATE TABLE
ConnectivityFeature DBE-1968 Provide the Application Name for DB sessions
Feature DBE-13182 Cloud Spanner: add "Credentials" field for data source to point to account file
Bug DBE-12559 Database plugin doesn't handle MySQL expired passwords
Bug DBE-12522 Incorrect icons for basic support drivers
Usability DBE-12813 Pressing the "Plus" button in the Data Sources and Drivers does nothing
Usability DBE-10327 Database tool window does not appear after creating connection
Usability DBE-10615 Conflict between 'system settings -> password -> do not save' and data source password 'save' option
Usability DBE-13181 Data Sources & Drivers > Advanced: Table not visible on MacOS 11.3
Cosmetics DBE-13230 Data source invalid selection in the list
Configuration Problem DBE-13173 change default settings for cockroachdb data source
Data DiffBug DBE-13150 Comparing with not running
Data Editor/ViewerFeature DBE-12547 Allow to set additive sorting by default (old title: Multiple column sorting no longer works)
Feature DBE-12714 Add titled separators to context menu of column header
Feature DBE-1751 Add an "Open in console" button side by side with the "View Query"
Bug DBE-12817 MongoDB: cannot convert one numeric type to other numeric type
Bug DBE-12679 Filter's inability to format date columns.
Bug DBE-9814 Oracle DATE type values should not contain time 00:00:00
Bug DBE-13126 Ctrl+F does not work second time in table
Bug DBE-12910 MongoDB: cannot type float value in integer cell
Bug DBE-13252 Table data editor action panel does not change color
Bug DBE-12575 Filtering (and foreign Key referencing) does not work on binary columns
Bug DBE-12818 MongoDB: maximize doesn't show string values in a column that is detected as numeric
Bug DBE-7504 Presto JDBC: Timezone displays incurrect even after setting -Duser.timezone=+0800
Bug DBE-13167 Wrong date is returned by Snowflake if session timezone is not UTC
Bug DBE-13130 Keymap conflict in database tool "add Row" <-> "set NULL"
Bug DBE-12716 Alt+F7 on binary primary key returns empty search result
Bug DBE-11078 No schema name in 'Choose target' popup
Bug DBE-13095 [YUGABYTE] [0A000] ERROR: System column with id -1 is not supported yet
Bug DBE-13078 No tooltip when hovering commit/rollback button in Database view
Bug DBE-12410 Unable to access referenced data
Bug DBE-11780 Greenplum. [42703] ERROR: column "ctid" does not exist
Bug DBE-12909 Cannot insert correct NumberLong value to MongoDB if a column is not NumberLong
Bug DBE-12830 Grid quick-doc is broken. getDataContext is invoked on non-EDT
Bug DBE-12940 "Toggle Soft-Wrap" button in Value Editor gone if select another cell
Bug DBE-12985 Date time dialog default day is today, not the date in the table
Bug DBE-12594 Formatted mode for XML removes all spaces
Performance DBE-11578 Smaller page size limit for MongoDB
Usability DBE-13055 DataGrip should display the time zone if the data type is one with time zone
Usability DBE-12883 Rename 'Related Data' to 'Related Rows' in 'Go To' context menu
Usability DBE-12545 Remember new ORDER BY field location on UI
Usability DBE-11774 Table is read-only when there is no schema qualifier (unresolved table references)
Data Import/ExportFeature DBE-10368 Import CSV success message should contain the link to open the new table
Bug DBE-12536 Exasol csv upload extremly slow
Bug DBE-12683 Conversion failed timestamp -> smalldatetime when coping tables
Performance DBE-11892 CSV Upload extremely slow
Performance DBE-13139 Import to Redshift is still slow even with batch support. Probably tweak linesPerStatement parameter
Performance DBE-11370 import CSV into a HIVE table took forever
Usability DBE-13259 Improve copy numeric data from SQLite due to dynamic types
Database ExplorerFeature DBE-12685 'got it' tooltip about '0 of 23' control when first creating the data source.
Bug DBE-12745 Broken breadcrumbs
Database MigrationsBug DBE-12589 Unable to open "events" and view error when errors occur
Bug DBE-12678 Missing mandatory keywords when saving stored procedure
Bug DBE-12652 MariaDB: invalid syntax for user creation with TLS Options
Bug DBE-12730 Comment on routine not supported
Bug DBE-12873 BigQuery: Invalid default data type `int` for new table creation
Bug DBE-8721 `Create New Table` generates SQL that is not accepted by MySQL when {Auto inc, Unique} are set
Usability DBE-12800 Object migration popup default size is weird
DiagramsFeature DBE-3541 Table comment in diagrams
Bug DBE-13283 Adding a diagram note leads to `ClassCastException`
Bug DBE-13046 Data source color setting is not reflected on diagram anymore
Full-Text SearchBug DBE-12967 "Full Text Search" for SQLite should use LIKE to search within LONGVARCHAR fields
GeneralFeature DBE-13111 Treat DataGrip projects like it's done in all other IDEs.
Feature DBE-7003 Custom Password Provider Plugin
Feature DBE-12094 Local history is absent for the source code editors
Bug DBE-13081 Scanning files hangs on startup
Bug DBE-12629 Context templates for select N rows in Oracle generates invalid query
Bug DBE-12533 Unable to save some settings
Usability DBE-13068 Add 'Shorten datasource and object names in tab titles' option to context menu of tab
Cosmetics DBE-12628 Incorrect size of resolution scope tree selection
IntrospectionFeature DBE-10584 Table structure in database window does not show partition information for MariaDB/MySQL
Feature DBE-8295 Generating DDL for MariaDB: include table partition information
Feature DBE-6811 Show offline databases
Feature DBE-10580 Introspect Redshift external tables with nested elements
Feature DBE-11818 Allow 'datistemplate=true' databases to show up
Bug DBE-9386 PG12 generated column DDL not valid
Bug DBE-12786 Introspection fails with numeric overflow
Bug DBE-13325 Better UI for dross-database synonyms
Bug DBE-12954 Native BigQuery driver does not introspect all schemas in a project
Bug DBE-12442 Oracle DB - Introspection failure after upgrading to 2020.3.1 (ORA-00907 when retrieving defaults and check predicates via XML)
Bug DBE-4797 Intospection interupted if one of DB is offline
Bug DBE-12166 BigQuery: CREATE TEMP FUNCTION causes database metadata to update on each query
Bug DBE-8546 DataGrip 2019.2. Not Recognize USING keyword in CREATE TABLE syntax (PostgreSQL 12)
Bug DBE-12298 Cannot display DDL for mysql 8 view
Bug DBE-13146 ORA-00904: "A"."CHAR_USED": ungültiger Bezeichner in Oracle 11.1
Bug DBE-13024 Introspection fails for Redshift
Bug DBE-5096 DB2 on Z/OS Routines not showing DDL
Usability DBE-13138 Redshift: Table views do not display sort key
Task DBE-12513 Error while introspecting H2 database: Syntax Error
Navigation & SearchFeature DBE-12901 Go to database object doesn't display data sources
Bug DBE-13033 Can't navigate to related data by additional virtual foreign key mapped on the same column
Bug DBE-12609 Broken behavior for going to object declaration
Bug DBE-11738 Context data source search seems to be broken
Bug DBE-4960 Navigation between triggers and connected routines in PostgreSQL
Bug DBE-13037 The button "Scroll from editor" in database tab doesn't work when selecting something in the table
Bug DBE-12968 Database color settings are not highlighting in "Go to Table/View/Routine..."
Bug DBE-13090 Datagrip 2021.1: View DDL from data viewer broken
Bug DBE-13272 Unable to see full name of objects in Favorites despite plenty of room in the Favorites window/panel
Bug DBE-9259 Can't map keyboard shortcuts to [Full-text Search...]
Usability DBE-13140 Can't open table data view from Favorites
Usability DBE-13251 Wrong focus position after first navigation on table.column_name via Search Everywhere
Usability DBE-5341 Database: Edit on Oracle synonym could open referred object editor
Usability DBE-10826 Target data source filter needs to chop long data source names
Query ConsoleBug DBE-8092 Database Console Editor Tab Filename Includes Path
Cosmetics DBE-12897 Execute routine dialog looks ugly in default settings
RefactoringBug DBE-12711 'Qualify identifier' is missed in ORDER BY
Run ConfigurationsFeature DBE-13048 Add before launch task to drop database connections
Bug DBE-12843 tSQLt - java.sql.SQLException when test returns a result set
SQL GeneralBug DBE-10132 IDE does not execute a PIVOT query
SQL ResolveBug DBE-4531 Completion fails on table synonyms across databases
Bug DBE-12619 [SQL Server] Unable to resolve security policy
Bug DBE-12779 Go to declaration doesn't work with system procedures
Schema DiffBug DBE-13121 Unify primary key and unique index in diff view
Tools IntegrationBug DBE-12634 "Restore with mysql" fails with added parameter (max_allowed_packet)
No subsystemFeature WEB-49702 Provide docs for CSSImportRule
Bug WEB-47995 IDE "Synchronizing files..." Indefinitely after installing dependencies in multi-package project
Bug WEB-48451 Vuex symbol resolution not working with namespaced modules
Bug WEB-50218 Exception when invoking introduce variable
Bug WEB-49530 Quick documentation for pseudo CSS classes is not available in html files
Bug WEB-50967 Popup with auto import suggestions shows 'Loading'
Bug WEB-49598 ('string = is not valid Windows path') when debug Node.js app via interpreter from container
Bug WEB-50907 Wrong typo inspection: visibilitychange
Bug WEB-49620 Provide docs for JavaScript global objects
Bug WEB-49900 MDN docs are not available for constructor calls
Bug WEB-49225 Quick documentation for some deprecated HTML tags should show warning and tag description
Bug WEB-50703 Typescript debug session closed once a breakpoint is hit.
Bug WEB-50444 unable to save plugin settings
Performance WEB-48133 Freeze after sync with file system on WSL (PhoneGap, Jade plugins)
Usability WEB-50871 Do not show less popular browsers by default in the browser editor widget
Build toolsBug WEB-49925 Update the bundled webpack schema
CSSFeature WEB-49111 Inspection "Unknown CSS property" doesn't know about properties added in Chrome 83+
Bug WEB-50486 CSS :where() pseudo-selector is not supported
Bug WEB-35215 CSS modules, SCSS/Less: support selectors created using &_suffix
Bug WEB-50028 CSS :is() pseudo class not supported
Bug WEB-49387 Show values for CSS properties in the quick documentation popup
Bug WEB-50307 Unknown CCS property "aspect-ratio"
Usability WEB-49798 Provide better name/description for "CSS | Invalid elements | Unresolved CSS Class" inspection
DartBug WEB-50212 Dart parser fails to parse expression `foo?[0] ?? ''`
Bug WEB-50691 VM Options in Dart Test configuration have no effect with Dart plugin version 211.7179
Bug WEB-48176 Migrate "pub get" to "dart pub get"
Bug WEB-51019 java.lang.IndexOutOfBoundsException: Index 0 out of bounds for length 0
Bug WEB-50043 Dart file move: relative imports become absolute. (Windows only)
Task WEB-45841 Dart plugin should use the update entry point for Stagehand
DebuggerBug WEB-50168 Can't debug react-native app with expo
Bug WEB-50166 Documentation missing for Debugging Javascript in Chrome for Rider
Bug WEB-50050 BlockingOperationException when debug electron app via npm script
Bug WEB-49821 Deno debug completely broken
Bug WEB-49996 Throwable + IllegalArgumentException + can't press anything in IDE after Force step into
Bug WEB-35835 The debugger does not stop at any breakpoints in symlinked files when using `--preserve-symlinks` node option.
Bug WEB-50455 Webstorm 2021.1 cannot reconnect debugger automatically
Usability WEB-49896 Rename 'Console' for Node.js
Cosmetics WEB-51035 Unexpected filename in context menu items of run and debug
Task WEB-50869 Remove Firefox Remote debug configuration in WebStorm 2021.2
HTMLBug WEB-49670 Simultaneous tags editing breaks JSX tags editing when using multiple carets
Bug WEB-49386 Show supported browser versions for HTML tags in the quick documentation popup
Bug WEB-49654 `type` attribute on HTML 'script'/'style' is marked deprecated, but its not
Bug WEB-49285 "loading" attribute of "<img>" tag is reported as not allowed
Bug WEB-49690 No documentation for 'onclick' attribute in button tag
Cosmetics WEB-50457 Use Obsolete instead of Deprecated in HTML inspections
JSONBug WEB-50759 JsonSchema: "deprecationMessage" not recognized when using "$ref" or "anyOf"
JavaScriptFeature WEB-49934 Feature: copy imports from type declaration
Feature WEB-50653 Private brand checks
Feature WEB-35266 Support TypeScript types in JSDoc
Feature WEB-19907 Guess parameter types from function calls
Feature WEB-50734 Add Surround with Arrow Function
Feature WEB-50182 After the `import` keyword provide completion and auto import for named and default exports
Feature WEB-40986 Lodash ES6 imports
Bug WEB-50522 JSDoc: correctly highlight parameter default value of Object/Array type
Bug WEB-49424 Documentation invoked from JSDoc tag can't render definition part properly
Bug WEB-49306 Generic type in suggest instead concrete
Bug WEB-49323 The type is shown incorrectly in the assignment
Bug WEB-50029 Insert template string argument intention should be available after template string
Bug WEB-50469 InvalidPathException while checking if file is included in .flowconfig when opening files with `:` in URL
Bug WEB-50052 No completion for commonJS module if the module is required in other files
Bug WEB-49034 Broken formatting in TSX with HTML "Enforce single quote" + removing trailing commas
Bug WEB-49727 Auto SQL code inject doesn't work with variable in JavaScript string template
Bug WEB-49699 Type is not correctly inferred when iterating over a collection typed with JSDoc using "for .. of" loop
Bug WEB-43428 Copying part of code adds wrong import
Bug WEB-35948 module.exports not recognized
Bug WEB-43935 'Infer JSDoc parameter types from usages' should paste '*' instead of 'any' to JSDoc
Bug WEB-37504 Flow: Works a lot worse than before
Bug WEB-49499 Highlight correct argument in parameter info when using spread in function calls
Bug WEB-49764 No suggestion to auto-import commonJS module if the module is required in other files
Bug WEB-49905 Incorrect refactoring rename property (js + jsdoc + ts)
Bug WEB-49717 False-positive no overlap for destructured props
Bug WEB-46919 JsDoc 3 Hashmaps are not supported for plain entries
Bug WEB-50462 Javascript object methods resolving issue
Bug WEB-49462 Type of async function called with `await` is not evaluated correctly
Bug WEB-49850 'rulezzz' in suggested completion names
Bug WEB-50487 Freeze on putting cursor to 'var'
Bug WEB-49506 Unwanted character escaping in `Template literals`
Bug WEB-50638 i18n: Preferences/Settings: Languages & Frameworks: JavaScript: Libraries: hardcoded string in framework type
Bug WEB-49869 Highlighting issue in JSDoc @see tag
Bug WEB-45339 "Unresolved type Promise" in a directory configured as es6
Bug WEB-50461 JavaScript one-line if-else doesn't report syntax error on missing semicolon
Performance WEB-49859 High CPU usage on file change
Task WEB-48616 Smart suggestion variable and function names based on file name
JavaScript. FormatterBug WEB-32166 'Add semicolons on reformat' should add semicolons after TS interface members
Bug WEB-50053 Spaces not removed after parameter property modifiers
JavaScript. FrameworksFeature WEB-49740 [2020.3.2] ij_vue_uniform_indent setting ignored in .editorconfig for .vue files
Feature WEB-47799 Support new component options syntax in vue-class-component v8
Feature WEB-49157 Provide support for Vuex 4 store
Feature WEB-32178 CSS modules in Vue <style> tags are not supported
Feature WEB-34380 Vue.js: support recognition of CSS classes inside literals in :class bindings
Feature WEB-33480 Extract Angular component refactoring
Feature WEB-43480 Quick documentation for Angular components
Bug WEB-48085 Code completion and auto-import don't work for Chakra-UI components
Bug WEB-50842 Extract Angular component: adjacent text interpolation problem
Bug WEB-49838 Infinite indexing with Vue plugin (EAP 2021.1)
Bug WEB-49776 Invalid warning of required attributes for components from Chakra-UI
Bug WEB-49656 'React' is duplicated in completion
Bug WEB-48778 Auto-import doesn't work for components with doc comments
Bug WEB-50597 Component or directive matching ... element is out of the current Angular module's scope
Bug WEB-44925 No completion for React Native component props with react-native@0.62.2 and higher
Bug WEB-50321 "Component or directive is out of the current Angular module's scope" reported for Material components after migrating to Angular 12
Bug WEB-48980 Unrecognized regular (not binded) "key" attribute in Vue templates
Bug WEB-31701 Vue.js: `ref` attribute is not correctly handled
Bug WEB-50823 Extract Angular Component does not work on Windows
Bug WEB-50675 Angular Material modules not recognized after building the application
Bug WEB-47706 No props completion for function component with propTypes
Bug WEB-49657 incorrect import suggestions in react+js for React.createElement()
Bug WEB-49311 Vue 3 + Vuex 4 - Mutations, actions & getters: wrongly marked as unused
Bug WEB-47054 Vue: Support properties from super class of a decorated component
Bug WEB-47477 cmd-click on a $refs in vue script should go to the ref in the template instead of where $refs is defined in the vue code
Bug WEB-49901 Actions inside vuex 4 modules have no indication of being in use.
Bug WEB-50392 Extract Angular component: error message disappears too fast
Bug WEB-49920 Wrong props types validation in Vue 3
Bug WEB-50376 Extract Angular component: wrong code formatting in extracted component
Performance WEB-47515 Slow syntax/error higlighting
Performance WEB-49122 Avoid accessing index if it's not built
Performance WEB-49596 Every press on the mouse right button cause a freezes for a few seconds (approximately: 5s) and is annoying
Performance WEB-49959 Freezes on vuex completion
Usability WEB-50402 Extract Angular component: extraction of the whole html file doesn't work (using ctrl+a)
JavaScript. InspectionsFeature WEB-48305 JavaScript: Add an inspection to check usages of void function
Bug WEB-50319 "Void function return value is used" false positive when function returns never
Bug WEB-50340 Noinspection SpellCheckingInpection multiple times within file
Bug WEB-50378 False positive "The value assigned to 'x' is never used" inside async function
Bug WEB-50520 Unreachable Case in Switch
Bug WEB-49796 "Void function return value used" inspection shouldn't work on IIFE
Bug WEB-49473 No quickfix for making async in callback function
Bug WEB-44319 JavaScript noinspection DuplicatedCode has no effect
Bug WEB-49443 Can be simplified to [...] for (JSDoc + TypeScript)
Usability WEB-46611 Add example to Unfiltered for..in loop inspection description
Task WEB-49631 Remove 'Using function arguments object outside function' inspection
JavaScript. RefactoringBug WEB-50091 Do not change const to let when applying the 'Replace for...of' intention
Bug WEB-50557 Inlining destructured variable based off conditional selected object
Bug WEB-45292 Can‘t Refactor in TypeScript File
LintersFeature WEB-25069 Stylelint: implement auto fixes
Feature WEB-47837 ESLint support for CoffeeScript files
Feature WEB-33429 Stylelint: provide a way to specify config file location
Feature WEB-49181 Support ESLint in MDX files
Feature WEB-47511 Lint Javascript in Laravel Blade files with ESLint
Bug WEB-47908 TypeScript files are not linted when `@babel/eslint-parser` parser is specified in the config
Bug WEB-49512 EslintConfigWrapper.RULES leaks references to extensions from unloaded plugins
Usability WEB-47440 Show quick fixes from the IDE inspections above quick fixes related to linters
Usability WEB-49705 "Please specify Node.js interpreter" popups should navigate to Node settings
Exception WEB-49593 'Access is allowed from event dispatch thread with IW lock only.' when open a project
Node.jsFeature WEB-46834 On completion show only names and hide values of variables stored in .env
Feature WEB-36709 Autocomplete in package.json should respect configured npm registry
Bug WEB-42169 Vue: Support Yarn 2 in PnP mode
Bug WEB-50591 Hovering over dependency in package.json does not show latest version until you hover over the package again
Bug WEB-50526 Installed prereleased version does not match the version range '*' in package.json
Usability WEB-51119 Hide V8 Profiling from the menu Tools
TypeScriptFeature WEB-43845 no action for convert `import = require` to `import from`
Feature WEB-44914 Move refactoring on TS class or interface: default to file with same name
Feature WEB-50944 Add support to nullish coalescing (??) in the angular templates (Angular 12 feature)
Feature WEB-49094 TypeScript 4.2: abstract Construct Signatures
Bug WEB-49802 Provide docs for standard JavaScript interfaces in TS
Bug WEB-50371 Typescript 4.3: remove types compatibility check of getter and setter from Type mismatch inspection
Bug WEB-50901 Copying class name and pasting to an export site adds unnecessary import of the same class
Bug WEB-46680 Union literal completion broken for type created from typeof when using type only import
Bug WEB-49595 No import suggestions for variables that are assigned values vie destructuring
Bug WEB-50001 Package Type Inference Broken with Yarn 2
Bug WEB-50375 Typescript 4.3: static Index Signatures
Bug WEB-50576 "as" keyword breaks "updated, but never queried" inspection
Bug WEB-47561 Importing across yarn workspaces results in incorrect path since WebStorm 2020.2
Bug WEB-49023 WebStorm cannot infer the correct type for a generic Pipe
Bug WEB-50098 unsupported typescript syntax; property decorators on rest parameters
Bug WEB-49826 false 'missing required attribute' error for styled components
Bug WEB-43140 export const [ destructured_1, desctructured_2 ] = my_array not being indexed in *.ts files
Bug WEB-50086 unsupported typescript syntax; nullish coalescing operator with anonymus function
Bug WEB-50374 Typescript 4.3: Template String Type Improvements
Bug WEB-50272 Typescript 4.3: override and the --noImplicitOverride Flag
Bug WEB-48295 Changes made to imported JSON not immediately recognized by Typescript language service
Bug WEB-50087 unsupported typescript syntax; literal computed property names in enums
Bug WEB-49621 Typescript unsuccessful auto-completion for known type. Syntax highlighting gets stuck.
Bug WEB-49888 Go to defintion and find usages not works with ts imports started with slash
Bug WEB-50019 Syntax error using `import type thing = require('things')`
Bug WEB-49327 Webstorm auto import does not work properly with inherited aliases
Bug WEB-50751 Yarn PnP: duplicated typescript package without version
Bug WEB-49779 wrong colour for inferred generics
Bug WEB-47997 A *.ts file isn't removed from the Project Errors tab in the Problems view, after deleting it
Performance WEB-43639 Resolution of augmentations may be slow
Performance WEB-49847 Sluggish typing during autocomplete of big firebase angular material projects
Performance WEB-50894 Typing causes CPU spikes
Task WEB-50916 Typescript 4.3: Support get/set in interfaces/objects
Task WEB-50611 Improve "Infer parameter types from usages" intention
Task WEB-49833 Update bundled TypeScript to 4.2
Unit TestsFeature WEB-46202 Jest "update failed snapshot"/"go to snapshot" not available for `toThrowErrorMatchingSnapshot`
Bug WEB-48569 Error debugging Mocha tests run with Vue CLI due to "Unknown argument: jobs"
Bug WEB-32836 Coverage reporter is asking for `lcov.info` file if `coverage` is absent in karma.conf.js reporters
Bug WEB-51076 RuntimeExceptionWithAttachments: Can't run Karma with coverage
Bug WEB-49314 Cannot debug karma v6 test code (error in karma-intellij-debug.js)
Bug WEB-49356 mocha-intellij-stringifier fails with BigInt values
Bug WEB-50640 i18n: Mocha Run/Debug Configuration cannot show up under CJK
Bug WEB-49873 'Cannot read coverageDirectory option' when re-run Jest tests
Bug WEB-49052 Running All Tests in Jest doesn't show the error message when there is a failed test.
Bug WEB-49452 Failed Jest test never completes when running with `--watch`
Plugin: Deployment _ FTP..Bug WI-60550 Use MLSD for listing for MLST FEAT reply
Bug WI-60097 Server alive interval in SSH Configuration UI does not work if Browse Remote Host is opened the first
Performance WI-3268 Too slow FTP uploading collecting files phase
Usability WI-55338 "Sync with" menu item missing when default server is selected if Web server URL is empty
Usability WI-11988 Empty Root URL should not generate warnings
Usability WI-59447 Drag and Drop to remote host doesn't work from "scoped" project window
Cosmetics WI-59403 Remove _Web path is not specified_ warning
Cosmetics WI-60441 Grammatical error in dialog box
Exception WI-58893 IAE exception on enabling automatic uploading
  • No labels