• [PyCharm IDE]
 
Skip to end of metadata
Go to start of metadata
No subsystemBug PY-47307 Don't insert dot "." after completing not imported module name
Code InsightBug PY-46229 No completion for "ast" classes
Usability PY-43889 Suggest "main" live template only when typed in the global scope at the beginning of the line
Exception PY-46983 s.models.ZipBasedModelProvider - Failed to load model empty_module#python-names:empty_module:1.0.0
ConsoleBug PY-46500 Console opens two empty consoles after one was closed.
EditingException PY-46178 Auto-conversion to f-string doesn't work in the middle of an URL
IDEBug PY-39134 2 Resources in Project structure in PyCharm
PackagingBug PY-34444 IDE fails to show the packages list after proxy configuration: MalformedJsonException
RefactoringBug PY-31369 Don't suggest "Add type hints for function .." and replace existing when function already has them
Exception PY-46099 "Extract Superclass" fails if the method contain a class initialization and its method invocation
RestructuredTextBug PY-31110 Sphinx: "System Message: ERROR/3"
BuildFeature IDEA-263998 Show warning if gradle script uses gradle-bintray-plugin
Bug IDEA-264085 BindException: Cannot assign requested address error When trying to build any project on WSL 1
Build. Built-in (JPS)Bug IDEA-260359 WSL: All files are up-to-date when compiling modified project
Build. GradleBug IDEA-264107 Gradle groovy scripts debugging doesn't work for projects on WSL
Bug IDEA-254884 Tests not compatible with gradle configuration cache
Bug IDEA-264439 Gradle project on WSL: error message in the case of using the JDK located on Windows
Bug IDEA-264336 Support using of Gradle installed on target environment
Usability IDEA-260728 Gradle init script is not configuration cache compatible
Code Analysis. InspectionBug IDEA-192702 Clicking Edit Settings in Insepction Results does nothing
CoreBug IDEA-258519 IDE fails to open a project from the command line if another project is already opened (perhaps Windows-only)
Core. DebuggerBug IDEA-262878 Click on toolbar button "Evaluate expression" no longer uses editor selected text
Core. DiagramsBug IDEA-263119 JPA: ER Diagram opened not centered
Bug IDEA-211984 UML Diagrams: any action performed from diagram can't be Undone though Undo is shown enabled with correct last action name
Bug IDEA-263112 JPA: ER Diagram is not refreshed after adding the attribute
Bug IDEA-263877 Spring Application Context Dependencies Diagram: on Show Library Models action the layout is not applied
Bug IDEA-263868 Spring Diagrams: with `Show neighbours of the selected nodes` option the results of selection change is ugly (no layout)
Bug IDEA-264029 UML diagrams fonts are too big in 2021.1 Beta when comparing with 2020.3.2
Exception IDEA-263255 NPE at com.intellij.uml.java.JavaUmlDataModel.createEdge
Exception IDEA-264067 NPE at com.intellij.uml.java.dependency.JavaClassDependencyAnalyzer$MyDependencyCollectingVisitor.isCollect ion
Exception IDEA-262492 CCE at com.intellij.uml.presentation.DiagramPresentationModelImpl.getNodeTooltip
Exception IDEA-264064 NPE at com.intellij.openapi.graph.impl.view.FastNodeCellRendererPainter.paintNode
Exception IDEA-263414 Throwable at com.intellij.psi.impl.file.impl.FileManagerImpl.checkHasNoOtherPsi
Exception IDEA-222077 UML diagram: attempt to add note to diagram popup causes IOOBE
Exception IDEA-262187 Throwable at com.intellij.psi.impl.file.impl.FileManagerImpl.checkHasNoOtherPsi
Exception IDEA-263489 IAE at com.intellij.diagram.presentation.DiagramState.restoreTo
Exception IDEA-263561 ISE at com.intellij.spring.perspectives.diagrams.SpringDiagramNode.getIdentifyingElement
Exception IDEA-263875 ICSE at com.intellij.uml.UmlFileEditorImpl.getData
Core. IDE SettingsBug IDEA-264893 [Choose Runtime dialog] there is no ability to add JBR if it isn't located in ~/Library/Java/JetBrainsRuntime/ folder
Bug IDEA-261869 Choose Runtime - polishing
Cosmetics IDEA-227451 Settings > Editor > Code Style > Java > Arrangement items disappear or move on mouse hover
Core. IndexingBug IDEA-263504 Invalidate Caches dialog: reconsider the defaults
Bug IDEA-262428 Do not show public CDN URLs
Bug IDEA-265212 IntelliJ IDEA 2021.1 beta 4 cannot resolves JDK classes
Bug IDEA-263200 Shared index trying to attach non-existing chunk
Bug IDEA-262899 Can't find a file using Search Everywhere/Goto File
Core. InstallationUsability IDEA-263364 App started from IDEA cannot access Bluetooth on macOS Big Sur
Usability IDEA-264060 2021.1 update journey is broken as it requires multiple "check for updates" to produce a fully working installation
Usability IDEA-252209 Avoid broken installation on Linux when distributive is unpacked into the same folder
Core. LicensingFeature IDEA-263678 License Panel: hide Evaluate radiobutton for CWM plugin
Task IDEA-263484 Docker Desktop causes wrong host name to be sent while obtaining floating license
Core. Platform APIBug IDEA-264897 A race condition that leaves daemon hanging
Core. Plugin ManagementBug IDEA-253978 "File type conflict found" on every IDEA start - 3rd party plugins
Core. Project SettingsBug IDEA-99596 Manifest file located under 'main/java' root in Maven module is shown in artifact editor even if it won't be really copied to artifact
Bug IDEA-260372 Maven projects can't be built after disabling the (not used) dependency
Bug IDEA-222640 Library configured via Project Structure For New Project dialog appears incorrectly in the new projects preventing new project libraries configuring
Bug IDEA-264113 Cannot change library scope second time after clicking "apply" in project structure dialog
Bug IDEA-257476 Modules get lost on changing the 'store generated files externally' option for multimodule maven project
Bug IDEA-262946 New EAP prints many errors to the log about duplicating LibraryIds
Usability IDEA-116209 Allow to directly specify a jar's META-INF/MANIFEST.MF file
Core. Run. ConfigurationsBug IDEA-264143 The root node is configurable in the Run/Debug Configurations dialog
Bug IDEA-264202 [new run config UI] invoking "command line" fields mnemonics don't move focus during indexing
Usability IDEA-263886 [new run config UI] Change 'modify option' hotkey on macOS to be Option-M
Usability IDEA-246087 [new run config UI] Improved keyboard navigation to fields
Exception IDEA-245958 Throwable: Directory index may not be queried for default project
Core. Run. TargetsBug IDEA-264026 Run Targets: IDEA coverage/profiler stopped working on Docker target
Bug IDEA-262446 Run Targets: SSH: contents of coverageNargs file is not uploaded
Bug IDEA-261979 SSH target startup is very slow because of files syncing
Bug IDEA-262289 Run Targets: SSH: attempt to run with coverage fails
Bug IDEA-262784 Run targets: SSH stops working after installing rsync on Windows
Bug IDEA-264934 Eternal throbber in target creation wizard
Performance IDEA-262457 Choose run configuration popup is slow on IntelliJ IDEA project
Usability IDEA-262430 Run Targets: SSH allow to select the Gradle home using the path chooser
Cosmetics IDEA-258266 Run Targets. Cosmetic UI bugs
Task IDEA-258455 Run Targets: download files from target
Exception IDEA-259929 java.nio.file.NoSuchFileException in Docker plugin on pulling the image by creation a run target
Core. Task ManagementUsability IDEA-254355 Provide an ability to assing shortcuts for "Start Timer" and "Stop Timer" actions
EditorBug IDEA-263938 Character moves a little when typing, looks like bounce effect
Bug IDEA-264440 Wrong bold font is used in editor
Bug IDEA-258454 Reader Mode options are not applied for opened library file until reopening
Editor. Code Completion. MLBug IDEA-261990 "Machine Learning Code Completion" plugin visits .class files
Editor. Editing TextFeature IDEA-119451 Extend line selection via keyboard shortcut
Bug IDEA-264147 Chosen font variation is ignored in some dialogs
Usability IDEA-260463 EditorTextFieldActionPromoter hides IdeaVim actions
Editor. Intention ActionsBug IDEA-263507 Line join silently changes semantics for nested ifs
GroovyBug IDEA-26403 Maia 92.65 and 92.81 overwrite and destroy existing Grails run configurations on startup.
Lang. JSONBug IDEA-261811 JsonPath support: the slice operator [start:end:step] is error-highlighted
Usability IDEA-262180 Evaluate JSONPath: the font used for the jsonpath expression field should be the same as the editor one
Lang. RegExpBug IDEA-262576 Wrong warning about redundant non-capturing group
Tools. DockerBug IDEA-263418 Docker. Dockerfile/Image run configuration. Publish all option doesn't work as CLI option
Bug IDEA-235007 No quotes autocompletion
Bug IDEA-263164 Docker-compose. Impossible to run docker-compose on docker-machine
Bug IDEA-263457 Docker. Run hangs after adding "Run built image" section and re-run
Bug IDEA-263159 Docker. After an invalid connection all run configs fail until I re-connect to the Docker
Bug IDEA-264653 Docker. Before launch. Compose in compose parent task doesn't run
Bug IDEA-186080 Typed YAML: when keys are references, completion for them should not suggest existing sibling keys
Bug IDEA-262568 Docker.Container Deploy log tab: Ctrl+C via keyboard doesn't work
Bug IDEA-256721 Docker. Impossible to delete connections from the Services view.
Bug IDEA-263514 Rider does not work with docker rootless
Bug IDEA-263419 Docker. Dockerfile/Image Run configuration.`Bind mounts` field is not removed at removing the option.
Bug IDEA-234252 DockerCompose: image tags completion doesn't work
Bug IDEA-263462 Docker. Remove docker.log file
Usability IDEA-196666 Add --rmi flag support for docker-compose integration
Cosmetics IDEA-264539 Docker. Connection Settings: the url for Rootless socket on UNIX systems overlaps the option name
Exception IDEA-263927 Exception when open Docker settings on windows
Tools. HTTP ClientBug IDEA-239228 REST does not work with manually configured ssh tunnel SOCKS5 proxy
Bug IDEA-260741 HttpClient: Completion for SSLconfiguration on windows comes with wrong "/"
Exception IDEA-261390 HttpClient: On run request with certificate get java.lang.AssertionError: Wrong line separators: '...y>\n</html>\r\n' at offset 254 exception
Tools. TerminalFeature IDEA-224561 API for custom highlighting of a found text in Terminal
Bug IDEA-264105 Using 2021.1 beta2, opening a terminal the mouse wheel scroll is not working. This used to work.
Task IDEA-228106 Provide API for getting Terminal cursor coordinates
User InterfaceBug IDEA-261715 Modal progress dialog is hidden on ESC, but Task is not cancelled
Bug IDEA-87703 Recent files doesn't close when floating Navigation bar appears
Bug IDEA-239130 The IDE gets stuck after cancelling opening a project
Bug IDEA-263574 Choose Boot Runtime: "Failed to set boot JDK runtime" error on attempt to select JDK in Download JDK dialog
Bug IDEA-264220 Initial path under \\wsl$\ is not selected in file tree on opening file chooser dialog
Bug IDEA-227657 "Recent files" popup has UI glitches after removing file
Bug IDEA-261723 Welcome Screen size grows after each restart so that its frame doesn't fit the display
Bug IDEA-263928 Notification balloons do not appear when the corresponding status bar widget isn't displayed
Bug IDEA-262234 Native crash due to uncaught exception NSInvalidArgumentException on several modal dialogs on BigSur
Bug IDEA-263915 "Quick switch scheme" popup mnemonics display as "..." with larger appearance font sizes
Bug IDEA-263961 Certain combinations of bookmark icon colors are handled incorrectly
Bug IDEA-249791 Switcher cannot display all options
Bug IDEA-263404 EAP user agreement too small to read
Usability IDEA-72536 Switcher shortcuts changing is confusing
Usability IDEA-264770 [Choose Runtime dialog] Minimize button closes the Setting IDE boot runtime pop-up and IDE looks like frozen until downloading will be completed
Usability IDEA-187018 Make F2 "Go to next highlighted error" work in Recent Files/Recently Edited files popups
User Interface. AccessibilityBug IDEA-257258 camplition popup is not voiced on macOS
User Interface. Action SystemTask IDEA-261330 Action names redefined in IdeUICustomization.projectMessage should be considered in goto action
Task IDEA-263205 Action Popups: Disable separate "next step" button
User Interface. Console ViewBug IDEA-261792 Cannot normally input in Run console
User Interface. ControlsBug IDEA-250004 Big Sur: Context menu highlighting breaks if submenu invoked
User Interface. Embedded Browser (JCEF)Bug IDEA-264004 JCEF JBCefOsrHandlerBrowser failed to invoke JS when global registry value ide.browser.jcef.jsQueryPoolSize is not set.
Task IDEA-263753 provide ability to configure proxy server for jcef
User Interface. Find, Replace, UsagesBug IDEA-264313 Find in Files: dots in empty text
User Interface. FocusBug IDEA-263483 focus lost after Reformat code
User Interface. Keyboard InputUsability IDEA-177432 Switcher shortcut to navigate backwards does not work with combinations other than Shift
User Interface. NavigationBug IDEA-263874 No mnemonics in Switcher opened with one-key shortcut
Bug IDEA-216720 "Ctrl+E" shortcut is displayed in "Recent Files" popup if it was removed from the keymap
Bug IDEA-264409 Cannot open a recent file in splitted window
Bug IDEA-264890 Recent Files / Switcher chooses the first item by default
Bug IDEA-102409 Switcher with custom shortcut (e.g. Cmd-I) doesn't disappear when modifier released
Bug IDEA-207163 Recently Edited Files popup doesn't have shortcut for switching between RecentFiles and RecentlyEditedFiles
Usability IDEA-263890 "Recent Files": unexpected focus, does not only filter on files
User Interface. Project ViewBug IDEA-257211 Can't navigate to package in external libraries
User Interface. Search EverywhereUsability IDEA-263459 Support screen readers in search dialogs
Version ControlBug IDEA-260241 Ctrl + C copies editor line instead of previous changed chunk content
Bug IDEA-237029 Selecting text shortcut conflicts with toolwindow resize in Commit toolwindow
Version Control. GitBug IDEA-264428 Git: pressing OK in "Define Remote" dialog does nothing
Bug IDEA-262223 Git Commit Template: respect relative paths
Bug IDEA-263695 Can't commit staged changes on the first Commit toolwindow opening
Bug IDEA-248343 Git Remote add unable to cancel.
Usability IDEA-262307 Git Staging Area: allow commit without checking the checkbox when changes from the only one repo are staged
Version Control. GitHubBug IDEA-263925 GitHub Enterprise: can't view pull requests
Bug IDEA-263686 Pull Requests: changing metadata from no assignees to 1 moves the entire right block to the left
Bug IDEA-263510 GitHub Pull Requests: wrong line separators error on editing PR description
Bug IDEA-264219 Github Pull Requests: file tree on Commits pane gets stuck in loading state on new pr creation
Performance IDEA-263978 IntelliJ consumes 100% of one core while being idle
Usability IDEA-263396 GitHub Pull Requests: New Pull Request tab isn't focused when call Create Pull Request action without opening Pull Requests toolwindow
Cosmetics IDEA-264070 GitHub Pull Requests: add project name on New Pull Request tab
Cosmetics IDEA-264072 GitHub Pull Requests: rename "Create Pull Request" action and button tooltip to "Create Pull Request..."
No subsystemBug DBE-12806 Jump to source not working correctly after updates
Code CompletionBug DBE-12780 No completion for system procedures if they are unquaified
Code GenerationBug DBE-12759 unable to get the comment information for the database view field. It's OK in version 2019.3.5.
Code HighlightingBug DBE-12517 False-positive "Unreachable code", PL/SQL
Bug DBE-12693 Exasol QUALIFY clause
Bug DBE-12556 'RESTART' is not recognized in PostgreSQL
Bug DBE-12833 Exasol: support FORCE/KERBEROS PRINCIPAL keywords for user creation
Bug DBE-12775 Outdated MariaDB dialect
ConnectivityBug DBE-12522 Incorrect icons for basic support drivers
Usability DBE-12813 Pressing the "Plus" button in the Data Sources and Drivers does nothing
Data Editor/ViewerFeature DBE-12714 Add titled separators to context menu of column header
Bug DBE-12830 Grid quick-doc is broken. getDataContext is invoked on non-EDT
Bug DBE-12818 MongoDB: maximize doesn't show string values in a column that is detected as numeric
Database ExplorerFeature DBE-12685 'got it' tooltip about '0 of 23' control when first creating the data source.
Database MigrationsBug DBE-12730 Comment on routine not supported
GeneralBug DBE-12629 Context templates for select N rows in Oracle generates invalid query
IntrospectionFeature DBE-6811 Show offline databases
Bug DBE-12298 Cannot display DDL for mysql 8 view
Bug DBE-12786 Introspection fails with numeric overflow
Bug DBE-4797 Intospection interupted if one of DB is offline
Query ConsoleBug DBE-8092 Database Console Editor Tab Filename Includes Path
SQL GeneralBug DBE-10132 IDE does not execute a PIVOT query
SQL ResolveBug DBE-12779 Go to declaration doesn't work with system procedures
No subsystemBug WEB-49598 ('string = is not valid Windows path') when debug Node.js app via interpreter from container
Bug WEB-48451 Vuex symbol resolution not working with namespaced modules
Bug WEB-49225 Quick documentation for some deprecated HTML tags should show warning and tag description
Bug WEB-49900 MDN docs are not available for constructor calls
CSSBug WEB-35215 CSS modules, SCSS/Less: support selectors created using &_suffix
Bug WEB-49387 Show values for CSS properties in the quick documentation popup
DartBug WEB-50043 Dart file move: relative imports become absolute. (Windows only)
DebuggerBug WEB-50050 BlockingOperationException when debug electron app via npm script
Bug WEB-49996 Throwable + IllegalArgumentException + can't press anything in IDE after Force step into
Usability WEB-49896 Rename 'Console' for Node.js
HTMLBug WEB-49285 "loading" attribute of "<img>" tag is reported as not allowed
JavaScriptBug WEB-49034 Broken formatting in TSX with HTML "Enforce single quote" + removing trailing commas
Bug WEB-49869 Highlighting issue in JSDoc @see tag
Bug WEB-49764 No suggestion to auto-import commonJS module if the module is required in other files
Bug WEB-49850 'rulezzz' in suggested completion names
Bug WEB-37504 Flow: Works a lot worse than before
Bug WEB-49905 Incorrect refactoring rename property (js + jsdoc + ts)
Bug WEB-49499 Highlight correct argument in parameter info when using spread in function calls
Performance WEB-49859 High CPU usage on file change
JavaScript. FormatterBug WEB-50053 Spaces not removed after parameter property modifiers
JavaScript. FrameworksFeature WEB-49157 Provide support for Vuex 4 store
Bug WEB-49838 Infinite indexing with Vue plugin (EAP 2021.1)
Bug WEB-49901 Actions inside vuex 4 modules have no indication of being in use.
Bug WEB-49920 Wrong props types validation in Vue 3
Bug WEB-49311 Vue 3 + Vuex 4 - Mutations, actions & getters: wrongly marked as unused
Performance WEB-49959 Freezes on vuex completion
Performance WEB-49596 Every press on the mouse right button cause a freezes for a few seconds (approximately: 5s) and is annoying
JavaScript. InspectionsBug WEB-49443 Can be simplified to [...] for (JSDoc + TypeScript)
Usability WEB-46611 Add example to Unfiltered for..in loop inspection description
JavaScript. RefactoringBug WEB-45292 Can‘t Refactor in TypeScript File
Bug WEB-50091 Do not change const to let when applying the 'Replace for...of' intention
LintersBug WEB-49512 EslintConfigWrapper.RULES leaks references to extensions from unloaded plugins
TypeScriptFeature WEB-44914 Move refactoring on TS class or interface: default to file with same name
Feature WEB-49094 TypeScript 4.2: abstract Construct Signatures
Bug WEB-48295 Changes made to imported JSON not immediately recognized by Typescript language service
Bug WEB-50001 Package Type Inference Broken with Yarn 2
Bug WEB-49826 false 'missing required attribute' error for styled components
Bug WEB-49888 Go to defintion and find usages not works with ts imports started with slash
Bug WEB-50019 Syntax error using `import type thing = require('things')`
Bug WEB-46680 Union literal completion broken for type created from typeof when using type only import
Performance WEB-49847 Sluggish typing during autocomplete of big firebase angular material projects
Task WEB-49833 Update bundled TypeScript to 4.2
Unit TestsFeature WEB-46202 Jest "update failed snapshot"/"go to snapshot" not available for `toThrowErrorMatchingSnapshot`
Bug WEB-49052 Running All Tests in Jest doesn't show the error message when there is a failed test.
Bug WEB-48569 Error debugging Mocha tests run with Vue CLI due to "Unknown argument: jobs"
Bug WEB-49873 'Cannot read coverageDirectory option' when re-run Jest tests
Bug WEB-32836 Coverage reporter is asking for `lcov.info` file if `coverage` is absent in karma.conf.js reporters
Bug WEB-49452 Failed Jest test never completes when running with `--watch`
Plugin: Deployment _ FTP..Usability WI-55338 "Sync with" menu item missing when default server is selected if Web server URL is empty
  • No labels