• [PyCharm IDE]
 
Skip to end of metadata
Go to start of metadata
No subsystemBug PY-7006 An Epytext @type rendering issue in Quick Documentation
Exception PY-31004 StackOverflowException in case of recursive type hints
App EngineTask PY-30853 Recognize gcloud sdk folder as valid app engine sdk
Task PY-30854 Run gcloud/bin/dev_appserver.py for App Engine Server Run Configuration when using gcloud sdk
BDDFeature PY-15464 Support for pytest-bdd
Bug PY-30806 pytest-bdd: "request" parameter is unknown by PyCharm
Bug PY-30739 pytest-bdd: support step definitions in conftest
Bug PY-30441 pytest-bdd: PyCharm doesn't parse outline parameters
Bug PY-30434 Support fixtures for pytest-bdd
Bug PY-30484 pytest-bdd: escape quotes in scenario name on completion
Bug PY-30486 pytest-bdd: PyCharm provides feature completion for @scenario ignoring the directory structure
Usability PY-30579 Auto-select BDD framework in Settings if it is installed on the project interpreter
Code InsightFeature PY-29062 Categorize color scheme settings for Python
Feature PY-27398 Support PEP 557 Data Classes
Feature PY-30942 Support PEP 561 Distributing and Packaging Type Information
Feature PY-26354 Support attrs library
Bug PY-29841 call hierarchy erroneously shows recursion
Bug PY-23270 New f string formating overrides SQL syntax highlighting
Bug PY-31146 Type hints using None are not retained in stubs
Bug PY-28249 False negative: Parameterized generics cannot be used with class or instance checks
Bug PY-30071 pytest.mark.parametrize can receive parameter names in tuple instead of a string
Bug PY-31299 "import sqlalchemy" breaks ORM classes detection
Bug PY-30936 No completion for multiprocessing.Manager
Bug PY-27148 Support for NamedTuple._replace
Bug PY-28243 False negative for illegal TypeVar declaration
Bug PY-29231 Suggest unlisted attribute when `__slots__` contains `__dict__`
Bug PY-29220 Sub class attributes navigation
Bug PY-30827 Renaming in injection language fragment triggers exception
Bug PY-29232 Suggest listed attribute when ancestor does not have `__slots__`
Bug PY-29894 PyCharm quick fixes result in text-PSI inconsistencies
Bug PY-30794 INSERT IGNORE INTO is not recognised as SQL
Bug PY-30287 Pycharm does not infer overloaded signatures from super classes and does not consider them for code generation
Performance PY-31044 2018.2: PyCharm and Idea are very slow on MacBook with TouchBar if Django support is enabled
Exception PY-30072 "Empty PSI elements must not be passed to createDescriptor" exception for "pytest.mark.parametrize"
ConsoleBug PY-31405 Wrong "__name__" in the Console for "Run with Python console" option if file raises an exception
Bug PY-24523 Stop button in Python Console does nothing
Bug PY-31168 "Run with Python console" - script name and scroll-to-the-end features have been lost in 2018.2
Bug PY-30611 Auto-completion in console do not recognize methods as methods
Bug PY-18029 Can't connect to remote interpreter python console
Bug PY-32005 Importing matplotlib 3.0.0 crashes Python Console
Bug PY-31067 Console history being erased between sessions
Bug PY-32147 Console freeze on closing: PythonConsoleClientUtil$synchronizedPythonConsoleClient$proxy$1.invoke
Bug PY-31074 2018.2 console quick documentation not found
Bug PY-32247 Hitting `Ctrl + C` in the Python Console waiting for input freezes PyCharm
Bug PY-30617 Open new Console instance by default when "Run with Python Console"
Bug PY-30939 "Run with Python console" ignore "if __name__ == '__main__'"
Bug PY-31063 PY file is not executed on remote interpreter if the network connection is slow
Bug PY-31281 PyDev completer can check if a numpy array is in a container, which is not allowed
Performance PY-30285 Code completion in debug console freezes the UI: PydevConsoleReference.getVariants waits on RemoteDebugger.execute
Usability PY-29124 Change implementation for "Run with Python console" (aka "Show command line afterwards") option
CythonPerformance PY-30053 High CPU usage due to CythonUsageBeforeDeclarationInspection
DebuggerFeature PY-29468 Add an ability to load values in Debugger/Console on demand
Feature PY-27594 PyCharm Debugger breaks when passing script via stdin to subprocess
Bug PY-27910 Using Python 3.7's breakpoint() starts pdb session during PyCharm's debugger session
Bug PY-29051 Breakpoints don't work, after first hit, on lines that throw exceptions
Bug PY-28178 Concurrency diagram doesn't auto open after the first execution
Bug PY-28457 Django project crashed during reload with Python 3.5 (not always)
Bug PY-32719 Debugger fails with the error "ImportError: No module named _shaded_thriftpy" (Remote Debug Server + IronPython and Jython interpreter)
Bug PY-29644 Asyncio graph doesn't show anything with Python 3.6.5
Bug PY-32383 Debugger script ports are not exposed when debugging using Docker Compose interpreter
Bug PY-32255 Data Viewer: numbers in table are aligned for top edge
Bug PY-32289 OrderedDict looks not ordered in debug pane
Performance PY-30222 Completion for pandas data frame is very slow
Exception PY-32522 Make pretty error notification on inability to connect to Docker debugger script
Exception PY-32148 IllegalArgumentException: Argument for @NotNull parameter 'minValue' of ArrayTableCellRenderer.fillColorRange
DjangoBug PY-31814 Dynamic generation of srcset raises file reference warning.
DockerFeature PY-24915 Support docker compose depends_on condition-clause (version 2.1 of docker compose configuration file)
Feature PY-21679 Add docker compose service settings setup for Python Run configuration
Bug PY-31131 Debugging Compose services with long-lasting entrypoint fails by timeout
Bug PY-32421 PyCharm helpers volume for Docker Compose between some versions is not updated properly
Bug PY-30858 Remote PHP interpreter - Issue with tmpfs volumes
Bug PY-29512 Remote interpreter, Docker Compose, environment variables ignored
Bug PY-29161 Failed to run single Docker Compose service app: Pulling pycharm_helpers (pycharm_helpers:PY-173.4674.37)... pull access denied for pycharm_helpers, repository does not exist or may require 'docker login'
Bug PY-31997 Files in PyCharm helpers volume for Docker Compose are not updated properly
Bug PY-25450 Helpers are not updated between PyCharm releases for docker-compose interpreters (conf. v3+)
Bug PY-29368 Cannot add PYTHON SDK when DOCKER INTEGRATION plugin is installed
Bug PY-29718 "Cannot start service pycharm_helpers: network ... not found" on activities with Python interpreter
Bug PY-31671 Environment variable is not substituted for service when setting up Docker Compose interpreter
Bug PY-31782 "Failed to change owner of skeletons volume" error for Docker Compose interpreter
Performance PY-29869 Generating Skeletons slow for docker-compose
EditingFeature PY-6027 Support of multiline TODOs in Python
Feature PY-20100 Add "one import per line" auto import style
Bug PY-24450 PyCharm suggests to "install and import" already installed package invoking intention on decorator
Bug PY-20777 Ctrl + Slash inside fstring comments out fstring expression instead of whole line
Bug PY-31154 Code folding is broken
Bug PY-31022 Jump outside closing quote not functioning
Bug PY-30825 Intention "Add type hints for function" suggests to annotate class' __init__ on methods calls
Bug PY-29158 Extended completion for packages and modules doesn't insert their fully qualified names in string literals
Exception PY-30713 Add type hints for function leads to IDE Fatal Error
FormatterFeature PY-20909 Code style settings to use continuation indent for multi-line lists/dicts/etc.
Bug PY-20159 "Sort import statements" should be case-insensitive
Task PY-29655 Migrate usages of CodeStyleSettingsManager to PsiFile-based CodeStyle API
IDEFeature PY-9915 Provide support for Copyright notices
Feature PY-19419 Time tracker plugin
Usability PY-20579 "Add to currently opened projects" is not present when opening from recent project.
Task PY-30744 Add 2018.2 keymaps to PyCharm
InspectionsFeature PY-17292 Add inspection for coroutines: were they awaited in code or not
Feature PY-20530 Validate and give visual feedback on PEP 484 type hints
Bug PY-29577 Type Checker Inspection issue in PyCharm 2018.1.1
Bug PY-29229 False positive when attribute is declared in ancestor `__slots__`
Bug PY-29704 abc.abstractmethod is not recognized by linter
Bug PY-29153 PyCharm doesn't recognise install_requires in setup.py if it is a tuple
Bug PY-27231 False type warning
Bug PY-31147 erroneous error using Generic type hinting
Bug PY-29731 Warning "Argument equals to default parameter value" isn't generated for bool parameters.
Bug PY-30335 Inspection "Argument passed to function is equal to default parameter" doesn't work with built-in functions.
Bug PY-30016 False Positive: Module in setuptools "tests_require" not listed in project requirements
Bug PY-31066 False "object attribute is read-only"
Bug PY-30357 Typechek error on class attributes ("class Meta" idiom)
Bug PY-29268 False positive when writing to new attribute to new-style class with `__slots__` inherited from old-style or unknown class
Bug PY-27972 Incorrect warning and underscores when importing types
Bug PY-29863 False positive when "islice" explicit argument "start" is None
Bug PY-31788 False negative: Invalid inspection when using isinstance with Type from typing
Bug PY-27866 Cannot find reference of Union types with slots
Bug PY-16853 Round brackets of Union command are not highlited in .pyi file
Bug PY-31505 Unclosed character class error in verbose regular expressions
Bug PY-10477 suppress type check for Mock
Bug PY-11208 False positive for mock.patch.object
Bug PY-30789 Multi-level heirarchy of abstract classes gives "must implement" inspection error
Bug PY-26025 False positive: from types import ModuleType
Bug PY-25325 HTML code displayed in inspection results
Bug PY-29623 unitest.mock not found using external typeshed
Bug PY-29665 Raw bytes literal using rb parses as string
Bug PY-28155 (False Positive) Expected type 'IO' got 'StringIO' instead
Bug PY-29763 False positive raise with no arguments within except block inside finally block
Bug PY-29817 No code completion for Gtk
Bug PY-31424 False positive warning "Expected type 'type', got 'str' instead"
Bug PY-13919 False positive "Local variable might be referenced before assignment" when raise an exception inside "with statement"
Bug PY-30512 __builtins__ reference should not be unresolved
Bug PY-30423 Wrong warning "Dictionary contains duplicate keys" if key has different type
Bug PY-10549 Unresolved reference: duplicated warning for unresolved param with type in docstring
Bug PY-29233 Don't match old-style class against structural if attributes are found in `__slots__`
Bug PY-29645 Skip dataclass's fields in code insight that are not annotated
Bug PY-24172 False positive «Duplicate character '…' inside class» inspection warning in Regexp
Bug PY-30699 Wrong asyncio Task helper compiling
Bug PY-27306 Missing whitespace before "Possible callees" in warnings.
Bug PY-29230 False positive when writing to new attribute to old-style class with `__slots__`
Bug PY-22845 inspector: wrong "Expected type 'Union[str, bytes, int]', got 'Path' instead" for python3.6
Bug PY-31354 PyCharm doesn't check typing in case when runtime package is in user project (marked as Source Root) and stub only package is installed to site-packages
Bug PY-30880 False positive: dataclasses init false field after a field with a default value
Bug PY-29425 Setting the `__class__` attribute on a unittest mock flagged with the error, "Property __class__ cannot be set."
Bug PY-15949 Wrong type after joining pathlib.Path via __truediv__ method
Bug PY-31760 Popup with suggestion to install stub package from non-whitelist is shown again, even after clicking on action "No"
Bug PY-21493 Legal f-strings in regex context are sometimes marked as errors
Bug PY-31831 It difficult to trigger popup with suggestion to install stub package from non-white list
Bug PY-32364 The inspection "No encoding specified for file" doesn't check if the interpreter is using Python 3
Bug PY-29748 Variable loses inferred type in identity comparison
Bug PY-24161 False positive 'not callable' inspection with typing.Type
Bug PY-28442 Support @classmethod on dataclasses
Bug PY-30450 ssl.CERT_NONE Reference Error
Usability PY-31851 Need to add information about PEP-561 in warning with suggestion to install stub package from whitelist
Exception PY-30383 broken editor inspection
Exception PY-31285 Pycharm highlight error after it was fixed due to an exception in PyResolveUtil.resolveQualifiedNameInScope
IntelliJ PluginBug PY-32248 NoClassDefFoundError after updating to IDEA 183.3647.12 with new Python plugin and old Docker integration plugin
Bug PY-30541 Python Plugin names all venvs created from the New Project screen as local username when there are no projects opened
Exception PY-30254 DuplicateComponentKeyRegistrationException: Key com.jetbrains.python.configuration.PyConfigurableInterpreterList duplicated
Interpreters SettingsFeature PY-27879 Support WSL natively, not through SSH workaround
Feature PY-26492 Add pipenv support
Bug PY-30540 Can't create Django project with Pipenv
Bug PY-30571 File chooser for Pipenv executable doesn't work
Bug PY-30803 pipenv support should ignore packages unsiupported on my platform
Bug PY-27251 Cannot save settings: please specify a different SDK name
Bug PY-12247 Python Interpreters: multi-project associated virtualenv is removed from project when opened separably
Bug PY-30679 Notification about changed Pipfile is shown after deleting package from preferences of project
Bug PY-9081 Set as project interpreter with multiple projects opened in one window sets interpreter only in last project in the list
Bug PY-31048 Venv auto-detection stops working in 2018.2
Bug PY-30929 Pipenv in project with setup.py constantly warns that packaging==17.0 is missing
Usability PY-30667 Install packages by default in new pipenvs created from the add interpreter page
Usability PY-30444 Pipfile.lock won't appear in the project tree till synchronize is done
Usability PY-30446 PyCharm won't update Pipfile if it's opened in the editor
Usability PY-30577 It's impossible to set Pipenv executable from the new project screen
Cosmetics PY-30573 Add wrapping for pipenv lock/update suggestion
Exception PY-32153 "WSL could not produce Remote SDK credentials" error is raise, when user ties to add interpreter path in setting of interpreter
Exception PY-32236 IAE: Argument for @NotNull parameter 'project' of com/jetbrains/plugins/webDeployment/config/PublishConfig.getInstance must not be null
PackagingFeature PY-31244 PEP 561: Suggest install stub only package for installing runtime package
Bug PY-30403 Missing latest versions when using pypi.org
Bug PY-27350 Double digit package beta/rc version number is wrongly parsed
Usability PY-30308 It is very hard to notice new grey "Upgrade" package button for new user
ProfilerBug PY-31610 Profiler runs pdb console in case when python script contains built-in breakpoint
PyCharm Web HelpBug PY-18188 Missing Tip of the Day data: HierarchyBrowser.html
Quick DocumentationBug PY-29339 Quick documentation does not reflect a fact that function defined with `async` modifier
Bug PY-30103 Quick documentation wraps function signatures bizzarely
Bug PY-31148 Updated Quick Documentation doesn't show parameter descriptions if they are combined with types in same :param tags
Bug PY-31025 Quick documentation does not render Returns section of Google Code Style docstrings
Bug PY-30432 Links to external documentation resources are displayed twice in Quick Documentation
Usability PY-31033 Poorly noticeable parameter names and missing defaults in the new quick documentation view
Usability PY-31862 Ctrl-hover is parsing html tags in docstrings
Exception PY-29978 Illegal read access when detecting docstring format from top-level file attribute
Exception PY-29977 Network access from EDT in Quick Documentation rendering
RefactoringBug PY-30762 Rename refactor on py.test fixture breaks usages
Bug PY-2862 Can't introduce variable
Bug PY-31795 Hang on Remove redundant parentheses
Bug PY-31384 "Select Methods to Override" dialogue uses different sorting than Structure Tool Window
Remote InterpretersBug PY-30206 Remote debugger doesn't work
Performance PY-30848 Slow remote libraries download
RestructuredTextBug PY-27860 RST icon blinking in "Structure" panel
Bug PY-30473 reST preview: support doctest blocks
Bug PY-30472 reST preview: support literal blocks
Bug PY-29386 reStructuredText code formatting breaks indents for .. toctree:: directive
Bug PY-30466 reST preview: support "code" and "code-block"
Bug PY-25729 false positive "Overline length must match the underline" for reStructuredText section title with back tick
Bug PY-30516 reST preview doesn't work on Windows with Python 3 interpreter
Usability PY-30474 reST preview: don't jump to a preview beginning on each edit
Usability PY-30475 reST preview: improve table rendering
Usability PY-30468 reST preview: open external browser when clicking on the link
Usability PY-30470 reST preview: provide dark theme
RunFeature PY-8362 redirect file to stdin e.g. python script.py < in.txt
Bug PY-31691 Doctest template configuration is missing for the new version of the IDE
Bug PY-28647 sphinx_runner.py fails to run.
SkeletonsBug PY-27195 Pycharm fails to generate tensorflow skeletons
Test RunnerFeature PY-30249 Parameter type is not inferred
Feature PY-30248 Support completion for parametrized names
Feature PY-30032 Support pytest fixture names completion
Feature PY-27630 Support completion for "@pytest.mark"
Bug PY-30519 "Jump to source" opens wrong file
Bug PY-32431 pytest runner cannot re-run failed tests if test method is in superclass
Bug PY-31053 Pytest fixture code intelligence missing if from pytest import fixture
Bug PY-31051 pytest fixtures with yield - return types is generator
Bug PY-30345 Type not infered for py.test parametrized when argument is scalar
Bug PY-31827 Keyerror in unittestpy.py
Bug PY-30563 pytest-bdd: params are not suported
Bug PY-31164 Intellij 2018.2 pytest 2.8 is not supported anymore
Bug PY-30529 pytest-bdd: Fixtures are not provided for step definitions
Bug PY-31953 Individual tests incorrectly pass when using right-click to run
Bug PY-30768 Parameter types are unknown to PyCharm when "parse" is used by Behave
Bug PY-30153 pytest support: cannot go to "implementation" of a fixture from conftest.py
Bug PY-25260 Wrong "run test" configuration for py.test when test module has a folder in the same directory with the same name
Cosmetics PY-26263 Rename py.test to pytest
Clouds.OpenShiftFeature IDEA-176760 Cloud Platform Openshift: Token Authentication
Feature IDEA-179768 Support OpenShift Origin (V3)
Bug IDEA-199187 OpenShift: Project dropdown is empty, so it is not possible to save run config
Bug IDEA-199186 OpenShift: Parameters area is too small
Diff_MergeFeature IDEA-101663 Allow option to ignore whitespace in three way merge
Bug IDEA-187715 Local history ignore encoding settings and show wrong diff.
Bug IDEA-197927 VCS: Diff: Unified-viewer renders empty line in the wrong place if 'ignore imports and formatting' is enabled
Bug IDEA-193373 Diff in Commit Changes: cannot resize TTF preview below some limit
Bug IDEA-195754 Wrong hint in diff window for function params
Bug IDEA-194913 Zoom is broken in Diff for images
Usability IDEA-197588 Text in Comparison/files view does not wrap in narrow window ("Difference between current working tree ...")
Usability IDEA-110057 Can't change keymap shortcut for "Compare Next File" in diff view
Usability IDEA-46059 Version control: the clickable area of "Deleted" editor mark is shifted
Usability IDEA-90565 Diff View:git: do not show LF|CRLF when I have option "automatically convert line separators" on
Usability IDEA-195517 'Yours' and 'Theirs' columns are not resizable - could not see full branch name
Cosmetics IDEA-194881 Rename Files Merged with Conflicts as it is confusing to users
DockerFeature IDEA-153443 Base directory for Docker deployment
Feature IDEA-194585 DockerCompose: Editor. Provide possibility to run service/services by keyboard actions and from the context menu
Feature IDEA-175476 Add option to wrap words in docker logs
Feature IDEA-186877 Docker. Support --runtime command line option
Feature IDEA-192030 DockerCompose. Display auto-assigned ports for docker containers
Feature IDEA-150690 Docker - add --rm option
Feature IDEA-174228 Docker: Add Run and Build actions into the Editor Context menu for dockerfiles
Bug IDEA-196083 docker-compose: wrong inspection at mem_limit option value in case of the string form instead of the integer
Bug IDEA-194072 Dead `--rm` container shown as not removed from the IDE view
Bug IDEA-187414 DockerCompose: The parent docker-compose node has "container" icon in case of some deploys from one folder
Bug IDEA-194659 DockerCompose: impossible to run docker-compose run configuration
Bug IDEA-194041 Number of Attached Console tabs keeps increasing with every container launch
Bug IDEA-178932 Docker: "dockerfile detection" description in event log/balloon: the link doesn't work
Bug IDEA-164756 Docker log tabs added with each new run
Bug IDEA-200763 DockerCompose: "Run" by click on service gutter doesn't work if there is no "docker" server
Bug IDEA-194871 Docker: Provide an inspection error for "rm" in the "Command line options" field if it is not applied
Bug IDEA-193893 DockerCompose: can't choose services for the attached yaml
Bug IDEA-196690 Volume mounting doesn't work on Windows using Linux containers
Bug IDEA-194227 Docker: DockerView, Log tab: multiple toolbars at resizing
Bug IDEA-188077 DockerCompose: Stop doesn't work if node contains any container not from the deployed compose file
Bug IDEA-158217 Docker: stop and delete old container after redeploy, even if container name is not set
Bug IDEA-154034 Focus on new tab after exec action
Bug IDEA-180157 Docker Run configuration : replace JSON file with explicitly listed options in CLI format
Bug IDEA-200684 Docker: "Path to compose file required" at running services without established docker connection.
Bug IDEA-202435 Adding Docker requires email that has nowhere to enter
Bug IDEA-199274 DockerView: NPE at choosing a service without published ports
Bug IDEA-201513 Docker-compose: call `restart` instead of `up` when already running service is relaunched from the gutter
Bug IDEA-200116 Docker: it should be possible to run compose after "down" all the conflict apps with the same names.
Bug IDEA-187895 Docker: Don't add the tabs from the previous run to the new container
Bug IDEA-199410 NPE while selecting "pull image" from docker tool window
Bug IDEA-192393 Dockerfile "cannot resolve stage" with valid --from syntax
Performance IDEA-189747 Docker loads YAML file AST when computing icon
Usability IDEA-187260 DockerCompose. Yml. Display more usable information after folding a "service" and "services"
Usability IDEA-155346 Docker. Container tabs. The focus is not on the new tab if we perform any command two times.
Usability IDEA-163754 Docker. Container, Exec menu item. Set focus on the command line after Exec-> bash
Usability IDEA-155340 Docker. Add possibility to "inspect" for images.
Usability IDEA-194040 Typing in Attached Console is very slow
Usability IDEA-180791 Docker: improve UI for Run/Build actions from Dockerfiles
Task IDEA-193122 Docker: migrate to docker-java to v3.1.0
Task IDEA-195394 Docker plugin API: provide support for debugging non-Java applications
Exception IDEA-193603 Docker: IllegalOptionException at saving run configuration with a folder instead of the Dockerfile
Editor. Code CompletionFeature IDEA-192382 Override unused imports when adding class with same name
Feature IDEA-199722 Can I make the live template appear at the top of the code completion list?
Bug IDEA-193689 IDEA logs of EAP version have eaten all free space of a /home - threaddumps
Bug IDEA-193509 Unintended code completion list pops up when typing non-ASCII strings
Bug IDEA-180723 Parameter name hints completion: incorrect hints are shown in case of nested call (i.e. method call using as argument value)
Bug IDEA-198968 Idea smart completion suggests non-accessible constructor
Exception IDEA-193362 java.lang.IllegalStateException: Not in a typed action at this time
Editor. Color SchemesFeature IDEA-193070 "Syntax highlight > Language defaults > Parameter" should have option to inherit from "Identifiers > Default" since it's Identifier
Bug IDEA-197528 Color scheme editor ConcurrentModificationException
Editor. Editing TextFeature IDEA-123328 When positioned on break/continue, highlight for/while/do it breaks out of
Feature IDEA-195733 Show parameter hints for enum constructor
Feature IDEA-152160 Add options to "Save as" for scratch files
Feature IDEA-196006 Link for files in JavaDoc generation output
Bug IDEA-198539 "underscored" and "strikeout" effects not rendering
Bug IDEA-194100 Code folding state resets automatically
Bug IDEA-194685 Add builtin soutv postfix template
Bug IDEA-197276 Adding external annotation into .class file breaks syntax highlighting
Bug IDEA-192288 Strange annoying behavior on mouse click in long file in ES6
Bug IDEA-196967 External annotations not updated when I edit the file manually
Bug IDEA-196929 Cannot copy text while IntelliJ is indexing
Bug IDEA-171789 "Last edit location" does not honor changes been made on "Commit changes" window
Bug IDEA-198767 Caret returns to wrong position at the end of the block in java code
Bug IDEA-195416 Join lines over arithmetic operations should preserve order
Bug IDEA-196224 Parameter Info bubble (CTRL-P) disappears immediately if invoked after first dot
Bug IDEA-193436 editor component draws a typed char in editor component even if a typed handler does nothing and returns STOP
Bug IDEA-199909 'Jump outside closing bracket/quote with Tab' not working for method call closing parenthesis when parameter info tooltip is displayed
Bug IDEA-192970 Jump outside closing bracket/quote: doesn't work if if/while/switch statements were completed
Bug IDEA-200103 Overload switching doesn't work for vararg methods
Bug IDEA-192919 Custom file type: incorrect Expand selection if word is between backslashes (tested with in C files)
Bug IDEA-193224 Tabbing out of brackets broken when having to import a class.
Bug IDEA-198066 RegEx. Wrong selection with double click.
Bug IDEA-198595 Last edit location does not remember changes made in Find in Path
Bug IDEA-196505 Cannot open JavaScript files
Bug IDEA-201625 Text jitter in editor when tabs are used for indentation (on a fractional-scale monitor on Windows)
Bug IDEA-198893 Parameter info hints: exception on undo
Bug IDEA-192519 yml and other files: Editor does not show unquoted devanAgarI unicode characters.
Bug IDEA-198113 File | Export to HTML: line numbers are displayed incorrectly when enabled
Bug IDEA-192328 Entering a newline between a regular multiline comment and doc comment introduces stray asterisk.
Bug IDEA-194238 Custom file types comments conflicting
Bug IDEA-194978 Mouse navigation & tooltips handler: take inlay hints into the account
Bug IDEA-190611 Unable to turn on parameter hint for all cases
Bug IDEA-194649 On navigation to a search result target location is not centered in editor
Bug IDEA-194473 Scope highlighting blinks terribly
Bug IDEA-195183 Inspection's tooltip shouldn't appear when the cursor stays on a hint
Bug IDEA-202087 Broken indentation (scaling 250% or higher)
Bug IDEA-186110 Esc doesn't close in-editor search during indexing
Bug IDEA-192700 Left gutter is not resized when breakpoint is removed
Bug IDEA-189671 Editor loses caret (thus focus) after closing one of the two splits using Close (Ctrl+F4)
Bug IDEA-194718 Column selection status text is incorrect when multiple window is open
Bug IDEA-196674 Escape doesn't delete all carets in string literal with injected language
Bug IDEA-194054 Gutter icons of the underlying code displayed on folded region quick view
Bug IDEA-190665 Caret is not repainted correctly
Bug IDEA-192438 Underline is always bold underline
Bug IDEA-192777 Builder methods return hints duplication in the editor.
Bug IDEA-197878 AssertionError when inserting several lines insted of the one in multiline TODO
Bug IDEA-193695 Quick Definition (Option+Space) writes a space character if it does not work
Usability IDEA-193635 Parameter hints react in a crazy way on incomplete expression
Usability IDEA-197915 Unable to set unix line separator for iml file
Usability IDEA-198598 "Split line" does not work for multiline TODOs
Cosmetics IDEA-186054 Text cursor is reset to position (1,1) when code editor tab is dragged from primary window to new 2nd window
Exception IDEA-193406 TraceableDisposable$DisposalException: Editor is already disposed
Editor. Error HighlightingBug IDEA-197802 Editor: highlighting for soft-wraps delimiter not always inherits background color from surrounding code
Bug IDEA-195971 Library source soes not match the bytecode for java.util.regex.Pattern
Bug IDEA-199466 Editor: Error highlighting isn't change on color scheme switch
Usability IDEA-178659 Parameter name hints: automatically inserted commas are highlighted as errors
Editor. Intention ActionsBug IDEA-144708 add static import adds import to inaccessible class
Usability IDEA-193480 Unable to add annotations to parameters from the gutter icon
File SystemBug IDEA-193418 Deadlock on project open
Performance IDEA-201455 Less calls to File.isDirectory in CoreLocalVirtualFile
Usability IDEA-192665 Annoying "External file changes sync may be slow" notification
Find, Replace, Find UsagesFeature IDEA-69435 Search for Multi-line fragment
Bug IDEA-198724 New SE: Duplicated results in "Recent files"
Bug IDEA-199986 Find/Replace in Path closes immediately
Bug IDEA-193329 New SE: SearchEverywhere | Action (FindAction): OpenInFindWindow button should be disabled
Bug IDEA-188646 Livelock in Git commit dialog during code analysis
Bug IDEA-177766 Find In Path: regex search finds irrelevant matches if "In commets" selected in filter
Bug IDEA-189354 "Find in path" (old style) requires 2 "ESC" pressing to close
Bug IDEA-82930 Ctrl+R (Replace) doesn't always copy the text selected to "From" box
Bug IDEA-195542 Inconsistent and partial results in "Occurrences of" Find tool window tab after opening from "Find in Path"
Bug IDEA-193321 SearchEverywhere: on scope switching the 'include non-project items' checkbox loses its state
Bug IDEA-184743 Button in "Replace in path" old dialog is called "Find" instead of "Replace"
Bug IDEA-193455 Cannot go from Find to Replace if shortcut was changed to Ctrl+H
Bug IDEA-170585 Disable tooltip for regex find
Bug IDEA-197216 Regex search for \b locks up the IDE
Bug IDEA-196638 Rows in usage view sometimes get cropped
Bug IDEA-193584 New SE: plugin enabling/disabling via Find Action is confusing and incorrect
Bug IDEA-191479 "Find in Path" partial results can flicker/selection is reset while the search is in progress
Bug IDEA-195122 Find / Replace: when the size of the search field is small, it is not autoscrolled on typing or on Right arrow key pressing; cursor just goes to the invisible area
Performance IDEA-198369 89-second decompiler UI freeze
Usability IDEA-167955 Find: `Ctrl+F` on selected word doesn't pre-select text in search field if Find bar is open
Usability IDEA-173010 Rerun is greyed out in Find Occurrences, results are collapsed by default
Usability IDEA-180366 Find in Path from VCS | Local Changes shall pre-select the selected change list or directory
Exception IDEA-193330 AIOOBE at com.intellij.ide.actions.searcheverywhere.SearchEverywhereUI$SearchListModel.getContributorForIndex
Exception IDEA-198437 NPE at com.intellij.structuralsearch.plugin.ui.filters.FilterPanel.initFilters
IDE ConfigurationFeature IDEA-99671 Export Settings: plugin repositories settings are not exported
Feature IDEA-152848 Fresh IntelliJ IDEA 2016.1 installation doesn't recognize the the exported settings file
Feature IDEA-146459 Provide a more convenient way of editing custom file type keywords
Feature IDEA-135447 Remember settings last exported
Bug IDEA-186794 "Reassociate" action to change a file type association
Bug IDEA-200848 SDK: Don't add the same SDK some times
Bug IDEA-194876 When removing "Other" from "B" live template context, it's reset to "None"
Bug IDEA-138366 Default file types configuration (extensions) is not preserved if custom plugin registers conflicting extension
Bug IDEA-197838 Project leak via animated icon in PluginsGroupComponentWithProgress
Bug IDEA-189920 Attribute inheritance flag in Editor color scheme is reverted on Apply
Bug IDEA-198818 'Annotations to copy' setting is not persistent
Bug IDEA-193029 Restarting is not supported on GNU/Linux with Python 3 as the only Python interpreter
Bug IDEA-186551 HttpConfigurable#getJvmProperties ignores proxy exceptions
Bug IDEA-196469 NPE error on startup with initial wizard
Bug IDEA-192064 "Remove from Sidebar" is not persisted across project re-opening
Bug IDEA-200626 File and Code Templates preferences section loads infinitely
Usability IDEA-198415 Option to turn off EAP channel updates entirely for stable releases
Usability IDEA-193234 Sort Live Template Scopes alphabetically
Usability IDEA-169751 Notification in the IDE about low heap memory which clearly tells user to increase an Xmx and provides a convenient way to do it.
Cosmetics IDEA-199540 Strange selection display when switching to "Other" tab in File and Code Template settings
Task IDEA-196480 New SE file types filters are not saved on IDE close
Configuration Problem IDEA-195913 Version Control Sidebar GUI behaviour
IndicesBug IDEA-197296 deadlock between FileBasedIndex Vfs Event Processor and EDT
Bug IDEA-181227 Throwable: unable to get stub builder
Bug IDEA-193172 Deadlock while typing after auto completion
Bug IDEA-194315 Spring Boot: application.yaml file opened in Editor while indexing is not recognized as SpringBoot configuration file
Bug IDEA-198452 Exception on Welcome screen -> Preferences -> Quit
Performance IDEA-185239 9 seconds freeze caused by non-interruptable Readlock
Performance IDEA-159590 File-based index stamp changes when the index returns equal results for modified file
Usability IDEA-196058 endless indexing :)
JSONFeature IDEA-185069 Kubernetes: Json. QuickHelp. Provide quick help for completion list items
Bug IDEA-198593 Errors reported by JSON annotator disappear only on typing
Bug IDEA-195340 bad JSON kills IntelliJ
Bug IDEA-193494 IndexNotReadyException
Usability IDEA-195016 Kubernetes: Json. Completion for "integer" types should be with space before comma
Exception IDEA-193553 Error while indexing .stylelintrc
KubernetesBug IDEA-200606 Web view: useless "Kubernetes" item in the context menu
Exception IDEA-199970 Helm. java.lang.Throwable by calling "Helm template"/ "Helm Dependency update" via keyboard shortcut
Language InjectionBug IDEA-153981 Injected fragment editor: multiple instances can be opened for the same fragment, but their contents is not in sync
Bug IDEA-196513 java.lang.AssertionError at "undo" language injection
Bug IDEA-196222 HTTP Requests editor: collapse stops working after expand
Bug IDEA-162596 Un-inject action works from the second attempt only
Performance IDEA-194117 @Language("RegExp") annotation doesn't scale to O(1000) expressions in a single file
Local HistoryBug IDEA-197060 Local history reverts file timestamps
Bug IDEA-197446 IntelliJ 2018.2.1 freezes after a short time
Bug IDEA-189367 Current version is not editable in the Local History of a directory.
Bug IDEA-194992 IntelliJ freezes when using local history
Packaging and InstallationFeature IDEA-187290 New balloon notification: IDE update has been applied
Feature IDEA-114307 'Create command line launcher' on Windows
Feature IDEA-199523 Listing of Error/Exit codes
Feature IDEA-184006 Add log for win installations.
Feature IDEA-170297 "Batch mode" for IDE updates
Feature IDEA-198292 Bundle WSL plugin for Windows distribs of Idea Ultimate
Feature IDEA-194011 Turn vcs.log.graph module into a healthy maven dependency
Feature IDEA-199192 Add "Open with Rider" action for files and folders to Windows context menu
Bug IDEA-190079 Installer doesnt close with finish button and nothing happens
Bug IDEA-182484 IntelliJ IDEA restart fails on Windows because of company restrictions
Bug IDEA-200776 Remove dependency from 'extensions' module to 'XStream' library
Bug IDEA-165190 Uninstaller should not remove the files it didn't create
Bug IDEA-138195 Uninstall progress bar animation doesn't represent the actual process state
Bug IDEA-198383 Duplicating libraries copied to 'lib' directory in IDE distributions
Bug IDEA-200342 Silent installation: There is no checking if the current version was already installed
Bug IDEA-201027 Small UI issue in Installer
Bug IDEA-168582 Windows setup stacks on 'Select Directory' wizard step for several seconds
Bug IDEA-199519 Uninstall: The IDE installation folder is not deleted after uninstallation
Bug IDEA-194822 Incorrect sed command in non OS_TYPE Linix libyjpagent check breaks non Linux startup
Bug IDEA-199522 Silent installation: There is no check if the installation folder already exists.
Bug IDEA-200274 Silent installation: installation to the wrong folder
Bug IDEA-170921 Can't uninstall IntelliJ IDEA Community Edition
Bug IDEA-200784 Uninstall.exe couldn't be launched in some cases.
Bug IDEA-201292 Several installations of one version IDE: Problems with Uninstall in Users folders
Bug IDEA-200781 Sometimes there is no message that this version already installed during the installation
Bug IDEA-199339 Incorrect installation folder.
Bug IDEA-193348 The IDE has been updated by Snap shouldn't be shown on macOS
Bug IDEA-200843 PATH can not be updated. The size is very big.
Bug IDEA-197938 Windows installer: incorrect "64-bit launcher" label layout
Bug IDEA-166445 Add SVG icon file to IDE distribution
Bug IDEA-200369 Silent Installation: mode=user: if you have no permission to install in the specified folder, installation is finished in the different folder
Usability IDEA-197129 Kotlin compiler binaries miss executable permissions
Usability IDEA-200235 No option to disable "Open Folder as <IDE> Project" context menu.
Usability IDEA-198858 Batch Mode for IDE updates: It will be usefull to mention which patch-file.zip is wrong when there is wrong jar file in chain.
Usability IDEA-185044 Show list of used third-party libraries directly in the IDE
Usability IDEA-182601 Silent install could provide some error feedback
Cosmetics IDEA-200363 Silent Installation: It is better to mention in log what was wrong in installation by specific words
Cosmetics IDEA-198708 IDEA Community Edition should probably have its own icon on the Welcome screen - not the same as IDEA Ultimate has
Cosmetics IDEA-198470 The community edition setup has the wrong icons
Task IDEA-191884 Extract platform classes to separate JARs in IDEs distributions
Task IDEA-189415 Bundle Kotlin 1.2.60 with IntelliJ IDEA
Task IDEA-196699 Bundle Kotlin 1.3 with IntelliJ IDEA
Task IDEA-192663 Provide special svg icons for EAP distributions
Task IDEA-195115 Bundle Kotlin 1.2.51 with IntelliJ IDEA
Task IDEA-193948 Publish modules which allows to read IDEA project configuration as Maven artifacts
Task IDEA-192733 Update bundled JDOM to 2.0
Task IDEA-189413 Bundle Kotlin 1.2.50 with IntelliJ IDEA
Task IDEA-200752 Remove dependency from java.psi.impl to java.resources.en
Password SafeFeature IDEA-200611 Protect master key file using PGP key
Bug IDEA-200404 Idea change Password Safe option silently on "cancel" in case selected DB is unaccessible
Bug IDEA-196508 On select custom location of keepass file, master password file should be checked also
Bug IDEA-165257 KeePass OVERWRITES existing database instead of appending or prompting!?
Bug IDEA-200735 Password Safe: IDE freezes on opening Settings dialog on Ubuntu
Bug IDEA-200401 Auth error on open DB file with [...] button
Bug IDEA-174581 KeePass storage is wiped if password token does not match.
Bug IDEA-164296 Unable to load library 'secret-1'
Bug IDEA-200375 Idea doesn't save password in KeePass database
Bug IDEA-164786 ISE at com.intellij.credentialStore.kdbx.KdbxSerializerKt.a
Bug IDEA-200849 Password Safe: incorrect reaction on custom location setting for the (not existing) KeePass database
Bug IDEA-200188 Password Safe: Set/ChangeMasterPassword actions cause significant delays on Ubuntu
Bug IDEA-187790 Passwords Inaccessible (in Settings->Appearance&Behavior->System Settings-> Passwords )
Usability IDEA-163353 Not obvious when master password is set up
Auto-reported Exception IDEA-195101 Login to GitHub: exception on hitting Deny
Platform APIFeature IDEA-177378 make the registry entries extendible by plugins
Feature IDEA-193136 Synchronous notification on file opening
Feature IDEA-169107 Create an API to add custom text in place of OuterLanguageElement-s to aid template data language lexer
Feature IDEA-192305 EditorTabTitleProvider: pass FileEditor, not just VirtualFile
Feature IDEA-183815 Capability to add a content between code lines in the editor
Bug IDEA-199797 ProgressDialog#myDisableCancelAlarm won't fire for a modal progress bar
Bug IDEA-134387 CallHierarchyNodeDescriptor or HierarchyNodeDescriptor should implement equals method
Bug IDEA-199978 Support several find-usages-providers
Bug IDEA-195319 `PsiSearchScopeUtil#isInScope(GlobalSearchScope, PsiElement)` returns true for every non-physical element
Bug IDEA-199458 NPE in UnionScope creation
Bug IDEA-200807 NPE caused by NonClasspathClassFinder constructor leaking "this"
Bug IDEA-193989 IDE does not start - broken icon loading by relative path and IconPathPatcher in multiple plugins
Performance IDEA-197722 Instantiate stubs lazily within file
Task IDEA-195486 Expose JBTabs instance used by EditorComposite in its public API
Task IDEA-192805 Clean up values set by Look-n-Feel
Task IDEA-158421 Document requirements for mac-builder agent
Task IDEA-191331 Migrate to ASM 6.2
Task IDEA-193114 Make property-based and code insight sanity testing frameworks available outside IntelliJ IDEA repository
Plugin DevelopmentFeature IDEA-197617 Extension point for inferred annotations
Feature IDEA-196383 DevKit: support <group> "use-shortcut-of"
Feature IDEA-197972 DevKit: add checks from PluginVerifier (plugins.jetbrains.com) to plugin.xml inspection
Bug IDEA-183006 Automatically load plugins on which the main plugin optionally depends in tests
Bug IDEA-194424 DevKit: fix usage scope for Action/Group
Bug IDEA-194744 DevKit: extensionPoint declaration verification
Bug IDEA-194146 plugin.xml EP naming checks: tighten rules
Bug IDEA-194306 Devkit: fix quick/full doc for extension point w/ "qualifiedName"
Usability IDEA-193156 DevKit: keep "plugin.xml" in editor tab title
Task IDEA-201464 Properly attribute exceptions happened during instantiation of plugin components to corresponding plugins
Exception IDEA-183233 Exception during offline inspections
Plugin ManagementFeature IDEA-186805 Rework plugin page for settings dialog
Bug IDEA-193311 "Install plugin" button is undistinguished
Bug IDEA-193930 New Plugins dialog: visual garbage on the upper panel after clicking on different tabs
Bug IDEA-195202 Plugins: delete action
Bug IDEA-193890 New Plugins dialog: Updates page does not suggest existent newer version of bundled plugin
Bug IDEA-202017 Can't install plugin if it contains necessary dependence on another plugin
Bug IDEA-198191 New plugins page takes 6-7 seconds to Show All plugins
Bug IDEA-194120 New Plugins Manager: cannot select text/version text in plugin details page
Bug IDEA-194591 New plugin manager has incorrect window size
Bug IDEA-197950 It's confusing that one has to install new plugins using Trending section
Bug IDEA-196430 New Plugins dialog: do not allow to install plugin from disk when it is already installed
Bug IDEA-202018 Old plugin dialog is shown when click on the notification popup
Bug IDEA-198219 New plugins page: stars are cropped
Bug IDEA-198136 New plugins page shows nothing after pressing Enter for empty search line
Performance IDEA-193969 Project leak via UIUtil$JBHtmlEditorKit
Usability IDEA-199622 Updated plugins UI -- grey "Install" button for already installed plugins hard to read
Usability IDEA-199434 Non-standard hotkey for uninstalling a plugin
Usability IDEA-197334 Completion is not aligned with word start in plugin dialog
Usability IDEA-199205 New Plugin manager: add hint for gear icon
Usability IDEA-199435 Search field is focused when returning to plugins list
Cosmetics IDEA-193887 IDEA refreshes plugin description page when hovering a link
Cosmetics IDEA-199197 Poor rendering of completion list in Search field on Plugins settings page
Quick DocumentationFeature IDEA-199882 Support JDK 11 external javadoc folders structure
Bug IDEA-195622 QuickDoc is not accessible from Search Everywhere popup
Bug IDEA-199409 UI freezes: Documentation popup loads images from network on UI thread
Bug IDEA-202420 Opening offline external documentation for JDK 11 does not work
Bug IDEA-189315 QuickDocumentation popup flicker for some libs
Bug IDEA-200711 View | External Documentation doesn't work for Java11 classes if documentation url is provided
Cosmetics IDEA-163805 documentation jumps with ctrl down
Exception IDEA-199780 Quick Doc: Throwable on 'Edit source' in read-only files
Exception IDEA-199046 NPE at pressing edit in the quick documentation
RefactoringBug IDEA-187647 Rename module does not rename directory
Bug IDEA-176840 View / Expression Type just after closing pair character changes user selection
Bug IDEA-199345 Change Signature is available from Structure view though not yet implemented for Go
RegExpBug IDEA-199135 Bad error recovery in regular expression parsing
Bug IDEA-195762 Single character alternation generates wrong replacement
Bug IDEA-195628 Tab in "Check RegExp" should switch focus between lines
Run | Debug configurationFeature IDEA-74031 Variables in command line parameters of run configuration
Feature IDEA-197239 Report warning when test pattern name does not occur in project
Feature IDEA-196611 redirect file to stdin for Java-based run configurations
Bug IDEA-198940 Dark font color on dark background in 'run anything'
Bug IDEA-197127 Restart tests opens a new tab instead of reusing current tab
Bug IDEA-199121 "Run anything" suggests groups, execution targets and then throws exception
Bug IDEA-198525 [Run Anything] when running saved configuration via run anything, it becomes unsaved
Bug IDEA-195937 Disable classpath file shortener for java 9+
Bug IDEA-186505 "Ungroup Configurations" doesn't work in the Run Dashboard
Bug IDEA-197466 JDK 11 doesn't have jaxb causing JShell not to load
Bug IDEA-187390 Allow using classpath instead of module path when running applications on JDK9
Bug IDEA-195693 Context help shows 404 page when invoked for a run configuration which don't have special help page
Bug IDEA-188962 "Before Launch" tasks are shared between Run Configuration and its copy
Usability IDEA-128651 Keep duplicate in same folder when duplicating a run configuration
Usability IDEA-193775 No easy way to delete a run configuration
Usability IDEA-169476 Run configurations are too easily deleted
Usability IDEA-181444 Run dashboard: toolbar buttons like ShowConfigutations, Restorelayout, Help should be available when some group or deleted RC is selected
Usability IDEA-181847 RunDashboard: auto-scroll to the running item in case of many items in the view
Settings RepositoryBug IDEA-193023 completion.factors.user.xml should not be synchronized by Settings Repository
Usability IDEA-149733 Settings are not synced when using only read-only sources
Structural Search and ReplaceBug IDEA-200398 Structural search doesn't find all constructor calls
Bug IDEA-195166 Finding same values does not work
Bug IDEA-194520 SSR: search template finds nothing if symbol with qualifier is used
Bug IDEA-195278 Replacing an unqualified method call fails
Bug IDEA-199278 Can't search for default method
Bug IDEA-192548 Structural replace replaces arrays with plain values in method signature and class fields
Bug IDEA-198746 Search target dropdown does not set search target
Task IDEA-193238 File type combo-box for the new design of the Structural Search dialog
Exception IDEA-198357 SSR: com.intellij.openapi.util.TraceableDisposable$DisposalException: Editor is already disposed
Exception IDEA-193171 Existing pattern "all methods of the class (within hierarchy)" fails
Task ManagementFeature IDEA-199282 Pre-Select branch by task name in "Open Task" dialog
Feature IDEA-190710 Tasks plugin does not support time tracking for GitLab
Bug IDEA-185092 Commit message is generated from active changelist not task
Bug IDEA-184079 Switching context by tasks is competing with Restore branch workspace when changing tasks
Bug IDEA-195862 [projectname].tasks.zip is not truncated
Bug IDEA-168220 IDEA freeze up to 1 minute after open "open task" dialog
Bug IDEA-193736 Task intgaration with GitLab does not work - 410: Gone error
Bug IDEA-197824 Cannot type in "Switch to task" dialog
Bug IDEA-189251 Task management: name of newly created local task is not displayed in the toolbar and in the open task dialog
Usability IDEA-85270 Tasks: don't allow empty changelist name format
Cosmetics IDEA-199265 'Switch task' menu item is almost invisible when invoked from main pane
Exception IDEA-199388 Throwable at com.intellij.util.io.HttpRequests.process
TerminalFeature IDEA-191464 Add environment variable to terminal detect if running in IntelliJ IDES
Bug IDEA-200839 Can no longer open specific directory in Terminal
Bug IDEA-193879 IJ Terminal links are not clickable when output hides from viewport (regression)
Bug IDEA-155071 TERM variable should not be set for windows (cmd) terminals
Bug IDEA-191852 Show typed user input in terminal console
Bug IDEA-201601 Sometimes terminal shows broken prompt on IDE startup
Bug IDEA-194928 Terminal console: a few first long lines are not properly carried over to next line
Bug IDEA-200294 Context actions on terminal tabs not working consistently
Bug IDEA-200880 Terminal: resize mouse pointer when hovering over "New session" button
Exception IDEA-187084 StringIndexOutOfBoundsException while executing some action with long output in the Terminal
User InterfaceFeature IDEA-168887 Themes: Ability to customize "speedsearch matching results" color
Feature IDEA-192585 Use special icons for EAP builds at runtime
Feature IDEA-158158 Love the new img you can set on the IDE however (.. flip and mirror)
Feature IDEA-90507 Need tab actions close all to the right/ to the left
Feature IDEA-163208 Add support for MacBook Touch Bar (Magic Toolbar)
Feature IDEA-197685 New SE: Also integrate (basic) "find in path"
Bug IDEA-201446 NullPointerException during using 'FindUsages'
Bug IDEA-200724 IntelliJ IDEA does not fully start after update, ends with window with menubar and nothing else
Bug IDEA-195177 Intermittent tests failure on MacBook with Touch bar in IntelliJ project
Bug IDEA-200379 Native menu bar on Ubuntu Linux: the View menu actions have incorrect state
Bug IDEA-194995 slow scrolling in svg viewer
Bug IDEA-185834 Scope tabs of the Project toolwindow: focus is lost on item deleting
Bug IDEA-195253 Project Settings: Assertion Error exception on add+delete incorrect content root
Bug IDEA-193403 New SE: incorrect integration with other popups
Bug IDEA-193028 "Refactor this..." is not displayed in Touch Bar
Bug IDEA-194208 "Add Language Annotation" quickfix appearance depends on the position of mouse cursor
Bug IDEA-193169 badly rendered SVG icons in Customize dialog
Bug IDEA-192960 Incorrect close button position
Bug IDEA-199585 Svg product icon isn't used when IDE is started from sources
Bug IDEA-192713 focus is lost on opening Find Usages tool window
Bug IDEA-192055 Focus goes nowhere after breakpoint popup
Bug IDEA-199447 Can't select multiple files with [command]-click from Navigate files dialog (regression)
Bug IDEA-193872 New Plugins dialog: search field in "Updates" allows to select plugin that doesn't require update
Bug IDEA-192318 Progress bar in "Getting Started" dialog do not scale correctly in HiDPI
Bug IDEA-198594 Input text box selection does not select to beginning of field if mouse pointer moves left of text box edge
Bug IDEA-197853 CaptureConfigurable table has wrong cell/row height
Bug IDEA-194229 New SE: layouting of "actions" results
Bug IDEA-197801 ContextHelpLabel loses its tooltip after switching to another project type pane
Bug IDEA-194924 TouchBar support: touch bar is not appeared after first IDE launch
Bug IDEA-193383 New SE: please remember last action I typed
Bug IDEA-198321 Unable to create exception breakpoint
Bug IDEA-151200 Ubuntu: Unity menu bar is not available for detached editor tabs and floating tool windows
Bug IDEA-193316 Font setting for IDE appearance is ignored
Bug IDEA-23606 application Run/Debug Configuration main class chooser issue
Bug IDEA-195751 New SE: Dialog doesn't fit screen on HiDPI displays
Bug IDEA-197708 New SE: Include non-project items has no accelerator in "All" tab
Bug IDEA-197287 Holding shift makes it look like you can click on code you can't
Bug IDEA-178171 intention settings: description editor is too small
Bug IDEA-194131 Missing 'Expand All/Collapse All' icons in TODO tool window
Bug IDEA-192976 MacBook Touch Bar: show debugger actions when run configuration is shown in Run Dashboard
Bug IDEA-200654 Search Everywhere not opening file on Linux
Bug IDEA-193536 scaling a composite icon modifies the base icons
Bug IDEA-193789 Settings: Plugins: unable to search in installed plugins
Bug IDEA-196488 Live Templates -> Change Context: keyboard navigation is impossible.
Bug IDEA-198135 Version control toolwindow is not displayed after Enabling VCS integration
Bug IDEA-199619 'Use dark window headers' doesn't affect the Welcome window
Bug IDEA-178692 AppServers View: splitter position is not persisted between sessions
Bug IDEA-195558 'Use dark header' setting is saved immediately
Bug IDEA-197803 ContextHelpLabel becomes too wide in project type settings
Bug IDEA-192303 "Darcula" colors are not replaced with "Light" ones on switching LaF back and forth on Windows
Bug IDEA-193875 Synchronise '' context menu item
Bug IDEA-197937 JDK9 - Wrong debugger toolwindow tab label rendering on HiDPI Linux
Bug IDEA-194018 New Plugins dialog: "enable" link is not visible for a plugin with multiple dependencies
Bug IDEA-133900 Can't type @ in Find/Replace dialog
Bug IDEA-191807 Cannot paste file into Scratches
Bug IDEA-198051 Remove button in Recent project is overlapping the project path
Bug IDEA-199024 GUI stack overflow with "Find in Path" action
Bug IDEA-194795 Exception appears when try to open file chooser from Welcome screen
Bug IDEA-196109 New Installed Plugin page's context menu actions are not DumbAware
Bug IDEA-193493 "Tip of the day" pixelated but correct size with 125% DPI scaling
Bug IDEA-198521 Preview diff in local changes Tab not always shown
Bug IDEA-190948 Dropdown button for elements content in Artifacts panel is not very good looking
Bug IDEA-195589 Structure popup has weird initial size
Bug IDEA-196366 Add ability to customize changes browser toolbar in VCS log
Bug IDEA-193115 TouchBar: dropdown values are not selectable
Bug IDEA-194051 Wrong row height for com.intellij.codeInspection.ui.ListTable
Bug IDEA-193867 Clicking bottom-most 'more' link in new Search Everywhere popup throws IndexOutOfBoundsException
Bug IDEA-197106 DesktopLayout ConcurrentModificationException on startup
Bug IDEA-194712 Messages tool window header is missing "Collapse/expand all" icons
Bug IDEA-193398 New SE: multi selection is not supported
Bug IDEA-201276 Linux Native menu: shortcuts disappeared from main menu panel
Bug IDEA-192720 Selection in Local changes resets when context menu invoked via keyboard
Bug IDEA-193862 Hard crash macOS
Bug IDEA-192691 Wrong title of JetBrains Privacy Policy window
Bug IDEA-194010 New SE: some toggles do not change their state while action performed
Bug IDEA-169693 No Help Available In Cannot Save file dialog
Bug IDEA-186262 Default icons for editor actions are not default for that actions
Bug IDEA-194716 Fatal error reporting with optional files not working correctly
Bug IDEA-197862 No AA in a list (jre 9)
Bug IDEA-195603 IDE crashes on startup
Bug IDEA-192119 Some SVG icons are rendered incorrectly in IDE
Performance IDEA-178384 Too many events from ProgressDialog update (via FileTreeModelBuilder)
Performance IDEA-192424 Editors are leaked forever after opening, via EditorTabbedContainer.CloseTab shortcut
Performance IDEA-198160 Non-disposed HelpTooltip leaks disposed project
Usability IDEA-198537 Settings dialog search: on finding an entry in new Plugins page the plugins list is not filtered and not scrolled
Usability IDEA-153071 Settings > Version Control > Confirmation window resize issues
Usability IDEA-57019 Add support for drag-and-drop files in welcome screen.
Usability IDEA-103803 Customize menus and toolbars - Choose action to add - Usability
Usability IDEA-192403 Touchbar support for Select in > Project view
Usability IDEA-199392 Incorrect menu spacing on macOS
Usability IDEA-193841 New "Search classes" does not show outer class for inner classes
Usability IDEA-166944 Reopen project: a way to save half a click
Usability IDEA-196288 Icons for "Commit" and "Set Active Changelist" are almost identical
Usability IDEA-198129 Mac: impossible to switch to Diff Window with a shortcut after switching to the project
Usability IDEA-200298 Show the first unsubmitted error when clicking on the "Fatal Error" icon in the status bar
Usability IDEA-190216 Hard to resize quick doc popup
Usability IDEA-197044 Run configuration doesn't fit the screen
Usability IDEA-197645 Tools | 'Internal Actions' menu is too long
Usability IDEA-191113 Don't show "Background tasks running" if we know the tasks can be safely resumed
Usability IDEA-195309 Support Ctrl+Backspace in SpeedSearch
Usability IDEA-195300 "Copy relative path" should exist in the keymap, or somehow lead to "Copy reference"
Usability IDEA-198538 Search Everywhere / Find Action: on finding an entry in Plugins page the plugins list is not filtered and not scrolled
Cosmetics IDEA-193385 New SE: cursor keeps improper shape
Cosmetics IDEA-198742 Markdown "Auto-Scroll Preview" Button Looks Like "Download"
Cosmetics IDEA-191307 Update "Create Gist" Git Octocat icon to white cat in black circle
Cosmetics IDEA-134373 File type icon on windows title bar doesn't reload for non-physical files
Cosmetics IDEA-193276 Strange gray rectangle instead of disabled value when moving Class
Cosmetics IDEA-194379 Auto-hide scrollbar on OS X similar to how default scrollbars work
Cosmetics IDEA-196183 TODO view: trim the ending spaces in the changelist name when displaying it in TODO view tab
Cosmetics IDEA-169819 "New Window" button in open project dialog has extra space
Cosmetics IDEA-118069 Untidy one-pixel gap between border and toolbar buttons
Task IDEA-195244 Merge two 'Version' comboboxes in repository library settings dialog
Task IDEA-196095 Update icons for Build tool window statuses
Task IDEA-197166 Increase click and hover zones for the close button for Manage Recent Projects popup and Welcome Screen
Task IDEA-188160 Make terminal tabs the same as other tool window tabs
Task IDEA-194353 Change focus border for field and combo in table cell
Exception IDEA-186452 StackOverflowError on setting Floating mode for console
Exception IDEA-195533 NPE in RequestFocusInToolWindowCmd
Exception IDEA-193393 TouchBar: exception is thrown after cancelling Project Structure window
Exception IDEA-193575 New SE: ClassCastException on selecting filter criteria
Exception IDEA-199072 java.util.ConcurrentModificationException
Exception IDEA-200273 Exceptions: GlobalMenuLinux - Unable to register window and AppMenu-service can't register xid
Exception IDEA-200919 ClassCastException: java.base/jdk.internal.misc.Unsafe cannot be cast to jdk.unsupported/sun.misc.Unsafe
Exception IDEA-191859 Using this EAP caused my Mac to hang twice today. I had to restart. It looks this version is completely broken.
User Interface. AccessibilityBug IDEA-193617 Accessibility issue with ComboBox and the Win10 LAF
Bug IDEA-200351 can't escape diff dialog when screen reader is enabled
Bug IDEA-201167 File tree in Commit dialog and Revert changes are not accessible for Jaws
Bug IDEA-182960 Screen Reader Accessibility: Autocomplete
Bug IDEA-201273 Problem with User Agreement Accessibility
Bug IDEA-199219 tables in dialogs not accessible
Bug IDEA-201843 NavBar popups are closed on up/down/speed search
Usability IDEA-192637 NVDA: Debugger
Task IDEA-195260 UI element with line numbers and debugging graphic not accessible to screen readers
User Interface. ControlsBug IDEA-201124 Linux native menu: main menu appears on a toolwindow in windowed mode
Bug IDEA-193777 Cannot switch on 'Show function keys on touchbar' feature
Bug IDEA-195717 Clicking directly on the arrow in the intention's menu has no effect unless it's done more to the right
Bug IDEA-195921 Toolbox buttons are cropped on hidpi displays with non-default UI font size
Bug IDEA-196307 Stripe buttons layout is broken after 'move to top/left/bottom/right'
Bug IDEA-197998 Multiline TODOs: multiline values are not displayed in toolbar on macOS
Bug IDEA-196606 Floating toolwindows can't be moved
Bug IDEA-197936 New SE: unable to use Ctrl/Cmd to expand selection
User Interface. FocusBug IDEA-196291 IntelliJ is sometimes not persisting files to file system
Bug IDEA-199344 The "Find In Path" action throws TypeAheadTimeoutException
Bug IDEA-196542 Exceptions from intentions are logged as info, not error
Bug IDEA-186820 Escape key often stops moving focus from a tool window back to the editor
User Interface. GraphicsBug IDEA-193488 Tool windows blur text when slide in/out
Bug IDEA-199416 IDEA startup NPE if no 'icons' specified in theme file
Bug IDEA-195624 wave underscore is partially bold
Bug IDEA-195614 IAE in EffectPainter2D
Bug IDEA-195981 Validation errors: bugs
Cosmetics IDEA-197371 Add down arrow in "Go To Changed Files" in diff dialog
User Interface. Look and FeelBug IDEA-200278 Background in editor doesn't change according to color scheme
Bug IDEA-200845 Editor color scheme is not applied when switching between custom themes
Bug IDEA-200171 High Contrast Theme: Editor color scheme remains "High Contrast" after changing theme from "High Contrast" to "Darcula"
Bug IDEA-195856 IDEA fails to start on Java 10
Bug IDEA-183573 printing a PHP source always encases the text in a background color (Darcula)
Bug IDEA-200591 White editor for Darcula scheme by default
Cosmetics IDEA-193982 Problem toolbar menu item's icon seems disabled when enabled
Cosmetics IDEA-191671 Mac menu icons don't handle Darcula well
Task IDEA-198114 Remove GTK/Windows native LookAndFeel support
User Interface. NavigationFeature IDEA-198407 Add nullness annotations to base SearchEverywhereContributor class
Feature IDEA-184492 "File..." action is suggesting folders
Bug IDEA-201308 New SE: Actions descriptions is not shown in status bar
Bug IDEA-199862 No selection until search is not finished
Bug IDEA-195792 No file name completion in File Choosers
Bug IDEA-201051 New SE: Use "Tab" key for command autocomplete
Bug IDEA-201937 Search Everywhere shortcuts: Ctrl/Shift+Tab shortcuts set for tabs switching do not work if Tab shortcut is set for "Select item" action
Bug IDEA-196250 It is impossible to invoke "Recent files" action from the "find action" popup.
Bug IDEA-199768 New SE: remove duplicates on "All" tab
Bug IDEA-199517 Add Run Configurations to new SE
Bug IDEA-198579 Freeze while searching files by name during indexing
Bug IDEA-195557 Cannot close splitted editor part after switching original editor
Bug IDEA-199664 [Run config in the new SE] hints to run or to debug configuration are mixed with each other and should be vice versa
Bug IDEA-196401 Don't show "no classes / files /symbols found" when files are found
Bug IDEA-200462 New SE: Add statistics
Bug IDEA-199403 New SE: skip other contributors results when search with command
Bug IDEA-199757 Fuzzy search works with folders only if slash filled in
Performance IDEA-200920 Goto File is slow
Usability IDEA-198002 New SE: part of the popup is outside the screen
Cosmetics IDEA-198030 New SE: Search item full name is overlapped by scrollbar
Cosmetics IDEA-199666 [Run config in the new SE] run config name and hints doesn't change a font color to white when is selected
User Interface. Project ViewBug IDEA-192364 Problems with opening multiple files when Scoped view is selected
Bug IDEA-191952 Scopes view: flatten packages doesn't work
Bug IDEA-189991 File changes external to project tree view cause collapse and reset
Bug IDEA-192786 Wrong directory is highlighted during moving files to Scratches
Bug IDEA-189742 Items in Project View remain highlighted as incorrect after deleting the class with uncompilable code
Bug IDEA-195578 New files do not show on package view
Bug IDEA-196319 Non-project/excluded from custom scope folders are still visible in project view
Usability IDEA-182143 Edit Scopes option only appears in Project tool window's menu when a custom scope is selected
Usability IDEA-194516 Issue when changing error color
Cosmetics IDEA-168362 Inconsistent labels in Project Tree View
Version ControlFeature IDEA-52927 Version control: Unversioned Files: provide possibility to specify the amount of unversioned files that would be shown in separate view
Feature IDEA-66943 Add "Revert Commit" action to file history context menu for Git
Feature IDEA-193058 Update commit legend UI
Feature IDEA-160857 Unversioned Files in Commit Changes dialog: support delete shortcut (DEL)
Feature IDEA-63893 Show current branch on Commit Dialog
Feature IDEA-193537 Update "Commit Message History" action UI
Bug IDEA-183551 Copy As Patch to Clipboard enabled only on files
Bug IDEA-193195 Compare Before with Local should support file move
Bug IDEA-192877 Git: CheckOut Tag Or Revision: on the first invocation some tags are not available in completion
Bug IDEA-192793 SelectChangesGroupingActionGroup doesn't work via Quick Actions Popup
Bug IDEA-194895 Git annotate: "Number of lines annotated by git is not equal to number of lines in the file ..."
Bug IDEA-188052 Tasks create branches with quotes
Bug IDEA-151064 Show Diff action is not available in annotations of an old revision
Bug IDEA-197154 Exception when highlighting a VCS file version opened via Browse Repository at Revision
Bug IDEA-106293 VCS gets confused if you revert changes quickly
Bug IDEA-192474 Annotate fail in error
Bug IDEA-198676 TODO appears in list several times on 'Review TODO' with selected 'Check TODO'
Bug IDEA-196914 Compare with local is disabled for directories in Mercurial History
Bug IDEA-193116 "Compare with Local" doesn't work with "added" shelved files
Bug IDEA-190095 File Mismatch When Unshelving Changes
Bug IDEA-191782 No tooltip for new button containing "ignore" actions in Changes view
Performance IDEA-195871 VcsRootScanner adds everything under a symlinked directory into the VFS
Performance IDEA-131357 Idea stucks after "accept mine" for 100 files in merge dialog
Performance IDEA-174636 Unregistered VCS root scanning, which happens in the Settings | Version Control, should be moved out of the EDT
Performance IDEA-199583 Files affected by revision is slow when invoked from annotation markers
Usability IDEA-171261 Cannot delete last changlist
Usability IDEA-184616 'Reword commit" do not add/alter item in commit message history
Usability IDEA-196963 Unclear dialog options in abort/rollback
Usability IDEA-131325 VCS Commit Message box is using the caret foreground from "Generic" but background color is not inherited from "Generic"
Usability IDEA-195922 Local changes: Focusing an empty changelist doesn't remove the preview diff
Usability IDEA-186415 Clear metadata associated with changelist after first successful commit
Usability IDEA-199471 Add Shortcut to open Diff from annotations without invoking contex menu
Usability IDEA-199656 Changelists should be expanded by default, and should retain the state
Usability IDEA-198769 Provide better progress indication for the Show Affected Paths dialog
Usability IDEA-193296 Assign default shortcut for the "Set Active Changelist" action
Usability IDEA-192073 Missing 'Expand All/Collapse All' icons in VCS Local changes
Usability IDEA-140866 Conflict in button's keyboard shortcuts in the Code analysis failed dialog
Cosmetics IDEA-195273 Default Changelist Changelist
Cosmetics IDEA-195248 Dialog Add File to Git, change Yes/No buttons to Cancel/Add File to Git
Cosmetics IDEA-197717 Edit Changelist should have default shortcut
Cosmetics IDEA-82955 Windows-specific setting name
Exception IDEA-200051 IllegalStateException: Cannot find content provider for vcs hg4idea
Version Control. GitFeature IDEA-88818 When creating .idea directory, automatically put inside a .gitignore containing workspace.xml and other files which have to be excluded from the VCS
Feature IDEA-75835 Init Git projects submodules automatically or by asking user at least?
Feature IDEA-95494 Copy some files from one branch to another branch
Feature IDEA-160208 Git Fetch multiple roots in parallel
Feature IDEA-192369 Allow configuring Local changes toolbar in "Appearance & Behavior | Menus and Toolbars"
Feature IDEA-192678 Multiple Github accounts: show login dialog if attempt to perform the remote operation fails
Feature IDEA-64024 Git submodules should be supported
Feature IDEA-147018 Delete git tag
Feature IDEA-133270 (Git) Annotate should retain history through file renames.
Feature IDEA-184293 Create a .gitignore on enabling VCS integration in new projects
Bug IDEA-197913 File History on a submodule folder shows the log of the submodule repository
Bug IDEA-170013 Git Native SSH with passphrase fails with Permission denied
Bug IDEA-149060 Modified files in one of repositories are often moved to the active change list
Bug IDEA-169002 Git submodules: Diff invoked for submodule entry shows 'fatal:bad revision...' message
Bug IDEA-193134 Multiple Github accounts: clone doesn't suggest github repositories if you are not logged in to all accounts
Bug IDEA-196449 IntelliJ tries to set git username and email for non-git vcs roots.
Bug IDEA-194991 Annotation tooltip is huge and empty
Bug IDEA-196072 Git Rebase dialog - Onto branch not persistent
Bug IDEA-199966 Git: .gitignore created on enabling git in project should not contain absolute paths
Bug IDEA-194286 Continue rebase doesn't refresh file status
Bug IDEA-193934 Git clone --recurse-submodules checkouts submodules in detached state which breaks Update project
Bug IDEA-198723 Git Submodules: project update doesn't update submodule project if the submodule is on branch
Bug IDEA-194449 New Git root is not detected until restart, if added externally as a submodule or under a new subdirectory
Bug IDEA-198271 Git: Native SSH: if password authentication is used, the password can't be remembered
Bug IDEA-192771 Git commit partially causes change CRLF to LF.
Bug IDEA-196117 Have not understood this message, there is a grammatical mistake
Bug IDEA-198952 Rejected push in a submodule fails if "Update non-rejected repositories as well" is not selected
Bug IDEA-199226 Git "Browse Repository at Revision" panel is not available in dumb mode
Bug IDEA-168999 "History up to Here" for a submodule folder shows empty history
Bug IDEA-100075 Git submodule commit should make parent repository re-request Git status to show updates to the submodule folder itself
Bug IDEA-195466 Status of new files is not parsed if `git add -N` was used
Bug IDEA-198264 Git: Native or built-in SSH: correctly process the invalid (empty) passphrase
Bug IDEA-193259 Git: Browse Repository At Revision: on new revision tab opening move focus there
Bug IDEA-186342 Cherry-pick with auto-commit uses full hash in the suffix, while cherry-pick showing the dialog uses short hash
Bug IDEA-198360 Git: built-in SSH: if the saved password doesn't match, allow to enter the new one
Bug IDEA-200864 Update Project doesn't fetch submodules
Bug IDEA-195270 Missing notification about invalid Git roots
Bug IDEA-187116 IDEA doesn't recognize Idea project on checkout project from Git
Bug IDEA-193688 Squash message editor starts with an extra line break
Bug IDEA-198951 Pushing main repo with submodule with reject leads to "not on branch" AssertionError
Bug IDEA-193260 Git: Browse Repository At Revision: JumpToSource action for folders is enabled but doesn't work
Bug IDEA-198727 Git Submodules: Annotate is enabled in the Diff view for the submodule entry but returns 'fatal: bad object'
Bug IDEA-199263 Confusing "Add file to Git" dialog choice
Bug IDEA-200448 VCS Git "Fetch" does not refresh the VCS "Log" view
Bug IDEA-156454 No Unstash of uncomitted changes when cancelling Git Rebase
Bug IDEA-172234 Git Branches Popup Menu does not pop up at all
Bug IDEA-196286 Git Reword Commit sometimes throws an exception when trying to find a commit to reword
Bug IDEA-192906 Git Push with Rebase puts all changes into the Default changelist
Bug IDEA-193239 Incorrect branch names shown for "checkout with rebase" and for interactive rebase operations
Bug IDEA-199969 Git: .gitignore is created in the project root on git repository creating in one of its subfolders
Bug IDEA-193140 Can't undo rewording of a commit made before a merge commit and get an exception
Bug IDEA-191992 Files Merged with conflicts shows only one branch name
Bug IDEA-197249 Builtin-SSH: fails when git protocol.version 2 is enabled
Bug IDEA-108316 Unregistered Git roots are not auto-detected if they are more than 2 folder levels deep than any project module
Bug IDEA-192800 Allow force push is available in Find action but does nothing
Bug IDEA-192531 Clone from github: incorrect behavior in case of github accounts configured but w/o saved credentials
Bug IDEA-193141 Git: on saving file after Reword Commit performing i often get the File Caches Conflict dialog
Bug IDEA-201054 Git: native SSH: confusing dialog on attempt to connect to (yet) unknown host
Bug IDEA-200107 Exception when invoke Default Settings from Welcome screen
Bug IDEA-197506 Git clone operations are not listed in log
Bug IDEA-193788 Git: Submodules: attempt to merge conflicts fails
Bug IDEA-199761 File names with trailing spaces break git diff
Bug IDEA-199003 git commit failed with "the following paths are ignored by one of your .gitignore files"
Bug IDEA-196503 Git: Partial Commits: when ShowDiff is invoked for file in specific changelist should display changes from this changelist
Performance IDEA-196535 2018.2 constant java processes
Performance IDEA-193442 Git Cherry-Pick became slower because of long process of searching for containing branches
Performance IDEA-197868 Branch listings extremely slow with many remote branches
Usability IDEA-192982 Multiple Github Accounts: if default account is selected and you are logged in, use this account for sharing and skip not authenticated ones
Usability IDEA-197543 Native SSH doesn't allow to save the passphrase or the password
Usability IDEA-192333 Automatically register Git submodules as VCS roots
Usability IDEA-199926 Scanning for Git roots in a project should skip known third-party libs locations
Usability IDEA-195155 Rebase Branch - Onto box should default to refs/heads/master if there is no tracked branch
Usability IDEA-155587 Git action "Checkout with Rebase" has counter-intuitive name
Usability IDEA-187320 "Show history for revision" action name is unclear
Usability IDEA-163630 "Cherry-picked from" suffix should be optional
Usability IDEA-180118 Interactive Rebase: Clicking Cancel in the dialog to enter a message for Squashed commits should cancel rebase.
Usability IDEA-144072 Sort order of branch names in git branches drop-down lists is not alpha-numerical (Rebase, Branch Widget etc)
Usability IDEA-124453 Update Project should not fail completely when some module can't be updated (have no remotes, doesn't have a tracked branch, is in detached state, etc)
Usability IDEA-194090 Protected branches do not prevent branch deletion
Usability IDEA-190367 Shortcut for git branch by default
Usability IDEA-183867 Ignore whitespace changes in annotations for git option
Usability IDEA-83415 IDEA should "git commit" when possible instead of always calling "git commit --only" with paths
Usability IDEA-167671 No simple shortcut for Force push
Usability IDEA-144948 Branch list in Git Rebase dialog should include remote branches
Cosmetics IDEA-198272 Git: change the tooltip text for "SSH executable" option in Settings
Cosmetics IDEA-198989 Broken html in remotes dialog
Cosmetics IDEA-198247 Use smoother scaling for avatars in GitHub accounts panel
Exception IDEA-194024 AssertionError at git4idea.rebase.GitRebaseLineListener.onLineAvailable
Exception IDEA-197947 ISE at git4idea.commands.GitNativeSshGuiAuthenticator.askKeyPassphraseInpu
Exception IDEA-193107 IllegalArgumentException trying to open Branches menu in the detached HEAD state
Exception IDEA-192978 kotlin.UninitializedPropertyAccessException at org.jetbrains.plugins.github.GithubShareAction$Companion$shareProjectOnGithub$1.onSuccess
Version Control. LogFeature IDEA-130845 Log: add action to go-to-parent and go-to-child
Feature IDEA-199867 Support Back and Forward navigation in VCS Log
Feature IDEA-170988 Add Diff Preview to File history view
Feature IDEA-190615 Explore the source code based on specific revision
Bug IDEA-198803 VCS log shows garbage in "author" field, looks like a corrupted index
Bug IDEA-193814 com.intellij.openapi.vcs.VcsException: Index: 1, Size: 1
Bug IDEA-199655 Unable to see git diff from file history for renamed file for commits made before rename
Usability IDEA-130970 Git Log: search for filter string both in hashes and in strings
Usability IDEA-160834 Log: do not display 2 progresses when filtering
Usability IDEA-194808 Branch filter should take repository filter into account
Cosmetics IDEA-195976 Fix progress bar in VCS Log in darcula
Task IDEA-191611 Update toolbar in VCS Log
Version Control. MercurialFeature IDEA-187194 Add compare action to the branch popup menu for Mercurial
Bug IDEA-193378 Merurial push/pull not working - hg4ideapromptextension returns AttributeError: 'module' object has no attribute 'Abort'
Cosmetics IDEA-187924 Mercurial: Project update - Cropped text
Version Control. PerforceBug IDEA-193396 Perforce: 2 default changelists are displayed by default, and the one not marked as default can't contain any changes
Bug IDEA-183743 Use file revision encoding when comparing file contents
Version Control. SubversionFeature IDEA-75033 Add option to immediatly switch to a new branch when branching from repository location
Bug IDEA-198691 Version Control: Error updating changes: For input string: "UNDEFINED"
Task IDEA-197126 Remove "Update administrative information only in changed subtrees" option
Exception IDEA-198536 After upgrading to IDEA 2018.3 EAP - Subversion History fails with error
XMLFeature IDEA-199839 Support deprecation in xsd schemas
Bug IDEA-142045 XML attribute is highlighted with red but validation succedes (using xml schema with restriction xs:list > xs:enumeration)
Bug IDEA-197050 IntelliJ doesn't find my namespaces when using autocompletion in an XML Schema file
Bug IDEA-151043 code completion sometimes does not suggest enumeration values when used with extension or union
Bug IDEA-78840 generate xml from xsd fails
Bug IDEA-194328 Bundled XMLSchema-instance.xsd refers to nill- instead of nil-attribute
Bug IDEA-195872 IntelliJ marks "Element is not allowed here" an Element which is allowed to configure
Bug IDEA-199694 XML reformatting does not preserve line breaks when the comments are at the end of the file
Performance IDEA-193127 DomFileIconProvider loads AST unnecessarily
i18nBug IDEA-179826 Refactor|Rename is unavailable for Resource Bundle in Project Tree
DB ConnectivityFeature DBE-5294 Auto-reconnect to db after "db timeout / disconnect / ssh timeout" feature
Usability DBE-6655 Custom JDBC driver configuration workflow
DB ConsoleFeature DBE-4949 Possibility to set default Isolation Level
Bug DBE-6889 MySQL execute procedure in console produces "[S1000] Operation not allowed after ResultSet closed" error
Bug DBE-7121 AbstractMethodError with Informix JDBC driver in Database Console
Bug DBE-7298 IndexOutOfBoundsException occurs on opening "Parameters" dialog if there are no parameters in query
Bug DBE-6751 Execute stored procedure: specify type length for the result or otherwise (if infer type length is not possible) indicate that the script is invalid
DB DiffBug DBE-7066 Migrate left right shouldn't synch both
DB IntrospectionFeature DBE-7198 DataGrip Should Provide Pattern to functionNamePattern in DatabaseMetaData.getFunctions() call.
Feature DBE-4366 Support for EXTENSIONS in PostgreSQL
Bug DBE-7150 Triggers not showing for MariaDB ver. 10.1.34
Bug DBE-4559 MS SQL Server index condition (filter definition)
Bug DBE-6896 Synchronizing a Database (Intersystems Caché) forgets the Schema
Bug DBE-4693 Column is missing from FK as displayed in Database tool window
Bug DBE-6863 PostgreSQL 11 Stored Procedures incorrectly show as functions in the Database pane and cannot be deleted
Bug DBE-7201 Uninformative "Project Data Sources: re-sync required"
Bug DBE-6362 Redshift view with no schema binding - unable to inspect columns
Bug DBE-6553 NPE when sync DB structure on already droped tables
Bug DBE-6324 DataGrip does not understand "included columns" of MS SQL Server indexes
Bug DBE-7234 Unknown system variable 'storage_engine' when trying to connect to MySQL 5.7
Exception DBE-6818 Postgres 11 broke backward compatibility (columns proisagg and proiswindow are dropped from pg_catalog.pg_proc)
DB RefactoringBug DBE-7205 Default SQL value wrongfully becomes string in "modify table" dialog
Bug DBE-6663 MYSQL: Drop table command does not encapsulate table name
Bug DBE-6616 Cannot delete database
Bug DBE-7103 Extra engine alteration
Data Import & ExportBug DBE-7012 Cannot import into table with ENUM field
Bug DBE-7019 JSON groovy extractor provides 1.0E8 instead of 100000000
Bug DBE-6312 Incorrect string parsing in batch script execution
Usability DBE-7015 Export to Database: do not re-execute the select query if possible
Data ViewsFeature DBE-6693 Qualify table and routine names in editor tabs
Feature DBE-4100 Feature Request: Show column comments in tooltips
Feature DBE-4150 Show # of selected rows in IDE
Bug DBE-2444 Can't select total row count of PostgreSQL table while a column is being sorted
Bug DBE-1858 Fiter in database table view does not apply to query result after cleared
Bug DBE-5204 Database Table DDL does not open in active window group
IDE GeneralFeature DBE-6502 YAML plugin in DataGrip
Feature DBE-2614 Add support for opening SQLite files from command line
Feature DBE-7036 DataGrip is missing "Report a Problem" menu item under Help.
Bug DBE-6544 Fail to generate pojos.groovy on view in database
Bug DBE-7116 Publish GitHub Integration plugin along with Git Integration
Cosmetics DBE-4250 Inconsistent Invalidate Cache / Restart location
Navigation & SearchBug DBE-6796 Consider data source group in Go to actions and other places where I'm choosing some database object
Usability DBE-5459 Remove storage files from "Go to file"
SQL CompletionFeature DBE-2285 Completion for sum() and avg() functions
Feature DBE-6989 Customisable aliases for tables when auto-completing SQL queries
Feature DBE-2854 Automatic alias
Feature DBE-850 Expand column list improvements
Feature DBE-2282 'Create table definition' suggest bad type
Feature DBE-6411 MS SQL: INSERT INTO [TABLE] ([ALL COLUMNS SUGGESTION])
Feature DBE-2242 Completion for sql select should show "all columns" as for insert into
Feature DBE-5940 don't suggest aliases for table names
Feature DBE-4770 GROUP BY completion should offer non-aggregated columns from SELECT clause
Bug DBE-5948 sql completion does not suggest distinct in count() on sql server
Bug DBE-6536 Inapplicable autocomplete suggestions - table ailas after table alias
Bug DBE-7049 Bad completion for avg() and sum() functions in Postgres
Bug DBE-5163 create index column autocomplete defaults to all columns
Bug DBE-5654 Duplicates in completion
Bug DBE-2852 Setting to select table order in ON-clause
Bug DBE-5591 Autocomplete for the FILTER (WHERE ...) clause of an aggregate function is not correct
Bug DBE-4656 Bad completion for window functions
Bug DBE-2824 Live template problem
Bug DBE-6895 Autocomplete and changing join type
Bug DBE-7128 Duplicate "INTERVAL" completion suggestion
Bug DBE-6778 Code completion doesn't suggest column types in create table statement for sqlite console
Bug DBE-5981 suggested alias should not have hash sign for temp tables on sql server
Bug DBE-4848 Code Completion: stored procedure with named parameters (Sql Server)
Bug DBE-4981 REGEXP_COUNT is an unknown database function
Bug DBE-6541 Complete function parameters in drop function statement
Bug DBE-5358 "Qualify Object on code completion" setting "Always" breaks postgresql updates
Bug DBE-6954 Improper syntax completion for functions
Bug DBE-4246 If inside brackets, on completion item selected dot is inserted incorrectly
Usability DBE-6606 "NOT NULL" should be suggested before "NOT FOR REPLICATION"
Usability DBE-5660 Better completion in Modify Table for SQLite
Usability DBE-7032 Improve completion for joins
Usability DBE-6450 Remove SELF argument from autocomplete prarmeter list of PLSQL Object type method
Usability DBE-3518 Autocomplite default inside values
Configuration Problem DBE-5511 Can't disable MySQL JOIN alias autocomplete
SQL GenerationFeature DBE-7025 Support SQL Generator `IF NOT EXISTS` option
Bug DBE-7129 Query plan visualizer doesn't work
Bug DBE-6992 Reshift Generic: invalid SQL generation for routines
Bug DBE-7195 In "Database Changes" window, right-clicking on a single function/view and clicking on "revert" reverts all changed objects!
Bug DBE-6743 MariaDB: Support CREATE OR REPLACE PROCEDURE
Bug DBE-7180 Several PostgreSQL rule issues with the Source Editor
SQL HighlightingFeature DBE-3109 Please add an inspection for unused field of subquery
Feature DBE-4999 Need temporal table support in SQLServer Dialects
Feature DBE-1456 Show warning on DELETE FROM without WHERE clause
Feature DBE-6759 highlight if JOIN aren't paired with ON
Bug DBE-7007 MySQL dialect constantly resets after IDE restart
Bug DBE-6975 Support 'or replace, materialized view, precomputed' syntax
Bug DBE-4709 SQL statement parse error with slash at end of line
Bug DBE-6761 PostgreSQL 10 drop function without arguments
Bug DBE-6303 SQL integration: "AT TIME ZONE" not recognised for Microsoft SQL Server
Bug DBE-6853 Newline concatenation with a bind variable in COPY command is erroneously not recognized as a valid syntax with Postgres
Bug DBE-6844 Invalid "Ambiguous column reference"
Bug DBE-6830 'ON' is not treated as value
Bug DBE-5919 DataGrip: Color coding when calling a user defined procedure with SQL Server global variables does not work
Bug DBE-7065 Support schema qualification syntax in CREATE OPERATOR FAMILY
Bug DBE-5635 Redshift: support varchar(max) syntax
Bug DBE-6848 Unresolved reference for alias in Redshift
Bug DBE-6862 Syntax for Oracle's sample.
Bug DBE-6817 Oracle ~= (not equals) operator causes parse error
Bug DBE-4774 MySQL: "where" keyword in select statement is highlighted as error
Bug DBE-6125 PostgreSQL support USING NEW INTO syntax
Bug DBE-7112 Incorrect error highlighting in HSQLDB mode
SQL ResolveBug DBE-6676 Quoted Identifiers are case insensitive SQL Server
Bug DBE-6641 User table not properly parsed
Bug DBE-6947 Some MySQL 8 functions aren't resolved
User InterfaceFeature DBE-6753 Can not drag Data Source to a group
Feature DBE-6537 Database view: add database element to a favourites by Drag and Drop
Feature DBE-6797 When renaming a datasource, interpret slashes as groups or interpret slahes in datasource names as groups
Bug DBE-6551 Database coloring stops working for some Editor tabs on project re-opening
Bug DBE-2390 Data Statistic Error
Bug DBE-6808 Gutter color is not respected
Bug DBE-6443 Default row height int "Modify Table" dialog is equal to the biggest row in the dialog
Usability DBE-6679 Provide an easy way to create custom Data Source
Usability DBE-6527 Cannot create datasource with MSSQL jdbc driver
Usability DBE-6799 Moving a datasource to a parent group that has no direct child only possible via "new..." group
Build toolsFeature WEB-34701 Run Anything: add npm tasks
Exception WEB-34650 InvocationTargetException when debugging npm script with node 6.x
CSSFeature WEB-6176 Add refactoring: "Move CSS ruleset to a different file"
Feature WEB-10307 Multiline TODOs for CSS/LESS/SCSS/Stylus/PostCSS
Feature WEB-22 Code cleanup - sort CSS properties by name inside declaration
Feature WEB-24381 Extract Ruleset intention action
Feature WEB-19525 Add "Keep Maximum Blank Lines" to Settings -> Code Style -> CSS
Feature WEB-35114 Stylesheet languages code style: add an option to control blank lines around nested selectors.
Feature WEB-34312 Add intention action: replace CSS var() function invocation with its fallback value
Bug WEB-35555 Some CSS pseudo-selectors are highlighted red in the editor
Bug WEB-34017 Unknown CSS property 'row-gap'
Bug WEB-10143 Code readability in css color preview
Bug WEB-35249 'Rearrange Code' action messes up CSS file if it contains import
Bug WEB-34155 CSS frames() function is marked as unknown
Bug WEB-35230 CSS formatting: 'Keep single-lines blocks' option affects blank lines
Bug WEB-34177 Value of css attribute stroke-width can be a number
Bug WEB-61 CSS optimization bug
Bug WEB-27101 ::slotted(*) css pseudo-element is highlighted red
Bug WEB-34825 Emmet in stylesheet comments
Bug WEB-20810 Css Custom Properties will be in error if you are in both the transform and calc
Bug WEB-33182 Intellij complains about valid css
Bug WEB-34176 stroke-linejoin. Add available values
Performance WEB-34434 "Unused CSS selector" inspection overloads CPU
Usability WEB-35153 Group code style pages for style sheet languages in Settings
Usability WEB-35013 Sort CSS properties: restore default custom order
Task WEB-35196 No reason to have different code style settings for CSS and PostCSS
Exception WEB-34806 Invalid comment range on file opening on comments searching
CoffeeScriptFeature WEB-12464 Add support for JSX syntax to CoffeeScript
Bug WEB-29109 CoffeeScript formatting of 'export default'
Bug WEB-32860 Local class properties/methods not being properly indexed
Bug WEB-32486 Coffeescript: splat operator in object definitions marked as error
Bug WEB-24288 Coffeescript - regex with whitespace considered bad code
Bug WEB-22252 Existential Operator Not Properly Parsed With Assignment to Function Result After Valid Space
Bug WEB-34887 support coffeescript re-export statement
Bug WEB-33733 CoffeeScript: JSX: export default should be highlighted as unused when it is unused
Bug WEB-15683 CoffeeScript: Red code: incorrectly parsed slash symbol
Bug WEB-33782 CoffeeScript: prohibit use of JavaScript Postfix Templates
Bug WEB-32981 [CoffeeScript] Uncorrect highlight "not" keyword
Bug WEB-14981 Existential Operator `?` on newline marked as invalid syntax, while invalid `?` usage is not marked
Bug WEB-34889 wrong autoformatting in coffeescript with exports
Bug WEB-33736 CoffeeScript: JSX: React import should not be highlighted as unused for stateless components
Bug WEB-31789 Coffeescript highlight OR= operator error
Bug WEB-33731 CoffeeScript: JSX: correctly highlight XML tags
DartUsability WEB-28503 Possibility to specify Dart Dev Server port for a Web app to facilitate using local storage such as indexeddb
DebuggerFeature WEB-23258 Configurable remote mappings for "Attach to Node.js/Chrome" run configuration
Feature WEB-32096 Show coverage on source files when source maps are used
Feature WEB-33127 JS Coverage: Show correct coverage for css
Bug WEB-33128 JS Coverage: Rename in Coverage toolwindow
Bug WEB-34783 Docker on Windows: ports are not bound automatically
Bug WEB-34520 Support BigInt type in Debugger
Bug WEB-35613 Can't run Node debug session if there mappings for 127.0.0.1 in /etc/hosts
Bug WEB-34537 Cannot attach to remote nodejs after upgrade to 2018.2
Bug WEB-34206 Webstorm 2018.2: "Debugger Console" view missing from Debug window with Node 6.x
Bug WEB-33528 Out of memory when debugging React Native application
Bug WEB-34890 IDE can't connect to Chrome - 'Waiting for connection to localhost'
Bug WEB-33170 Breakpoints not matched properly
Bug WEB-34407 Debugger controls do not work when debugging code executed within a VM
Bug WEB-35218 Can't debug Node.js: path no program files is considered as incorrect
Bug WEB-34483 Run/Debug Configurations: .NET Project : Browser/Live Edit. Confusing button in the web address field
Bug WEB-33151 NPE when hovering over field declaration during debug session
Bug WEB-34132 Exception on JS debugging on a local node server
Bug WEB-34605 Debugger stops on EVERY same-named source file while debugging Node JS remotely using "Attach to Node.js/chrome"
Bug WEB-33044 Debugger stops on muted breakpoints in React native app
Bug WEB-33020 IndexOutOfBoundsException when stop JS 'Run with coverage'
Bug WEB-33398 CSS Coverage is shown for the generated .css, not for the apprepriate .sass file
Bug WEB-33033 IntelliJ 2018.1.3 does not show frames when debugging webpack
Bug WEB-33397 No CSS coverage for 'Web Starter Kit' project
Bug WEB-30584 Source mapped breakpoints have unexpected behavior in async code
Bug WEB-33095 Breakpoint is not hit in multi-module node projects bundled with webpack
Bug WEB-34822 'this' is wrongly evaluated with sourcemaps in Variables view
Bug WEB-33667 Child process debugging doesn't have async call stack when using Node 8 'inspect-brk'
Bug WEB-33119 Wrong file path in Console when debugging a Vue app
Bug WEB-33419 Debugger tooltip shows value for the variable one line above
Bug WEB-35037 Variables from outer function appear in shorthand arrow function scope
Bug WEB-35530 React Native build doesn't start with 'react-native' package
Bug WEB-34990 Debugger doesn't update breakpoints positions
Bug WEB-35084 @angular/cli: duplicated AppComponent in variables | local | this
Bug WEB-34895 Can' debug react native app with react-native@0.57.0
Bug WEB-32763 Debugging hangs on Facebook API
Bug WEB-33604 Infinite 'Loading value' when calculating a variable
Bug WEB-33328 Node.js remote debugger ignores breakpoints in .ts file inside Docker container
Bug WEB-14424 IntelliJ can't debug into node_module entries that are created by NPM Link
Bug WEB-33878 NodeJS debug breakpoint not working without server restart when using reconnect automatically Build #IU-182.3684.2
Bug WEB-35448 JS debug is broken (183.3975.9)
Bug WEB-35449 Debugger stops on first line in a file when debug with js.debugger.use.node.options turned on
Bug WEB-34667 Debugger ignores breakpoints when debug grunt task
Bug WEB-33717 WSL: debugger ignores breakpoints when use babel-register
Bug WEB-33132 JS Coverage: create-react-app, App.js is not added in coverage result
Bug WEB-33288 Incorrect coverage report for @angular/cli 1.7.4
Usability WEB-13852 Debugger: "Add to Watches" for multiple variables selected in Variables view adds the first variable only
Usability WEB-33303 Node script fails to debug due to run configuration typo
Usability WEB-32842 Improve notification in case of wrong settings in 'Node.js/Chrome remote' RC
Usability WEB-33956 Auto expanded object properties values make variables view noisy of there is too many object entries
Cosmetics WEB-33294 Attach to Node.js configuration: add separator
Task WEB-33027 JS Coverage: hide the Debugger and Elements tabs in tool window, add notification
Task WEB-7998 If breakpoints muted, don't stop on debugger keyword
Exception WEB-33729 InvalidPathException when debug creare-react-app
Exception WEB-34839 IllegalArgumentException: Argument for @NotNull parameter 'file'...
Exception WEB-31501 [[FunctionLocation]] not found when call 'Jump to source'
Exception WEB-33102 Exception in IntelliJ IDEA on closing Internet Explorer
Exception WEB-32925 Throwable: No last annotation when 'Run with coverage'
Exception WEB-34648 IllegalArgumentException: BIGINT when debug via node 6.X
File WatchersFeature WEB-33319 Add Insert Macro button for the Program path field in File Watchers
Feature WEB-33321 Add File Watchers to Settings for Default Project
Feature WEB-12478 Global File Watchers
Bug WEB-33191 File Watcher with custom scope is triggered on all files if this custom scope is deleted
Bug WEB-35498 Prettier file watcher: opening and closing file chooser changes Program path
Bug WEB-33661 Export File Watchers action: preserve Path Variables
Cosmetics WEB-33683 File watchers: column title doesn't fit on Linux
Task WEB-34630 Update file watcher template for Babel 7
HTMLFeature WEB-34949 Add inspection: an HTML element has no alt attribute
Feature WEB-20608 Unwrap tag should be available via Alt+Enter as a context action
Feature WEB-34944 Add inspection: an HTML element has no title attribute
Feature WEB-8885 Reformat code after an "Unwrap/remove" in HTML
Feature WEB-35006 Add inspection: A head tag should contain a title tag with content
Feature WEB-33921 Convert named entity to numbered one and vice versa intention
Feature WEB-5082 HTML: completion could suggest all valid closing tags
Feature WEB-34959 Add inspection: an HTML tag should have a lang attribute
Feature WEB-34756 data-* attribute "is not allowed here"
Feature WEB-33951 Make rearrange tag attributes available as an intention
Bug WEB-33949 Complete HTML tag when there's only one variant: closing tag is not updated
Bug WEB-29360 Emmet preview is not working in JS injections
Bug WEB-34566 Support 'Jump outside closing bracket/quote with Tab' feature for HTML files
Bug WEB-34358 Unwrap html tag works wrong
Bug WEB-34361 Convert text to CDATA should not be available in JSX
Bug WEB-34950 Add inspection: use <em> and <strong> for emphasized or special text
Bug WEB-34363 Surround with CDATA item should only be available in XML
Bug WEB-342 Surround with tag not indenting properly
Bug WEB-33582 Inspections - Unknown HTML Tag not working
Bug WEB-34356 Generate xml tag items displayed multiple times
Bug WEB-34754 Wrong unescaped characters inspection in html script section
Bug WEB-13095 Element names are not spelling mistakes
Bug WEB-35033 HTML: "Unknown HTML tag attribute" inspection: allow "alt" attribute for the "applet" tag
Bug WEB-35129 Add inspection. A table without summary attribute
Bug WEB-34573 Remove Surround with CDATA intention
Exception WEB-17902 NullPointerException when applying 'Form input without an associated label' quickfix
JSONFeature WEB-34618 Duplicate JSON keys inspection should provide navigate to duplicate as a quick fix
Feature WEB-33746 Add completion/navigation for $schema property
Feature WEB-33308 JSON Schema inspections: smarter error selection and better targeted quick fixes
Feature WEB-35067 Auto-insert whitespace after typing ":" in JSON after property name
Feature WEB-24696 Paste into JSON could help with escaping quotes
Feature WEB-31891 Unescape when copying content of JSON string
Feature WEB-32826 JSON schema: Provide quick fixes for schema incompatibility errors
Feature WEB-35148 Add comma when pasting lines into JSON
Feature WEB-33212 Mechanism for providing completion for third-party webpack plugins via json schemas
Feature WEB-33426 Support path patterns for JSON mappings
Feature WEB-35323 Add "Surround with > quotes / array literal" for JSON
Feature WEB-31879 Insert comma automatically with closing bracket / quote
Feature WEB-34898 Typing assist to insert quotes automatically when typing ":" after property name
Feature WEB-34748 Inject JS regexp into "pattern" property of JSON schema and "patternProperty" property names
Feature WEB-35058 JSON: Support $id property properly (resolve $ref-s with id, navigate, etc.)
Feature WEB-24731 JSON Schema: implement completion for the contents of $ref reference
Feature WEB-34368 Add completion for "required" properties in json schemes
Feature WEB-35463 Add a checkbox to prefer remote JSON schemas over bundled schemas
Feature WEB-24726 JSON Schema: highlight unresolved $ref references
Bug WEB-32453 JSON schema: #ref links are resolved incorrectly in several cases
Bug WEB-35302 Incorrect type detection for TSLint 'rules' in JSON code completion
Bug WEB-34477 JSON Schema: enum validation is skipped in presence of 'pattern', that's not spec-conformant
Bug WEB-34369 Title from json schema is not used in documentation popup
Bug WEB-33913 JSON Schemas: Warning message shows information about PSI loading
Bug WEB-34092 JSON Schemas without file associations are not available in the list of schemas
Bug WEB-35121 JSON Schema: incorrect oneOf branch selection - at least one should be always selected
Bug WEB-33758 "Reformat Code" inserts an extra newline when the predecing element overlaps the right margin
Bug WEB-35303 'rulesDirectory' in tslint has two possible type variants, but we suggest only array in code completion
Bug WEB-34657 JSON Pointer escapes for '/' and '~' are treated incorrectly in $ref completion/resolve and in schema validation
Bug WEB-33494 Incorrect handling of allOf+oneOf combination
Bug WEB-35318 JSON pointers do not follow proper URL encoding
Bug WEB-34915 LineWrapPositionStrategy is not implemented for JSON, leading to invalid splitting of string literals, etc.
Bug WEB-34354 "type": "object" is not always correctly handled by "add missing properties" fix
Bug WEB-34103 JSON schema validation for enums of arrays/objects giving incorrect warning
Bug WEB-35493 JSON schema validation validates itself
Bug WEB-34897 'anyOf'/'oneOf' with identical schemas leads to no or partial errors
Bug WEB-33852 JSON Schema: Caret is out of the quotes after adding missing property
Bug WEB-33705 Unintended autocomplete list pop-ups when typing B or P inside quotes in JSON strings
Bug WEB-33235 JSON schema: Don't suggest non-string variants inside string literals
Bug WEB-33179 Exception while trying to add missing property to JSON file
Bug WEB-33099 JSON Schema Mappings: conflicting mappings for newly added item
Bug WEB-33306 JSON Schema Mappings: required fields are not suggested inside 'oneOf' definition
Bug WEB-32514 JSON: escape tilde and slash symbols on "Copy JSON Pointer to clipboard" action invocation
Bug WEB-33724 Incorrect 'missing property' in case of 'anyOf' with required
Bug WEB-35358 JSON: "Surround with > quotes / array literal" doesn't surround several items inside array
Bug WEB-32972 JSON switcher: schema causes conflict instead of switching for a file in nested folder
Bug WEB-31876 JSON inspection tab character in strings
Bug WEB-33845 File type detection on EDT via JsonSchemaVfsListener
Bug WEB-26702 Add/remove commas when moving statement in JSON
Bug WEB-33014 "File is not a schema" error in json widget when file was manually added with a mapping to schema
Bug WEB-34643 JSON: Validates against 'not' schema warning in package.json files
Bug WEB-33858 Json Schema Validation string enum case insensitive
Bug WEB-33444 JSON Schema mappings are stored with platform-dependent slashes
Bug WEB-34928 JSON Schema reference breaks other references to JSON properties
Bug WEB-34888 Validation of 'allOf' condition is too weak
Bug WEB-31894 Escaping backslash inside a string in JSON causes spellcheck underlines to appear at random
Bug WEB-34538 Duplicating items in code completion
Bug WEB-33880 JSON Schemas: false positive 'Validates to more than one variant' warning
Bug WEB-34178 JSON Schema: Caret is out of the brackets after adding missing property
Bug WEB-33215 JSON Schema Mappings: Empty file pattern and path should match nothing
Performance WEB-33189 Add file-based index for "$schema" and "$id"/"id" properties in JSON
Performance WEB-34304 Azure deployment JSON schemas are not properly evaluated and cause laggy code analysis
Performance WEB-34294 Specific repository/JSON file is freezing RubyMine on every action.
Usability WEB-35385 JSON: merge the user whitespace with whitespace auto-inserted by typed handler
Usability WEB-33178 'Missing property' inspection in JSON should provide all missing property names at once
Usability WEB-33103 JSON Schema Mappings: no validation for empty path to file/pattern
Usability WEB-33404 Add an API to suppress JSON widget for particular files
Usability WEB-20445 JSON Schema: errors from schema in Event log should not be red-colored
Usability WEB-33908 JSON Schema completion: show types in completion item descriptions when no description is avaiable
Usability WEB-33453 Collect all one-of branches / any-of when none is applicable and show smarter inspections / suggest smarter fixes
Usability WEB-33265 JSON Schema widget is always visible when index is being updated
Usability WEB-34093 JSON Schema: improve the status for not yet downloaded schemas
Cosmetics WEB-33544 Clean up empty items on saving JSON schema mappings
Task WEB-33207 Limit JSON schema services only to supported files
JavaScriptFeature WEB-33892 Check RegExp should support lookbehind
Feature WEB-30855 No autocomplete for flow's $ReadOnly types
Feature WEB-32425 IDE is unaware of Flow utility types
Feature WEB-10122 Add SQL auto injection for Javascript
Feature WEB-29456 Completion for overrides should behave same as 'generate overrides' - insert parameters
Feature WEB-35564 Flow: better support for function generics
Feature WEB-27961 Parameter hints (like in Typescript) in pure JavaScript
Feature WEB-18381 Flow/TSX/React: provide possibility to navigate via namespaced React tags
Feature WEB-34461 Completion for <this>.property in JavaScript classes
Feature WEB-33343 Copy path breadcrumbs to clipboard for JS/TS
Feature WEB-33050 Support 'Jump outside closing bracket/quote with Tab' feature for Javascript/Typescript files
Feature WEB-33195 'Iterate' intention action for JS/TS
Feature WEB-31579 Intention action to add/remove numeric separators
Feature WEB-35103 Completion for overrides with full bodies should work in object literals
Feature WEB-32660 Support nullish coalescing syntax
Feature WEB-33884 Prefer package imports when auto-importing modules in Yarn workspaces
Feature WEB-22059 @providesModule
Feature WEB-34683 Multiline TODOs for JavaScript/TypeScript
Feature WEB-30594 jsDoc | Add support for optional properties in @typedef with @property
Feature WEB-31502 Support for webpack 4 built-in plugin's schemas
Feature WEB-34932 Enable "Unsound 'typeof' type guard check" inspection for JS
Feature WEB-32924 Better default values for object literals, tuples, arrays and functions
Bug WEB-30290 Some JS intentions break code formatting when invoked
Bug WEB-34377 go to declaration for a imported (from a node module) function should take you to the function definition in the exporting module
Bug WEB-34394 Show introduce variable intention only for the `class`/`function` keyword in `export default class/function`
Bug WEB-32522 JS: wrong function param styling
Bug WEB-33627 Wrong 'Invalid number of arguments' error for chai.test function
Bug WEB-32421 next/prev method ignores es6 object methods when {key: function} is present within a method
Bug WEB-32977 Undefined property assignment incorrectly triggering
Bug WEB-33349 Spread expression types in calls are always evaluated as 'any', that is incorrect
Bug WEB-34702 "Contents of collection are queried, but never updated" when using ternary operator
Bug WEB-32584 Unresolved function or method error
Bug WEB-34996 Enable completion for object properties as keys inside square brackets in JavaScript
Bug WEB-34347 JSdoc: named @typedef with type specified via @type not accepted
Bug WEB-24709 Move 'suppress for statement' into nested menu if error with quick fix is reported from JSAnnotator
Bug WEB-33591 Reduce availability range of some intentions for class members
Bug WEB-34101 `for await` not shown as wrong when used outside `async`
Bug WEB-35550 Wrong links to MDN in documentation popup for React APIs
Bug WEB-32979 @memberOf for instance members support only 1 way of declaration of 3
Bug WEB-32935 Install and add to dependencies should respect project package manager
Bug WEB-30363 JQuery + RequireJS $.each() and $.ele.children() unresolved
Bug WEB-34154 Enabling 'Method bodies' in Code Folding | Collapse by default shouldn't affect nested code blocks
Bug WEB-34315 Error in Javascript inspection and code completion
Bug WEB-34768 forEach to for...of intention bugs
Bug WEB-34595 JavaScript: Duplicated options in Surround With action menu
Bug WEB-30386 TypeScript import added when pasting from clipboard into comment
Bug WEB-35356 JavaScript: enable base "navigate to source" for global @types libraries
Bug WEB-21480 Referenced JS Library shows "OK" state after Library is Deleted (or name changed)
Bug WEB-24606 Intellisense taking the wrong JS file and not the one imported in require('./...) using NodeJS
Bug WEB-33290 Iterate intention: template should skip the last variable
Bug WEB-28566 Erroneous "missing import" statement for Flow type
Bug WEB-33498 Navigate/Declaration works wrong when using computed properties
Bug WEB-35327 Invalid code check warning (false positive): Type boolean is not assignable to type boolean
Bug WEB-33700 JavaScript: 'Method expression is not of Function type' after exporting
Bug WEB-35017 Autocomplete for class properties of templated data structures does not work if defined above 'class' declaration
Bug WEB-32940 [Flow] Call generic function with specified type parameters
Bug WEB-33611 Javascript. Array type is not properly defined
Bug WEB-33061 WebStorm doesn't type 'this' properly when used in JSDoc
Bug WEB-34936 False "Method expression is not of Function type" type mismatch
Bug WEB-32484 Should not resolve top-level elements to local functions in modules
Bug WEB-34082 Flow JS results of 'Get expression type', navigation to definition is unreliable on unsaved files
Bug WEB-25867 Resolve webpack built-in plugins
Bug WEB-34230 Support referencing non-existent files in JavaScript libraries
Bug WEB-34337 index.js is added to the imports when moving files
Bug WEB-35274 Provide quick documentation for arrow function parameters, where referenced within the function
Bug WEB-33280 Can't finish template for switch/while by pressing Enter once
Bug WEB-33129 Add keyword completion for 'new.target' and 'import.meta'
Bug WEB-34468 Make method static generates extra point in multiline class object
Bug WEB-32337 Resolve for property assigned in other scope
Bug WEB-34257 Flow: quick documentation doesn't show callback params
Bug WEB-34745 Don't show 'forin' postfix template on array/iterable type
Bug WEB-35384 Flow: class generic arguments are not supported properly
Bug WEB-33077 Instance fields have inconsistent styling
Bug WEB-32396 Flow core library global type definitions are not exposed to the IDE
Bug WEB-35136 Trailing comma in dynamic import gives spurious syntax error
Bug WEB-34425 provide completion for object shorthand properties in function arguments
Bug WEB-35243 Completion for overrides: place caret inside the method body
Bug WEB-32208 React Stateless Functional Component autocomplete doesn't work with Flow prop types
Bug WEB-33435 Imported class member not resolved when using singleton pattern
Bug WEB-35113 'Generate' creates body with return in pure JS if implementing TS method with 'void' return type
Bug WEB-31523 Ordered lists <ol> are not supported in JSDoc comments
Bug WEB-35565 Code completion not working until type definition file is touched
Bug WEB-35419 'Copy qualified name' doesn't work for tags in Flow & React projects
Bug WEB-30291 Flow Project errors does not show warnings if there are no errors
Bug WEB-34125 No import quick-fixes in 2018.2
Bug WEB-34341 Default export is marked as unused when using directory imports
Bug WEB-32911 JSDoc: Type info lost on optional parameters for methods defined with @name
Bug WEB-34046 Flow JS 'Specify type explicitly' intention and 'Show expression Type' throw exception
Bug WEB-32119 Proper support for `@instance`
Bug WEB-34658 Do not show parameter hints for JSX expressions
Bug WEB-33984 Unable to disable "cannot resolve symbol" error in JSX
Bug WEB-34641 ES6: enable autoimports from node_modules if it contains ES6 modules
Bug WEB-33420 Javascript code completion doesn't work in webpack configuration file
Bug WEB-30683 Add patterns to allow configuring language injection in JSX tags
Bug WEB-32140 Better availability for 'Introduce variable' action
Bug WEB-35115 invalid "variable might not have been initialized" inspection for destructuring assignment, should be a syntax error
Bug WEB-34282 Used parameter/variable/function shows unused in language injection (heredoc)
Bug WEB-34314 Unresolved function or method hasOwnProperty() on JSON object
Bug WEB-35468 Support at least explicit substitutions for Flow generics in class constructors
Bug WEB-35253 Generating overrides doesn't respect generator methods
Bug WEB-32933 Can't resolve sortBy import from lodash
Bug WEB-34212 JS/ES6: Inspection issue: Contents of collection are updated, but never queried
Bug WEB-33574 JS: Changing language level doesn't trigger reindexing node modules
Bug WEB-32953 No support for Node.js Async Hooks module
Bug WEB-32458 Renaming variable changes same-named object property
Bug WEB-34922 'worker_threads' isn't resolved in require statement
Bug WEB-35141 Flow: CMD-hover type lookup does not work across files
Bug WEB-35191 "Type mismatch" inspection: false positive when using `return;`
Bug WEB-34687 Opening parenthesis immediately within a JSX tag cause parse error in flow js files
Performance WEB-16757 "Unused global symbol" inspection causes high CPU usage
Performance WEB-30360 Code Analysis, Strange Lagging Bug
Performance WEB-35390 2018.3 EAP6 crash
Performance WEB-35280 High memory usage while working with JS
Usability WEB-34273 Changed colors of Monokai scheme in 2018
Usability WEB-35200 Unclosed comment ending with a new line is not highlighted with underwave
Usability WEB-34937 Very hard to type spread operator (...)
Usability WEB-33727 Missing breadcrumbs for switch statement
Usability WEB-33552 Autocomplete for properties doesn't show string-named items when typing a capital letter
Usability WEB-34719 Autocomplete for `function` not working in some cases
Usability WEB-33854 Generate 'switch' cases action improvements
Cosmetics WEB-33635 Issues with brace highlighting
Cosmetics WEB-31831 Settings: JS/TS: Code generation: align fields on the page
Cosmetics WEB-33186 Wrong before preview for "switch" postfix action
Cosmetics WEB-35075 Change merged gutter icons (they were replaced recently, and now the merged option doesn't look nice)
Task WEB-34965 Merge "Unsound" inspections for typescript and javascript
Task WEB-35079 Infer primitive type facts from initializer for javascript
Exception WEB-33628 PsiInvalidElementAccessException when expand and collapse tag
Exception WEB-35658 IllegalArgumentException: Argument for @NotNull parameter 'element'
Exception WEB-35047 periodic PsiInvalidElementAccessException when editing js
Exception WEB-35416 IllegalStateException: Calling invokeAndWait from read-action leads to possible deadlock
JavaScript. FormatterFeature WEB-7308 reformating JS else statment not in right position
Feature WEB-34976 Add option to align Typescript union/intersection Types
Feature WEB-28679 Add an option to treat lambda fields as methods when rearranging code
Feature WEB-32566 Formatting should adjust spaces in template string arguments
Feature WEB-13488 JavaScript code style settings: Spaces within array literal
Bug WEB-35074 JSX state object misaligned
Bug WEB-34770 Newlines between opening brace and comment not removed
Bug WEB-33968 Formatting moves block comments to new line
Bug WEB-35220 Wrong alignment of html attributes when [] are used
Bug WEB-34052 Exception when rearranging code
Bug WEB-34726 No option to set code style (JavaScript) for unary word operators
Bug WEB-33625 Formatting for TSX tag generics
Bug WEB-34535 The short React fragment syntax is reformatted differently than the longer one
Bug WEB-35501 No indent on a new line after if after line without semicolon
Bug WEB-17899 Braces for JavaScript Switch statement ignore "Brace Placement -> Other -> Next Line Shifted" setting
Bug WEB-34954 No alignment for Angular HTML attribute
Bug WEB-33844 TypeScript auto import corrupts existing imports when ES6 import/export 'Align "from" clauses' option also reformats code
Task WEB-33431 Formatting for conditional types, named and default generics, variadic tuples
JavaScript. FrameworksFeature WEB-27290 Feature Request: more options creating Angular Cli project
Feature WEB-31654 Can't autoimport React HOCs
Feature WEB-33244 React: Complex prop-types (oneOf, shape, arrayOfType) should be supported
Feature WEB-20913 Intention: Switch between React class and pure function syntax
Feature WEB-29682 Angular CLI 1.5 generators don't have command line arguments info
Feature WEB-33381 Show type of React props in completion popup
Feature WEB-32334 Vuex. Code completion is missing for store actions/states/mutations/getters
Feature WEB-35156 Language completion for script and style tags in Vue templates
Feature WEB-33304 Remove "introduce local variable" intention for angular methods/data
Feature WEB-33912 Suggest webpack.config.ts files in settings
Feature WEB-26862 Add single step import for ES6 and TypeScript scripts in .vue files
Feature WEB-32549 Highlight unresolved references in JSX
Feature WEB-30064 Make 'Unwrap/Remove' work for JSX tags
Feature WEB-33489 Vuejs rename component name
Bug WEB-33799 React: required props inside the PropTypes.shape should not be shown as optional in the completion
Bug WEB-32564 Vue.j SFC not resolving @ alias with @vue/cli 3 if vue is installed in a subfolder
Bug WEB-33064 Regression. imported 3rd party vue components are not resolved (vuetify)
Bug WEB-34555 Typo in some React Live Template variable expressions (using filenameWithoutExtension instead of fileNameWithoutExtension)
Bug WEB-34489 React extract component: better handling of key attribute
Bug WEB-34899 Exclude build folder for CRA projects
Bug WEB-33114 Completion of function inserts parens when completing in JSX with expected function type
Bug WEB-34157 'Extract react component' fails with shorthand object properties
Bug WEB-32986 Support pointer events (react 16.4)
Bug WEB-32515 WebStorm Warning for Input iView Component
Bug WEB-33575 Can't create react-native project
Bug WEB-33526 React Class Component template should be 'Component' instead of 'PureComponent'
Bug WEB-32162 Copy React import when moving or copying JSX code
Bug WEB-23647 React: provide autocomplete for standard methods
Bug WEB-34053 React props resolved from wrong file when using named props types
Bug WEB-28405 closure library - code completion for 'goog.provide' symbols inside 'goog.module' is not working
Bug WEB-30850 React Native: no completion for native components properties
Bug WEB-34010 'Extract React component' in Flow should generate prop types as type declaration, not propTypes
Bug WEB-33826 Return type is missing after converting React component
Bug WEB-33802 'React functional to class component' should add .propTypes and .defaultValues in JSX expression context
Bug WEB-27337 Webpack: Not existing config file is chosen in settings
Bug WEB-31992 auto-imports for scoped packages resolves to wrong file
Bug WEB-34471 Optionally add `.vue` extension when auto-importing Vue components
Bug WEB-34352 Angular: property with `$` name suffix is detected as "unused" when it's used with "async" pipe
Bug WEB-35317 Space is removed before some attributes in Angular template
Bug WEB-34522 WebStorm Angular "unused property myVar" on setter function even if its used for binding in template
Bug WEB-34076 Create default run configurations for React project (npm start, debug)
Bug WEB-33818 Handle TSX type context when converting class component to functional
Bug WEB-33121 Do not suggest running npm install when creating a new Vue project
Bug WEB-33452 Changing vue component tag doesnt change closing tag
Bug WEB-33722 React: add autoimport for Component based on react.d.ts
Bug WEB-31285 Unnecessary code completion within JSX tags (without braces)
Bug WEB-34269 Type hierarchy not working for Google Closure classes in different namespaces
Bug WEB-34159 React extract component: better handling of unresolved/multi-resolved expressions
Usability WEB-35481 Disable "Missing React import with JSX" inspection for .vue files
Task WEB-34873 Disable XML refactorings for everything other than XML
Exception WEB-34842 @NotNull method com/intellij/lang/javascript/frameworks/react/ReactXmlExtension.getElementForResolve must not return null
JavaScript. InspectionsFeature WEB-34117 if (a = b) is not a warning
Feature WEB-34980 TypeScript and JavaScript: base nullability control flow analysis
Feature WEB-25768 support vuex mapGetters helper
Bug WEB-33610 Wrong "Iterate with for..of" intention inside strings
Bug WEB-34278 Object Shorthand Methods es6 syntax does not show as error in Webstorm when in Javascript language version set below 6.
Bug WEB-33556 Inspections: "Missing require() statement" inspection has no description
Bug WEB-35179 Rider suggests broken code fix.
Bug WEB-35426 < > are escaped in Flow when apply inspection
Bug WEB-33930 Webstorm stopped show required props on components
Bug WEB-35399 Incorrect inspection "Consecutive commas in array literal" in destructuring assignment
Bug WEB-33846 Incorrect mismatched query and update of collection with JSX
Bug WEB-33365 JSDoc error with default + rest arguments
Bug WEB-32956 False positive for inspection "Primitive type object wrapper used"
Bug WEB-32303 Strict mode inspection behavior is not applied in modules and classes
Bug WEB-33833 False warning about type coercion with `!=` and `typeof`
Bug WEB-28206 Allow to skip files from webpack code analysis
Bug WEB-35461 Inspections: "Missing required 'alt' attribute" gives false positive in the Vue.js files
Bug WEB-35526 Typescript - wrong "remove unnecessary parentheses" warning
Bug WEB-34384 JavaScript Redundant Local Variable inspection false positives on compound assignment
Bug WEB-33588 inspection "TypeScript | Unsound 'typeof' type guard check" is not fully correct
Cosmetics WEB-34829 Missing module inspection: show npm install quick fix first
Cosmetics WEB-33289 Rename Iterate intention
Exception WEB-33555 Throwable: Tool 'JSUnresolvedFunction' registers INFORMATION level problem in batch mode
JavaScript. RefactoringFeature WEB-23894 Refactor: Extract React (JSX) component
Feature WEB-12768 Convert function to method(variable holding function expression or arrow function) and vice versa
Feature WEB-35341 'Convert to named function' intention should work for arrow functions assigned to class fields
Feature WEB-33090 Move symbol from files without import/export
Bug WEB-35543 Decorators changes their order after refactoring its method
Bug WEB-33062 `Refactor -> Move` is very slow as it checks node_modules too
Bug WEB-33107 Move module member fails with resolve to implicit overload element
Bug WEB-33831 'Move ES6 module member' shows error dialog if non-module file references moved element
Bug WEB-33049 'Move into matching file' intention should escalate visibility of non-exported items in modules
Bug WEB-34717 'Inline local variable' when invoked as fix shouldn't show confirmation dialog
Bug WEB-32734 Rename for class and file together should always search for the file references
Bug WEB-33418 Move ES6 module member: update imports to non-js files
Bug WEB-34145 Field prefix is placed after renaming an interface member
Bug WEB-33646 Extract type alias should produce generic type if selection references generics
Bug WEB-29572 JavaScript "Convert to named function" intentions drops JSDoc comment
Bug WEB-33416 Disable Inline refactoring for React functional components
Bug WEB-33309 'Move module member' should move assignments to properties
Bug WEB-33417 Move ES6 module member: usages of react components should be updated
Bug WEB-34720 Refactoring "Inline function" should be aware of context when inlining async function
Bug WEB-33091 UI issues with the Move Symbol dialog on resize
Bug WEB-33890 "Introduce local variable" shouldn't be available inside injected fragments for the outer language
Bug WEB-35503 Typescript arrow function signature refactor loose types
Bug WEB-34653 Click in conflicts view in 'Move module member' refactoring navigates to moved member, should navigate to usage
Bug WEB-33986 'Replace ?: with if-else' intention should not be shown for const values
Bug WEB-33377 Rename of variable produces incorrect result with destructuring and object literal shorthands
Bug WEB-35149 'Convert function to variable holding arrow/ function expression' should check and declare 'const' var if possible
Bug WEB-33891 "Introduce local variable" is not working if caret is positioned after the expression
Usability WEB-34109 [Javascript] Move refactoring triggered is not triggered when caret is at start or end of element
Usability WEB-34440 inline constant refactoring should default to removing the constant
JavaScript. TemplatesFeature WEB-15657 EJS indent options for control block content
Bug WEB-21041 EJS: don't add spaces between EJS tags on formatting
Bug WEB-11024 EJS: extra closing tag is added on adding nested tag
Bug WEB-10780 Code Formatter breaks .ejs files
Bug WEB-18941 Handlebars: avoid errors when expression is used as attribute value
Task WEB-33748 Choose one of the pre-defined run configurations by default
LESSBug WEB-33442 less file '{' expected with guard clause
Bug WEB-34030 Less variable should be highlighted if cursor is before "@"
LintersFeature WEB-25697 ESLint / TSLint does not respect Editor Inspection severity level color formatting
Feature WEB-34034 ESLint should have a 'Fix current error only' quick fix
Feature WEB-25014 Feature: TSLint: provide appropriate suppress actions
Feature WEB-29829 Add ability to use ESLint in TypeScript files without eslint-plugin-typescript
Bug WEB-30174 Standard code style suppression comments the line
Bug WEB-31134 ESLint: eslint-disable-next-line generated in wrong positions
Bug WEB-33619 ESLint: 'Suppress for file' action is shown twice
Bug WEB-31449 Stylelint error when file is in .stylelintignore
Bug WEB-29400 ESLint: do not import rules from the ESLint config in case the Standard linter is defined in the project
Bug WEB-26709 ESLint/Standard: JSX content is not suppressed correctly
Bug WEB-34689 Bundled tslint-schema.json has to be updated
Bug WEB-33883 .eslintignore lookup should not go outside of project
Bug WEB-33897 ESLint --ignore-pattern is not working if file .eslintignore is not exists
Bug WEB-33918 ESLint: Don't show quick fix for non-fixable linter rules
Bug WEB-22548 ESLint: use the severity specified in .eslintrc for offline inspections
Bug WEB-34634 JSHint: update the bundled version to 2.9.6
Bug WEB-32991 Code styles from ESLint config inside package.json are not applied
Bug WEB-32103 'Suppress' action for ESLint inspection sometimes generates invalid comments
Bug WEB-33680 Throwable: Read access is allowed from event dispatch thread or inside read-action only
Bug WEB-33055 Guessing linters shouldn’t happen while indexing on initial project generation
Usability WEB-31204 Add option to disable "Undo Reload From Disk?" after running 'Fix ESLint Problems'
Task WEB-34986 Update JavaScript Standard Code Style rules according to Standard 12
Live EditBug WEB-22518 LiveEdit ignores some changes in html
Bug WEB-29792 Live Edit: 'restart if hotswap fails' doesn't work with Node.js 8+
Bug WEB-35736 'Elements' tab is empty when debug HTML
Bug WEB-34789 Live edit ignores changes in .html
Bug WEB-34876 New content is shown only after moving to the new line after the tag
Bug WEB-32345 Live Edit not working when <noscript> <header> <footer> tags combination is present
Bug WEB-33214 Support Live Edit without Chrome extension
Node.jsFeature WEB-35204 TypeScript: enable "navigate to source" for node core libraries
Feature WEB-35143 Allow to use @types/node for Node.js coding assistance
Feature WEB-34226 Use NODE_OPTIONS for Node.js debugging
Feature WEB-33571 Add node_modules/.bin folder to PATH in Terminal for current project
Feature WEB-29975 Feature: completion for previous versions of npm packages in package.json
Bug WEB-33707 WSL: can't install nyc or istanbull via link from error
Bug WEB-33368 Incorrect encoding in console.table() output
Bug WEB-33042 Find usages of file doesn't work if it's specified with "main" field in package.json
Bug WEB-22911 Node Remote Interpreter: Docker: "Stop" button should be in sync with remote server
Bug WEB-34791 'install and add to devDependencies' quick fix adds library to 'dependencies' (yarn specific)
Bug WEB-33149 WebStorm Node Express Project does not generate correct debug environment variable
Bug WEB-35496 Cannot enable Node.js coding assistance with IPv6 enabled
Bug WEB-33263 WSL: interpreter from linux is incorrect for some RC
Bug WEB-33687 WSL: flow doesn't start (Throwable: Can't find node interpreter)
Bug WEB-35413 Stepping resumes execution after pause on first breakpoint
Bug WEB-33248 'WSL Ubuntu is not available' when try to run or debug
Bug WEB-33154 Support ANSI coloring in log files
Bug WEB-33246 WSL: can't configure node coding assistance
Bug WEB-34602 @Vue package is not resolved in the node.js package list
Bug WEB-33256 WSL: can't create project via Ubuntu legacy
Bug WEB-32697 Node.js: Run console width is limited to 80 symbols
Bug WEB-35462 Folder node_modules is not marked as library root if Data Source configured
Bug WEB-34814 Detect npm package for Debian and Ubuntu based Linux distributions from the official repo
Bug WEB-35594 Can't enable Code assistance for Node.js if there mappings for 127.0.0.1 in /etc/hosts
Bug WEB-33931 runnerw.exe cannot run Node.js script with WSL bash.exe
Bug WEB-35412 Can't resolve app.use in express project
Bug WEB-32859 Incorrect view of ANSI symbols in run tool window when create create-react-app project
Bug WEB-33688 WSL: covered lines are not marked in the editor
Bug WEB-35528 Can't run vue-cli-service scripts from @vue/cli project
Bug WEB-33708 WSL: webpack config can not be analyzed
Bug WEB-34413 Detect all node_modules as libraries on startup
Performance WEB-34416 Do not index symlinks inside node_modules targeting files inside project
Usability WEB-35031 Do not auto-exclude `dist` within node module folder if there are `module` or `esnext` keys referencing files from `dist`
Usability WEB-35568 WSL: ExecutionException when try to debug with incorrect interpreter
Exception WEB-33725 WSL: IllegalStateException when indexing project
ProfilingException WEB-33825 Profiling: Heap: Throwable on the opening the Occurrence tab
SASSFeature WEB-6006 Would like formatting options for SCSS
Feature WEB-20279 Better code style for .scss .sass files
Bug WEB-34131 Good code red: animation-timing-function inside SASS nested property
Bug WEB-35182 File Watchers: update default sass command
Bug WEB-33505 SCSS code formatting breaks with nested namespaces
TypeScriptFeature WEB-34476 Merge multiple gutter icons for implementations into one
Feature WEB-33546 TypeScript service: provide show quick fixes for "suggestion" annotations
Feature WEB-33454 Support TS 3.0 tuple type inference
Feature WEB-33447 Replace if with switch intention in should work with enums and constant variables/fields
Feature WEB-33221 Support TS 3.0 'unknown' type
Feature WEB-33291 Support TS 3.0 tuples in function calls
Feature WEB-32271 Inspection for tsconfig.json
Feature WEB-35377 Support non-unit types in union discriminants (TS 3.2)
Feature WEB-33430 Support TypeScript 3.0 variadic tuple types and tuples with optional items
Feature WEB-33326 Add references to TS 3.0 named generic arguments (so that they can be renamed/navigated)
Feature WEB-34456 Support TS 3.1 property assignments in JS-like style
Feature WEB-26909 ES6/TypeScript: comments should be moved together with the symbol Move Refactoring
Feature WEB-35052 Support TS 3.2 callable/bindable functions
Feature WEB-34144 Update bundled TypeScript version to 3.0
Feature WEB-33448 Intention actions to convert TypeScript parameter-property to field and back
Feature WEB-33712 ES6: autoimports for ts declarations inside node_modules
Feature WEB-33769 TypeScript 3.0 project references in monorepo
Feature WEB-32988 'Is not accessible' inspection and quickfix "Make constructor public" for private/protected constructors
Feature WEB-30212 Auto-imports should prefer symlinked file from node_modules to actual file in monorepo projects
Feature WEB-27788 Alt+Enter (imports all ?!) in .ts file
Feature WEB-33222 Support TypeScript 3.1 named type arguments
Feature WEB-32997 Suggest static factory methods based on expected types
Feature WEB-34455 Support TS 3.1 mapped type changes
Bug WEB-35549 Typescript formatter fails on object construction with cast
Bug WEB-33467 Incorrect type text for tuples with repeating same types
Bug WEB-33225 TypeScript: better error messages
Bug WEB-35277 Private methods should not be in the completion list for inherited classes
Bug WEB-33632 TypeScript: Types are included in pre-populated JSDoc for properties/vars
Bug WEB-35263 Typescript. Go to declaration broken for the field of union type.
Bug WEB-34554 Wrong tsx syntax inspection when comment has tag
Bug WEB-33519 Remove redundant empty line when replacing if with switch
Bug WEB-33001 Bad "Must be lvalue" inspections in typescript
Bug WEB-35030 Wrong Redundant typeof check for nullable variables
Bug WEB-33491 Array destructuring should support TS 3.0 variadic tuples
Bug WEB-34516 Autocomplete reporting incorrect type with mapped types
Bug WEB-34261 Typescript - WebStorm includes private methods and properties when using keyof
Bug WEB-33765 Completion for generic TSX components doesn't work properly for the first attribute if TS service is enabled
Bug WEB-33230 typeof dynamic import error: expression expected
Bug WEB-32989 Classes with private/protected constructors are suggested after "new" word outside their visibility zone
Bug WEB-34945 Typescript: Invalid guard result for Map.
Bug WEB-34074 Correctly import modules from @ionic/core
Bug WEB-35125 StackOverflowError at JSTypeEvaluator.addTypeFromElementResolveResult()
Bug WEB-33647 Broken 'Create from usage' and 'Introduce type alias' in TSX tag generics
Bug WEB-32021 Spell Checking Bug in object property names
Bug WEB-33590 TypeScript objects with getters/setters fail type validation
Bug WEB-35345 TypeScript getter and setter generation should honor the "Use 'public' modifier" setting
Bug WEB-35446 JSX Generics are not parsed when tag name is namespaced
Bug WEB-30699 Type inference problem in Typescript
Bug WEB-34878 Red icon is shown on the TypeScript tool window name when there's no errors
Bug WEB-33373 TyperScript non-null assertion operator("!") syntax error case
Bug WEB-29799 tsconfig.json paths don't work with Vue .vue single file components
Bug WEB-35400 Incorrect behaviour of "pull member up" refactoring on a method with a decorator
Bug WEB-33285 Spread of 'any'/'unknown' should result in 'any'/'unknown'
Bug WEB-34663 Typescript: convert parameters to use object initializer - removes the optionals
Bug WEB-33457 Spread expressions in arrays are always treated as 'any'
Bug WEB-35329 Improve suggestion Typescript Extract, Exclude types
Bug WEB-35078 Wrong typeof check if the original type of value is 'any'
Bug WEB-33036 Typescript TSX conditional syntax error
Bug WEB-21141 [TypeScript] false error with generic extends non-named types
Bug WEB-34511 Import All in Webstorm 2018.2.2 doesn't import everything
Bug WEB-35459 Typescript exports not resolved for imports completion
Bug WEB-33612 Incorrect lexing of tuples in TSX tag generic arguments
Bug WEB-33194 TypeScript User Defined Type Guards: Renaming parameter does not rename type gurad definition "x is Y"
Bug WEB-34127 TypeScript: incorrect import suggestion for @types/mocha@5.2.3
Bug WEB-33355 Generic type arguments in JSX elements should allow whitespaces between tag name and generic list
Bug WEB-21614 invalid error: rest parameter must be an array type
Bug WEB-33584 TypeScript Auto-complete for new Promise is worse now
Bug WEB-35181 Unneeded 'Invalid instanceof check' warning when strictNullChecks enabled
Bug WEB-33572 Support ES2018 regexp features in TypeScript
Bug WEB-35254 Code completion for overrides should properly handle access modifiers
Bug WEB-35410 "Make private/protected" intention should not be available for the parameters in the arrow functions
Bug WEB-34912 "Complete Current Statement" on "for .. of" loop breaks code
Bug WEB-34622 TypeScript interface field renaming refactoring is ignored with object literals in anonymous functions
Bug WEB-35551 Import are marked as error when overriding baseUrl in child config
Bug WEB-34019 Type of 'const foo = Symbol()' should be inferred to 'unique symbol'
Bug WEB-33545 Should properly infer tuples from spreads
Bug WEB-25990 TypeScript: Contents of collection are updated but never queried (destructuring case)
Bug WEB-31080 Can't automatically add all imports in TypeScript
Bug WEB-35240 Add Import statement: missing "from" keyword when import path is already there
Bug WEB-29621 Support mixin signatures
Bug WEB-35252 Code completion for overrides shouldn't insert 'super.' when base type is an interface
Bug WEB-35178 Typescript: generate constructor omits optional parameter specifier when used with React
Bug WEB-33701 [TypeScript] Wrong "Non-ASCII characters in an identifier" inspection on TypeScript decorator with property access
Bug WEB-35278 Convert to field holding arrow function generates redundant access modifier
Bug WEB-33976 TypeScript: Renaming an interface member doesn't rename usages in generic curried functions
Bug WEB-34229 TypeScript autocomplete is broken in PhpStorm 2018.2 (lacks results)
Bug WEB-35474 StackOverflowError on types resolving
Bug WEB-30796 path completion in import doesn't work when using path mappings
Bug WEB-33716 Incorrect rest parameter's type in "parameter info" / "quick doc" for aliases and tuples
Bug WEB-32189 Abstract fields should not be in suggestion list to generate getters/setters/constructors
Bug WEB-34311 TypeScript: comment inside the React tag breaks highlighting
Bug WEB-34098 Monorepo import isn't respected during copy-paste
Bug WEB-34587 False positive "Abstract class constructor can be made protected"
Bug WEB-32336 [TypeScript] RxJS lettable operator - type inference support
Bug WEB-31543 vue-mixin-decorator doesn't work in Vue files with TypeScript
Bug WEB-33651 Typescript. Autocomplete for properties doesn't show string-named items when service is on
Bug WEB-34100 False positive JSMismatchedCollectionQueryUpdate for object literal
Bug WEB-35505 Typescript "arrow to named function" prepend "public" modifier inside module
Bug WEB-33644 Add 'extends' to the suggestion list for conditional types
Bug WEB-33293 Expected type for tuple element shouldn't include types from other elements
Bug WEB-35523 Cannot generate props when contextually typed by an object literal.
Bug WEB-33037 TypeScript mixins do not work
Bug WEB-34124 Wrong type specifying for unique symbol
Performance WEB-34174 IDE gets frozen on switching to another app and back
Usability WEB-33609 Inaccurate typescript autocomplete for text "ret"
Usability WEB-34564 Parameter hints: not clear how to configure for TypeScript
Task WEB-35105 TypeScript: check limit for completion result (for avoiding processing extra-elements)
Task WEB-33010 TypeScript: remove "rxjs" from default blacklist
Task WEB-35080 Update bundled TypeScript to 3.1
Task WEB-33013 TypeScript: enable excluding js sources for node modules packages with typings
Exception WEB-33911 Throwable: Infinite type substitution T|never|never|never...
Exception WEB-35567 Exception while disposing TypeScript service
Unit TestsFeature WEB-34119 Navigate to source at failure for failed tests (Karma, Jest, Mocha)
Feature WEB-34691 Upload and display Jest coverage report in the IDE
Feature WEB-24245 Ability to specify suite name when running protractor tests
Feature WEB-35177 Single suite / test run with Protractor
Feature WEB-34826 Support running Jest with angular-cli
Feature WEB-35142 Single test file run with Protractor
Feature WEB-26053 Rerun failed Mocha tests
Feature WEB-33164 Rerun failed Jest tests
Feature WEB-33201 Rerun failed protractor tests
Bug WEB-34908 Jump to source for failed tests does NOT take me to the failure line
Bug WEB-31143 Jest package is set incorrectly if there are two node_modules folders in a project
Bug WEB-34142 Not running jest tests
Bug WEB-35553 Jest RC: set working directory to the closest directory with jest.config.js or package.json
Bug WEB-33260 WSL: interpreter from linux is invalid for mocha RC
Bug WEB-30856 Jest 'Run with coverage' not showing coverage panel when coverage options exist in package.json
Bug WEB-9523 An issue of running Node.js task & karma server at same time
Bug WEB-33259 WSL: interpreter from linux is invalid for Karma RC
Bug WEB-33354 Jest, re-run failed tests: all same-named tests are run (even not failed)
Bug WEB-33594 'Show ignored' option doesn't work for Jest
Bug WEB-33682 Karma: 'Re-run failed tests' button disappears when debugger starts
Bug WEB-33353 Jest, re-run failed tests: all test files are shown in the result tree
Bug WEB-33356 Jest: re-run failed tests can be faster
Bug WEB-30368 Add JavaScript test files to the predefined test scope
Bug WEB-35512 Running Jest tests broken with Jest 24 alpha
Bug WEB-34118 Karma: some links are not clickable
Bug WEB-33622 WSL: Jest Coverage tool window not showing any stats
Bug WEB-34734 Cannot run Jest unit tests with @vue/cli-service
Bug WEB-35242 running tests assumes Jest supports --runTestsByPath
Bug WEB-1699 Structure view shows nothing for JS test file
Bug WEB-33810 'Click to update snapshot' link is missing
Bug WEB-33218 ClassCastException when rerun Jest and Mocha test in 'Run with coverage' mode
Bug WEB-34073 Mark tests in 'e2e' folder as protractor tests
Bug WEB-33261 WSL: interpreter from linux is invalid for jest RC
Bug WEB-33855 Jest: custom setupTestFrameworkScriptFile is not executed sometimes
Bug WEB-35484 Navigate to source at failure fails on 'test'
Bug WEB-33816 Jest: initialization error is shown as passed test
Bug WEB-35083 @angular/cli: Karma tests are wrongly run by jest
Bug WEB-34422 Jest terminates with unknown error (ReactJS, Jest, Jasmine, Typescript)
Bug WEB-33631 Jest + Vue: coverage marks not shown in gutter of .vue file
Usability WEB-28498 "Mocha package" field does not persist for my shared Run Configurations
Usability WEB-35273 When changing run configuration for Jest tests, don't clear out file choice
Usability WEB-28401 Add --env=jsdom to Jest configuration in apps created with create-react-app
Usability WEB-34429 Jest test ran as file should be invoked directly
Usability WEB-30439 Jest: show console.log output in test results console when clicking on test
spy-jsBug WEB-33835 WSL: Spy-js for Node.js fails to trace the application
Bug WEB-33832 Spy-js for Node.js cannot be started on Node 9.11.0+
Bug WEB-34527 "Next call" not recognized as disabled until I arrow-down over them, toggling "filter disabled" won't make them disappear
HTTP ClientFeature WI-42095 Create run-configuration for HTTP Requests
Feature WI-43332 Implement completion for @no-redirect doc tag
Feature WI-43351 Implement quick documentation for @no-redirect doc tag
Feature WI-43335 Add request with `@no-redirect` to HTTP Requests Collection
Feature WI-20560 Restful Web Service Tester: Add Option to not Follow Redirects
Feature WI-40409 Support environment variables in request body
Feature WI-40450 Support formatting for POST request body
Bug WI-42311 response handler scripts: Multiple headers with same name
Bug WI-40496 RESTful webservices: REST client: parameters are not sent for POST methods
Bug WI-43099 HTTP Client: Add 'print()' function to 'http-client-stub.js'
Bug WI-42269 HTTP Client: Allow request body for HEAD requests
Bug WI-43689 Collections doesn't work (file can't be found)
Bug WI-43685 Running request via gutter updates saved configuration if file names collapses
Bug WI-42899 Completion of variables inserts redundant }} when there is a space after the variable
Bug WI-42436 Basic authorization should be preemptive
Bug WI-42005 REST Client: Content-Type is case sensitive
Bug WI-43729 Files created outside the project after creating HTTP Request scratch not "visible" to IDEA / Webstorm
Usability WI-42391 Completion of environment variables doesn't work in request body
Exception WI-42641 HTTP Client doesn't save responses if large
Exception WI-43981 Exception when invoke quick documentation on http response processing script
Plugin: Deployment _ FTP..Feature WI-2171 Automatic upload should listen to file revert, update and delete [and external changes]
Feature WI-909 Upload files on multiple (S)FTP servers at once (at least on VCS commit)
Bug WI-42345 Ask to reenter invalid password from Remote Host refresh
Bug WI-42992 "Deployed file is on server removed" stuck since update 2018.2 (26th july)
Bug WI-42429 Unable to deploy from Mac via SFTP to a IPv6-only host
Bug WI-42253 Remote Host menu works not as expected
Bug WI-43386 SSH Passphrase not saving
Bug WI-42386 Selection of deployment path mappings doesn't ask for password
Bug WI-43570 Could not connect to FTPS server: MalformedServerReplyException: Truncated server reply
Usability WI-41694 There is no way to provide authentication data on clicking browse button in ''Root path''
Usability WI-42881 Enable "Details" logging for Deployment logging
Usability WI-43801 Failed uploading on a server inside group with closed File Transfer tab is hard to detect
Usability WI-36742 Remote Host - warning dialog to allow canceling of unintended directory or file moves (on the localhost/project side PhpStorm already does this)
Usability WI-43892 Servers from group are duplicated with the same name when duplicate group
Cosmetics WI-43277 New Project from Existing Files doesn't have the FTP port specified by default
Cosmetics WI-43804 Rewrite Server Removal dialog wording
SpellcheckerFeature WI-42897 Ini files spellchecking
Bug WI-42710 New spell errors in PHPDoc (in custom tags, in words with special symbols, in strings not prepended by *)
  • No labels