• [PyCharm IDE]
 
Skip to end of metadata
Go to start of metadata
No subsystemFeaturePY-20770Support Python 3.6 asynchronous generators and comprehensions
FeaturePY-21768Semantic highlighting for Python
BugPY-19573Python console - no output under OS X
BugPY-9875Incorrect syntax highlighting for function parameters
BugPY-18203Redundant parentheses quick fix produces syntactically incorrect code for tuples
BugPY-20322False positive warnings about abstract property
BugPY-27030Support substitutions in IdentityFile in OpenSSH config
BugPY-27032Ignore OpenSSH configuration files for password and key pair authentication
BugPY-27061manage.py broken in Django 2.0rc1 because "_parser\parser.py" does not support loose versions
BugPY-27029AttributeError: StringIO object has no attribute 'encoding'
BugPY-20602Line numbers displayed incorrectly in "Initial configuration" preview
BugPY-20837.ui File Can't Be Opened
BugPY-23759Duplicate Path Mapping after creating a remote project
BugPY-18458Docker-based Python interpreters mistakenly marked being invalid in Python interpreters list
BugPY-27031Hash hosts in known_hosts file setting ignored
BugPY-23925Pycharm 2017.1.1 sftp remote deployment not working
BugPY-23409The extension point runConfigurationProducer doesn't work
BugPY-17739Conda enviroment not being activated
BugPY-15837Running a pytest that raises an exception with styled string (ie: "\033[31m") causes the IntelliJ Test Viewer to display a false-positive
BugPY-17120Adding new conda repository isn't working
PerformancePY-20332Array and data frame views result in extremely high CPU usage
PerformancePY-8713Sporadic UI lockups due to slow YAML parsing
PerformancePY-26036crash when specific file is open
PerformancePY-24882After the new updates - "Updating Indices" for ten minutes, every time I pull.
UsabilityPY-20448DataFrame viewer does not have automatic column-sizing
UsabilityPY-18009Buttons are missed
UsabilityPY-26164"Show Variables" pane should not be displayed by default
UsabilityPY-26445Ability to enable/disable semantic highlighting independently
CosmeticsPY-6691Use sentence case for all fields of the "New Setup Script" dialog
ExceptionPY-26942NPE during new project creation
ExceptionPY-20026IndexOutOfBoundsException in PyClassImpl.mroMerge
ExceptionPY-26105local import causes IllegalArgumentException in Python BDD support
App EngineFeaturePY-5186Reference to attribute from script in app.yaml with python 2.7 runtime
BugPY-6470App Engine Project Always Imports WebOb 0.9
BDDFeaturePY-14572Lettuce "Scenario Outline" not working correctly
BugPY-19824Re-run of lettuce tests with outline doesn't work
BugPY-21950AttributeError if there's a falling assertion in the behave steps
BugPY-19942Missing Traceback in behave 1.2.6
BugPY-19794Behave doesn't work well with square brackets
BugPY-24876pycharm behave integration matches wrong rule in editor
BugPY-20854behave runner not handling feature tags correctly
BugPY-19641Inline statistics are in miliseconds but displays seconds
BugPY-26070lettuce can't resolve step reference
BugPY-15714Behave: Features do not recognize steps imported from other modules
BugPY-25789Exceptions raised during Behave tests do not appear in the debugging console
BugPY-19474Behave's captured logging is no longer displayed
BugPY-17105right clicking folder with large amount of files freezes the ide
PerformancePY-20465Right-click on behave's .feature content causes IDE hangs
UsabilityPY-25589Lettuce: auto-generated step generates warning (first argument shadows name 'step' from outer scope)
Code InsightFeaturePY-12745Support the "six" Python 2 & 3 compatibility library
FeaturePY-22971Support @typing.overload in regular Python files, not only in Python stubs
FeaturePY-18972implement support for PEP 498 (f-strings)
FeaturePY-22004Show all possible parameter hints when function could be resolved to different locations
FeaturePY-20003Breadcrumbs for Python files
FeaturePY-21519Support autocompletion in type hint comments
FeaturePY-22005Show types in parameter hints
FeaturePY-21231Resolve reference only to Python stub file if it exists
FeaturePY-18254Support Python 2.7 additions to PEP 484 (function type comments)
FeaturePY-20744Support Python 3.6 PEP 526 Syntax for Variable Annotations
FeaturePY-22215"Implement Methods..." action for Python
FeaturePY-20768Support special attributes of PEP 487: simpler customization of class creation
FeaturePY-25288Implement "Expression Type" action for Python
BugPY-15270Numpy: Unresolved reference: false positive for accumulate and reduce
BugPY-20280Warn if class variable listed in __slots__
BugPY-14044Autocomplete not working for namedtuple class constructor arguments
BugPY-19825Tuple sub-assignment typing broken
BugPY-15071Unresolved reference: false positive for private names listed in __all__
BugPY-24987Class attributes do not show up in 'goto' symbol or implicit resolve results
BugPY-20864False positive: "Unresolved reference" for variable annotations with types from typing module
BugPY-19530from MODULE import SUBMODULE as NAME not find inheritance
BugPY-19078Show Inherited option doesn't work when parent class from "import as"
BugPY-19989Wrong union type is inferred for the reference to a module imported via Python 2 implicit relative import
BugPY-21897Wrong type inference with None and conditionals
BugPY-15296Numpy: allow passing all sequence types for array and array-like parameters
BugPY-20778Invalid conversion character in fstring is not marked as an error
BugPY-20776Empty fstring expression should be marked as an error
BugPY-20775Unclosed braces inside a fstring should be an error
BugPY-20773Pound sign inside fstring is an error
BugPY-20901False negative: f-string expression fragments nested deeper that two times
BugPY-16541Copy Reference gets line number instead of function name
BugPY-19773Symbols available via higher level package are missing in the auto import suggestions if there are other imports from same package in a file
BugPY-25606StringIndexOutOfBoundsException in PyAnnotateTypesIntention
BugPY-9924"Expected type" warning when indexing a list with a slice object
BugPY-20735Creating a setup.py with "'" in the description breaks the output in the resulting file
BugPY-25484Auto-import on code completion doesn't take in account __all__
BugPY-23625Incorrect default argument value in print() function
BugPY-22620False positive: Unused imports for type comments containing multiple annotations
BugPY-19967Type inference and completion doesn't correctly when inheriting from namedtuple
BugPY-5500Unresolved reference: strange behavior on references within __all__ list
BugPY-13159"Type checker" failed to determine property type
BugPY-18246No completion for typing.NamedTuple
BugPY-25368Python stub-AST inconsistency in intention tests
BugPY-20897False negative: f-string - Single '}' is not allowed
BugPY-15272Numpy: comparison operations on arrays should return array, not bool
BugPY-26493Auto Complete stops working after first use when class object is passed to a function and identified with assert isinstance
BugPY-12425Completion breaks when implementing a callable object with the __call__ method
BugPY-19461Inspection does not recognize all subclasses
BugPY-16404Syntax highlighting does not work for the pattern in `re.fullmatch`, but works for `re.match`
BugPY-19796Incorrect parameter type hint for ord() function parameter
BugPY-16676Parameter info only shows first string in consecutive concatenated strings
BugPY-3167Redundant/useless import suggestion appears after manually added import
BugPY-9472Parameter info: losing popup when moving caret through calls as parameters
BugPY-9471Do not show parameter info outside function parenthesis
BugPY-24242Completion strikes after specifying variable value
BugPY-12944Add type checking for coroutines
BugPY-25076Inspection "Method may be static" doesn't report methods referencing attributes named "self"
BugPY-24383type inference broken for Union[Any, List[int]]
BugPY-20063Code introspection / autocomplete does not resolve types in Sets (and perhaps other collection types) when used with single-character iteration expressions
BugPY-25906Wrong method implementation order
BugPY-16744numpy.linalg.norm
BugPY-19604numpy asarray should accept integer as an argument
BugPY-25751If "__all__" is used in "__init__.py" PyCharm doesn't understood type of imported package
BugPY-15284Numpy: unexpected argument: false positive for casting argument in can_cast: parser fails to process generated argument with keyword name
BugPY-12083Code Insight does not respect numpy ndarray types
BugPY-26801PyCharm creates __init__.py in every folder to project path on new package creation action
BugPY-22449Breadcrumbs are incorrect when caret placed after the last character of the block
BugPY-8132Completion shows function instead of variable if function contains a variable with name equal to function name
BugPY-18253Navigate to implementation gutter icon doesn't work
BugPY-15365Suggest names of submodules and subpackages for __all__ inside __init__.py
BugPY-7322namedtuple types are not detected with reST :type :
BugPY-4351Type Checker: detect type for named tuple unpacking
BugPY-20917'Replace with str.format method call' messes up with collection calls
BugPY-22181Element type is not inferred in case of iteration over iterable with separate iterator
BugPY-15307Numpy: TypeChecker: fals positive when passing new array shape as two ints to resize method
BugPY-19749'Replace with str.format method call' should not add positional id
BugPY-22249Add parameters tooltip to namedtuple constructor
BugPY-22037Code completion on property that returns self declared in base class only shows options for base class
BugPY-12634Decorator usage not highlighted in presence of whitespace after "@"
BugPY-26032data and target attributes are unresolved in scikit Bunch class
BugPY-19884Bundled python-skeletons lack annotations for "set" and "fronzenset" collections
BugPY-19473Incorrect sql injection detected
BugPY-19220Multi-line assignments break type hinting
BugPY-2724Exclude protected methods from completion list if completion is performed outside a class
BugPY-18098Import "numpy" doesn't have effect
BugPY-26243Unresolved reference in dunder all for not imported modules
BugPY-19506CREATE TEMP TABLE not recognized as SQL-statement within Python-String
PerformancePY-18039PyCharm extremely slow and unusable. Freezing constantly on one project
PerformancePY-20258PyCharm Hangs on Start
PerformancePY-25892GUI freeze during indexing
UsabilityPY-3563Put classes from already imported modules on top of auto-import variants list
UsabilityPY-12627Non-code usages displayed even it's turned off
UsabilityPY-1526Basic completion for kwarg in a method call should put variable by name as the first suggestion
UsabilityPY-5833No namedtuple autocompletion if field names passed in
UsabilityPY-23295Breadcrumbs are too short by default.
CosmeticsPY-9516Wrong current parameter info popup position with caret on indented line
ExceptionPY-24272StackOverflowError in PyResolveImportUtil: Code analysis never finishes
ExceptionPY-20921f-string exception: String must be quoted by single or double quote
ExceptionPY-21697Multiline string literal with escaped quotes inside hangs the editor
ExceptionPY-22198Exception in PyImplementMethodsQuickFix on showing dialog with methods to implement
ExceptionPY-26028Code insights fail - StackOverflowError
ExceptionPY-26006SOE if function is decorated with the same name decorator
ExceptionPY-20421IOOBE on processing function type comment containing single element tuple
ExceptionPY-26847Pycharm 2017.2 insane logging - freezing
ExceptionPY-21840Long unicode escape sequences in regular expressions cause exceptions
ExceptionPY-25101NullPointer exception on highlighting element usages for imported modules
ExceptionPY-21906Code inspection stops working with StackOverflowError in PassExecutorService
ExceptionPY-20785Named unicode character inside fstring causes IDE exception
ConsoleFeaturePY-19613Variable viewer after "Show command line afterwards"
FeaturePY-10498Add option, "Load current project Virtualenv and open in terminal" (bash, zsh, fish or windows CMD)
FeaturePY-14330Pandas dataframes viewer in debug or console
FeaturePY-13498Copying from PyCharm console to a python file
BugPY-21384Wrong input prompt inside Python console for IPython + Remote interpreter (>>> instead of In[...])
BugPY-24642Python console action should open Debug prompt if available
BugPY-21792Python Console stopped working
BugPY-20619Multi-line commands: incorrect syntax error for return statement in functions
BugPY-20618Problems with multi-line commands in Python console
BugPY-20848PR 444: The console doesn't show the value of variable or function without print() command
BugPY-20849PR 444: Line numbers in IPython console
BugPY-20847PR 444: Can't finish multiline command
BugPY-21055PyCharm freezes after Python console restart if launched from the terminal (bash)
BugPY-22243"Show command line afterwards" option blocks `input()`
BugPY-14746Debug console interpreter
BugPY-18189UnboundLocalError: local variable 'traceback' referenced before assignment
BugPY-14960numpy array viewer for too large arrays
BugPY-21991"Execute Selection in Console" action does not work for multiple indented lines
BugPY-26413Unable to navigate through console history
BugPY-18424[Python] multiprocessing.Manager cannot start with "Show command line afterwards"
BugPY-25468IPython banner is lost when using Remote Python Console
BugPY-20732Python Console is broken for Remote interpreter with IPython 5
BugPY-10779Python Console "Include parent environment variables" setting has no effect
BugPY-17536"Show commandline afterwards" fails when script raises an Exception
BugPY-20617Multi-line commands: remove inappropriate inspections
BugPY-15727IPython Console: do not show input prompt until previously entered command is executed
BugPY-27009Python Console doesn't work with Python 2.6
BugPY-22535auto-update in Data View doesn't work when opened from console variables view
BugPY-16311pycharm python console crash with multiprocessing.Pool()
BugPY-20839Execute line in console gets executed on every console restart
BugPY-20831Console can lock up entire IDE for up to 60 seconds
BugPY-21591Use of "?" for help in IPython console does not format help properly only in Pycharm (outside is OK)
BugPY-18021Python Unit tests do not work with active winpty-agent.exe console on Windows
BugPY-13029Rerun for Python Console should reread settings
BugPY-17615Debug Console: Splash screen appears after typing only
BugPY-20685The prompt in debug console with IPython
BugPY-22056aborting commands in debug console
BugPY-25742Weird syntax error on executing line in console left after executing file
BugPY-18069NPE attempting to start Python Console
BugPY-19937No invitation '>?' to input in python console
BugPY-14828Interpreter options do not work for python console.
BugPY-26603Exception when stopping Python Console
BugPY-14446long lines hard to read in python console output
BugPY-24880Waiting for REPL response when python console using IPython
BugPY-15731IPython Console: not able to pass subsequent lines as arguments: UsageError: %% is a cell magic, but the cell body is empty.
BugPY-18302Python console is run as python script
BugPY-16324"Show command line afterwards" conflicts with debugger
BugPY-20013Pycharm Doesn't work with ipython 5.0.0
UsabilityPY-22099'Execute line in console' shouldn't execute empty lines
UsabilityPY-26415Hide "_", "__" and "___" to the Special Variables on console variable view
CosmeticsPY-20615Multi-line commands: remove double empty lines
CosmeticsPY-26557Typo in Console Settings
CosmeticsPY-20616Multi-line commands: dots at the beginning of the second line
ExceptionPY-25352Exception is thrown sometimes on closing Python console
CoverageFeaturePY-20131No branch-coverage (partial-hit coverage) available.
BugPY-17533coverage not shown in editor since upgrade to 5.0
BugPY-14869Running nosetests with Coverage fails
BugPY-10984Coverage results in remote interpreter not refreshed
DebuggerFeaturePY-22089Implement the faster debugger for Python 3.6 (using PEP 523)
FeaturePY-13540Show returned value in debuger after step out from function
FeaturePY-24593Implement "Condition" and "Log expression" for Exception breakpoints
FeaturePY-2431Provide threads suspend policy in breakpoint setting
FeaturePY-24114Create an option for selecting PyQt backend while debugging
FeaturePY-22362Data View tool window
FeaturePY-9537Is there really no "set next statement" option in the debugger?
FeaturePY-21763Extend pandas.Dataframe view support to pandas.Series
FeaturePY-18343Step Over `yield from`
BugPY-24022SystemError: unknown opcode
BugPY-24026Debugger skips breakpoint added to the current frame while running
BugPY-20052"Suspend all threads" options doesn't work with Python 3
BugPY-22561Data View: auto-update doesn't work with slices
BugPY-26584Debugger strips '-m' flag from script params and assumes it was meant for the interpreter.
BugPY-17885"Import by filename is not supported" when debugging script
BugPY-23680Error when debugging PyQt application
BugPY-19650Show returned values: show the name of the class
BugPY-22450Can't pause script execution with new fast debugger
BugPY-22455View as Array/DataFrame does not work with debugger hyperlink from Python Console -> Show Variables
BugPY-22454 "Suspend all threads" policy doesn't work with new fast debugger
BugPY-18241Thread ids are incorrectly shown with multiprocess debug
BugPY-16825Cannot do keyboard input in debug mode with interactive console turned on
BugPY-17929Remote debugging: Warning about wrong debugger version
BugPY-17923Django 1.9 - WARNING: Template path is not available.
BugPY-20158debugger stopping in all threads after resuming from a breakpoint
BugPY-20154debugging with fabric commands fail with sys.stdin argument must be an int, or have a fileno() method.
BugPY-22411Data View doesn't work well with several simultaneous debug processes
BugPY-22412Icon for Data View tool window
BugPY-19777Breakpoints don't work in included Django templates
BugPY-19342Django template breakpoints never hit
BugPY-23419Data view don't show the index of DataFrame neither rows numbers from numpy array.
BugPY-19710Turn on "Show returned values" by default
BugPY-24537Debug console isn't working with IPython 6.1.0
BugPY-20196Set default breakpoint suspend policy to "Thread"
BugPY-17722Pycharm does not collect run-time type information
BugPY-16100Unable to debug with remote Python interpreter: cannot connect to X server
BugPY-20468View as arrays is enabled w/o debug session
BugPY-17986Can not attach to process with python 3.5.1(win32)
BugPY-20251DataFrame viewer "Colored" setting isn't consistent
BugPY-18734"Evaluate Expression" triggers action twice under specific circumstances
BugPY-22499Add warning for slow debugger options
BugPY-20002Collecting call signatures doesn't work in debugger with IronPython
BugPY-20005The debugger hanging after print or call matplotlib in the debug IPython console
BugPY-183345.0.4 Regression: Debugging from Windows client to unix interpreter does not work if paths have uppercase letters
BugPY-26270Use white background for plots if light color scheme is used
BugPY-24656Correct link to documentation from Cython extension popup
BugPY-19622Debugger can't step into different threads
BugPY-22572Data View: close corresponding tabs when Python Console session removed
BugPY-21215"ImportError: No module named stackless" leftover in sys.exc_info()
BugPY-17409Debugger ignores breakpoints
BugPY-17092multiprocessing fail to debug, breakpoint not work in main module
BugPY-19853Input doesn't work in Debug Console
BugPY-18299Concurrency visulalizer: deadlocked threads are not marked
BugPY-19642Break Points ignored and random debugger freeze in 2016.1.2/3
BugPY-19647Several clicks on cython configuration hint can start several tasks
BugPY-22447Debugging jinja templates: visualization of currently active line is stuck on the first breakpoint
BugPY-22444 "Collect run-time types information for code insight" isn't available for new debugger
BugPY-22443Got an error message with new debugger on every debug run
BugPY-22270Jinja2 template debugger doesn't work since version 2.9
BugPY-23906Jython remote debugging fails with attribute error
BugPY-22421input() does not work in debug console
BugPY-20165AttributeError: 'DebugConsoleStdIn' object has no attribute 'buffer'
BugPY-20971Unordered display of OrderedDict in "Evaluate Expression" window
BugPY-26465Limit number of threads when evaluating variables asynchronously
BugPY-26460Image is cropped on retina display
BugPY-18292Additional newline appears when breakpoint is hit
BugPY-25285Concurrency visualizer doesn't work with Python 3.6
BugPY-9767IndexError in pydev_monkey.py when debugging
BugPY-19724Can't create application "setup" in Django if pycharm-debug.egg is installed
BugPY-20476Argument parsing for subprocess under debugger
BugPY-24766Segfault in debugger with Python 3.6
BugPY-21909"Collect run-time types information" doesn't work with Python 3.6
BugPY-22335Dataframe viewer gives UnicodeDecodeError from inside debugger in 2016.3.2 , complains of non-ascii characters when there are none-pandas handles them fine
BugPY-20780Debugger not working if path contains tilda (~)
BugPY-22690Can't debug python script with Remote Interpreter
BugPY-16690Exception when trying to debug an app that uses subprocess with "Attach to subprocess automatically while debugging" option unset
BugPY-25081Variables in function called from loop stick after console started in debug mode
BugPY-19205Debugger filters: impossible to filter debugger helper
PerformancePY-19215Cython debugger binaries should be built for Python 2.6
UsabilityPY-26289Do not evaluate variables during debug session if Variables View is hidden
UsabilityPY-22566Data View: distinguish tabs opened from debugger and console
UsabilityPY-22700Data View tool window: enable by default
UsabilityPY-26883Show a full name of interpreter when Attaching to process on Windows
CosmeticsPY-24754Hide verbose output from "Attach to process" action
ExceptionPY-25384Syntax error "del __py_debug_temp_var_*" while stopping debugger
DjangoFeaturePY-20612Django: Autocomplete kwargs for Model.objects.create()
FeaturePY-3130Files generated by 'manage.py startapp' should be automatically added to VCS
FeaturePY-24579``TEST_RUNNER`` value is not parsed
FeaturePY-18634django form autocompletion support in class based views
FeaturePY-20264Django Form field dictionary does not autocomplete field name
FeaturePY-16084Add configuation option that allows user to mark some folders as "plain html" and other like "django templates"
BugPY-15214Context data is not available in template if template is provided as as_view argument for genetic views
BugPY-24254PyCharm 2017.1.2 Expected type 'Union[SupportsInt, str, bytes, None]', got 'xx' instead false warning
BugPY-11965Type is inferred as "WSGIRequest | unknown" for the first param for all functions in views.py
BugPY-19636the blocktrans `asvar` parameter introduced in Django 1.9 is not supported
BugPY-1409Django test runner hangs on error creating the test database
BugPY-20097Installing django-chameleon when creating Django project with chameleon template engine
BugPY-26611``<modelname>_list`` variable has wrong type in templates
BugPY-24417PyCharm URLs regexp false "Number expected" error detection
BugPY-18461Django test runner does not accept many options
BugPY-25853Wrong django template path checking when using f-string
BugPY-26629Django support is partially broken when Django root differs from project root
BugPY-20464Cannot find reference 'outbox' in '__init__.py'
BugPY-24777Management commands throw the error "Choices should be list"
BugPY-24577redundant slashes should be ignored in "static" tag
BugPY-21914Using TEMPLATES['loaders'] causes app dirs to be ignored in 2016.3
BugPY-25304File cache conflict when creating Django with jinja template project
BugPY-18933In Django project, after collecting static files, the css and js lines in template files show as unresolved template reference.
BugPY-18694Django, Cannot find declaration to go to: if url 'namespace:name'. It finds only if url 'name' (without app_name)
BugPY-15745Cannot stop Django internal server process under Linux Mint Mate 17.1
BugPY-27003``re_path`` function appeared in Django2.0 is not supported.
BugPY-27002``include`` moved to new package, `` and not supported anymore
BugPY-24387Cross references in Django model are not supported
BugPY-13385Code analysis failed with exception
BugPY-21842Using function to create `template_name` value results in `Template file not found` inspection warning
BugPY-24345Wrong inspections for {% static %} template tags
BugPY-13909Django project root settings - not affected to template static tag autocomplete and etc
BugPY-20123Running manage.py commands using a remote interpreter can result in orphaned files
BugPY-15616Django: Refactor -> Rename: model references in relations fields are not updated properly if referenced with string notation
BugPY-24300Freezes when typing in the class of a Django model
BugPY-24111Running manage.py tasks produces NameError
BugPY-20351Support "is" and "is not" for "if" tag in Django templates
BugPY-18062Valid syntax using Django template tag {% with ... as ... %} marked as error
BugPY-19934Detect form field name in add_error method
BugPY-26660Django test runner should support custom options
BugPY-26936HTML file with non ascii line endings not recognized as Django template
BugPY-27000Django model constructor aguments are not suggested when called from different file using model prefix
BugPY-26620Template tags not recognized
BugPY-17107utilities in django.db.models.locating are deprecated
BugPY-18306Django structure is shown for a pure Python project
BugPY-21342Django autocomplete in templates doesn't work for foreign-key linked models
BugPY-21343Class-based view link from template gives menu with multiple similar choices
BugPY-14166Wrong refactoring after moving a model with ForeignKey / ManyToManyField pointing to it
BugPY-21648Pycharm 2016.3 - Django tests configurations - custom settings do not work
BugPY-24863Django Templates: Autocomplete for URL name in urls.py not working when using `include` with pattern_list
BugPY-22710Django 2.x Version Numbers
PerformancePY-24023CPU/Memory Usage
PerformancePY-18697Scanning files outside of project dir
UsabilityPY-24224Django 1.11: Can't ctrl-click widget template
ExceptionPY-20537PsiInvalidElementAccessException: Element: class com.jetbrains.python.psi.impl.PyClassImpl
DockerFeaturePY-19251Docker Compose on Windows
FeaturePY-17716Docker: Need custom parameters when run a container use docker-machine interpreter plugin.
BugPY-19594Allow user to change target mounting directory in Docker container for project sources
BugPY-19844Default mapping to /opt/project doesn't work for docker-compose
BugPY-22247docker mac debugger python don't work : Can't run remote python interpreter: Could not find docker0 network interface
BugPY-19983'404 page not found' two times and interpreter is added long
BugPY-19863Docker-compose: File's output doesn't reset
BugPY-20111Support stdin when running or debugging Python scripts
BugPY-20750"You cannot remove a running container" error on adding docker compose interpreter
BugPY-19759NPE on run/debug Python script with Docker Compose interpreter with no working directory set
BugPY-19755Error on running Python configuration when docker-compose configuration contains network description
BugPY-20270Argument for @NotNull parameter 'strings' of com/intellij/util/ArrayUtil.contains must not be null
BugPY-19944"unacceptable character #x0000" error on adding docker compose interpreter
BugPY-19198Configure Remote Python Interpreter dialog has no Docker option in IntelliJ IDEA 2016.1
BugPY-18516Show Docker Machine exceptions on starting run/debug configurations as execution errors
BugPY-25077Docker remote interpreter skeletons not copied correctly when image has Python PIP packages
BugPY-20999Python interpreter could not be added for Docker for Mac with socat workaround
BugPY-21847remote python interpreter and docker integration with docker-compose
BugPY-24971Python console fails with volumes value has non-unique elements error
BugPY-18455Docker interpreter is added as incomplete
BugPY-18456Docker-machine can't be started via PyCharm
BugPY-19644PyCharm created Docker containers are not removed after exiting PyCharm
BugPY-20743I have just upgraded and now python interpreter is not working for docker-compose
BugPY-20358Reloading generated skeletons keeps on running
BugPY-19332Unable to use docker compose when "restart: always" policy is used
BugPY-19684Generating python skeletons from docker env ridiculously increase docker virtualbox size
BugPY-20379Use version of docker-compose image that is installed locally at the users machine
BugPY-21177Docker Compose: unable to debug code when non-virtualbox driver is used
BugPY-18748Python console not working with remote docker interpreter
BugPY-18490Docker: Could not pull image error
BugPY-22489Support docker compose configuration 2.1
BugPY-22674Support version 3 of docker-compose configuration
BugPY-19886Docker for Mac Beta v1.12 Doesn't Support HostConfig
BugPY-25088Remote Libraries for Docker interpreter are empty
UsabilityPY-24894Docker Compose should report stderr from container output if process can't be started
UsabilityPY-18674Docker Compose: Service name may be chosen in select field
UsabilityPY-19420Unintuitive dialog for creating Docker Compose interpreter
UsabilityPY-19357Docker-Compose restarts all containers, removes all database container data and always exposes service ports
ExceptionPY-24604Unable to create Docker-Compose interpreter - InternalServerErrorException: invalid environment variable
ExceptionPY-26074Could not initialize class org.jetbrains.yaml.YAMLLanguage
ExceptionPY-18494Exception from Docker integration
DocstringsBugPY-24923Empty Numpy style Docstring breaks syntax error scanning
BugPY-17705Awkward formatting of parameter types in Quick Documentation for io.open()
BugPY-20125No documentation show up if docstrings contains chinese
BugPY-25779Show documentation for method if caret is placed inside parameters list
BugPY-25778Show documentation on import target expression
BugPY-19761PyCharm fails to render docstrings if PYTHONPATH environment variable exists
BugPY-25885Installed sphinxcontrib-websupport prevents PyCharm from displaying documentation for docstrings in Numpy/Google Style formats
BugPY-8219Unused local function in case of only usage in docstring
UsabilityPY-24854Allow Quick Documentation invocation when caret is placed inside docstring
EditingFeaturePY-20633Option to switch between backslash and parentheses for multiline imports
FeaturePY-18792Configuration for "Optimize Imports" action
FeaturePY-19606main postfix template
FeaturePY-19607print postfix template
FeaturePY-1779Triple-quoted strings: autocompletion for closing triple-quote
BugPY-26131Macros playback inserts "self"
BugPY-11040Support TODO in docstrings
BugPY-21269Multi-line editing inside a class, strange behaviour
BugPY-18181Folding:Folding doesn't work with 'with' statement
BugPY-3032Surround action can't be invoked when first line of selection is a comment
BugPY-21289multiline insertion sometimes inserts "self" incorrectly when opening parens
BugPY-7644Emacs Tabs misses possible indentation levels
BugPY-12396Property getter live template is useful only inside python class
BugPY-13323Code completion not recognizing correct position after imports
BugPY-14358Custom folding regions: invalid indent for closing tag on last method in class
BugPY-19836Aliases are not sorted for the same modules of one package
BugPY-21412Postfix .main triggers in comments
BugPY-19100Bad indentation when pasting whole function definition with multiline parameter list at the top of a file (smart indent on paste is turned on)
BugPY-17017Region comments are not parsed correctly at the end of a class
BugPY-7616"Emacs Tab" does not move cursor from column 1
BugPY-6382PyCharm Stripping Escaped Spaces in Regex
UsabilityPY-24430Do not show completion popup after ellipsis
UsabilityPY-15240Auto-insert "self" in methods doesn't respect code style
UsabilityPY-24432Unindent after ellipsis
FormatterFeaturePY-18265Missing code style option for power operator
FeaturePY-1765Add option to force blank line between 'class' and first method in class
FeaturePY-21598Add "Empty method call parentheses" and "Empty method declaration parentheses" to Python Code Style settings
FeaturePY-10182Add option for indentation of closing parenthesis, braces and brackets
FeaturePY-9764Optional forced trailing commas in multiline "from" import statements
BugPY-15051Formatter: comments right after a block gets overly indented with a EOF right after the comment
BugPY-24160Incorrectly reformatted multi line "if" condition with parenthesis
BugPY-19674Optimize imports splits unresolved relative imports between third-party and project-local groups of imports
BugPY-20836Unindent doesn't work if used at end of document
BugPY-25567Optimize import changes style
BugPY-24220Setting for the minimum number of blank lines after top-level imports should have precedence over that for "Around top-level classes and functions"
BugPY-21515Formatter doesn't remove extra spaces before source part in "from" imports
BugPY-20392Python code style option "space after comma" doesn't work properly
BugPY-12008reformat code over-indents multiline ifs
BugPY-19292Optimize Imports does not alphabetically sort import lists on the same line
BugPY-22272Dictionary formatting incorrect for list evaluation of element
BugPY-20970Formatter doesn't remove extra spaces after "nonlocal" keyword
BugPY-17979Pycharm incorrectly uses continuation setting producing non PEP-8 compliant formatting
BugPY-15874Bad indentation for the closing bracket in a list comprehension
BugPY-13304Wrong indent used for continuation of method call arguments
BugPY-19707Reformat code doesn't honor continuation indents in preferences
BugPY-19705Empty line between class header and its first method is not preserved (which conflicts with PEP 8 guidelines)
BugPY-21931reformat fails to remove extraneous spaces before "else" in conditional expressions
BugPY-25356Formatter doesn't handle excess blank lines between comments
IDEFeaturePY-11166Ability to create new projects without selecting Python interpreter
FeaturePY-6311support for ssh agent
BugPY-26261I have professional edition of pycharm but I am still suggested to have Ultimate edition
BugPY-23930"Add to currently open projects" not working
BugPY-18191PyCharm doesn't start via pycharm.exe
BugPY-26701Installation of Cython speedup extension failed when PyCharm installed via snap
BugPY-13328Create New Project: warning about installing template packages is not shown
BugPY-17836Project Opening options are ignored, confirmation window is shown regardless of settings
BugPY-9384Create new project doesn't warn about invalid interpreter
BugPY-18177New project created in wrong directory
BugPY-17717For subdirectory of a `Sources Root`, cannot `Mark Directory As > Sources` from right-click context menu
BugPY-26627Desktop entry doesn't work if PyCharm installed with snap on ubuntu 17.10 is used
UsabilityPY-2191Alt+Enter on importable unresolved references adds an unwanted auto-import
UsabilityPY-25962The documentation window in Scientific mode can take up all the editor space
UsabilityPY-13562New Project: there is no focus in project location
UsabilityPY-24580Come up with a list of synonyms for our settings and actions
CosmeticsPY-20143Duplicate warnings in "New Project" wizard
ExceptionPY-24573Can't select Angular CLI project
ExceptionPY-26075Prebuilt stubs can't be loaded
InspectionsFeaturePY-14056Warn about non-public API usage defined by __all__
FeaturePY-16055Python return type hint should be type-checked with inferred-type of function body
FeaturePY-3996Don't flag underscore-prefixed variables as unused (or make not doing so an option).
FeaturePY-16098Warn that async and await will become keywords in Python 3.7
FeaturePY-8325String format inspection for new-style format method
BugPY-20800'Replace with str.format method call' adds additional :s for repr
BugPY-20803'Replace with str.format method call' goes wrong with * character
BugPY-20805False positive "Variable is not used" for local variable inside fstrings
BugPY-22525PyCharm complains that typing.Iterable "does not define __getitem__".
BugPY-23057"Statement has no effect" inspection should ignore ellipsis operator
BugPY-20038"Call to __init__ of super class is missed" inspection if super is used with __class__
BugPY-26269Dict value type of Dict type and updating dict *member* gives typechecker warning
BugPY-25045False positive: expected type '{__div__}', got 'Union[int, float]' instead
BugPY-23552PyRedeclaration does not recognize static/class methods
BugPY-20824Spelling inspection does not work for the first word in fstrings
BugPY-23707False positives for __new__ arguments of some builtin classes
BugPY-16585PEP 484: "type:" comment may work incorrect in list comprehension lines
BugPY-20844f-string expression cannot include a backslash
BugPY-11943Type annotation and checking does not consider `dict` a `MutableMapping`
BugPY-20987Spelling inspection doesn't report typos for consecutive nodes of a "glued" string literal if the first node doesn't have a prefix
BugPY-20986"Assignment can be replaced with augmented assignment" should be removed from warnings
BugPY-20679Inspection error. 'Cannot find reference in object'
BugPY-23513Overrides of abstract static methods with expanded arguments fail signature checking (PyMethodOverriding)
BugPY-21408PyCharm not aware of callable attributes
BugPY-20863False positive: unresolved reference for quoted type hints inside annotations
BugPY-22091Incorrect "method may be static" inspection with string literals in Python 3.6
BugPY-22831Access to a protected member of a class inspection not ignored in py.test test functions
BugPY-20655Calling `locals()` within decorator causes "Unused Local" Warning for Decorator Parameters
BugPY-23355Invalid "Python versions < 3.5 do not support starred expressions in dicts" inspection warning when using type comments
BugPY-20242PyCharm thinks package requirement is not satisfied, but it is.
BugPY-24960False-positive warning about results of comparison operators for imported types
BugPY-24969False positive: "expected to return ..., got no return" for variable type annotation
BugPY-24436False positive: "Class has not __init__ method" if A inherits B which inherits another A with __init__
BugPY-26368False negative: Can't check definition of value of class properties
BugPY-20752'Replace with str.format method call' messes up with tuples
BugPY-20754Supress 'Replace with str.format method call' for bytes
BugPY-19130Type inference: decorators behaving oddly
BugPY-17456Wrong error message about return type of scipy.integrate.quad function
BugPY-23311Postgres Create Extension doesn't get syntax highlighting
BugPY-18791False positive in type information when returning callable from property
BugPY-19119Warnings "PEP 8: no newline at end of file" for PEP 484 type hint comments
BugPY-21164False positive inspection 'Too few arguments for format string' with unpacking argument list inside other list
BugPY-21166No inspection if unknown format code is used in formatted string
BugPY-18402False positive for attribute of conditionally defined variable in imported module
BugPY-4344Parameter unfilled: false negatives for named tuples
BugPY-22222Type doesn't have expected attributes with __slots__
BugPY-22224no warning about: `x, y = None` (TypeError: 'NoneType' object is not iterable)
BugPY-19323typing.Callable type without arguments incorrectly warns that it is not callable
BugPY-19927Magic methods __setstate__ and __sizeof__ not highlighted as magic methods
BugPY-19699False positive "Too few arguments for format string" on *imported* tuple
BugPY-19691Source root named the same as its child package causes unresolved references in "from" import from the latter
BugPY-21994False positive on PyTypeChecker for optional list argument
BugPY-19775Unresolved attribute reference on attribute defined inside async def __init__
BugPY-19956Slotted attributes considered read-only
BugPY-19486Python compatibility inspection incorrectly flags enum import when enum is in project requirements
BugPY-20946False positive: `__init_subclass__` method first parameter should be named "self"
BugPY-17962Incorrect handling of type Callable
BugPY-24287False positive: A variable of type AnyStr should also accept bytearray
BugPY-23623False positive: __getitem__ not being defined for list after isinstance check
BugPY-25346typing.NamedTuple field types are not inferred
BugPY-26023The presence of an `@abstractmethod` decorator totally cancels all typechecks.
BugPY-20460typechecker false positive with slice
BugPY-22642Static typecheck resolution of `typing.Generic` is to the first assignment, not the effective
BugPY-22919max() function transmits argument type to return type
BugPY-24182datetime.isoformat(timespec='seconds') argument is not recognized as valid
BugPY-18880Python 2.7 code compatibility inspection warns that the typing module does not exist even if it has been installed with pip
BugPY-25118Pycharm incorrectly flags class attributes as unresolved on typing.NamedTuple subclasses
BugPY-8936False positives in inspections for non-data descriptors
BugPY-8933Import in try block should also be defined in except block: false positive when name not used
BugPY-26491Using * twice in function signature should be picked up as a syntax error
BugPY-20798'Replace with str.format method call' messes up with dictionaries
BugPY-16893open() returns TextIOWrapper which isn't correlated with IO types
BugPY-16894open(..., 'b') returns FileIO[bytes] which isn't correlated with BinaryIO type
BugPY-23391False positive: calling float on Decimal
BugPY-25171False positive of signature check in metaclass's __new__
BugPY-23247Shorten inferred type of zip function
BugPY-16406Class 'tuple' does not define 'sub', so the '-' operator cannot be used on its instance
BugPY-22305PyCharm thinks the Python version is 3.5 when using 3.7
BugPY-22302False positive "Python version < 3.0 do not support '...' outside of sequence slicings."
BugPY-25545Add support for __init_subclass__()
BugPY-21655False inspection: @asyncio.coroutine decorated function treated as non-awaitable
BugPY-21651Unresolved reference for attributes created by with statements
BugPY-26510False positive: raise with no argument in finally block
BugPY-25157Inferred type shows incorrect return type with namedtuple
BugPY-25624Appearance of "raise NotImplementedError" in parent class's methods causes unnecessary inspection in derived classes
BugPY-20004Chained comparison is simplified wrong
BugPY-23289UUID is not accepted argument for int()
BugPY-21619No warning in UI for missing newlines after function or class definitions
BugPY-18357Inspections misunderstanding numpy ndarray comparison operators
BugPY-23540PyCharm doesn't recognise metaclass when the class has other builtin bases
BugPY-20810PEP-8 E701 'Multiple statements on one line (colon)' for every variable annotation
BugPY-20818Unresolved attribute reference with isinstance and class inheritance
BugPY-24240False positive: "unexpected argument" inspection for multiple inheritance/mixin
BugPY-24817False positive: Method may be 'static' when docstring is present
BugPY-21800Standalone comparison expression should always trigger 'Statement seems to have no effect'
BugPY-18375“_” in comprehensions triggers “Redeclared names without usage”
BugPY-22763False positive in type checking for typed chained comparison methods
BugPY-19020Incorrect PEP 8 validation with argument annotations having default values
BugPY-26290False positive "not declared in __all__" for "from unittest import mock"
BugPY-20660False positive return type inspection for Python stub files
BugPY-24637True, False and None are marked as unresolved reference in docstring example
BugPY-22740Unexpected argument for field names of class inherited from namedtuple
BugPY-23367False positive: comparing int and float, only left.__gt__(right) is checked, right.__lt__(left) is ignored
BugPY-22102NamedTuple class declaration for Python 3.6 not supported by PyCharm
BugPY-18427Type hints don't respect conditional type definitions
BugPY-25695False positive for imported name after append to __all__ and re-export this module via star import
BugPY-19998Inspection "Chained comparisons can be simplified" falsely suggests quickfix "Ignore statement with a constant in the middle"
BugPY-19999Quickfix "Ignore statements with a constant in the middle" for the inspection "Chained comparison can be simplified" doesn't update settings
BugPY-19992Pep 8 coding style inspection settings are ignored for custom inspection profiles
BugPY-20876'Replace with str.format method call' messes up with sets
BugPY-19523'Python version 2.7, 3.1, 3.2 do not have module bz2' inspection is incorrect
BugPY-21479PyCharm incorrectly displays an 'unresolved reference error' in f-strings in list/dict comprehensions
BugPY-26313False positive: io.seek doesn't return anything
BugPY-24405False negative: Async Context Managers type hinting does not work
BugPY-24408Single underscore redeclared usage
BugPY-22801False positive for long(number) in Python 2
BugPY-22808Wrongly suggested returning list of list with unknown type index
BugPY-19858type checker: wrong type for List[List] elements
BugPY-19085Unresolved attribute reference 'fullmatch' for class '__Regex'
BugPY-24364Type inference fails when generator is converted to list, but the variable name is kept.
BugPY-12773Misleading warning for attribute assignment when a class has __slots__
BugPY-24099False positive: parameter unfilled for NamedTuple with default value
BugPY-22391'if' statement causes an incorrect Optional type inference
BugPY-18275Wrong hint on "{}".format(...)
BugPY-16066basestring not treated as a `type` by PyTypeChecker inspection
BugPY-18866Method '...' can be 'static' - false positive when calling super()
BugPY-24930False negative: no parameter info when implicitly calling __call__
BugPY-14234"Access to a protected member of a class" false positive when underscored module imported
BugPY-24445False positive: PyCharm ignores issubclass check inside list comprehension
BugPY-19127__prepare__ magic function not hightlights
BugPY-13273Incorrect unresolved reference error with list comprehensions in decorator args
BugPY-24323Wrong expected type inspection for the `key` argument of `min` and `max` functions
BugPY-21175Actual type of variable is lost after it's compared with None
BugPY-19353Wrong PEP8: unexpected spaces around keyword / parameter equals
BugPY-18744Advertiser about compatibility inspection is wrongly shown
BugPY-22398False positive about missing argument for numpy.maximum.accumulate()
BugPY-21156No inspection if unpacking argument sequence is used with format method
BugPY-23429False warning about expected type of parameter
BugPY-19374Class can't reference itself in .pyi stub files
BugPY-25491'as' imports marked as unresolved when project opens
BugPY-23634min() from comprehension with unknown items type return list
BugPY-19975When both PyQt and PySide are installed, auto import quick fix can't get proper import name for symbols from PyQt
BugPY-16968Passed variable keyword arguments are reported as unexpected for function with keyword-only arguments
BugPY-19492Magic method parameter value is flagged as unused but cannot be removed because it's required by Python
BugPY-14614False positive for "Class must implement all abstract methods" inspection
BugPY-18965Python version 2.7 does not have method exec - regression
BugPY-19701False positive "setter should not return a value" with local function definition
BugPY-25120Error while iterating over a dict value if it has both list of strings and bool as values
BugPY-23684False positive: PyTypeChecker - Type Checking Error on Child of Metaclass Instance
BugPY-24749False positive: Enum __init__: Signature is not compatible to __new__
BugPY-10397PyCharm should check __slots__ before issuing "unresolved reference attribute" warning
BugPY-24194Incorrect unexpected type error when calling bytes() on a class instance that implements __bytes__()
BugPY-20244False 'Assignment can be replaced with augmented assignment' for lists
BugPY-20889Unresolved attribute after isinstance check in boolean expression
BugPY-1177Control flow analysis doesn't detect while/break
BugPY-24763Expected wrong return from __init__
BugPY-23239NamedTuples aren't getting their types checked
BugPY-14381Wrong "Empty group" warning for regex
BugPY-25166types.MethodType stub incomplete and results in warning when running Python documentation example code
BugPY-22676False positive: "parameter iter2 unfilled" for map() call
BugPY-24789float and int DO support Decimal...don't they?
BugPY-23253NamedTuple subclass inspection
BugPY-20783PyCharm does not see local variables when parsing fstrings
BugPY-22312Type inference incorrectly thinks there's a tuple in here somewhere
BugPY-17828Wrong signature inspection false positive for __prepare__ method of metaclasses
BugPY-22692YAML comments starting with "# type: " are taken for Python type comments
BugPY-16473Inspection naming error for namedtuple declared into a funtion
BugPY-19412Class method support becomes broken if method attribute is used
BugPY-20599False positive for %a format specifier
BugPY-24067False docstring async function return type inspection
BugPY-23481False positive: parameter unfilled for dict.update() with explicit argument
BugPY-20017Unresolved attributes for child class if __new__ is implemented in parent class
BugPY-9662Type of expression * int literal results is detected as int while it's unknown
BugPY-22716False positive __slots__ inspection in subclasses of classes
BugPY-22712zip() signature inspection warning
PerformancePY-20553Performance problem: One CPU core running always at full speed
PerformancePY-25794Inspections should not load AST where possible
UsabilityPY-3318Add all words from django settings.py to spell-checker vocabulary
CosmeticsPY-20610Don't highlight arrow when reporting mismatch of return type and type hint
ExceptionPY-25994Code insight failures
ExceptionPY-26061Specific code pattern causes inspections to hang
ExceptionPY-24260StackOverflowError in PyTypeChecker.substitute: PyCharm Inspections engine crashes
ExceptionPY-24610Exception because of Invalid TextRange in format string
ExceptionPY-20223NumberFormatException in requirements normalizer breaks code inspection in PyCharm 2016.2
ExceptionPY-22739IAE: Argument for @NotNull parameter 'value' of com/intellij/util/containers/hash/LinkedHashMap.put must not be null
Interpreters SettingsFeaturePY-21571It should be possible to specify a default folder for virtualenvs
BugPY-26749Can't create pyramid project if new venv is going to be created inside project
BugPY-26372False positive: location directory is not empty if existing interpreter is selected
BugPY-20078Failed to create conda virtual environment "conda: error: unrecognized arguments: -y"
BugPY-13708Project Interperter: remove for the duplicated interpreter removes both
BugPY-18074virtualenv problems with pycharm5 and python 3.4
BugPY-14906options/jdk.table.xml does contain absolute path. Should be ~/
BugPY-26657don't install Flask package in Flask project creation
BugPY-25388Can't install new packages in master build
BugPY-26456PyCharm doesn't allow to create project right after interpreter is chosen
BugPY-26450UI is frozen during new project creation with venv inside it
BugPY-18513Cannot create a new conda environment with Profession Edition 5.0.4
BugPY-19568Pycharm hangs on editor right click
BugPY-26594Manually added paths to local interpreter get lost
BugPY-26968Create a new environment for a new project by default
BugPY-18453Package management disabled in PyCharm 5.1 EAP
BugPY-26373PyCharm uses wrong slash for venv path on Windows
BugPY-26358Can't select venv as existed interpreter
BugPY-18785Interpreter appears twice
BugPY-26443PyCharm doesn't auto rename virtualenv according to project
BugPY-20263PyCharm doesn't recognize built-ins and standard modules if there are entries in the interpreters list that end with (1), (2), and so on
BugPY-27014ISE: @NotNull method com/intellij/openapi/projectRoots/impl/ProjectJdkImpl.getName must not return null
UsabilityPY-15911Make managing **many** local interpreters easier
UsabilityPY-13099Remember last used virtual environment location
UsabilityPY-26360Not a clear way to create conda venv
UsabilityPY-13464Truncated virtualenv paths look strange and lead to ambiguity
UsabilityPY-26376PyCharm won't preselect previously used venv base interpreter if it was a detected interpreter
UsabilityPY-20109Annoying automatic scrolling to the system interpreter executable in "Select interpreter" dialog
UsabilityPY-26359Do not start interpreter updating right away when system interpreter is selected on new project window
UsabilityPY-26357Existing interpreter list is not updated until PyCharm is restarted
UsabilityPY-23783Notify user about existed same name conda virtualenv
UsabilityPY-26998Remember the base interpreter for new virtualenvs if it's not detected or configured yet
UsabilityPY-24660Detected virutalenv selected for a project becomes available to all projects by default
CosmeticsPY-18439Remove minor version from generated interpreter name
ExceptionPY-22028Exception on open project in the same window while SdkUpdater didn't finish it's job
Jinja2BugPY-19931Recognize Jinja 2.8 block assignments
Jupyter NotebookFeaturePY-21261Make Run Configuration for Jupyter Notebook
FeaturePY-14740Convert an .ipynb file to and from a standard .py file
FeaturePY-14224show line numbers in code cell
FeaturePY-14605Add support for remote ipython sessions including password protected nbservers.
FeaturePY-15790Refactoring not available in notebook view
BugPY-20033Annoying PEP 8 "no new line at end of file" in IPython Notebook cells
BugPY-24803Run current cell action should be available from editing mode
BugPY-24397Jupyter Notebook: infinite loading in editor window
BugPY-20674Terminating 'Jupyter Notebook' enforces to force quit PyCharm
BugPY-19610Notebook validation failed
BugPY-21467charts that appear normal on jupiter are cut on pycharm
BugPY-21957Jupyter Notebook fails to display formulas with multiple exponentiations
BugPY-14395IPython notebook: Bad grammar and style in the tooltip
BugPY-14132IPython Notebook: navigate to symbol from other cell doesn't scroll to the caret position
BugPY-25300PyCharm cannon't connect to a server after notebook was opened in a browser
BugPY-14394IPython Notebook: specify type in docstring: quick-fix opens separate code tab
BugPY-24850IPython cell can't be run in Jupyter Notebook launched via new Jupyter Notebook run configuration
BugPY-24870Obsolete hint for remote Jupyter Notebook bad URL
BugPY-19813ASCII CR character creates new line in jupyter notebook rather than returning to the beginning of the current line
BugPY-24830Intellij IDEA 2017 freeze on Macos 10.12.5
BugPY-21214Jupyter notebook rerun should stop and rerun process
BugPY-16983iPython notebook undo bug and redo can not get back
BugPY-22424Reconnect to remote host on settings change
BugPY-25639"Convert to Jupyter Notebook" removed all line breaks in code.
BugPY-22032Jupyter 403 error: _xsrf argument missing from POST
BugPY-25106PyCharm changes ipynb file content on open
BugPY-24565Copy & paste first cell works only on the second time
BugPY-16470Help for IPythonNotebook shows wrong page
BugPY-24845Hang on installing jupiter package via Fix button in Run Configuration
PerformancePY-18625ipynb files performance problems
UsabilityPY-20039Adjust Jupyter notebook font size with python cells font size
UsabilityPY-14305IPython Notebook: add shortcuts to the action popups
UsabilityPY-20055Do not collapse imports in ipython notebook
UsabilityPY-23514Jupiter notebooks need different working directories
UsabilityPY-14218Move editor inner toolbar to the proper place.
UsabilityPY-24847Let current project folder be default working directory for Jupyter Notebook run configuration
CosmeticsPY-20058Suppress pep8 e402 warning for jupyter notebook
CosmeticsPY-21136Jupyter notebook editor buttons have some weird gray circles on the background on Windows
ExceptionPY-22534CertificateException on first execute cell action in remote Jupyter nootebook
ExceptionPY-24873Can't execute notebook cell if remote interpreter is used
ExceptionPY-22558Exception on close project with jupyter hub
ExceptionPY-22559NPE on execute cell in notebook
MakoBugPY-17932mako syntax highlighting broken
ExceptionPY-23505editing Mako break pyCharm - for three years
PackagingFeaturePY-13896devpi support and make pypi.python.org optional
FeaturePY-6801Remove pypi repository
BugPY-22773Project > Project Interpreter incorrectly highlights prerelease versions as 'Latest' e.g. 1.0rc1 > 1.0
BugPY-11963Package requirements inspection warning for Python packages with names that don't match PyPI packages
BugPY-20489Requirements.txt inspection complains about libraries stored in source roots
BugPY-12460degug info option for setup.py build_ext must be --debug
BugPY-25091no bdist_wheel opinion in setup.py tools
BugPY-19925Alt-Enter package installation always warns about not installed pip and setuptools
BugPY-18184Failed to install python packages using conda-script when creating project
BugPY-20522Pycharm doesn't understand "compatible release" (~=) in requirements.txt?
BugPY-19544Incorrect parsing of requirements.txt
BugPY-20081No information about packages from default pypi: unable to update and download new packages
BugPY-22275Package requirements tracker does not recongize versions with asterisks
BugPY-20374Inability to install packages from a local repository running over the directory structure of package artifacts
BugPY-18966setup.py dependency_links not respected by PyCharm "Install requirements"
BugPY-18703Can no longer mix conda/pip under Conda env
BugPY-20880Package requirements inspection does not support local version identifiers
BugPY-24682"AttributeError: NamespacePath has no attribute sort" during package installation
BugPY-24867'Add requirement ...' quick-fix doesn't work well for packages with names that don't match PyPI packages
BugPY-23842PyCharm fails to install packaging tools in the newly created 3.6 venv
PerformancePY-20370PyCharm hangs when one opens settings for an interpreter with many packages from Welcome Screen
PerformancePY-20478Pycharm 2016.2.1 Crashes when trying to navigate the project interpreter screen
UsabilityPY-6398Hide "Package successfully installed" notification when you start installing another package
UsabilityPY-14630Packaging: do not disable Add Package button while indexing
CosmeticsPY-24225Poor scaling in "Available packages" browser on HiDPI screens
TaskPY-21929Update bundled versions of pip and setuptools used to bootstrap virtualenvs created in PyCharm
ExceptionPY-19920AssertionError at com.jetbrains.python.packaging.PyPackageUtil.updatePackagesSynchronouslyWithGuard
ExceptionPY-19923Exception from SdkUpdater if setuptools is not installed
ExceptionPY-21002Exception is thrown when new project is created
ParsingFeaturePY-18973implement support for PEP 515 (Underscores in Numeric Literals)
BugPY-19679"await" in list comprehension is not marked as a syntax error
BugPY-24389False positive: "expression expected" for trailing comma after annotated function argument with default value
BugPY-20662Making any magic method async displays an error, even though it is sometimes legal
ProfilerFeaturePY-19481vmprof-python profiler integration
BugPY-19862Blocks in Call graph are not connected with cProfile
BugPY-18442Profiler fails with Python 3.x
BugPY-18085Nothing shows when Running Profile or Open cProfile snapshot
BugPY-20608Pycharm profiling shows whole seconds
BugPY-24509Profiler copy of six module is outdated, breaking code using new features
ExceptionPY-19593SocketException: Connection reset
PyramidBugPY-13931Create new Pyramid project: invalid duplicated pyramid.includes section in app:main
BugPY-24519Error when adding a new file template
BugPY-21031Pyramid doesn't start, Traceback (most recent call last):
BugPY-22709PyCharm fails to create template folder for Pyramid + Chameleon + Windows: exception raised
BugPY-22189New project template for Pyramid shows incorrect template languages in "More Settings"
BugPY-22639Pyramid Chameleon project template generates wrong path to .pt template file
BugPY-23177Empty template file for Chameleon based project
CosmeticsPY-22077Update Pyramid icon in new project window and run configs
ExceptionPY-18172IllegalStateException: @NotNull method com/intellij/execution/configurations/GeneralCommandLine.getExePath must not return null
ExceptionPY-18171Pyramid project can't be created with Assertion failed: Write access is allowed inside write-action only
RefactoringFeaturePY-8174"Change Signature" as quickfix for "Unexpected argument"
BugPY-24602Change Signature doesn't handle keyword arguments for vararg intermixed with ordinary keyword arguments
BugPY-24607Change signature doesn't add name to an exsiting argument when its parameter gets preceded by new one with default value
BugPY-24609Change signature keeps keyword in arguments of a former keyword parameter moved before positional vararg
BugPY-8604Rename refactoring for variable in generator comprehension leads to unresolved references
BugPY-19583Bad simplifying in condition
BugPY-19136"Superclass" refactoring: forgotten inheritance and incorrect UI behaviour
BugPY-19137"Superclass" refactoring: incorrect inheritance specification leading to MRO resolution conflic
BugPY-24479Change Signature doesn't properly handle deleted parameters in functions with varargs
BugPY-24288Change signature removes existing keyword argument if an extra parameter with the same name was added
BugPY-16683Change signature doesn't handle keyword-only arguments in Python 3
BugPY-24480Change Signature doesn't properly handle new parameters in functions with varargs
BugPY-18808Incorrect variable highlighting
BugPY-25035"Convert from variadic to normal parameters" does nothing
BugPY-18216Refactor/Move with option "Search for references": moving module to a different package performs "Optimize imports"
BugPY-24365Bulk Move operation only moves first item selected
BugPY-19748'Replace with str.format method call' should not add u
UsabilityPY-19010TAB doesn't work properly in Change Signature dialog
UsabilityPY-24149Change Signature dialog should by default focus on parameters instead of the name of a function
CosmeticsPY-24150Parameter list in Change Signature dialog doesn't scale well on HiDPI screens
ExceptionPY-19760Refactorings should not be started inside write action - applying quickfix of inspection 'Method signature does not match signature of overridden method'
Remote InterpretersFeaturePY-22600Support SSH Key Pair (or Password) + OTP authentication for Python remote interpreters
FeaturePY-22787Speed up skeleton generation for Docker & Docker Compose interpreters
BugPY-11455Pycharm creates new sftp-server process every time I run script on remote server
BugPY-27165Extra slash in remote path
BugPY-14940No "Reload paths" button for remote interpreters
BugPY-20198Debbugger fails to show variables in 2016.2
BugPY-19192Remote debugging path mapping broken, C:/PathC:/Path=/path
BugPY-1873820+ prompts upon PyCharm startup with remote interpreter
BugPY-27046SFTP deployment doesn't work if OpenSSH config is used
BugPY-26981ssh config file doesn't work on Windows
BugPY-24247JSch logger is not initialized in some cases
BugPY-2813Namespace packages reported as unresolved references for remote interpreters
BugPY-18843Stub generating for a new local interpreter fails if some old remote one is inaccessible
BugPY-18520Execution of run configuration fails when default synced folder "." redefined in Vagrantfile
BugPY-23653Ssh console hangs on connecting to vagrant box
BugPY-18437Project interpreters based on deployment configurations listed with invalid names
BugPY-26464OpenSSH configuration files are not reloaded during IDE run
BugPY-25525debugger has trouble with space in path
BugPY-19982Remote interpreters could not be added within Python plugin if Docker plugin not installed
BugPY-26486Python Console doesn't work: Process finished with exit code -1
PerformancePY-5688Remote Interpreter: send pycharm helpers to remote host as one zipped archive
UsabilityPY-24028Show connection string when prompting for OTP
UsabilityPY-7576"Uploading PyCharm helpers…" should be interactive
TaskPY-26171Remote interpreters fails to connect to pure IPv6 host from Mac OS X Yosemite 10.10
ExceptionPY-19536Python remote interpreter plug-in, causes "Unable to save settings: Failed to save settings. Please restart PyCharm".
ExceptionPY-26442SshTransportException and InvalidSdkException if remote interpreter server is down
RestructuredTextBugPY-20820Syntax highlightning for reST substitution fails on multi-word declarations
BugPY-12241links_ are not highlighted in ReST files when they are followed by some of the punctuation chars
BugPY-23884ReST :kbd: Markup is Not Highlighted Correctly
BugPY-7123Structure for RST document incorrect
BugPY-24476ReStructuredTest Support Plugin incorrectly reports warning on title length
BugPY-23970False positive: "Title length must match the underline" for rst
BugPY-23344Incorrect RST autoformat result
BugPY-18961ReStructuredText editing broken after upgrading to IDEA 2016.1
BugPY-22350reStructuredText :class: and :name: options break IDE code-block highlighting
BugPY-24881rst completion of links
BugPY-20203Short RST headings missing in structure view.
BugPY-24685Code Inspect for rst files does not recognize Multi character foot note references when target is under a rubric directive ..
BugPY-18529REST Client and ReStructuredText Support plugins conflict
RunFeaturePY-22487Emulate terminal in python output console
FeaturePY-22042Gutter icon for running main clause
BugPY-9448Add ability to directly create pdf's from sphinx documentation
BugPY-23996Source roots and content roots are added in PYTHONPATH for run configuration in no particular order
BugPY-17816PyCharm drops "/usr/local/bin" from PATH
BugPY-25435Run configurations should be executed independent of indexing
BugPY-15085Virtualenv's $PATH not passed when running scripts
BugPY-22733Default Working Directory Ignored for New Run/Debug configurations
PerformancePY-254295-10 second delay when running any script
ExceptionPY-22495"Emulate terminal" option raises an exception when trying to run debug
SkeletonsBugPY-15912can not resolve RandomState in numpy
BugPY-26751Pregenerated skeletons get deleted if SDK path does not exactly match
BugPY-15285Numpy: Parameter unfilled: false positive for randn function with only one argument
BugPY-15283Numpy: Unexpected argument: false positive for reshape: invalid skeleton for the method
Test RunnerFeaturePY-2410support twisted.trial unittest runner
FeaturePY-14221Wanted option: Stop tests on first failure or error
FeaturePY-23932Any file should be runnable as plain script, but tests configuration should be displayed first to save keystroke
FeaturePY-19727Context menu on test does not honor the chosen test runner
BugPY-25271PyCharm passes pattern to doctest even if pattern option is disabled
BugPY-19015tox fails for tox environments with empty commands list
BugPY-23570left-gutter run buttons try to execute Karma/Jasmine tests with Django test runner
BugPY-18839PyTest: "Rerun failed tests" fails when TestCase is a derived class.
BugPY-20091Test runner hides tests that errored during the collection phase
BugPY-22457No warning is shown for Test Run Config if there is no such runner installed
BugPY-26432teamcity.diff_tools error shows when doing a self.subTest() instead of usefull fail message
BugPY-23452sys.path[0] incorrect when running unittests with "Add source roots to PYTHONPATH"
BugPY-7856Doctest: missing diff link for failed doctest
BugPY-22414RuntimeError in nosetest runner with specified python-target and Python 3.x
BugPY-22410Target is always sent to executed line when running test configuration with "Custom" setting
BugPY-21142NoseTest run configuration : Pattern parameter unavailable
BugPY-18163Test case no longer recognized as test
BugPY-12100PyCharm 3.1 no longer supports running all unittests in a folder
BugPY-18282PyCharm runs nosetests on directories, but not on files
BugPY-25664PyCharm fails to find tests in file if test class contains methods with none "test_*" name
BugPY-24282Raising SkipTest on PyCharm results in KeyError
BugPY-20194Unitests should have project root as working directory if not specified explicitly
BugPY-18125Creating tests: Multiple "Test method" selections only seems to pick first test
BugPY-22641Almost everything it broken when tests launched from subfolder with out of __init__.py
BugPY-24770Unittest runner suggested for top-level functions when it has assert in it
BugPY-17535Can't use relative import in unittest on python3
BugPY-22490PyCharm wrongly counts number of tests
BugPY-23490New test runner in 2017.1 does not find unit tests
BugPY-22514Spurious runConfigurations.xml
BugPY-23856space in test name
BugPY-18538tox runner appears to run tests twice
BugPY-24875Bunch of teamcity messages inside Debug Console
BugPY-20624Pytest before 2.8.0 does not work - ImportError: No module named '_pytest.pytest_teamcity'
BugPY-24010Renaming project removes py.test context configuration option
BugPY-25264Regression in unittest runner if test removes its working directory
BugPY-23738Unittest - test stopped with chars wider than 7 bits (not ascii)
BugPY-25386Fix button in default test runner settings for twisted.trial installs pytest
BugPY-25387Can't pass additional arguments to twisted.trial
BugPY-22579Unittest Pattern is not passed to the test runner
BugPY-24997Nosetest output is not displayed until the end of test
BugPY-19602django test module incorrectly being treating as nosetests module
BugPY-26102Run Py.Test menu option not available to all objects in project
BugPY-24619Hyphen in the file/folder name blocks PyCharm to detect tests
BugPY-25205Pyramid project test don't work
BugPY-22460Can't run nose/unittest configurations with target set to Custom
BugPY-24423"django.core.exceptions.AppRegistryNotReady: Apps aren't loaded yet." error in 2017.1.3 (runs fine in 2017.1.2)
BugPY-24302Python unit tests fail in project with multiple modules. Only 1st configured module works
BugPY-23926Testing does not work if ``teamcity-messages`` is installed on interpreter
BugPY-22409Test Progress Bar stuck at "half done" till the end of tests running
BugPY-17955Django test target is incorrect when running tests from the context menu
BugPY-20457Rerun tests does not work with subtests
BugPY-23217django-nose: Test Results don't lead to test anymore
BugPY-22378Old py.test run configuration become broken
BugPY-23821nose generates a bunch of empty lines with no reason
BugPY-23820unittest generates a bunch of empty lines with no reason
BugPY-13833Invalid subtest display with pytest.mark.parametrize
BugPY-23785(unittest2) AttributeError: 'super' object has no attribute 'addSubTest'
BugPY-24047unittest passing when exception is raised
BugPY-22506Rename refactor does not affect Test Run Configuration
BugPY-22505New jb_unittest_runner doesn't print text from input and any flushed text until end of test
BugPY-23846Dot in subtest name breaks output
PerformancePY-22401PyCharm is totally freezed after changing modes of test run results (Docked, Floating, Windowed, etc)
UsabilityPY-26255Test runner validation improvement
CosmeticsPY-25243Typo (or bad English) in error message
CosmeticsPY-18233Newline is needed for test summary (tox + py.test)
CosmeticsPY-22379nosetest, py.test and unittest configurations have incorrect UI display
ExceptionPY-22376No entries about running tests in context menu for files with test: java.lang.ClassCastException
VagrantFeaturePY-19781Add 'Vagrant Share' command to Tools > Vagrant
BugPY-19554Option "disabled" in synced_folder directive ignored
BugPY-23997Remote CLI Interpreter using Vagrant Instance can not find vagrant settings.
BugPY-17000Remote interpreter mappings aren't working for BDD runners
No subsystemFeatureDBE-2808add column comment feature
BugDBE-2912DataGrip does not save parameters for a function
BugDBE-2237Derby: Inspections: false positive "Unresolved reference" inspection at some functions used with {fn ...} syntax
BugDBE-2886Copy table DDL is gone
BugDBE-4387Regression: PostgreSQL query VALUES with enrcypt() not recognised
BugDBE-2608Database tool window sorts columns wrong
BugDBE-2607Completion in injection with joom db prefix
BugDBE-3167Unable to run CREATE TRIGGER with DB2
BugDBE-516PostgreSQL: default values of function parameters are not shown
BugDBE-3872Looking for JDBC Driver Implementations
BugDBE-4873Hsqldb script: hinting still fails to resolve some columns
BugDBE-3130Postgres: cyrillic column name incorrectly shown in disconnected mode
BugDBE-3150single quote not escaped when copying DDL
BugDBE-2742Explain Plan not working for Sybase ASE 15.0.3
BugDBE-2906Bad timestamp value
BugDBE-2137Sequence Keyword not reconized on SQL console.
BugDBE-3077Database window does not list tables from Redshift
BugDBE-2891Routine Editor indents PL/Python code in PostgreSQL
BugDBE-2941Cannot export query results to csv or copy results to clipboard
BugDBE-5005Version 2017.2 Does not let you update records in the datagrid using DB2 dialect
BugDBE-2811Error in SQL Table editor when set NULL to nullable UUID column on Postgresql
BugDBE-3104Strange behavior with resolving and schema choosing
BugDBE-3661Unable to resolve user defined type in stored procedure
BugDBE-4476Dump to clipboard missing column names
BugDBE-2547Fix split line intention and enter handler for escapes PostgreSQL strings
UsabilityDBE-4608SQL editor does not detect fields of OLD or NEW variables on constraint triggers function
TaskDBE-2657DataGrip should ask user if they want to associate *.sql files with DataGrip
DB ConnectivityFeatureDBE-1203Data Source / SSH/SSL: how to use OS native SSH?
FeatureDBE-2100Database access through ssh with both key and Google Authenticator (two factor authentication)
FeatureDBE-5107ssh-agent support for Intellij database connections
FeatureDBE-2287PostgreSQL: support several databases in one Data Source
BugDBE-1933Cannot connect to DB, driver settings keep reverting to the Abstract Driver class on "Apply"
BugDBE-3245Incorrect file path if to create Sqlite data source from file
BugDBE-2142H2 data source goes from 'Remote' to 'Embedded' after closing
BugDBE-5011Can not set jdbc driver options for Redshift
BugDBE-2108Apache Phoenix connection: Unable to PTableType enum
BugDBE-1733Unable to Paste into URL field when adding connection
BugDBE-197 Derby: Validate empty database name
BugDBE-3214Forever growing list of "Update Database Drivers List" background tasks
BugDBE-2630SSL settings are not copied when duplicating Data Source
BugDBE-2357Default SQLite database driver does not work in 32-bit linux
BugDBE-2812Data Sources doesn't save port number for Postgres
BugDBE-3923Datasource changes back to default
BugDBE-2858Cannot select private key file while setting MySQL Database over SSH using Key pair
BugDBE-3884Comments from tnsnames.ora are shown in combobox
UsabilityDBE-3064ClassNotFoundException throws if there is no downloaded driver for data source
UsabilityDBE-2884By clicking on the "Test Connection", the result information is visible only in the first dialog tab
UsabilityDBE-3892Allow load_extension in SQLite
Configuration ProblemDBE-4716Redshift driver uses the default PostgreSQL port instead of the Redshift one
DB ConsoleFeatureDBE-4773show all existing consoles from console dropdown
FeatureDBE-1036New Action/Shortcut: Execute query and show results in new tab
FeatureDBE-4254Ability to open results in new tab only when required
FeatureDBE-2033As a user I would like to switch between schemas/sessions with a shortcut to be more efficiant and work without using my mouse
FeatureDBE-3644Make it easy to evaluate an expression
FeatureDBE-912Configurable Query Completion Notifications
FeatureDBE-1481Option to hide toolbar in database console.
FeatureDBE-265Switch results tab when editor tab is switched
BugDBE-53662017.3: unable to ROLLBACK aborted transaction with Postgres
BugDBE-4793eap 2017.2.4 opens console tabs randomly
BugDBE-1265different tabs linked to different db connections should be clearly distinguishable
BugDBE-5170DB2 LUW View Creation fails from improper syntax
BugDBE-4929executing multi statement mysql procedure returns only first result set
BugDBE-4483Can not associate Data Source with sql file based on file and Data Source SQL dialects
BugDBE-4906Results row count zeroed for scripts run from console outside default
BugDBE-4242MySQL proc which runs lots of inserts hangs IntelliJ
BugDBE-1806Error Message using DB2 Driver for Informix Database
BugDBE-5241Jump to Console new menu useless
BugDBE-3509Connection disconnects or errors unselect selected line in query window
BugDBE-4174Incorrect summary error count on MySQL script run
BugDBE-4340Can't Connect SQL File to Console
BugDBE-1697Regression of DBE-1382 Cancelling MySQL Query Prevents Further Queries
BugDBE-4136Editor database toolbar is not restored on closing and reopening .sql file
BugDBE-4836Showing Database Console triggers update of Structure View
BugDBE-4996Can not execute begin ... end block if there are multiply such blocks
BugDBE-4504DataGrip freezes after cancelling query
BugDBE-4979Run sql file in console reads the file contents later
BugDBE-2071Explain plan feature is broken for Oracle
BugDBE-3925Auto-commit mode is turned off when executing statement
BugDBE-583PostgreSQL: Commit does not trigger Synchronize
BugDBE-569Does not retry failed command upon connection failure
BugDBE-4882Not applicable variable declaration
BugDBE-2698Explain doesn't obviously do anything
BugDBE-4590Auto commit activated suddenly
BugDBE-2996Postgres: Database console sets different timezone in session that PGAdmin
BugDBE-762SQL Server. Invalid line endings of the text sent to the server
BugDBE-4733Extra empty rows in a console's output tab
BugDBE-3885Wrong routine edited when schema name matches database name
DB DiagramBugDBE-2130Only some foreign key edges are shown in the diagram
DB DiffBugDBE-2794Schema Compare - Migrate ignores missing tables
BugDBE-2328Data Compare doesn't handle dbs with different names
DB IntrospectionFeatureDBE-2048Oracle Materialized Views
FeatureDBE-1865Postgres: Foreign Data Wrappers
FeatureDBE-4098Return type for table-valued user-defined functions is not shown in database tool window
FeatureDBE-1404MSSQL Support User-Defined Data Types (non-CLR)
BugDBE-2002Duplicating connection doesn't change displayed DB
BugDBE-2367Length of Char and decimal fields not shown when extracting DDL
BugDBE-3526Incorrect foreign key introspection if key references on table in another schema
BugDBE-5309Corrupted dataSources xml
BugDBE-4856Azure: db_id() doesn't work, we need a workaround
BugDBE-2722Support drop table cascade in PostgreSQL incremental introspector
BugDBE-2767Sybase: varchar fields are show as TEXT in Database tool window after certain length (in my case varchar(300)
BugDBE-2295PostgreSQL: rename column causes broken domestic references from indices and keys on columns
BugDBE-4760SQLServer Database plugin has NullPointerException running DDL From Dialogue
BugDBE-5379Doesn't show index sort order in table list view, always shows as ASC in Modify Table
BugDBE-5161Synchronizing a database schema forgets everything
BugDBE-2783MS SQL 2000: 'schema_name' error on SQL Server 2000(jTds) with older compatibility level
BugDBE-5147PostgreSQL stored-function "security definer" setting not exported to DDL
BugDBE-2893Database error ORA-00942 on Synchronize Database Structure
BugDBE-1814PostgreSQL: when a table has dropped columns, introspector makes wrong references on next columns from indices and keys
BugDBE-5252Oracle introspector fails on retrieve cluster info
BugDBE-5060DataGrip repace escape character \' in MySQL procedure
BugDBE-2136Create data source dialog doesn't detect all schemas for MSSQL
BugDBE-2935NPE when synchronizing with snowflake database
BugDBE-3863Oracle Sources: long lines of procedures, packages, etc. are truncated
BugDBE-5440Introspection fails with exception on MS_Description = NULL
BugDBE-4751MySQL DataSource is not fully synchronizing
PerformanceDBE-2867Database Sync Hangs (2016.2)
PerformanceDBE-2338Performance issue with Introspecting schema
ExceptionDBE-2885Cast problem from GenericModel to MysqlModel.
ExceptionDBE-2354MS SQL: Numeric Overflow on Spatial indices (384000)
ExceptionDBE-2839Oracle introspection failing with "ORA-00942: table or view does not exist"
ExceptionDBE-4089DataSource using pgsql-ng driver causes kotlin.KotlinNullPointerException
ExceptionDBE-2771Postgress EnterprizeDB can't sync: column reference "oid" is ambiguous
DB RefactoringBugDBE-2144When renaming a column with unique key and fk constraint too much queries are generated
BugDBE-2661Renaming variable misses instances inside dml statements (SQL SERVER)
BugDBE-2299Drag and drop text magically pastes clipboard and makes Ctrl+Z throw a popup
BugDBE-4600Renaming schema has issues
BugDBE-3904DB2 modifying column using dialog to allow null generates invalid sql
BugDBE-2120Mysql Auto Increment appears empty
BugDBE-3184I can't find 'Auto increment' checkbox in DDL builder.
BugDBE-2316Cannot rename function in Postgres
BugDBE-2956DatabaseView. ModifyTable dialog, ForeinKeys tab. Columns become not visible at attempt to edit them.
BugDBE-4282Wrong column sort order in edit window after add new column
DDL & PL EditingBugDBE-2917Do not replace types in PostgreSQL to equal ones.
BugDBE-2101Create Function that returns TABLE alters to returning SETOF
BugDBE-2909DataGrip cannot handle PostgreSQL functions with default variadic parametes
BugDBE-5318Generate DDL To Console Places ENDGo at end
BugDBE-3962Incorrect ordering direction of indexes displayed in Table DDL page & 'Modify table...' window [PostgreSQL]
BugDBE-2111Alter procedure doesn't work, MS SQL Server
BugDBE-2637Can not replace existing DDL for table from the DDL Data Source
BugDBE-666DB2 for AS 400: opening Procedure/Function editor fails
BugDBE-2134Mysql modify table: enum-values are shown uppercase with Keywords | To upper settings in Code Style
UsabilityDBE-4025Auto-Focus on modify column
ExceptionDBE-4869Assertion failed exception in CodeTextBuilder
Data Import & ExportBugDBE-5097when importing CSV file DG messes up the data making the table completely unreliable
BugDBE-3990H2: missing quotes in generated SQL insert statement for binary column
BugDBE-5140Import CSV as DOUBLE PRECISION results in 0.000000
BugDBE-5148Postgres restore option isn't working with non default credentials
BugDBE-3926Ability to execute directly to file/clipboard
BugDBE-5020Impossible to specify path with space to pg_dump executable
UsabilityDBE-4524Remember last target schema when choosing the target while copying table
CosmeticsDBE-4572Spelling error in notification after import errors
Data ViewsFeatureDBE-5324Paste TSV/CSV to Data Edtior
FeatureDBE-2701Database Console - Data View: Visual output improvement for data values alignment.
FeatureDBE-3138Make XML extractor great again
FeatureDBE-2950Ability to edit multiple rows at the same time
FeatureDBE-2710Grow selection (Ctrl+W) for table rows
FeatureDBE-2743select whole row in grid view
BugDBE-4518Deleting of table rows doesnt work from bottom to top
BugDBE-2937PostgreSQL: schema_path does not affect Table Editor
BugDBE-4968Color settings IN CONSOLE EDITORS AND GRIDS does not work for grids
BugDBE-2436Double clicking a table results in db crash
BugDBE-3549In results tab line spacing don't calculate correctly
BugDBE-2623Data Results tab does not take focus after select all. Pressing ctrl-c afterwards copies the query text, instead of the data results
BugDBE-5032Export Options Disabled
BugDBE-2981Unescaped/unquoted bytea data when dumping table to SQL Insert staements
BugDBE-1863Reopening table editors on startup is potentially dangerous
BugDBE-3306Display error cause when importing
BugDBE-2729Default size of columns should be set according to the value
BugDBE-4810Cannot directly edit json fields, throws error.
BugDBE-3091Export data from data view action exports only first page
BugDBE-4741Timestamp column's default value stuck to 0000-00-00 00:00:00
BugDBE-3174Cannot delete row with µs timestamp in table editor
BugDBE-3172Table Editor resets the filter with Drag&Drop
BugDBE-4505Oracle CSV Insert Rounds Numeric Data
BugDBE-2902version 2016.2 (build DB-162.1122.5) does not recognize Postgres hstore extension - will not edit table. Version 2016.1 works fine.
BugDBE-3032Next page of results are not part of the original query
BugDBE-2922Can not insert a record into a Sql Server table that has an identity column
BugDBE-5085Sudden IDEA freeze
BugDBE-4211Table editor row number misplaced when horizontal scroll bar is present and scrolled to the bottom
BugDBE-3076Database's datagrid shows only one row when the table has more than one row
BugDBE-2612Presentation mode query results font is not increased
BugDBE-640Timestamp not displayed correctly
BugDBE-3183Can't edit hstore column in Postgres
BugDBE-3186delete row scrolls grid view to very last column
BugDBE-3187NVARCHAR(MAX)
BugDBE-2765Row filter is disapplied when a filtered table tab is dragged out into a separate window
BugDBE-2654SQL Dump truncates arrays larger than 100 elements
BugDBE-3537Error when trying to use the table editor in DB2
BugDBE-3156can not sort columns if they are timestamp with timezone
BugDBE-2872Data grid hides row header
BugDBE-2992Database Console: Boolean field cannot be rendered in result view
BugDBE-2993PostgreSQL: Table editor does not support CITEXT
BugDBE-2734PostgerSQL. Insert interval data
BugDBE-3106Oracle Limit condition is wrong in Table Editor
BugDBE-3590Table Editor Should Hide Error Message Upon Successful Operation
BugDBE-3169In DDL view, when there is a foreign key and column comments, incorrect position of the comma
UsabilityDBE-4902Unable to expand the content of the "Quick evaluate expression" windows
UsabilityDBE-897PostgreSQL: allow setting 'infinity' and '-infinity' for DATE and TIMESTAMP columns
IDE GeneralFeatureDBE-212Default directory for projects
FeatureDBE-2426Desktop/Launcher shortcuts
FeatureDBE-2694Please add Favorites to DBE
FeatureDBE-4059Support XQuery/XPath as injectable language
BugDBE-4942Go directly to table DDL from table editor with CTRL+B
BugDBE-5038Context menu to add a file to favorites has disappeared in 2017.2.1
BugDBE-2863Exception from initial configuration dialog in master
BugDBE-2300DataGrip "forgets" custom (Redshift) driver for certain data sources
BugDBE-31572016.3 EAP uses .DataGrip2016.2 folder as default place for Project Folder
BugDBE-4915Missing context menu items on table bookmarks
BugDBE-2095"Confirm application exit" setting not work
BugDBE-4086Generate POJOs.groovy setter problem
BugDBE-4000DataGrip does not support setings repository plugin to sync IDE settings
BugDBE-4753Ctrl+Shift+A can't execute "Invalidate Caches / Restart"
UsabilityDBE-3881SQL: Oracle: Synonym item in various popups has no icon
SQL Code StyleFeatureDBE-2322SQLServer - Code Format - Table Variables not handled correctly
BugDBE-3112Inorrect reformating SQL query
BugDBE-3968Support for Oracle Compound Trigger Syntax
BugDBE-1034Oracle stored procedures displayed without proper formatting
SQL CompletionFeatureDBE-3194Create smart option auto-qualifying completion
FeatureDBE-3098In autosubstitution offer as an option with all fields, including AUTO_INCREMENT field.
FeatureDBE-1140A little smarter completion for JOINs
BugDBE-4511User parameters are substituted incorrectly if to use the same placeholder
BugDBE-5321Wrong competition in oracle join statements
BugDBE-3006Ability to remove all default-valued column from INSERT auto-complete
BugDBE-2668Auto completion should favour most probable keyword from context
BugDBE-3323Completion for H2 sql does nos suggest the FROM keyword in SELECT
BugDBE-2680In USING() clause, autocompletion should offer only valid column name candidates
BugDBE-2856Wrong auto completion in JOIN USING () clause
BugDBE-2549Code completion can't resolve references in specific circumstances
UsabilityDBE-3820sql: allow configuration of lowercase table alias name suggestions
SQL EditingFeatureDBE-2849Provide Python language support
FeatureDBE-3760SQL: PostgreSQL: need language injection at dblink queries
FeatureDBE-45Insert statement inlays
BugDBE-2938Cannot avoid automatic string splitting in SQL files
BugDBE-3791SQL: correlation name should be used if specified, not table name
BugDBE-3790PostgreSQL: join can't be natural and cross at the same time
BugDBE-2879Formatter makes code invalid
BugDBE-1288Rename of sequence breaks invocation syntax
BugDBE-4654SQL Editor does not understand the NOEXPAND hint for SQLServer
BugDBE-3775SQL: Inspections: DB2, Sybase: Types compatibility: false positive if the result of join has several columns with the same name
BugDBE-3757PostgreSQL: function aliases are not resolved
BugDBE-3756SQL inspection: Unresolved reference: code with missing table name in FROM clause is green
BugDBE-4704hqsldb dialect various errors: uuid type, unique constraint, foreign key definition, "inherited" columns in views from other tables/views, ...
BugDBE-3421Valid H2 SQL shows red line
BugDBE-2962Successive semicolons give syntax error
BugDBE-51672017.3 EAP 173.2290.12 - Inspections Hang (Stuck)
BugDBE-3788PostgreSQL:no quick fix for 'unresolved reference' if the column at FOREIGN KEY
BugDBE-4953Schema Path List Scroll Problem
BugDBE-3050Sql editor does not recognize 'json_table' function in Oracle
BugDBE-3054DataGrip cannot resolve db objects in sql file
BugDBE-4648Insert pair quote does not work in DB console
BugDBE-563Oracle output parameters not showing in parameter help
BugDBE-3706SQL: Derby: schema name created via AUTHORIZATION clause is not resolved
BugDBE-3702SQL: PostgreSQL: quoted double quoted sequence name in sequence functions is not resolved
BugDBE-3768SQL: Inspections: Types compatibility: no warnings at derived table with join after it
BugDBE-1728MySQL injection in MySQL string (for preparing procedures and so) break with escaped quotes
BugDBE-2133Custom folding issue
BugDBE-2656Database console shows too many options, most of them with no docs
BugDBE-2652Inspection not working with python templates
BugDBE-3824PostgreSQL. 'Expand column list' produces incorrect query
BugDBE-2312User parameter makes alias unable to resolve
BugDBE-3801PostgreSQL inline code nextval(sequence) problem: unresolved reference inspection triggered
BugDBE-3809Identity not restarting in DB2
BugDBE-3311MS SQL: False positive warning in pseudo-tables "INSERTED" and "DELETED"
BugDBE-3105Flip is broken
BugDBE-5193Editor hangs up while editing PlPgSql code
BugDBE-2972parameter pop-up stop updating
BugDBE-3796MS SQL: unresolved reference using functions with xml data type
PerformanceDBE-4814Working with lots of queries crashes the SQL editor
PerformanceDBE-4814Working with lots of queries crashes the SQL editor
UsabilityDBE-1632PostgreSQL: Accessing subfields from function returning composite type
SQL GenerationFeatureDBE-2662Implement possibility to enable/disable all triggers
FeatureDBE-3634Missing trigger code generation
BugDBE-4513Database tool: comments ignored when creating a new column
BugDBE-3954Sqlite: incorrect sql script generation for modify index
BugDBE-5015DataGrip generate faulty code for procedure
BugDBE-2714Schema switcher does not affect create table dialog
BugDBE-2975Cannot create column of BIGSERIAL type: SERIAL is created instead
BugDBE-4439In Database view, right-clicking in a column "Generate and Copy DDL" is not working
BugDBE-3102Error in generation of adding primary key
TaskDBE-4811Show the real table structure
ExceptionDBE-3126Errors when performing data dump from Sybase database
SQL HighlightingFeatureDBE-4352SQL Server merge statement (upsert)
FeatureDBE-4374No SQL support for Cross Apply and Outer Apply clauses
FeatureDBE-2677Detect and report semantic errors
FeatureDBE-3101Add an inspection for unused parameter
FeatureDBE-3168PostgreSQL 9.6 support
BugDBE-3202Postgres: copy to program syntax support
BugDBE-2149ORACLE: unable to resolve collection, defined in procedure
BugDBE-5307H2 SQL dialect: ALTER TABLE X ADD [COLUMN] optional keyword not supported
BugDBE-4550Syntax error shown for valid Filter clause in PostgreSQL ordered-set aggregate functions
BugDBE-4223Support HASH keyword for Oracle
BugDBE-5155DataGrip does not recognize SQL commands GROUP BY ROLLUP and GROUP BY CUBE for SQL Server
BugDBE-3956Incorrect arguments order for array_prepend in PL/PGSQL
BugDBE-4903Constant condition between Inserted and Deleted views
BugDBE-4909Use of SQL parameters does not work in IF-statements with SQL Server (Mirosoft)
BugDBE-4038Add recognition of short equivalent of JSON_UNQUOTE(JSON_EXTRACT()) in MySQL (json inline path)
BugDBE-2165Problem compiling oracle package containing "merge" statement
BugDBE-2168Unknown database function 'Try_Convert'
BugDBE-1123REDSHIFT: escape single quote does not highlight properly with LIKE or POSIX regex syntax
BugDBE-4639With clause in using statement is marked as error
BugDBE-2341Postresql support composite type expression
BugDBE-4408Support drop synonym syntax
BugDBE-2800select for update limit 1 support
BugDBE-4093escape characters in string not seen as word break by spell checker
BugDBE-2309DataGrip doesn't recognize PostgreSQL 9.4- refresh materialized view CONCURRENTLY parameter
BugDBE-2843keyword "COLLATE" is not recognized in PostgreSQL dialect (highlighted RED)
BugDBE-3110Valid Postgres code is red
BugDBE-488SQL Server SELECT INTO syntax is not supported
BugDBE-5280Support for OPENJSON(...) WITH (...)
BugDBE-2949T-SQL JSON PATH syntax request
BugDBE-2572PostgreSQL FUNCTION RETURNS SETOF view
BugDBE-2746Incorrect warning "Suspicious comparison with NULL" (SQLServer)
BugDBE-2901PostgreSQL subquery expressions
BugDBE-4786Hint about syntax error in SQL query with ANY keyword
BugDBE-4788Incorrect error highlighting for PostgreSQL JSON operators
BugDBE-2787Error syntax in query with 'with' clause
BugDBE-2645PostgreSQL: SELECT foo.* column count 0 for composite types
BugDBE-4683Sub-query-columns counted as inserted columns
BugDBE-4613User Parameters case insensitivity
BugDBE-2210Microsoft T-SQL Support Create Login With Password Hashed Syntax
BugDBE-3927Non-int-literal expressions not supported in PostgreSQL TABLESAMPLE clause
BugDBE-3920Support Inline table functions starting with CTE
BugDBE-5270Qualify object is absent in ORDER BY clauses
BugDBE-5276Wrong alias resolve
BugDBE-2898Oracle SQL. PIVOT keyword is unknown.
BugDBE-396Unable to resolve column 'ENGINE'
BugDBE-2171PostgreSQL select with no fields parse error
BugDBE-3185DataGrip does not support newer features of SQLite
BugDBE-2833PostgreSQL: CREATE MATERIALIZED VIEW parse errors
BugDBE-2650Postgres concatenation followed by string function breaks sql validator
BugDBE-4088Doesn't recognize RENAME TO syntax for Postgresql's foreign tables
BugDBE-4083Oracle: False inspection when ORDER BY references CTE by alias
BugDBE-4884Unable to resove index
BugDBE-3531SQL Server: columns of table-valued user functions return result are not recognized
BugDBE-2678Wrong autocompletion suggestion for Oracle DROP PROCEDURE statement
BugDBE-2878postgresql: ASSERT keyword is highlighted red
BugDBE-2990Oracle SQL*Plus dialect: statement parsing issue
BugDBE-2320ORACLE LISTAGG function fails if run within a CTE
BugDBE-4455Support BEQUEATH DEFINER syntax
BugDBE-2851poatgresql: create new sequence if not exists
BugDBE-2642PostgreSQL: CTE name not resolved after UNION keyword in subquery/RETURN QUERY
BugDBE-4484False error on parsing statement "get diagnostics"
BugDBE-4862Reporting error on valid mysql concatenation
BugDBE-496Postgres: Unable to resolve column when referring to record in function
BugDBE-2953Record variable is not recognized
BugDBE-2779PostgreSQL: INSERT ... WITH clause is not parsed correctly
BugDBE-2548Postgres: valid code is red
BugDBE-4752syntax highlighter does not highlight UDFs as functions
BugDBE-722Redshift APPROXIMATE function generates error
BugDBE-3162Unable to resolve column in postgresql prepared statement
BugDBE-3166PARALLEL SAFE clause not supported
BugDBE-3165Incorrect syntax highlighting near REQUIRE statement
BugDBE-2568Postgres: valid code is red
UsabilityDBE-1559PostgreSQL: COMMENT ON CONSTRAINT always highlighted as a warning
SQL ResolveBugDBE-4844Oracle: Doesn't recognize :new and :old in triggers
BugDBE-4652SQL Resolution Scopes not working in console
BugDBE-4637Invalid 'Column should be in group by clause' warning
BugDBE-4662redshift dialect does not recognize all functions, e.g. dateadd()
BugDBE-4603Unable to resolve columns from user-defined functions
BugDBE-4886Autoscroll from Editor does not work for DDL opened in console
User InterfaceFeatureDBE-77Group Data Sources by folder
FeatureDBE-4454Add shortcut for Switching attached console
FeatureDBE-3145Feature request for showing comments in Database tree
BugDBE-4798Lost "Data source" color settings after upgrade
BugDBE-3224Navigation to database tree is not working if DDL as data source
BugDBE-1158Option "Hide file extension in editor tabs" has no effects
BugDBE-2988New Data Source from Data Sources and Drivers window
BugDBE-4362scroll from editor doesn't work properly
BugDBE-5232Database console font is not affected by "Console Font" setting.
BugDBE-4879No schema in table editor name
BugDBE-4818Wrong "Open DDL in console" by default shortcut
BugDBE-3180Define executed file SQL dialect by data source it run against
BugDBE-3108No database completion in MSSQL datasource
BugDBE-4824Modify Table dialog doesn't show context
BugDBE-3089Current schema appears duplicated in list
UsabilityDBE-5242where is "more schemas" button?
UsabilityDBE-4368cannot change the connection / console for a sql file without "Run"
UsabilityDBE-2195Make SQL dialect selection dialog keyboard-friendly
CosmeticsDBE-5362ugly database counter
CosmeticsDBE-3175Table editor tab name is useless
ExceptionDBE-2720Modify table dialog not showing in DataGrip
IDE integrationBugALL-1311Clicking on an project which is already open does not bring that project to foreground
No subsystemFeatureWEB-40Custom folding regions should be visible in structure view (CSS)
FeatureWEB-20263Enable Fill Paragraph for JS
FeatureWEB-24551Add ability to run ESLint for the TypeScript sources files
FeatureWEB-18555Recognize 'none' value in editorconfig files
FeatureWEB-22722Update bundled JSHint version to 2.9.2
FeatureWEB-15916Enable "Simultaneous Tag Editing" for more file types
FeatureWEB-15687Export EditorConfig file based on internal IDE settings
FeatureWEB-15190Ignore validity of library code
FeatureWEB-21873Automatically group related generated files
FeatureWEB-17977Feature: Configure Patterns for Automatic Nesting of Transpiled Files
FeatureWEB-23134ES6 refactorings: convertion require() -> import
FeatureWEB-23847Add support for command line parameters for react-native-cli
BugWEB-25007Angular: No autocomplete for @Attribute
BugWEB-26720Doctype breaks HTML language auto-injection in JS template literals / strings
BugWEB-21997Go to URL matches urls incorrectly if url contains $ in it
BugWEB-23055Support ASCII control characters to improve webpack progress showing in console
BugWEB-17317 502 Bad Gateway error from the server when post data
BugWEB-20041In Angular2, inside a Template, doing cont-/ to comment produces // comment instead of <!-- HTML type comment
BugWEB-28065Find in Path (Ctrl + Shift + F) in Smarty template file within HTML attribute is not working.
BugWEB-24911Strange errors when using flow-typed with flow
BugWEB-22519Use of double dollar sign variable names (e.g $$customer) as JSX attributes causes red syntax warning/error
BugWEB-29686JavaScript/ES2015+ com.intellij.psi.PsiInvalidElementAccessException in JS Function Expression
BugWEB-20245Strings in require() statements are spell-checked
BugWEB-22493Go To Declaration/Implementation does not jump to the function definition with `module.exports` function reference
BugWEB-22496JavaScript live templates needs to drop quotes for jsMethodName()
BugWEB-23186JavaScript - Invalid Inspections - Implicitly declared global JavaScript variable & Unused JavaScript / ActionScript local symbol
BugWEB-21921Only 1 Startup Task is starting automatically
BugWEB-25284Sass partials starting with double underscore cannot be resolved
BugWEB-22156Missing import statement
BugWEB-20554Autopop documentation will not turn off
BugWEB-24874'var' JS inspection suggests replace 'var' with 'const' in for loops
BugWEB-25382Cannot make eslint to work
BugWEB-27710Webpack aliases are sometimes not recognized
BugWEB-29224JS File won't open with AngularJS plugin installed
BugWEB-29204"Rerun tests" notification's location and font
BugWEB-19336Live template `func` doesn't work for me
BugWEB-21928JavaScript file that includes nothing but 'export' statements is recognized as minified (generated)
BugWEB-14867Extra space added to jQuery statements
BugWEB-25093Unused field propTypes
BugWEB-21743Electron - console.log output isn't displayed within webstorm ( terminal / npm run script )
BugWEB-24981Angular 2 - unnecessary label trackBy
BugWEB-25059Inspect code not working as expected for Unused CSS Selector
BugWEB-27433/bin/sh: adb: command not found
BugWEB-21028Supplementary Unicode characters cause 'Unsupported characters for the charset 'UTF-8'' warning
BugWEB-24702Respect "Use semicolon to terminate statements" Code Style option when "Add braces to arrow function statement"
BugWEB-29284Wrong (and *very annoying!*) suggestion in JSX page
BugWEB-24269The underscore in node_modules is interpreted as a shortcut key
BugWEB-20052Emmet: abbreviations with multiplication are not expanded in JSX context
BugWEB-21980Build 162.844.4 fails to run with a JDK error on windows 10 64b
BugWEB-22560assertion on downloading typescript stub library
BugWEB-17148Structural replace broken
BugWEB-24760Project Tool Window: CSS source maps (gulp-generated) not grouped under the same name, but JS does.
BugWEB-26269Missing escaping quotes when insert in string variable
BugWEB-26528Webstorm does not recognise awaited async-function as parameter for JSDoc
BugWEB-23073"to template string" quick helper generates invalid output
BugWEB-28427webpack.config.js: Webpack aliases not resolved when exporting multiple targets
BugWEB-23441Suggest inserting 'use strict' / Syntax Error not being caught
BugWEB-15602Ctrl + F11 does not re-run app
BugWEB-22819ESLint and .vue files
BugWEB-24885Cannot download javascript libraries. Languages&Frameworks > Javascript > Libraries > Download > Typescript Community Stubs > webaudioapi
BugWEB-22481quickdoc for array of mixed type is wrong
BugWEB-22126Autocompletion for JSDoc
BugWEB-27516Reformat Code does not honor HTML indentation settings in .editorconfig
BugWEB-21168Live Template for Angular 2
BugWEB-22601When collapsing a react/jsx component it shows as <xml /> instead of the component name.
BugWEB-28976UI: package field component has wrong vertical alignment on OSX
BugWEB-23153Generated source files should not be edited message for init.js files that are created by me
BugWEB-21441Support component properties (inputs) without brackets
BugWEB-27538JSON Schema: quick documentation improvements
BugWEB-24662Angular CLI not detected if not in the main project directory
BugWEB-24475External annotators for a base language are ignored when another external annotator exists for a more specific flavor
BugWEB-21469 Flow declarations are formatted incorrectly
BugWEB-22163Add braces to arrow function statement — doesn't work as expected
BugWEB-22167Angular-ui-router: index.html is not shown in the diagram
BugWEB-18650Structural search and replace doesn't work in JavaScript
BugWEB-21664Unexpected "Cannot resolve symbol" error
BugWEB-24820React: creating react application as a submodule of existing IDEA project fails
BugWEB-25225Unable to save settings
BugWEB-27176show method separators doesn't work with shorthand methods
BugWEB-19429Fat arrow after function() does not produce error
BugWEB-24804Angular2 - Invalid error reported in Angular 2 template.
BugWEB-26787Can't download d.ts file for paper
BugWEB-18541Reformat code during commit unminifies minified CSS files
BugWEB-19944.eslintrc: missing property 'webextensions'
BugWEB-29020Spell checking should exclude function names in template strings
BugWEB-24504JSX comments are still not working
BugWEB-22901Broken "to template string" helper
BugWEB-20244Foundation 6 not updated yet in new version. How do you do this manually?
BugWEB-25244Throwable when open color picker
BugWEB-20002Template sring `${new Date().getTime()}${Math.random()}` breaks syntax higlighting
BugWEB-23386ES6 convert require() -> import: make inner scopes option only for "Fix all" mode
BugWEB-23380Object destructuring assignment expression with default value reports incorrect warning
PerformanceWEB-24880ES6ExportDefaultReferenceSearcher unstubs declaration's file on highlighting usages in a current file
PerformanceWEB-24768Indexing a large .js file causes IDE to run out of memory
UsabilityWEB-27048Update tag with Emmet - class replaced instead of appended
UsabilityWEB-26745Start Flow service using Node
CosmeticsWEB-28608Change signature dialog: cosmetics
CosmeticsWEB-25204Missing colon in new project wizard (IDEA)
TaskWEB-28990Add an ability to add "Build*" actions in "Before launch" block of any JS run configuration
TaskWEB-22183Enable 'var' used instead of 'let' or 'const' inspection
ExceptionWEB-22881Python code inspection fails to finish due to JavaScript indexing problems
ExceptionWEB-27712Can't create ruleset from text: &-state[data-state=left top]
ExceptionWEB-20107Code inspection not working in latest EAP
Build toolsFeatureWEB-13409Support ability to navigate webpack's enhanced requires
FeatureWEB-21829Allow using path variables in grunt-cli package value
FeatureWEB-14753Should be able to use grunt and gulp tasks and npm scripts as before launch options without creating separate run configurations
BugWEB-22578Debugging Gulp with Node.js v6: add --expose-debug-as=v8debug
BugWEB-22153Gulp executed within PhpStorm throws errors while executed in console runs fine
BugWEB-21763Gulp run task does not recognise folder named "gulpfile.js"
BugWEB-23589Jump to source and Debug shortcuts are hardcoded for build tools tool window
BugWEB-27477Grunt tasks don't load when ts-node is present
BugWEB-27210Add warnings about invalid Node.js version when analysing webpack.conf.js
BugWEB-22859Restart task from Task run window (Alt+F11)
BugWEB-27119Grunt: VFS is not refreshed on running `watch` task when using Grunt 1.0.1
BugWEB-14876Grunt: delayed visibility of file change when using jit-grunt for loading tasks
UsabilityWEB-19862Ability to collapse all gulp file nodes in the gulp tool window
UsabilityWEB-27219Add message to event log when webpack.conf.js is successfully analysed
CSSFeatureWEB-24273PostCSS: support postcss-modules-values plugin
FeatureWEB-27776CSS color properties should provide code completion for 'rgb()', 'hsl()', etc. syntax
FeatureWEB-27548CSS4 case insensitive attribute value
FeatureWEB-17218Support for CSS modules
FeatureWEB-20101Support file structure for inline styles
FeatureWEB-4CSS, @font-face: provide completion for formats in 'format' hint in src references
FeatureWEB-14124Support for CSS Custom Properties
FeatureWEB-4585Consider CSS selectors used if they show up in string literals
FeatureWEB-150CSS completion of ID/CLASS name of html files in the project
FeatureWEB-28480provide support for `scroll-behavior` CSS property
FeatureWEB-23345Stylelint: provide parsing for rc file
FeatureWEB-16792Support WebPack specific import statements
FeatureWEB-28693Add CSS min-width/min-height auto property
FeatureWEB-4698Expand CSS support to include new CSS3 additions and vendor prefixes
BugWEB-21523Errors in mixed PHP+CSS
BugWEB-27071Reporting invalid parameter in -webkit-column-span: all; even though "all" is a cs supported parameter
BugWEB-27912Error when clip-path url is id
BugWEB-7014Case insensitive autocomplete in CSS selector does not correct case
BugWEB-27587CSS3: provide completion for CSS transform functions
BugWEB-25121Stylelint: .stylelintignore file is not respected
BugWEB-23373Stylelint: correct name of the property used in the package.json
BugWEB-28495Angular styling: don’t mark “ng-deep” as warning/error
BugWEB-22846SCSS: "Cannot find variable" when it's imported from a package loaded via Webpack's sass-loader
BugWEB-23601PostCSS: bad inspection CssNegativeValue
BugWEB-15551Webstorm CSS parser consider negative value for order property incorrect
BugWEB-19417`speak` property support.
BugWEB-26458CSS autocomplete list should have defaults
BugWEB-20333HiDPI display: small gutter icon for CSS color preview
BugWEB-26826When formatting CSS with braces set to "on next line", if there are parentheses for a mixin, the brace style is not honored
BugWEB-195Code-Folding support in CSS and CSS super-languages
BugWEB-23095Choosing severity level doesn't work for 'Invalid CSS pseudo-selector' inspection
BugWEB-22913Invalid property value on calc function
BugWEB-24700Stylelint 7.7.0 support
BugWEB-27414CSS units are auto inserted
BugWEB-22894PostCSS: Colors & Fonts: Tag name is not colored
BugWEB-22893PostCSS: Colors & Fonts: unknown-at-rule cannot be colored
BugWEB-28205CSS modules support doesn't not work when using `import as`
BugWEB-28446CSS autocomplete for rgb color broken
BugWEB-28444Mismatched parameters when used exponential notation
BugWEB-25193Add support for "::placeholder" and ":placeholder-shown" pseudo selectors
BugWEB-8686Unknown CSS property pointer-events
BugWEB-22781Red code in css - values of 'text-justify'
BugWEB-28165Wrong CSS syntax check for @apply rule
BugWEB-28146Red code in PostCSS files (@value reference as function arg)
BugWEB-28141Value of 'composes' attribute may be a reference to CSS @value
BugWEB-19831suppress syntax error when generating CSS in HTML template
BugWEB-27533Sass imports fail to resolve when imported in nested node_module folders
BugWEB-27877CSS completion doesn't work because of java.lang.IllegalArgumentException: Can't create ruleset from text
BugWEB-27875Completion for CSS Transition values
BugWEB-27117Provide resolve for files in CSS @value declaration
BugWEB-27116CSS modules values: provide resolve for reference after 'from' in import
BugWEB-27813Incorrect CSS box-shadow inspection for comma-separated lists
BugWEB-27379CSS modules: import via require does not work
BugWEB-21567Inline CSS: delete extra entered semicolon when completing property value
BugWEB-16861JQuery CSS: typing extra quote when adding multiple selectors shouldn't add another pair of quotes
BugWEB-28808Add dB attribute in the completion for the "voice-volume" parameter
BugWEB-9540CSS3: support 'initial' keyword
UsabilityWEB-28861Code completion should suggest only applicable units after a number.
UsabilityWEB-18993Emmet live templates does not work as they used to
CosmeticsWEB-27775Add "monospace" to spellcheck dictionary
CosmeticsWEB-27234Add line number and icon in the completion popup for lines with references to parent selector (&)
TaskWEB-25427Incorrect CSS inspection warning "should be integer" on decimal letter-spacing
TaskWEB-10783Support for CSS3 speech module
TaskWEB-23340Stylelint: WS does not find path to stylelint
ExceptionWEB-26721'Extract inline CSS | Current file' causes PsiInvalidElementAccessException
ExceptionWEB-24917Throwable when choose color
ExceptionWEB-23350Stylelint: Provide icon for rc file
ExceptionWEB-22810"PSI and index do not match" exception while editing CSS
CoffeeScriptBugWEB-16823Spell check in CoffeeScript inside string blocks
BugWEB-28223[CoffeeScript] String Dragnrop error
BugWEB-21854Opening coffee file throws exception
BugWEB-22422CoffeeScript string template highlight error
BugWEB-17872'use strict' breaks CoffeeScript destructuring
ExceptionWEB-20180Defining getter in CoffeeScript class throws error
DartBugWEB-27985Dart: query parameters are stripped from URL when redirecting
DebuggerFeatureWEB-19984Debugging Node.js app built with Webpack
FeatureWEB-27323Debug React Native process in headless Chrome instead of node
FeatureWEB-27797Provide possibility to specify packager parameters when running react-native
FeatureWEB-23955debugging react native always attempts to run react-native run-android
FeatureWEB-7986Debug web workers
BugWEB-20925Node Debugger incorrectly reports the lexical `this` in arrow functions (ES6)
BugWEB-28213JavaScript-console wrongfully collates distinct console.log-outputs (hides output that differs from the first)
BugWEB-21991New Node.js debug protocol incompatibilities
BugWEB-28780Always show async stacktraces
BugWEB-19983Compiled TypeScript not stopping at breakpoints
BugWEB-19982Cannot debug ES6 - Babel - Webpack apps
BugWEB-18588Node-webkit: debugging doesn't work with NW.js 0.13.+
BugWEB-29107Update Live Edit settings
BugWEB-22491Breakpoint is ignored with 'Async' checkbox
BugWEB-19390Don't show debugger tooltips in stylesheets/html files
BugWEB-26960Node 7, 8: Debugger can't detach when execution finishes
BugWEB-29141JS Debugger does not re-use tab
BugWEB-28151Node 8 forked child debugger is not disconnected after child exit
BugWEB-27507Can't debug TypeScript with webpack-dev-server in a big project
BugWEB-25102Meteor: client-side debugging doesn't work
BugWEB-20141Freezing, StackOverflow and many other errors when run JS debugger
BugWEB-27864Breakpoints are not hit on second run of Karma debug
BugWEB-27123Node 8: Can't debug npm script
BugWEB-27312Child process debugging doesn't work when using Node 8 'inspect-brk'
BugWEB-27559Breakpoints don't work with the Chromium Remote debugger and Node 8
BugWEB-27303Can't debug React-Native app with node 8
BugWEB-21574FireFox: some breakpoints are skipped
BugWEB-11110Wrong error message "Built-in HTTP Server on custom port disabled"
BugWEB-27649Breakpoints in Web Workers don't work
BugWEB-27884Karma: Error 'Helper script failed on remote' when inspecting arrays
BugWEB-25012Node 7: React native debugger does not work
BugWEB-22545Debugger ignores breakpoints and 'debugger' keyword
BugWEB-24721Angualr2 with Angular-cli (Webpack) VERY often break points are missed and the only way to fix is use ;debugger keyword
BugWEB-26732Attempt to debug Nashorn project fails if the javascript language version is set to Nashorn js
BugWEB-27607Chrome not found on Mac when launching React Native
BugWEB-26794Can't debug node 8 nightlies
BugWEB-27906The Console output of console.trace() and console.error() has duplicated file and line info
BugWEB-28799Breakpoints with node --inspect (Chrome protocol) do not not work with sourcemap files (TypeScript)
BugWEB-14454Breakpoints not hit when using inline sourcemaps produced by browserify
BugWEB-29116JavaScript debug is not working without JB Chrome Extension if java SDK is set
BugWEB-24960MessageError when 'Copy JSON'
BugWEB-15998Karma JS debugger does not suspend on breakpoints with the browserify + istanbul preprocessor
BugWEB-22522Debugger: java.nio.file.AccessDeniedException on Karma tests debug
BugWEB-21106Cannot change numeric value of Javascript property when stopped in debugger
BugWEB-26567console.log() cause bug about file and line info when output has newlines
BugWEB-22121Debugging Karma tests no longer works
BugWEB-22466Debug with node 6.3.0 don't work at WebStorm 2016.2
BugWEB-21447Attached files (.css, .js) are not served by built-in webserver
BugWEB-29444Can't debug JavaScript from 2 instances of IDE
BugWEB-28692Extra instance of react-native with the default port is started when debug with custom port
BugWEB-29409Support ANSI coloring in console messages when debugging node remotely
BugWEB-28311Meteor: debug doesn't work with meteor 1.6
BugWEB-27784Electron 1.7.4: change debug-brk to inspect-brk (breakpoints are not hit)
BugWEB-28379React Native run starts debug session
BugWEB-29569Webstorm react-native does not work on react-native version 0.50 and above
BugWEB-25061Node 7: Stopping at breakpoint opens a new read-only editor (Windows)
BugWEB-22597Node 6.*: debugging multi-threaded applications doesn't work
BugWEB-18191Debugging Node.js is slow (~2 seconds to step over one line and see variables update)
BugWEB-21717Debugging IntelliJ with NodeJS 6.2.0 shows many ReferenceError v8debug on start of app
PerformanceWEB-20618JS debugger memory leak
UsabilityWEB-28789Rename debug configurations for Node.js and Chrome
UsabilityWEB-27608 Start a new instance of Chrome when running react-native
ExceptionWEB-27381InvalidPathException when debugging app produced with @angular/cli 1.1.2
ExceptionWEB-25131Throwable when debug karma in angular-cli app
ExceptionWEB-21285Throwable at com.jetbrains.javascript.debugger.scripts.DirectoryInfoKt.addEntry
ExceptionWEB-28531Exception in plugin JavaScript Debugger
File WatchersFeatureWEB-13633Do not run multiple File Watchers in parallel if FW settings are file-independent
FeatureWEB-29416Introduce 'Run on external changes' option
FeatureWEB-21877File watchers: get rid of Insert macro for Program field
BugWEB-23527Babel File Watcher predefined options problems
BugWEB-17949.es6 Babel file watcher watches incorrect files by default
BugWEB-22607IncorrectOperationException when move file+generated via file watcher files
BugWEB-14871File Watcher hangs on "Executing Closure Compiler Task" when using wildcard
BugWEB-23553File Watcher Macros Ignore System Directory Delimiter
UsabilityWEB-22091Allow multiselection in File Watchers configurable
UsabilityWEB-7912Postpone watchers when project is being rebased, or merged
UsabilityWEB-21433File Watcher for "Unknown" file type behaviour
CosmeticsWEB-22475Notification about dismissed File watchers
HTMLFeatureWEB-20599HTML: add completion for 'sandbox' attribute
FeatureWEB-18809Add some exotic, but standardised, HTML attribute awareness
FeatureWEB-393Add reference to the image (<img> tag with filled in 'src' attribute) after drag an image to the Editor
FeatureWEB-20704Emmet: allow to configure bem separators
FeatureWEB-21768Code folding enhancement
FeatureWEB-7856Priorize suggestion of compatible file types in file path autocompletion
FeatureWEB-204Dragging JS/CSS into HTML Document adds tag
FeatureWEB-27963Inject JavaScript in <form> action attribute value
FeatureWEB-16029Support Emmet abbreviation preview in JSX
BugWEB-17992HTML5: "autocomplete" tag should accept more values than only "on" or "off"
BugWEB-29522'Extend selection issue' doesn't select tag if started from CSS
BugWEB-28841Can't add a single closing curly brace in HTML files
BugWEB-313HTML Code Style - insert new line berfore bug
BugWEB-315Don't highlight href of type "javascript:" as "Cannot resolve file"
BugWEB-12182Please remove u-tag decrepated alert
BugWEB-27035Redundant default attribute value assignment.
BugWEB-15805HTML: Spell-checker should not mark ARIA role names as misspelt
BugWEB-26853Wrong redutant notification
BugWEB-17897Line of HTML disappears when moving other lines
BugWEB-426"onclick" attribute parse bug
BugWEB-428php tags in className - broken breadcrumbs.
BugWEB-20843Support rel="noopener"
BugWEB-18213 html page format error
BugWEB-28500Emmet for JSX. Support curly brackets syntax
BugWEB-19972Subresource integrity attributes are marked as invalid in HTML files
BugWEB-28125"Module" is listed twice in completion of script type
BugWEB-29031Completion for HTML attributes doesn't work in JSX
BugWEB-21707Don't create duplicating links
BugWEB-307Spellchecker: Valid attribute values in html gets highlighted by dictionary
BugWEB-14119"Auto-close tag on typing '</'" don't work on template languages
BugWEB-9936Strange tab (auto-complete) behaviour in html files.
BugWEB-26936an svg feature has been removed from the Web standards.
BugWEB-27994Duplicate xmlns completion suggestion in HTML
UsabilityWEB-25194HTML in Javascript length limit
UsabilityWEB-7947Tags whose contents are functional shouldn't be broken on "Move block"
UsabilityWEB-23578HTML tag "hgroup" marked as not recognized (both in HTML and CSS): change to deprecated
CosmeticsWEB-430Tag bounds shower is not updated after a single-row tag is selected
TaskWEB-27728"Split tag" action produces inconsistent PSI
ExceptionWEB-26738NullPointerException when call Code | Generate | XML Tag
JavaScriptFeatureWEB-20920JavaScript completion should be sorted by frequency
FeatureWEB-16359Intention for converting string concatenation into ES6 template string
FeatureWEB-25303name property of package.json should default to the name of the directory it is created in not "application-name"
FeatureWEB-18172Closure Compiler goog.module() support
FeatureWEB-28741Auto-imports should contain file extension when corresponding option is enabled in Registry
FeatureWEB-18844[FEATURE_REQUEST]Folding anonymous function to arrow function like Android Studio folds Callables
FeatureWEB-16444ES6 inside inline scripts
FeatureWEB-22473Add Code Completion for ES2015 Object Literal Shorthands
FeatureWEB-22281Provide coding assistance for declaration names
FeatureWEB-25101Colors and Fonts: provide separate option for the arrow function sign
FeatureWEB-24675Support `import()` function
FeatureWEB-23359Detect .babelrc or babel package and set JS version to the ECMAScript 6 for the new project
FeatureWEB-23358Detect react or react-dom packages and set JS version to the React JSX for the new project
FeatureWEB-23357Detect .flowconfig and set JS version to the Flow for the new project
FeatureWEB-29454typescript: exclude javascript files from indexing if package contains typescript declarations
FeatureWEB-24344WebStorm keeps autosaving files, related option is unchecked
FeatureWEB-7522Support JSDoc's @template mechanism on a class level
FeatureWEB-20977Flow: provide 'before type reference colon' and 'after type reference colon' options to Code Style/Javascript/Spaces
FeatureWEB-29032Flow error reporting is way too limited to be useful
FeatureWEB-23096Support JavaScript generic/template types in autocomplete
FeatureWEB-17170Support folding in ES6 import statements
FeatureWEB-7386Add breadcrumb for JavaScript
FeatureWEB-22930Flow: provide intention when @flow comment is present inside the code
FeatureWEB-29094Javascript: add install global types fix
FeatureWEB-27592Support Optional Chaining syntax
FeatureWEB-20078Complete string literals where they expected
FeatureWEB-28073Support 'Optional catch bindings'
FeatureWEB-28072Don't force inserting parens after method name completion in JSX
FeatureWEB-28791React autocomplete doesn't work with Flow generic React.Component<Props, State>
FeatureWEB-20252Support trailing commas in function parameter lists and calls
FeatureWEB-19775Code folding for ES6 imports
FeatureWEB-26560Improve function callback completion
FeatureWEB-25905Flow: provide a way to restart Flow service
FeatureWEB-22120Missing parameters when generating abstract method bodies
FeatureWEB-20715Auto indentation not occurring on ES6 imports
FeatureWEB-12666Ability to have different JS versions in project
FeatureWEB-27135Add `*.mjs` file extension to JavaScript file patterns
FeatureWEB-27489Add option to simplify module names in generated ES6 import statements from `module/index` to `module`.
FeatureWEB-16758All keywords in JavaScript are highlight in blue, except "undefined"
FeatureWEB-23511Fix action 'Split into declaration and initialization (and move to scope start)' for destructuring
FeatureWEB-3536Support JSON schema
FeatureWEB-20944Single step import for ES6 classes at new keyword
FeatureWEB-20003Auto Completion for ES6 String Interpolation Doesn't Work
FeatureWEB-22928Flow: provide Flow View to list current and project errors.
BugWEB-21529Annotations, inherited array properties code auto-complete doesn't work
BugWEB-17446Wrong message "overrides method in object" in node.js project
BugWEB-19696Find usages doesn't work in VanillaJS code
BugWEB-22369Convert to arrow function produces truncated result
BugWEB-1292JS: 'unused parameter' inspection doesn't report violations for arrow functions if the function body is not enclosed in curly braces
BugWEB-22883IDE UI locks up when clicking on 'var' keyword in Javascript file
BugWEB-27888No semicolon when path in import statement is autocompleted
BugWEB-28847Find usages of default export doesn't find usages via import("") call
BugWEB-23020Flow: Settings: correctly detect when "Resolve..." option should become available
BugWEB-20188No argument hinting for IIFE (Javascript)
BugWEB-22345Flow parameter hints incorrectly suggesting optional param
BugWEB-23985folding inline JSDoc issue and adding JSDoc type feature
BugWEB-23252"Parameter info" is wrong when using an inner arrow function without braces
BugWEB-24930JsDoc @augments ignored
BugWEB-27944Ignore typescript features when overriding e.g. constructor with generator
BugWEB-17483ES6 import resolve error
BugWEB-26986When editing JSX, there are no import suggestions
BugWEB-27636Moving does not update paths in JS.
BugWEB-27637webpack: support webpack.config.babel.js
BugWEB-12847'Inline local variable' JS refactoring highlights too much
BugWEB-28419Vue.js: live template incorrect output
BugWEB-28064ES6 class documentation not shown when using default export
BugWEB-24910Auto importing a flow type does not add "type" after "import"
BugWEB-24915Unable to change color from gutter if multiple colors are defined on the same line
BugWEB-13673Moving JavaScript always skips function() block
BugWEB-29688React standard methods/components can't be resolved with react 16.1+
BugWEB-20261Wrong 'Replace with template string' intention inside angular message
BugWEB-19767ES6: Dummy suggestions for `yield`
BugWEB-23211'Expression statement is not assignment or call' shown for Chai expectations
BugWEB-24976CommonJS: exported properties are not available in completion after module re-export
BugWEB-27777IDE performs Flow analysis even when Javascript language level isn't "Flow"
BugWEB-25440JSDoc and es6 class attribute type resolution error
BugWEB-25449ES6 Import Code Completion does not match CommonJS
BugWEB-23456JSDoc folding (first empty line)
BugWEB-20186CommonJS: no parameter info shown for constructor reference used as exported module property
BugWEB-27759Color syntax error in React reducer
BugWEB-3407JS: Smart Enter fails to add closing parentheses
BugWEB-19495JSDoc: This type string _sometimes_ causes an error
BugWEB-25129JavaScript Intellisense is useless
BugWEB-15808'Invalid' value in completion
BugWEB-17099CommonJS: module functions not available when re-exporting module instance
BugWEB-26457Javascript Fonts color problem with PhpStorm 2017.1
BugWEB-24428Avoid multiple resolving for TypeScript overloads in JavaScript if d.ts files are set up as JavaScript libraries
BugWEB-28154Autoimports don't use webpack alias if the alias is resolved to a file
BugWEB-22285Live Templates: jsClassName() doesn't return AMD module name when expanded in ES6 method definition shorthand
BugWEB-13212Wrong error and highlight with JavaScript ternary operator
BugWEB-23841Flow checking gives wrong warning & errors in interface files
BugWEB-2967"Select Word" (Ctrl-W) feature misses comma in members of variable declarations
BugWEB-27869Don't suggest to import already imported modules
BugWEB-25713Optimize Imports (ES6) splits one import into two
BugWEB-2398Extract method before inline comments preceding scope function
BugWEB-28922ES6 / TypeScript: enable "directory" import by default
BugWEB-27730Nice to have: don't resolve into inacessible nested function
BugWEB-27732Pasting an expression in a template string adds unnecessary backslash
BugWEB-20129WebStorm, JavaScript autocompletion is out of scope.
BugWEB-20127Merge duplicates in parameter info
BugWEB-19668let variables within switch-case-default
BugWEB-23332Carriage return within JSX string value mistakenly marked as error
BugWEB-26672Flow: function types are parsed incorrectly
BugWEB-21665Node exports not correctly detected
BugWEB-26885Edit Live Templates Predefined Functions: JavaScript predefined functions don't appear unless all JS subelements are selected
BugWEB-26881Option to disable auto imports in JavaScript
BugWEB-19801'Attribute is not allowed here' for local variables
BugWEB-22998ES6 Destructuring in require statement completely broken
BugWEB-28092Undefined method 'hasOwnProperty' on window object
BugWEB-23125False type mismatch errors on using generic types from typescript stubs
BugWEB-21786WebStorm go to type declaration
BugWEB-27807Structure Panel Mishandles Array of Objects
BugWEB-28346JS / ES6 "insert import" feature does not seem to pick in priority imports from "index.js"
BugWEB-28342Autocompletion object properties
BugWEB-25231False error "expected =>" for Flow typecast
BugWEB-19604JavaScript documentation popup indents parameters too far when @return includes <...>
BugWEB-28641Structure View shows wrong hierarchy
BugWEB-29599Automatic imports should be added below "use babel"
BugWEB-29594Add import with unresolved symbols on copy & paste from another file
BugWEB-21232[Flowtype] import and importype incorrect hints.
BugWEB-27305Enable code completion in webpack configuration file if the filename contains 'webpack'
BugWEB-27041Don't report 'red' errors based on JSDoc
BugWEB-7504make JSHint error highlighting more prominent
BugWEB-20434node.js: WS assumes variables in npm packages are available everywhere in normal code
BugWEB-21747Code Analysis Error with ES6 Template Strings
BugWEB-21968Type detection picking up suggestions from completely and obviously impossible places - even from local variables in other files inside functions
BugWEB-27181CommonJS: provide completion when requiring module with destructuring
BugWEB-27188JSDoc auto-generated comment doesn't realise an ES6 arrow function with a concise body have an implicit return
BugWEB-28816Different JS versions in project: can't configure version per file
BugWEB-23540Flow: Project Errors need Jump to Source possibility and grouping by files
BugWEB-21493Autocompletes JavaScript function call incorrectly.
BugWEB-21530JSDoc, inherited nested objects code auto-complete doesn't work for additional child properties
BugWEB-20956ES6: re-exporteing default module causes 'default export not declared in imported module' error
BugWEB-25258Can't find .flowconfig on Javascript project with Flow static type checked enabled
BugWEB-25251JSDoc is converted to parameter's type when call 'Split into declaration and init'
BugWEB-23565Support await postfix completion
BugWEB-20038E4X path navigation expressions that use namespace qualification are incorrectly flagged as not supported
BugWEB-28225invalid "attempt to assign to const variable" inspection for a variable marked /*global*/
BugWEB-27415Intellisense does not work with ES6 anonymous class instances passed as a function parameter
BugWEB-22542JS: let is not considered a keyword
BugWEB-22096Node modules: @types should be always indexed
BugWEB-24266Flow: comma (`,`) and plus (`+`) in generics are marked as bad characters
BugWEB-20237Export foo as default gives issues
BugWEB-20586ES7 Property decorator with the same name as property doesn't navigate to decorator's definition
BugWEB-29512JavaScript/TypeScript: File Structure doesn't show Inherited members
BugWEB-19688Move statement - screw up if statements with comments (JS)
BugWEB-24924Don't insert "use strict"; in ES6 modular code
BugWEB-20919CommonJS: completion shows properties of all exported modules in project
BugWEB-25033Troubles with JS libraries in multimodule project
BugWEB-23036ES intention "Convert anonymous function to arrow function": wrong result
BugWEB-25192Optimize imports should respect code style settings
BugWEB-22972MAJOR refactor bug - Can no longer refactor/rename destructured variables
BugWEB-13313JSDoc: Regular expression breaks stub
BugWEB-20803"Element is not imported" error for "module"
BugWEB-10771Invalid Javascript is recognised as valid
BugWEB-20094JSX: incorrect 'unused import warning' if component binding is unresolved
BugWEB-19755ES6 implementation of JSDoc defined interface
BugWEB-18593Broken hint and autocomlete for destructured parameters
BugWEB-15855ES: File structure view shows imported data wrong
BugWEB-23016Flow: disable Suppress for statement in Inspection results
BugWEB-26526replace with template string adds extra space
BugWEB-24969Unexpected warning "Element is not exported"
BugWEB-19500JSDoc: Erroneous message "Returned expression type ... is not assignable to type ...."
BugWEB-22521wrong style for js keyword operators (void, typeof)
BugWEB-22520[regression] [js] get and set are not styled as keywords
BugWEB-22839Debug files in JavaScript library reclassified as release on index
BugWEB-20251Corrective auto-complete produces unexpected results
BugWEB-25336'Create field' quick-fix produces invalid code
BugWEB-26013React Props do not get resolved when doing a direct named re-export
BugWEB-23996Flow language level syntax highlighting error
BugWEB-28162Webpack aliases not resolved when using webpack.babel.config.js
BugWEB-27576When generating JSDoc, don't put a dot before angle brackets in the return type
BugWEB-23051'use strict' statement breaks flow highlighting
BugWEB-24881Extend Selection doesn't support javascript es6 "``" syntax
BugWEB-24080Star-imported es6 module intellisense broken
BugWEB-21773Inline type information in function parameters is not found when param. destructuring is used
BugWEB-20191Convert to ES6 template works incorrectly
BugWEB-27743Do not auto import from .d.ts files from libraries in JavaScript files
BugWEB-22297babelrc doesn't recognize plugin options
BugWEB-28772Different JS versions in project: settings for flow are not show after reopenng the project settings
BugWEB-24603Flow autocomplete does not show params and params types
BugWEB-25805'Cannot resolve file' when importing from module that has `.js` name postfix
BugWEB-21833"u" modifier in JavaScript regular expression
BugWEB-21839knockout observable DefinitelyTyped signatures not being recognized properly
BugWEB-17651Split into multiple declarations removes comment
BugWEB-28123IDE "failed to load" webpack config that exports function taking env and returning the config object
BugWEB-3381JavaScript: Move Statement Up/Down moves additional line with code because it treats end-of-line comment as a comment for the next line
BugWEB-16923Javascript: Cannot jump to declarations of destructured variables
BugWEB-27398 require() paths broken after Refactor > Rename file if its parent directory is marked as resource root
BugWEB-29440ES6: access to static members of imported default unnamed class doesn't work
BugWEB-25397Find imports in other files for default exports
BugWEB-21350"get" keyword has wrong highlighting in JavaScript
BugWEB-23176JSDoc and destructuring: Works without type definition but not with a type
BugWEB-21281folding object error
BugWEB-28109Support Flow import type in Move symbol refactoring
BugWEB-14576Ignore React JS Lifecycle components/properties in JSX files
BugWEB-29279Invalid red code (parse error) if Flow return type uses parens
BugWEB-24862JavaScript parsing fails with "0xffe1" (testfile attached)
BugWEB-21617JSX: Line Comment breaks code inside ternary condition
BugWEB-27111Flow Single Argument with no parenthesis syntax causes Parse Error
BugWEB-19444JS: Invalid 'Duplicate declaration' highlight in destructuring assignment
BugWEB-22398Wrong redundant character escape in ECMAScript 2015 unicode mode
BugWEB-26408Flow object type spread is not supported
BugWEB-26872Flow: Global error pane shows the wrong line numbers
BugWEB-26878Class name is incorrectly marked as unused in class expression
BugWEB-21792Syntax errors on parsing object property with name 'views'
BugWEB-278372017.2 - Go to Declaration, Go to Implementation is broken
BugWEB-21426JSX: block comment is not undone on comment action re-invocation
BugWEB-27487Flow parser with JSX and template literals
BugWEB-27485Duplicates in completion list for classes which should be imported
BugWEB-27484Wrong import statement is generated when export includes new
BugWEB-26291flow: import {type A} from ... syntax shorthand not supported
BugWEB-19407Autocomplete doesn't work if object property was created with constructor
BugWEB-25223Arrow function and object - Parsing errors for correct code
BugWEB-28536Smart keys -> Insert pair does not disable pair removal
BugWEB-27816Flow forcing showing it's tab when you have unsaved files
BugWEB-20791Move Statement Down action breaks code
BugWEB-25202No JSDoc deprecated highlighting for default imports
BugWEB-19280JSDoc inline types: Problem with ES 2015 arrow functions with one parameter and no parenthesis syntax
BugWEB-29581bound (bind) function results in wrong mark of unused import
BugWEB-18548Wrong processing of JSDoc array-parameter fields
BugWEB-25041Exception when extracting variable used in decorator
BugWEB-25040Make className string attribute selection behave like class attribute
BugWEB-21560"Replace with Template String" fails if original contains a backtick
BugWEB-26101Type detection fails on "await"-ed promise that returns an array (works for simple values)
BugWEB-23997@mixes and @mixin is ignored when using JSDoc with EcmaScript 2015
BugWEB-20363refactor move file & import from '../path/bla.jsx'
BugWEB-19023ES6/Typescript auto-imported names should be inserted after "use strict" statement if presented
BugWEB-29042When auto-imports are enabled, pasting code containing Flow types will incorrectly add an import
BugWEB-27658JavaScript auto import should respect webpack aliases
BugWEB-28233Change name & description to 'ECMAScript 6' language level
BugWEB-28234Broken JS module import paths
BugWEB-25653Fix for updating method return incorrect for Promise
BugWEB-22927Flow: provide Live Template for @flow comment
BugWEB-22920JavaScript no syntax error on labeled continue
BugWEB-3763Context info for extended JavaScript objects
BugWEB-27666Flow: union optional type used as arrow function return type is not parsed correctly
BugWEB-28000Support new Flow 0.51 "opaque type" syntax (new Flow keyword)
PerformanceWEB-27283PyCharm Frezzes or work very slowly during writing code
PerformanceWEB-23925Editing JS with enabled Flow server freezes IDE
PerformanceWEB-23255Major editor slowness when Flow turned on
PerformanceWEB-27562Indexing of Javascript files takes 30+minutes, hangs Intellij on exit
PerformanceWEB-22544Poor editor performance with 25000 line javascript file
PerformanceWEB-18670Optimize memory usage for references having several resolves
PerformanceWEB-26877High CPU usage when idle
PerformanceWEB-22042IntelliJ IDEA freezes while editing javascript file
UsabilityWEB-18070ES6: Find usage of default export
UsabilityWEB-27317Autocomplete label keeps blinking with Flow enabled
UsabilityWEB-25455Module Dependencies Diagram: provide separate popup shown for the empty context
UsabilityWEB-22602ES6: inconsistent availability of "convert to arrow function"
UsabilityWEB-29270Code completion does not understand @param context in JSDoc
UsabilityWEB-29274Properties are sorted randomly in the QuickDoc (Ctrl+Q)
CosmeticsWEB-201812 actions with same icon
CosmeticsWEB-23101Flow errors tool window: improve UI
CosmeticsWEB-22215Exclude JSDoc from 'assignment' inspection
TaskWEB-29497JavaScript: rework "show expression type" UI
TaskWEB-27627JS Stub/Tree mismatch after "Negate" intention invocation on a garbage code
TaskWEB-29467Remove option to use Flow for resolving all references
ExceptionWEB-29703Exception in JSDoc completion
ExceptionWEB-28323NPE invoking JS documentation
ExceptionWEB-23507ClassCastException When update JSDoc
ExceptionWEB-26736Throwable when call require inside script tag in vue
ExceptionWEB-25330Exception when formatting React tag inside template string argument
ExceptionWEB-22218angular-ui-router diagram: ClassCastException when create a new note
JavaScript. FormatterFeatureWEB-24015Align from in ES6 import statements
FeatureWEB-26042Add minimum number of blank lines to Typescript Code Style
FeatureWEB-13303Add an option "Spaces within expression parentheses"
FeatureWEB-19143Remove last comma in json or js arrays/object automatically
FeatureWEB-22612"Reformat code" is unopinionated on TypeScript generics
FeatureWEB-12581New JavaScript formatter option: split variable declarations in lines
FeatureWEB-20668Code Style: spaces around ES2015 (ES6) Generator
FeatureWEB-24556Reformatting option to add, remove, or leave alone (default) semicolons
FeatureWEB-19585Formatter: provide option for the arrow function in the Around Operators settings
FeatureWEB-25019"New line after (" in JS function calls should ignore multiline parameters and take into account only line breaks *between* parameters
FeatureWEB-14310Add support for Google JavaScript style guide
FeatureWEB-19523No 'Wrapping and Braces' alignment code-style options for JavaScript 'new' expressions
FeatureWEB-22783Add options to control blank lines
FeatureWEB-22782Add formatting options to insert/remove trailing commas in Object Literals, Function Declaration Parameters, Function Call Arguments, ES6 Imports/Exports
FeatureWEB-24357JavaScript Code style: Space between async and () => {}
BugWEB-28822[Typescript][Formatting] Wrong alignment of close brackets
BugWEB-27678Live templates with multiple variables doesn't work with specific code style
BugWEB-29293Indentation of Flow type cast syntax is messed up
BugWEB-27460JSX formatting issue - Spaces are removed in some cases
BugWEB-23475Optimizing imports in javascript/ES6 modules ignores inspection controls
BugWEB-26559Code Style: JavaScript/TypeScript: improve Arrangement
BugWEB-24853Formatter doesn't follow the formatting rules when formatting Flow type annotations, also reports valid Flow type as "error"
BugWEB-18475JSDoc comments are broken by word-wrap functionality
BugWEB-16628JavaScript IIFE braces formatting
BugWEB-24389Flow: Some flow type syntax confuses the formatter
BugWEB-24126Flow: provide correct formatting for union and intersection types
BugWEB-28925Formatter: "Function declaration parentheses" changes "In async arrow function" option behavior
BugWEB-25235destructured parameter defaults do not obey the alignment formatting options
BugWEB-27105JSX tags are not correctly indented when using ternary operator
BugWEB-24694Can disable trim trailing spaces in Editorconfig
BugWEB-1206JS formatting problem after if statement
BugWEB-27149JavaScript punctuation code style options are not respected when formatting code embedded in Vue template
BugWEB-22016JavaScript reformatting may corrupt chained method calls mixed with line comments
BugWEB-25218'Use semicolon to terminate statement' is not applied inside 'script' tag in html file
BugWEB-17628javascript indentation problem
BugWEB-27988Javascript punctuation codestyle reformat produces syntactically wrong code
BugWEB-13304JS "Line comment at first column" always on for HTML scripts
BugWEB-24513Reformat code action doesn't retain indent for ES6 shorthand arrow function
BugWEB-22268Align var statement and assignments does not align ES6 destructuring assignments
BugWEB-21972Indentation problems with JavaScript
BugWEB-27411'Set from' option doesn't copy all settings from the chosen language
BugWEB-22093Formatter formats a comment despite (enabled) formatter markers telling it not to
BugWEB-28059Auto format method named get adds space before function parantheses
BugWEB-24927'Make static' breaks code or highlighting depending on settings
BugWEB-9146Embedded javascript should be indented according to Javascript settings for indent/continuation indent
BugWEB-25312Incorrect indentation in JSX using ternary operator
BugWEB-26522wrong reformat of es6+react
BugWEB-24787Use semicolon to terminate statement option with for loops
BugWEB-24786Wrong indent after 'Extract++'
BugWEB-24789Globally installed Standard always shown in the UI
BugWEB-18387Indentation after <ENTER> is wrong
BugWEB-27689ES2015: Reformat Code produces incorrect indent with JSDOC + computed property
BugWEB-19713Formatting preferences cause AssertionError "Attempt to create a composite block with no children" when accessing certain files
BugWEB-28145code reformat on JavaScript combines statement code into preceding comment
BugWEB-27531Typescript Code Style. Problem with object inside array
BugWEB-21149IntelliJ adds linefeed before opening brace in `switch-case` statement
BugWEB-22446JS Alignment of multi-line parameters doesn't work if it's an object instantiation
BugWEB-23348Formatting empty class breaks the line when "simple blocks in one line" is enabled
BugWEB-29550JavaScript code contains invalid token after reformat
BugWEB-24643Problem with indentation after updating to 2016.3.2
BugWEB-28430Javascript punctuation like standardjs remove too many semicolons in single line and with PHP mixed, result in broken code
BugWEB-21661Wrong 'Format Code' in React render code
BugWEB-27834Wrong comments indent when formatting typescript enum
BugWEB-2226JS: "if" braces always inserted on next line by formatter
BugWEB-25222es6 destructuring indentation issue
BugWEB-22003Function Body is Indented Wrong
BugWEB-24527Phpstorm does bad auto formatting in functions with jsdoc inside arrays
BugWEB-18509WS 11 EAP: Assigment syntax dependent indentation issue
BugWEB-26763Wrong indent in .vue files with .editorconfig
BugWEB-25247'Align parameters when multiline' ignores destructuring parameters
UsabilityWEB-24704ES6: Preserve order of imports and empty lines between them
ExceptionWEB-27269Bad .editorconfig file, will not open any file
ExceptionWEB-25477JS: Throwable when formatting injection in template strings with escaped spaces (\n, \t)
JavaScript. FrameworksFeatureWEB-10654AngularJS: Support for angular-ui-router
FeatureWEB-21351Add intention action to switch between "" and {} in JSX files
FeatureWEB-23370Angular2: when using the function of "Find Usage" alt-f7, WebStorm should also look in templates (especially for class name or selector)
FeatureWEB-20722Support angular-cli: new project template
FeatureWEB-28689Configure react className not use brace
FeatureWEB-19890tsconfig, eslintrc: do not show used properties in code completion
FeatureWEB-22524Add integrations with Create React App for creating new projects
FeatureWEB-25459Support Angular 4 ngIf else branch
FeatureWEB-26468Emmet in JSX, support non-self closing tags for host components
FeatureWEB-22531img src parameter and curly braces produces 'cannot resolve file' warning (Angular2)
FeatureWEB-18545React: support import/export as syntax
FeatureWEB-18730Angular 2: support property bindings
BugWEB-21527Intellij freezes when opening xml file
BugWEB-25006Angular method decorate with @HostListener mark as unused
BugWEB-24719Angular CLI: can't generate components inside a feature folder
BugWEB-21735Coding assistance for props in React is not working when props are defined in separate file.
BugWEB-27671Closure Compiler goog.provide/require support
BugWEB-27679Support color attribute for md-button directive
BugWEB-28028Wrong code inspections in XSLT Stylesheets with Angular
BugWEB-23754Missing type introspection inside *ngFor
BugWEB-23251Update Angular2 Live templates
BugWEB-27945Webpack config file autosaves on every keystroke in 2017.2
BugWEB-22574Angular2: support comma-separated selectors list for Component
BugWEB-27896React component props no longer autocomplete
BugWEB-21684React: Missing required prop should not trigger warning when defined in getDefaultProps
BugWEB-25307Can't create Angular CLI project after Angular CLI was renamed
BugWEB-22659React: don't report 'missing required attribute' error for required properties from defaultProps
BugWEB-22656React: don't report child context properties (childContextTypes, getChildContext()) as unused
BugWEB-23654Angular2 html (event) binding expression inspection doesn't recognize component variables in LHS of expression
BugWEB-22537Memory Leak on Angular 2 project.
BugWEB-22827angular2 Navigation to the file from the path styleURLs and templateURL are failed (from all components)
BugWEB-26235Auto import doesn't work for functional React components
BugWEB-24095Add option to pass environment variable in React native configuration
BugWEB-22498Good code is red in JSX React syntax
BugWEB-22675angular-ui-router: turn off diagram for Angular2 project
BugWEB-27756Invalid id reference but id exists
BugWEB-22809False positive inspection inside img tag (support [src] syntax)
BugWEB-25128React native debugger: template app can't be debugged
BugWEB-25122Angular2 component @Input/@Output name changes
BugWEB-22472angular2: unresolved method in template, but resolved in components code on same property
BugWEB-19803Red code: Angular Formatting Messages
BugWEB-19808Implement validation/completion for TemplateUrl in @Component
BugWEB-19809Implement validation/completion for StyleUrls in @Component
BugWEB-22289angular-ui-router diagram is available for node.js project
BugWEB-26258JSX components are incorrectly marked as deprecated HTML tags
BugWEB-23144in Angular2 templates Can't navigate to the input field from the html when input define on the getter
BugWEB-22389"Cannot resolve symbol" error for AngularJS modules defined though a wrapper function
BugWEB-29240componentDidCatch marked as unused method in React 16 component.
BugWEB-26418Resolve types from React 'prop-types'
BugWEB-27826 Missing type introspection inside *ngFor
BugWEB-27121WebStorm doesn't understand escaped curlies in Angular2 html templates
BugWEB-28098No quick-fix for Missing React import when using React 16
BugWEB-28328Can't resolve Component in react 16
BugWEB-25562Angular-cli: New Project Name validation
BugWEB-22033angular-ui-router: missing .html on chart
BugWEB-23128No navigation to html template
BugWEB-26324Menu element showing as deprecated in JSX
BugWEB-25095Angular2's [attr.xlink:href] not recognized by code inspector
BugWEB-27164False positive warning: Bitwise operator used in Angular project
BugWEB-20339Support bindings for components defined using AngularJS 1.5 component helper
BugWEB-28629Support non-null assertion operators in Angular templates
BugWEB-28191Angular: syntax errors when using opening curly brace in interpolation
BugWEB-28192Find Usage / Jump to Declaration (CTRL+Click) in AngularJS is no longer working
BugWEB-21966angular-ui-router chart: different declarations cause different charts (structure is the same)
BugWEB-21965angular-ui-router chart: add an info tooltip if template url is declared as a function
BugWEB-19954UnsupportedOperationException when call completion inside Angular message
BugWEB-19957Incorrect resolve in angular message
BugWEB-26165Unused default export
BugWEB-28384Provide completion for React components that extend PureComponent
BugWEB-26801Refactor: Rename Angular selector: 'aa-bb' is not a valid identifier
BugWEB-21570React: provide path completion/validation for <img>, etc. tags in JSX components
BugWEB-27347IDEA Webpack support: After adding "fake" webpack configuration, IDEA can't resolve "path"
BugWEB-19589React: Refactor - Rename of component doesn't work properly with default exports
BugWEB-25212Vue + Typescript: export is not recognized
BugWEB-27882React: propTypes completion doesn't work for material-ui components
BugWEB-24064selector of components recognize wrong #Angular2
BugWEB-20720Angular2, controller methods that are used in an external HTML template are set unused methods
BugWEB-22765Unresolved variable or type $event
BugWEB-28859Webpack Failing Loading Plugin BrowserSync
BugWEB-21981angular-ui-router chart: templateUrl is not ignored if views object is defined
BugWEB-21985angular-ui-router:provide warning and inspection for missing .html files
BugWEB-26793Angular: <ng-content> is reported as 'unknown HTML tag'
BugWEB-27629Closure Compiler. Strings should highlights separately
BugWEB-27455Don't write WebPackConfiguration to misc.xml when webpack is not used in a project
BugWEB-26504PHPStorm doesn't recognize angular variables in ng-repeat-end blocks.
BugWEB-23268No docs for React component props
BugWEB-27251Provide completion for webpack aliases
BugWEB-22500[angular2] Auto-complete not obeying camelcase of actual suggestion
BugWEB-28400Create react app extension: add UI items
BugWEB-24966Placeholder element <ng-container> is reported as unknown HTML tag
BugWEB-21692Element X doesn't have required attribute Y
BugWEB-23999IDEA parameter suggestion doesn't properly detect React component properties depending on code structure
BugWEB-28754Angular: Generated method based on a typed EventEmitter does not use the EventEmitter-type
BugWEB-25479Vue.js: child component appears as 'unknown HTMl tag' in parent template
BugWEB-22292angular-ui-router: 'Show edge labels' is shown when shouldn't
BugWEB-22129angular-ui-router: add possibility to refresh chart
BugWEB-28776Angular content assist seems to fail for external component library
BugWEB-23154JSConstructorReturnsPrimitive and React stateless functional component
BugWEB-22855aria-attributes are not recognized in JSX
BugWEB-26915VueJS plugin shows unused default export
BugWEB-28717Comment out property on JSX not reservable #JSX #React
BugWEB-27350Warning:(1, 1) Angular Language Service internal globalError: ngLanguageService.getDiagnostics is not a function
BugWEB-27703Missing import statement inspection erroneously triggered for new flow syntax
BugWEB-23821When using 'this' in angular 2 template, error of unresolved var
BugWEB-19675No support for code completion and code highlights in Angular 2 @component({styles})
BugWEB-22169Angular-ui-router: states from other main-page-templates on the diagram
BugWEB-26395Vue.js: broken 'async/await' construction highlighting in <script> tag
BugWEB-26095VueJS directives autocomplete
BugWEB-23118Guessing wrong React props - based on name, not actual file
BugWEB-22184angular-ui-router: UnsupportedOperationException when press cmd+d
BugWEB-21798React: don't report 'Empty tag' violations for tags in JSX
BugWEB-20308Wrong color of commented lined inside template
BugWEB-28656Don't show "Split current tag" intention for Vue props
BugWEB-28659Wrong Top-level 'this' warning in Vue files
BugWEB-26833Formatting: Code Styles: JS/TS: "Keep Maximum Blank Lines" option saves only 2 blank lines
BugWEB-26772React: don't report `static defaultProps` as unused field
BugWEB-21677JSX Children PropTypes incorrectly parsed
BugWEB-22277JSX boolean attributes mistakenly reported as not boolean
BugWEB-19921Red code in Angular 1.4
BugWEB-19028IDE suggests make 'Render' method static
BugWEB-25652Angular 2 template does not resolve `Output`s from base class
PerformanceWEB-28011Webstorm on Mac freezes
PerformanceWEB-27766Slowdown when working on large php / vuejs projects
UsabilityWEB-29063"Angular CLI" menu is missing when the "angular-cli.json" file is created without a dot at the beginning
UsabilityWEB-28453Angular: Keyboard navigation from custom template parameters to declaration (F4)
UsabilityWEB-28980Improve error message for webpack.config.js load fail
UsabilityWEB-25823intellisense doesn't change case
CosmeticsWEB-28300Directives that does not expect any expression
CosmeticsWEB-26821Vue files don't properly highlight es6 imports
ExceptionWEB-28981Webstorm fails to load webpack.config.js if webpack-dashboard plugin is included.
ExceptionWEB-22195angular ui-router: IllegalArgumentException, file is not open
ExceptionWEB-22208angular-ui-router chart: Throwable
ExceptionWEB-27026IllegalStateException when stop debugger
ExceptionWEB-29049Exception in Vue path completion for template and style sources
ExceptionWEB-27194ClassCastException when open a project
JavaScript. InspectionsFeatureWEB-20310Missing import inspection: add symbols from the same module in one statement
FeatureWEB-21230Support ESLint fix
FeatureWEB-12565Exempt @class from function naming convention inspection
FeatureWEB-21946Linters: highlight the whole token
FeatureWEB-25172Provide import suggestion from .jsx to .js
FeatureWEB-20190ES6 imports: suggest to install [with npm] modules metioned in from clause
FeatureWEB-19830Add code completion for eslintrc file
FeatureWEB-28101Intentions: TypeScript: make "Remove Unnecessary Parentheses" works for types
FeatureWEB-24517Inspection: '==' operator is used instead of '==='
FeatureWEB-14388Invalid "Unused JavaScript / ActionScript local symbol" inspection for unused parameters
FeatureWEB-24074Add eslint-compatible suppression options
BugWEB-6099Parameter is not highlighted as unused if its name is present in a string literal
BugWEB-27281False "Possible iteration over unexpected (custom/inherited) members" inspection errors when using 'hasOwnProperty.call()'
BugWEB-21505eslint-plugin-html doesn't validate html files
BugWEB-21054JavaScript useless warning Variable might not have been initialized
BugWEB-21051Missing module dependency: should add a package.json file to the project
BugWEB-24736Potentially invalid usage of this in getters/setters inside constructor
BugWEB-9059JavaScript: "remove redundant else" option is not consistent.
BugWEB-14957No usages not marked
BugWEB-20225Enable "Missing import statement" inspection for JSX/Flow language versions
BugWEB-22343Duplicate declaration warning when there is no one
BugWEB-27916Javascript generate intentions not available in html files <script> tags
BugWEB-23920Magic Number inspection should not apply to JavaScript Object key/value pairs
BugWEB-20694JSCS: requireObjectKeysOnNewLine "allExcept": ["sameLine"]
BugWEB-24754Warning with async functions and no return value
BugWEB-22576Javascript: simplify if statement intention adds additional !!
BugWEB-22755Inspections: async keyword is not treated correctly by "Convert to anonymous function"
BugWEB-26180Invalid 'Unused assignment' in JS catch()
BugWEB-28254Incorrect quick fix for "unused default export" warning
BugWEB-21731Invalid return and break statements
BugWEB-22668Erroneous conversion to arrow function
BugWEB-23595wrong types recognition by function parameter named as 'props'
BugWEB-22641Convert to let/const inspection in Inspections results
BugWEB-19694global objects are not resolved/behaved as expected
BugWEB-25309convert to template string produces invalid code if contains a string argument with newline character.
BugWEB-27804Unresolved function or method Xxx() bug
BugWEB-23479Intentions: "Convert to ES6 class": when defineProperties() has writable: false do not generate setter
BugWEB-23210No-variable declaring destructuring assignment not recognized as valid
BugWEB-22760JSCS: provide support for new options
BugWEB-22824Inspections: disable "Convert to class" intention inside Typescript classes/interfaces
BugWEB-23044Code analysis after most recent update is very slow
BugWEB-25140ESLint highlights incorrect line when line is too long
BugWEB-24630Convert to class intention loses getters and setters
BugWEB-7241Destructured assignment in function parameters causes incorrect inspection warnings
BugWEB-22116Intentions "Convert var to let", "Convert var to const" freeze large project
BugWEB-19149Warning about "Potentially invalid usage of this" when accessing property in ES6 generator
BugWEB-25127Unable to disable broken ui-router state tracking
BugWEB-22864False positive "Element is not exported"
BugWEB-22135Convert to let should keep initialization together with declaration
BugWEB-23374Links do not work in Documentation expression popup
BugWEB-25104Wrong warning about usage of reserved word in destructuring
BugWEB-24672Inspections: "Convert 'for..in' to 'for..of'" is shown twice for each code construct in Inspection Results
BugWEB-21847Import statement is marked as unresolved
BugWEB-20147False positive "Add missing import"
BugWEB-27515Inspections: Create class/interface quick fix should correctly treat preceding comments
BugWEB-20726ES6 destructured assignment warns assigned to variables may not be initialised when being assigned!
BugWEB-21602v2016.1.2: "Possible iteration over unexpected members" mislead
BugWEB-26254ESLint: error notification is not updated on linter version update
BugWEB-23160getter MAX_VALUE shouldn't be considered as constructor
BugWEB-23290Duplicated warnings for non-imported element
BugWEB-19487missing AMD warning for 'console' and 'document'
BugWEB-19667Variable might not have been initialized with ES6 destructing
BugWEB-23316Inspections: disable "require() is used instead of import" for TypeScript files
BugWEB-23315Inspections: "require() is used instead of import": destructing of require is not converted correctly
BugWEB-22690Inspections: "Missing module dependency": correct inspection in Inspection results
BugWEB-21789False 'missing module dependency' violation for 'express-sessions' module
BugWEB-25234"Content of collection is never updated" is wrongly reported on Sets
BugWEB-21903'Cannot resolve symbol' exported import es6
BugWEB-22228Incorrect "unresolved variable" warning after a destructing assignment from a require() in Node.js
BugWEB-24938ESLint command line error messages are not shown properly
BugWEB-22728ESLint: provide absent rules and options
BugWEB-22260Incorrect detection JSDoc in tag @typedef
BugWEB-29280Invalid 'conflicting inherited declaration' highlight (observable with React components in JS files)
BugWEB-22931Inspections: "Remove unnecessary parenthesis": do not suggest it for Flow syntax
BugWEB-22092Invalid "Returned expression type ...not assignable to type ..." error
BugWEB-24268Imprecise highlight of unused value in ES6 destructuring assignment
BugWEB-22376"Missing import statement" in code inspection by mistake
BugWEB-24926Standard Code Style: correctly setup rules from preset
BugWEB-21334Eslint config with strings
BugWEB-24748JSCS: 'Fix current file with JSCS' doesn't work from Inspections Results toolwindow
BugWEB-27597JSDoc case sensitivity with regard to arrays
BugWEB-27625magic number - false interpretation
BugWEB-29137not imported symbol is recognized and not-recognized at the same time
BugWEB-23480Convert to ES6 class: suggest only if source function has prototype assignments or this assignments, or defines static methods
BugWEB-22503Inspections: "Convert to let": do not change operations order
BugWEB-22502Inspections: "Convert to let": do not place result 'let' into another scope
BugWEB-23464Inspections: "require() is used instead of import" put imports to the end of file when both normal and inner requires are present
BugWEB-23205Flow: improve "Coverage errors" inspection
BugWEB-20525JSCS: remove outdated rules from completion
BugWEB-22642Convert to let/const inspection messes up the comments
BugWEB-22310Inspections: "Convert to let" leaves preceding comments untouched while moving declarations
BugWEB-24948Linters auto detection: if local package is installed always set path to local not to global package
BugWEB-29159Intentions: improve "Convert type alias to interface" intention settings
BugWEB-27216'Create method' quick fix shown when not applicable
BugWEB-23295Inspections: "require() is used instead of import": comments breaks converted import
BugWEB-22879False-positive inspection 'Module is not listed in package.json dependencies'
BugWEB-24609'Convert to let' adds redundant export modifier
BugWEB-27230'Module is not installed' is not shown for references inside module
BugWEB-19836JSHint 1.8.0 not loaded
BugWEB-25162ESLint: 'Fix ESLint problems' action is missing in .jsx file right-click menu
BugWEB-25398Throwable when inline variable
BugWEB-20153WebStorm code inspector: 'Interface can not be instantiated' for new Error('ErrorMessage') and for new Buffer(). NodeJs scope ls enabled.
BugWEB-20156Missing import inspection: suggest importing CommonJS modules
BugWEB-20157Missing import inspection: can't import several symbols from one file
BugWEB-22166Intentions: "Add braces to arrow function statement" eats any preceding comment
BugWEB-28930Inspection and Intention "Replace Assignment With Operator Assignment" - false positive and broken code for `a = a !== false`
BugWEB-21878Erroneous "type mismatch" inspection warnings when using arrow functions and promises
BugWEB-23132Missing module dependency inspection shouldn't work independently from library scope
BugWEB-15524Extra inspection 'The value assigned is never used' inside 'if' section
BugWEB-24686Inspections: do not suggest "Convert 'for..in' to 'for..of'" in case of conflicting error with "Unfiltered for..in loop"
BugWEB-22689Inspections: "Missing import statement"/"Missing require() statement": correct inspections in Inspection results
BugWEB-22684Inspections: "Convert to let" eats preceding block comment
BugWEB-22685Inspections: "Convert to let" duplicates variables both as let and const
BugWEB-22681Update built-in JSLint version
BugWEB-12412Inspections: Code quality tools quick fix opens Settings dialog for each item
BugWEB-21568Excessive vertical space in JSCS config description
BugWEB-20281Inspections: disable "Missing module dependency" for TypeScript ES6-style imports
BugWEB-27657webpack: do not show Missing module dependency warning for aliased paths to node module
BugWEB-23574Missing import statement: for modules having both jsnext:main and main, incorrect import results are suggested
BugWEB-26353Incorrect detection of unused ES6 import
PerformanceWEB-24567Editing is slow because of 'missing Import' inspection
PerformanceWEB-21650JavaScript analysis never finishes if a variable named "i" is missing "var"
UsabilityWEB-22757Improve support of eslintConfig section in package.json
UsabilityWEB-22763Inspections: "Missing module dependency": reorder list of available package.json files
UsabilityWEB-24566Linters auto detection: log information about turning on linters into events log
UsabilityWEB-23570Intentions: "Convert to Class": correctly sort generated set/get attributes
CosmeticsWEB-22029Constant 'if' statement inpection: spelling
ExceptionWEB-22616Inspections: "Convert to let": IOOBE is thrown on applying quick fix to Fix all statements
ExceptionWEB-23463Inspections: exception is thrown on attempt to process multiple comments with "Convert to let" Fix all
ExceptionWEB-19198JSCS: Import Code Style: IllegalStateException for empty input file
ExceptionWEB-22394Inspections: Throwable on applying "Convert to let"/"Convert to const" quick fix
ExceptionWEB-23076Inspections: AssertionError for "Missing module dependency" group shown in Inspection Results
ExceptionWEB-26859PsiInvalidElementAccessException when call 'Remove unused export' in vue files
JavaScript. PredefsFeatureWEB-6574Add matchMedia to DHTML.js
FeatureWEB-14702provide external documentation for DHTML.js and DOMCore.js
FeatureWEB-3371Fully implement the Console API
FeatureWEB-28113ES7: add `String.prototype.padEnd()` and `String.prototype.padStart()` to EcmaScript.js
FeatureWEB-28052Support Promise.prototype.finally
BugWEB-8821Unresolved variable or type 'HTMLSpanElement'
BugWEB-6783JavaScript Math.atan2 signature seems incorrect
BugWEB-18251Function is not treated as instance of Function
BugWEB-19648Incorrect signature for document.importNode
BugWEB-13840WebGL constants are defined on WebGLRenderingContext, rather than WebGLRenderingContext.prototype
BugWEB-18967Incorrect Event prototype definition makes inspection fail
BugWEB-22269EcmaScript6.js (Predefined JavaScript files) claims Array.prototype.fill will return "void"
BugWEB-23265document.domain is defined as a const
BugWEB-15422Invalid postMessage warning
BugWEB-11480Add support for WebWorkers API
BugWEB-11805Incorrect DHTML.js, resulting in incorrect inspection
BugWEB-22026Window.postMessage is not resolved.
BugWEB-6766setTimeout/setInterval inspection expects fixed signature
BugWEB-29218Wrong link to external documentation
BugWEB-29217Unexpected documentation for type
BugWEB-25673Missing property declarations on HTMLTextAreaElement.prototype in DHTML.js
BugWEB-21011Incorrect type annotation on HTMLDocument.prototype.activeElement in DHTML.js
BugWEB-25241Buffer.from pointing to wrong method Array.from
JavaScript. RefactoringFeatureWEB-24775Incorrect shorthand object literal refactoring
FeatureWEB-22639ES6 string templates: create intention to convert between line separators
FeatureWEB-22198Refactoring [to / from] [ES6 / Typescript] object literals
FeatureWEB-19996Improve name suggestion for Refactoring | Rename
BugWEB-27074'Refactor | Rename' skips functions call (import via module.exports)
BugWEB-24232React: extracting method from JSX content breaks the code
BugWEB-20067"Find Usages" and refactoring does not work, with es6 object definition
BugWEB-26215NullPointerException when extract field or variable from default export
BugWEB-29160Refactoring: improve "Extract Interface" action
BugWEB-23455refactoring object property
BugWEB-16913ES6 JS Refactoring: change signature
BugWEB-16440"Redundant variable" warning and "Inline variable" refactoring don't work on a destructuring variable declaration
BugWEB-22611Shorthand property inline adds no key
BugWEB-23598Convert require() to import: does not work at the moment with relative paths
BugWEB-27227Introduce parameter from 'or' expression throws when 'optional' is enabled
BugWEB-25481'Compute constant value' doesn't support ES6 template strings
BugWEB-22132Convert to let should consider scope
BugWEB-22133NPE during var to let conversion
BugWEB-29450Refactoring: "Extract Interface" action from the object literal suggests invalid result
BugWEB-25380Cannot rename in ES6 binding
BugWEB-23623Convert to class: when constructor defined as variable, not converted duplicate properties are not shown after refactoring
BugWEB-3654JS Extract Method for arrow function: refactoring can't be performed if the part of expression after => is selected along with leading space
BugWEB-3652JS, Extract Method refactoring: code is broken if a semicolon is included in selected expression
BugWEB-21419ES6: Intentions: add support inside HTML script tag and inside JS injections
BugWEB-22694Convert to arrow function creates invalid function with object literal
BugWEB-28666Can't add parameter without default parameter value
BugWEB-27642Javascript 'Extract variable' refactoring on a part of template string swallows text and produces syntax error
BugWEB-20035Inline doesn't work on class methods
BugWEB-27416Inline rename in JavaScript is too eager about replacing text
BugWEB-22897'Convert to anonymous function' add extra semicolon
BugWEB-20054Create Function Definition feature does not use selected scope - always creates it in global scope
BugWEB-24920ES6 - not correct actions in the Action Menu for Arrow functions with Destructuring objects as function parameters
BugWEB-24742ES6: convert to class with a commented function property: null assertion
BugWEB-29092TypeScript/JavaScript: Improve "Pull Members Up" refactoring
BugWEB-27599JavaScript consecutive refactoring on "Replace with template string " does unwanted escaping
BugWEB-23483Refactor->Move does not work with Javascript functions from structure tab
BugWEB-23484ES6 convert to class: pseudo-class method definition, expressed as created object's member, should be converted to member function
BugWEB-27023'Refactor | Rename' skips functions call (import via module.exports)
BugWEB-24222Extract method allows extracting invalid code fragments
BugWEB-19994NullPointerException when try to extract field from decorators
BugWEB-19995AssertionError when change method's signature
BugWEB-28289"Remove unnecessary parentheses" removes argument type hints
BugWEB-3648JS, Introduce Variable: false 'Selection contains reference to arrow function parameter' warning when selecting expression in arrow function body
BugWEB-26852quick fix changes "declare var" to "let"
BugWEB-1423JS, Extract Method refactoring: pass local variable declared using 'let' as a parameter
BugWEB-19002ES6: Refactor/Rename directory doesn't correctly update paths in import statements
BugWEB-28800convert to let/const in batch does not work after recent changes in 5a58af90ab0b8a2ca0d1c7cc06e0049bb53ef3c8
BugWEB-27656JavaScript "Create method" refactoring doesn't add 'static' method qualifier when class is defined in another file
ExceptionWEB-20603Cannot delete variable from parent : JS:DESTRUCTURING_PROPERTY when use 'Inline'
ExceptionWEB-26850Throwable when call 'Refactor | Extract variable' in JSX code
JavaScript. TemplatesFeatureWEB-19721Allow reformat to place closing tag in new line in JSX
LESSFeatureWEB-14762support inline LESS/SCSS stylesheets
FeatureWEB-27344Support for CSS modules with LESS
BugWEB-20921Add support for valid HTML syntax for including LESS/SCSS in <style> tags
BugWEB-20066Missing property values in completion in .less if put cursor before a value
BugWEB-21722IDEA tries to parse @unknown rules in less file
BugWEB-12012LESS: '~' in calc() function causes 'unexpected term' error
BugWEB-21601String concatenation inside cals in Less files is not recognized
BugWEB-14251Less editor incorrectly shows an error when using tilde ~""
BugWEB-23707Less: webpack ('~') imports not resolved when using 'resolve.alias' and 'resolve.modulesDirectories'
BugWEB-27471The LESS editor offers the @include-once directive, although it has been removed in version 1.4
BugWEB-25471Autocomplete for less
BugWEB-26642LESS & operator not resolved in `not` expression
BugWEB-27811Emmet offers the wrong options
CosmeticsWEB-27002Typo in Sass/SCSS/Less | Resolved by name only inspection popup
LintersFeatureWEB-27500ESLint: Improvements for the ESLint code styles import
FeatureWEB-27908Add .eslintrc.js support
BugWEB-27540ESLint: update config schema with overrides
BugWEB-28290.eslintrc importer is unable to map space-before-function-paren rules properly
BugWEB-29372Standard formatting only honors package.json at project root
BugWEB-27734JSHint: update bundled version to 2.9.5
BugWEB-27220Linters: hide notification about invalid path to Node.js when Node.js is updated for the project
BugWEB-27868ESLint: linting is not enabled in .vue files
BugWEB-26653Standard Code Style: wrong highlighting in the Editor
BugWEB-27228JavaScript Standard Style integration doesn't seem to honour the settings from package.json
BugWEB-24814Enable TSLint by default for Angular CLI projects
BugWEB-27100ESLint inspection inexplicably shows an error on ignored file
BugWEB-28648Do not suggest to use Standard code style when you open excluded or library file
BugWEB-27418TSLint shows error message when opening new project with tslint.json and ? no installed TSLint?
BugWEB-28197Lint .vue files with Standard
BugWEB-29302ESLint: auto-import-settings on first project opening to do its best without any popups
BugWEB-27024Standard Code Style: can't start linter when using "plugins" option
BugWEB-27253TSLint: errors are not highlighted in editor if the project directory is a junction
BugWEB-26393can not get result of ESlint annotation
BugWEB-29231Standard code style: can't start ESLint with eslint-plugin-flowtype
BugWEB-27331ESLint: TypeScript linting doesn't work unless the typescript plugin is explicitly redeclared in child .eslintrc
BugWEB-26756ESLint: warning about new line character is now shown
UsabilityWEB-26581TSLint: http URLs in error tooltips should be clickable
UsabilityWEB-26971ESLint: Code/Inspect Code reports errors for each ignored file of the .eslintignore
Node.jsFeatureWEB-11419Provide better exclude rules for indexing.
FeatureWEB-25407NodeJS: Navigator opens symlink instead of symlink target
FeatureWEB-15231Notify about changing project package.json after VCS update
FeatureWEB-25514Support for n (virtualenv for Node.JS)
BugWEB-23597"Missing module dependency" inspection "Install module" fix installed previously typed module-name
BugWEB-19697Module is not statement
BugWEB-28027package.json update notification is not removed after executing "run 'npm install'" or "run 'npm update'" action
BugWEB-27618Package.json notification should be shown only for root package.json file
BugWEB-23009File .idea/jsLibraryMappings.xml is created automatically when opening a new project with node_modules
BugWEB-20060Scratches don't recognise project installed NPM modules - Defective behaviour
BugWEB-20061Remote interpreter: handle external changes in path mappings
BugWEB-22327Can't open project. Cyclic dependency: [JSLibraryMappings, JSLibraryMappings]
BugWEB-21685.iml files contain ancient references
BugWEB-22653Node.js: node_modules recognition: excluded folder of the removed library should not be added back as library
BugWEB-22652Node.js: node_modules recognition: correctly preserve enabled/disabled library state
BugWEB-22654Node.js: node_modules recognition: library becomes disabled after project opening in different versions
BugWEB-20304Hide Remote interpreters from the Node.js and NPM Settings/Preferences
BugWEB-26490Tslint 5.1.0 errors are not clickable in NPM console
BugWEB-22499Npm: Missing module dependency inspection: search in all package.json files in the project
BugWEB-22114Node.js Remote Interpreter plugin breaks possibility to manage Node versions in Run Configuration
BugWEB-26965Excluding directory should disable indexing descendant node_modules/ folders
BugWEB-22619Node.js: node_modules recognition: remove "Node.js dependencies for" library
BugWEB-19727rsa key as env variable not working
BugWEB-26576runConfiguration npm type - first argument override
BugWEB-19812Better warning when a deployment configuration corresponding to a remote interpreter is removed
BugWEB-20161"Require() call is missing" inspection: correctly insert require inside inline JavaScript in HTML
BugWEB-28159Node api: methods are not resolved
BugWEB-19806Connect to remote host dialog pops up when remote interpreter configuration is canceled
BugWEB-27523Notification about successful downloading is too big
BugWEB-27384Node interpreter: can't change value in drop-downs via arrow keys
BugWEB-20808should not follow symlinked packages that are not in the project library root node_modules folder
BugWEB-19641Node remote interpreter should be shown only for valid Run Configurations
BugWEB-25219Improve behavior of Express generator when offline
BugWEB-28621"npm install" rather than "npm update" after updating package.json
BugWEB-27397Incorrect mark of excluded directories
BugWEB-20033don't warn about "missing import statement" / "require() call is missing" for mocha describe/it methods
BugWEB-27410Annoying "package.json" notification when opening IDEA project
BugWEB-21725node-globals-stub is wrong for process.hrtime
BugWEB-29651java.lang.UnsupportedOperationException when trying to choose node in setings
BugWEB-25372Do not suggest packages in devDependencies that are already listed in dependencies
BugWEB-27453Node package field is badly rendered on Windows
BugWEB-26508NodeJS support cannot be enabled for Node 8
BugWEB-20278Node.js: update indexes on package.json update
BugWEB-24963Bower.json completion hangs IDE due to not installed bower package on Unix/Mac
BugWEB-25154[node][es6] Using quickfix to import exported function fails when import is present
BugWEB-27769Node.js coding assistance cannot be enabled
BugWEB-26220Update highlighting after invoked "Add module to package.json dependencies"
BugWEB-22102Can't remove Docker node interpreters
BugWEB-26569process.nextTick() in node.js
BugWEB-20194Remote interpreter: disable "remove" action for inherited path mappings
BugWEB-29559Update data in the interpreter list when 'Set as project default' is called
BugWEB-28122Node.js version seems to be cached and does not update when using Nodist
BugWEB-27393Package.json notifications: false positive notification for packages with dist-tag
BugWEB-27392Package.json notification: no notification for new packages
BugWEB-22620Node.js: node_modules recognition: each node_modules folder is treated as separate library
BugWEB-29558Suggest to update node interpreter when opening a project
BugWEB-29257Add hyperlink detecting filter to Run console
BugWEB-21673Adding Electron inside a packaged app as a Node.js interpreter starts the app
BugWEB-21931Change text in remote interpreter configuration
BugWEB-20306Node Interpreters: auto fill in path to the npm package on the Windows
BugWEB-21652Different variable highlighting for Node.js core modules
BugWEB-21914angular-cli: Cannot find angular-cli package
BugWEB-23100Show library folder icon for node_modules marked as "library root"
BugWEB-27999node interpreter changing is broken after adding "package.json scripts to top right panel (Run/Debug configuration)"
BugWEB-27545Do not show suggestion to run npm install on creating Angular CLI project
BugWEB-22900Log is spammed by WARN - ry.NodeModulesDirectoryManager messages
BugWEB-19920Node remote interpreter: reconnect to Vagrant in the background on RC opening
BugWEB-19922Node remote interpreter: Multi-Machine Vagrant: wrong error for empty Machine name
BugWEB-22923Node Remote Interpreter: Docker: correctly hide "v8-profiler package" field chooser
BugWEB-23381Fix the English in the $NODE_DEBUG_OPTION message
UsabilityWEB-22658Node.js: node_modules recognition: show folder as Excluded in Directories
UsabilityWEB-18399node.js: record package into package.json quick fix: ask where to create package.json
UsabilityWEB-29147Bower: use bower package rather than bower executable in settings
UsabilityWEB-27579Project node interpreter should be set to the one selected in project generator
UsabilityWEB-22429Node.js: correctly mark node_modules as a library root in the Project View
UsabilityWEB-19902Node.js RC: select currently active Node Interpreter on opening "Configure Node.js interpreters" table
UsabilityWEB-19901Node remote interpreter: Configure Remote Mappings dialog should have OK and Cancel button
UsabilityWEB-19904Node remote interpreter: Vagrant: show absolute path instead of relative to the project root
CosmeticsWEB-22719Node remote interpreter: Docker: correct error message when server is not selected
ExceptionWEB-25507IllegalStateException is thrown on opening JSCS settings
ExceptionWEB-22627Node.js: node_modules recognition: StackOverflowError on old project opening
ExceptionWEB-20303Remote interpreter: IAE is thrown on Canceling the Added Remote configuration
Pug (ex-Jade)BugWEB-21823Jade: Angular2: injected fragments should become AngularJS fragments automatically
TaskWEB-21353Rename Jade plugin to Pug and support Pug language
REST ClientFeatureWEB-29226Support completion for environment variables
FeatureWEB-28563Rest Client: support multipart/form-data
BugWEB-24584Test REST Client can't delete pramertes or headers anymore
BugWEB-28720Encode request parameters before sending
BugWEB-28593Diff panel show the wrong files
BugWEB-28564Rest Client: update file references on 'move' refactoring
BugWEB-29272Check query after variable substitution (allow https:// to be a part of variable)
UsabilityWEB-28596Make "Show Http Requests History" action discoverable
UsabilityWEB-29275Add request separator after execution
TaskWEB-28638Support environment variables
SASSFeatureWEB-19089Add foldings for maps
FeatureWEB-27547Support for CSS modules with SASS
FeatureWEB-13028SASS/SCSS + Compass regular CSS import syntax
BugWEB-12958SASS 3.3: provide completion/navigation for selector created using &_suffix
BugWEB-20068Inline scss: problem with @charset
BugWEB-20069 Inline scss: missing highlighting for some keywords
BugWEB-19743"cannot resolve sass into sass/scss file" warning is not relevant with sass globbing pattern resolver importer in project
BugWEB-25321Importing scss files using tilde (~) as in webpack to specify a path relative to root won't work
BugWEB-19458SCSS: use "java-resource" root when resolving SCSS import paths
BugWEB-28306SASS: support absolute paths in `@import` statements
BugWEB-20100Inline sass: problem with @import
BugWEB-9251Compass support: correctly update imports on Refactor-Move
BugWEB-27321Generated source files should not be edited
BugWEB-25094Error-marker in SCSS file
BugWEB-19351SASS: 'unexpected whitespace' error shown if there is a space after variable name in interpolation
BugWEB-26792Placeholder selectors are not resolved if defined with parent reference (&, ampersand)
BugWEB-20070Inline SCSS: quick-fix 'Expand css shorthand property' enter extra spaces
BugWEB-22357lint says calc does not handle negative first value, but it does
BugWEB-22644"Go to Declaration" doesn't work for variables in .scss files in Bootstrap Ruby gem
BugWEB-19176Sass @import of css file without extension doesn't resolve
BugWEB-20198Color scheme settings are ignored for Scss line comments (double slash)
BugWEB-21764Incorrect "Generated source files should not be edited..." warning
BugWEB-20131SASS / SCSS code completion not working for property values
BugWEB-21425SASS: don't add quotes around URL in @import on refactoring
BugWEB-5879SASS: Resolving nested selectors in html
UsabilityWEB-28576Disabling "Color preview" gutter icon shouldn't affect background preview
StylusFeatureWEB-19456Support partial reference in Stylus
BugWEB-20228Stylus 0.53: support Relative selector reference
BugWEB-18110Stylus reformat breaks concatenated root-reference selectors
BugWEB-28433Stylus. Redcode when no line after using function and single-line comment
BugWEB-20641Stylus: parser errors on using kwargs in mixins/functions
BugWEB-20622Stylus invalid error with selector interpolation
BugWEB-13553Stylus: Red code: recognize media at-rule complex queries
BugWEB-13557Stylus: Red code: anonymous functions
BugWEB-24008Stylus: block-level @import and @require indentation is broken after reformatting
BugWEB-28447Stylus: wrong indent format with function.
BugWEB-28263Stylus: recognize partial selector reference that immediately follows the &-selector
BugWEB-24382Stylus: comments are unindented on formatting, breaking the code
BugWEB-27551Stylus: Good code is red: Wrong warning "Unexpected elementCSS_COMMA"
BugWEB-28280Stylus: "Unexpected elementCSS_COLON" error when using variables
BugWEB-21360Wrong indentation in Stylus files
BugWEB-13549Stylus: Red code: support @supports at-rule
BugWEB-13543Stylus: Red code: Dot is not recognized as unexpected term
TypeScriptFeatureWEB-19047TypeScript move statement action moves line, not statement
FeatureWEB-26727ES6 / TypeScript: move symbol refactoring improvements
FeatureWEB-19986TypeScript: provide new intention "Remove modifier" for invalid code
FeatureWEB-12611Enforce types in TypeScript
FeatureWEB-22280TypeScript 2.0: support 'include' option in tsconfig.json
FeatureWEB-13214Request: improve TypeScript code style flexibility
FeatureWEB-26431Support auto-imports for modules provided by module augmentation
FeatureWEB-21474Issue with interface (TypeScript)
FeatureWEB-26678provide support for tslint-language-service TypeScript Language Server Plugin
FeatureWEB-24838TypeScript: Add code style for spaces in Intersection and Union Types
FeatureWEB-22030TypeScript 2.0: parse never type
FeatureWEB-22032TypeScript 2.0: parse optional class members
FeatureWEB-22035TypeScript 2.0: parse 'this' function type
FeatureWEB-17292Javascript/Typescript move symbol refactoring
FeatureWEB-27795New intention/ refactoring: create type alias for complex type
FeatureWEB-17603Highlight unused TypeScript imports
FeatureWEB-29012TypeScript: provide quick fix for installing "@types/" definitions
FeatureWEB-22053TypeScript 2.0: parse global module export
FeatureWEB-22938TypeScript editor should include typings from tsconfig.json lib property
FeatureWEB-18307TypeScript template string formatting when html
FeatureWEB-11078TypeScript: allow navigation to javascript when using .d.ts
FeatureWEB-19686TypeScript: Improve a way to show type inference information (auto declaration) for variables and expressions
FeatureWEB-23285Autoformat arrow functions like in js
FeatureWEB-20095Update typescript compiler to 1.8.0beta
FeatureWEB-20897Add support for "allowSyntheticDefaultImports" for Typescript
FeatureWEB-23990TypeScript: provide a 'Create class' quickfix for 'unresolved type' error
FeatureWEB-21443TypeScriptCheckImport should resolve JS files in imports when allowJs: true in tsconfig.json
FeatureWEB-24840TypeScript: Improve string literal completion (enums)
FeatureWEB-23306TypeScript: import can be shortened inspection + quick fix
FeatureWEB-27704"Extract interface" refactoring for TypeScript (just like "extract variable")
FeatureWEB-19850TypeScript 1.8: Support comments in tsconfig.json
FeatureWEB-24868Auto-Import not resolving TypeScript source (not declarations) in node_modules
FeatureWEB-26663Should trigger typescript service on js files when checkjs=true
FeatureWEB-21421Add support new feature: generic defaults
FeatureWEB-8658That TypeScript .d.ts files were folded like .js and .js.map below .ts files in the Project view
FeatureWEB-19616Add new intentions for abstract classes
FeatureWEB-24153TypeScript: Semantic support for "Object spread"
FeatureWEB-22001Auto-imports are wrong when importing from a library that has pathMapping setup
FeatureWEB-20969Add support non nullable types
FeatureWEB-29390Show parameter name hints in constructor calls
FeatureWEB-24057feature request: autocomplete typescript function callbacks
FeatureWEB-29047Add an option to import all symbols after paste
BugWEB-21528Good Code Red - angular-cli importing index.ts pattern
BugWEB-19222no content awar move down/up in TypeScript
BugWEB-24711Fix 'Split into multiple declarations' for enum
BugWEB-27672Find Usages: option "show import statements" doesn't work
BugWEB-27890No auto import inside object literals
BugWEB-27891Typescript type inference problem with switch statements.
BugWEB-28673Proper support for f-bounded generics and indexing by literals
BugWEB-23640generated files still shown after hiding 'excluded files'
BugWEB-28455No autocomplete/suggestion for `undefined` keyword in TS.
BugWEB-24730Extracting field/parameter from `await` expression creates invalid code
BugWEB-29649Issue with indexer type: indexing by 'string | number' should be equivalent to indexing by 'string'
BugWEB-29642Copy-paste with imports doesn't insert imports with RxJS/Observable
BugWEB-20229TypeScript `this` parameter type is not resolved as actual type
BugWEB-27208Adding async after await. TS error is still there.
BugWEB-14301Don't work auto resolve types in classes
BugWEB-26988JavaScript & TypeScript: Inline Method broken with object literals using property shorthand
BugWEB-28257Change signature. Wrong type definition when working with ...rest paramter
BugWEB-22322TypeScript: Convert to shorthand arrow function creates invalid shorthand functions
BugWEB-27677JSX/TSX editing auto-complete and existing imports broken (flashing)
BugWEB-27938.d.ts files are treated as non-project-files
BugWEB-29339TypeScript+React: Non-optional methods in Props interface not auto-stubbed when typing component name as JSX.
BugWEB-22513Incorrect warning that labeled continue is unnecessary at the end of a loop
BugWEB-29683TypeScript quickfix "Variable initializer is redundant" results in invalid code.
BugWEB-6819TypeScript Rename Refactoring too Aggressive
BugWEB-25160Some types are ignored when using arguments destructuring in Typescript
BugWEB-19185TypeScript: Refactor/Rename for class property should also rename properties of class instances
BugWEB-20886TypeScript: todo's in /** multiline */ comments
BugWEB-23217"Cannot resolve symbol" for 3rd party imports using ES6
BugWEB-27957Function change signature removed access modifiers (in typescript)
BugWEB-29358TypeScript+React: Intellisense not working for component State properties within calls to React.Component.setSate()
BugWEB-22826Typescript: type not correctly inferred for overloaded function using generics and type constraints
BugWEB-22799model not reconciled after doing an import
BugWEB-24895typescript format enum incorrect if adding auto semi colon
BugWEB-28297Check generic default of typescript as error
BugWEB-22676Typescript: Module importing flags import as unused if only type is imported
BugWEB-27200TypeScript: unexpected auto import for the export default import
BugWEB-27209TypeScript. Wrong code inserted when autocompleting object's property
BugWEB-17398TypeScript: Overridden marker is not displayed for fields
BugWEB-27696WebStorm doesn't infer generic types from indexers
BugWEB-27690Add support for "export default abstract class" TypeScript syntax
BugWEB-26610Typescript: Cannot Call Overloaded Super Constructor
BugWEB-26616Typings aren't recognized correctly when using "ng" namespace with TypeScript service disabled
BugWEB-29140Auto-Imports from non-d.ts node_modules files are broken in 2017.3
BugWEB-22610TypeScript: false errors/wrong navigation for functions that return union type
BugWEB-19723Marking correct decorator as error, and break it on code reformatting
BugWEB-13153TypeScript - Find usages of constructor doesn't work
BugWEB-23580TypeScript: IntelliSense fails to suggest definitions from global declaration
BugWEB-27737Typescript auto import should use closest path from tsconfig
BugWEB-26630Comments in tsx do not work
BugWEB-21623React/Typescript: Functional components are not being recognized
BugWEB-19129Destructuring does not work
BugWEB-19127IntelliSense doesn't work in TypeScript JSX templates
BugWEB-22630TypeScript: Newline config ignored when using TypeScript service
BugWEB-28490Typescript 2.4 mapped types issue
BugWEB-27249Typescript service doesn't start with TypeScript 2.4.0-dev
BugWEB-26574Typescript. Type information is lost when destructuring types with string index signatures
BugWEB-26434TypeScript: Nested array in generic argument causes '] expected' error
BugWEB-23604Auto import modules in typescript
BugWEB-23352Wrong 'Unresolved function or method deserialize()'
BugWEB-22433Function in module wrongly marked unused
BugWEB-21860Good Code Red: @ngrx/db import
BugWEB-17944TypeScript: Incorrect type inference for chain calls
BugWEB-23166Syntax Highlighting broken for functions defining the type of this
BugWEB-21299Typescript Formatter for property with "type", "namespace" (and more) name (with included JSDoc)
BugWEB-21085should not warning "Method can be static" when abstract implementation - TypeScript
BugWEB-19783TypeScript optimize imports: remove duplicates
BugWEB-22416Additional TypeScript annotator in plugin breaks semantic highlighting of TS class names
BugWEB-28908Not all class in completion list
BugWEB-27829Wrong properties completion when using enum fields as type
BugWEB-19868Invalid import organisation in TypeScript
BugWEB-22199TypeScript: correctly recognize "public static readonly" statement
BugWEB-24693Change signature - re-order removes optionality from unaffected parameters
BugWEB-18905Typescript auto generated documentation return type is wrong
BugWEB-27494Wrong type inference for const variables
BugWEB-20315Ugly tsx autoformat code
BugWEB-29592'else' branch of ternary type guard is not applied when dealing with aliases
BugWEB-29590Type guard is not evaluated though it should be
BugWEB-29595Error when extracting an interface
BugWEB-22226typescript: useless completion after new
BugWEB-22008Incorrect error notification
BugWEB-15045Moving .ts files should leave updated relative references in require() begin with ./ or ../
BugWEB-11466Typescript: "super" keyword syntax checks are incomplete
BugWEB-20291Refactor: Extract Field: Type should be calculated and applied in method/constructor scopes
BugWEB-26585TypeScript: "Missing augmentation import": do not suggest module itself
BugWEB-26584TypeScript: "Missing augmentation import": provide suppression for the exported type
BugWEB-29037Angular and auto method creation from the template
BugWEB-22723TypeScript: Type checking for functions checks initializer type instead of type declaration
BugWEB-28549TypeScript. Property names in indexers should be on top of the list with better priority
BugWEB-28547TypeScript. Parameter hint doesn't work in case of a re-assigned method with multiple overloads
BugWEB-29587Type guards are applied incorrectly in presence of type aliases
BugWEB-21207TypeScript Import Optimization messes up inspection statements like "//noinspection"
BugWEB-17860TypeScript: wrong Quick Documentation popup in case of intersection types
BugWEB-27436TypeScript: parameter type not recognized with export { default as ... } from ...
BugWEB-25070TypeScript: overloading is not recognized for imported functions
BugWEB-26284Use relative path not directory import when auto-importing module under same directory
BugWEB-26285Typescript. Code completion for string based enums
BugWEB-27664Typescript inferred type omits null & undefined types
BugWEB-29282typescript 2.6 support
BugWEB-24728Applying postfix template to `await` expression breaks the code
BugWEB-28853AssertionError while analyzing TypeScript file
BugWEB-29675[TypeScript] cannot resolve symbol from some import
BugWEB-22371Should suggest "Add Class Qualifier" for static methods in TypeScript
BugWEB-22374Incorrect TypeScript "Argument types do not match parameters"
BugWEB-27292"Add braces" to arrow function removes TypeScript return type.
BugWEB-23244Decorators make class the jsdoc comment inaccessible
BugWEB-24745AssertionError is thrown on caret position at the exponential operator
BugWEB-24740IDEA fails to properly link classes imported using modules in Angular 2 project
BugWEB-19279Scratch files: errors are shown in a correct code
BugWEB-23742Types from module imported from index.ts not resolved if imported file name matches directory name
BugWEB-20079TypeScript field creation intent generates field with wrong name
BugWEB-20073Completion on React component name doesn't respect named import in TSX file
BugWEB-28464add support for TypeScript 2.4+ dynamic import expression
BugWEB-24767Typescript now reporting != as poss type coercion when comparing two numbers
BugWEB-27028Typescript: StackOverflowError on recursive generic types
BugWEB-28248Change signature. Reduntant comma generated after adding new parameter
BugWEB-28244Change signature - multiple Strings in suggestion
BugWEB-28245Change signature. Can't remove optionality from one of parameters
BugWEB-13660Incorrect type inference for enum declaration
BugWEB-23079Typescript won't suggest or import namespaces using ES6 style imports
BugWEB-23698Typescript for ... of variable type not inferred by the IDE
BugWEB-23446Typescript autocomplete with nested templates broken without 'use typescript service' and painfully slow with it.
BugWEB-24945incorrect warning msg
BugWEB-20750overriding abstract method in abstract class marked as abstract
BugWEB-29348TypeScript+React: Documentation of React Props/State properties cannot be found.
BugWEB-21596IntelliSense doesn't recognize generic type of class extended from Array in TypeScript
BugWEB-22817JSDoc: param's types are missing in auto-generated JSDoc
BugWEB-20192Wrong parsing of keywords in semicolon-free classes
BugWEB-20992Rxjs 5.0.0-beta.3. Some operations of Observable are not recognized in WebStorm 2016.1 EAP (build 145.596)
BugWEB-26641TypeScript service doesn't work with typescript@2.3.0-dev.20170420
BugWEB-28142Type is always `any` when destructuring props in TypeScript React components
BugWEB-27513Typescript. Auto-importing with TS's path mapping leads to circular dependency
BugWEB-20388TypeScript: Refactor - Extract Field: prohibit action for the callback parameter type
BugWEB-27236TypeScript: improve member access completion
BugWEB-28120Auto-import from TypeScript definition file with default export incorrectly destructures the import
BugWEB-29447Typescript: completion incorrectly suggests modules with name in quotes
BugWEB-23369Formatting chained methods in Typescript
BugWEB-28104Unnecessary brackets for typescript getters after autocomplete
BugWEB-9583TypeScript: Code Style: wrappings for Extends/Implements don't work
BugWEB-21460Failure to evaluate complex type guard
BugWEB-18890TypeScript overloads list must not contain method implementation declaration
BugWEB-23613Typescript, JSX, Generics - invalid report issue
BugWEB-23344Typescript Compiler "Cannot start language service process"
BugWEB-23614TypeScript: implementing method can not be static
BugWEB-28733IDEA completely freezing during editing of TypeScript files
BugWEB-21612Chrome not loading ts files after security update
BugWEB-19442WebStorm reports "function name expected" for generator symbol properties
BugWEB-26895Since latest update double click on TypeScript file in Project tree expands the node to show the .js and .map files
BugWEB-2344TypeScript: provide completion for 'public' and 'private' keywords inside constructor parameters signature
BugWEB-29178Parameter name hints doesn't show up for negative numbers when using method.
BugWEB-29408AutoFormat with member reordering issue
BugWEB-29405Wrong typescript error when comparing imported enums
BugWEB-21670Angular2: no completion for @angular module inside import statement
BugWEB-19794extract method doesnt work with tsx code
BugWEB-27008TypeScript file are not pretty formatted
BugWEB-26874'Constructor' keyword is shown twice in completion
BugWEB-23130Cannot find tsconfig.json in angular-cli generated project
BugWEB-28674Subtyping type guards don't work at all
BugWEB-28678Union types in overriden method are broken
BugWEB-22213Typescript Auto Import does not work when TS compiler is enabled
BugWEB-28806ES Module JS file extension when working with TypeScript
BugWEB-22022Optional properties with "readonly" name breaks code validity
BugWEB-28533Auto-import doesn't correctly work for modules with `.js` name postfix
BugWEB-28657Extract type refactoring reformats the whole file
BugWEB-29214'Extract superclass' should insert base constructor call
BugWEB-29210Pull members up, extract super/interface does not work with TS parameter properties
BugWEB-29213TypesScript. Navigate to Type Declaration is broken when parameters destructuring is used with default value
BugWEB-22532Paramater Info (Ctrl+P) fails to suggest parameters when using TypeScript import alias
BugWEB-25844Typescript code navigation does not work in multi-module intellij project
BugWEB-20323Typescript: 'export default class' expects a name
BugWEB-24152Typescript incorrect variable resolving engine
BugWEB-27786React/typescript: setState({}) autocomplete not supported for latest @types/react (v15.0.37)
BugWEB-28513Invalid implementing TypeScript interfaces
BugWEB-26789Typescript - rxJS issue with type inference for argument of onNext function in observable subscription
BugWEB-23538TypeScript compiler fails to compute relative output paths
BugWEB-29584Should check base type properties when checking for implemented interface properties
BugWEB-29586Cannot resolve React props from generic TProps
BugWEB-21755Re-exported type is not resolved
BugWEB-21757enums not shown in 'navigate to class' popup
BugWEB-21562Wrong type checking for TypeScript subtypes after .find or. filter
BugWEB-16214TypeScript: Structure View needs improvements
BugWEB-28374Typescript 2.5.1 no longer automatically compiling on changes
BugWEB-29393False positive incompatible types
BugWEB-28570TypesScript. Can't Implement/Override protected/public properties
BugWEB-23082Not using instanceof type guard in Typescript
BugWEB-29568Optionality from the key-providing type is not respected in mapped types
BugWEB-25908TypeScript: support "key/in" / generic types
BugWEB-27421Incorrect/incomplete type inference in Typescript
BugWEB-15017Moving TypeScript .d.ts files breaks import statements in referencing files and vice versa
BugWEB-18733TSX: single quote or double quote causes ") expected" error
BugWEB-28558Reassigned functions with multiple overloads are handled improperly in code completion and parameter hints
BugWEB-28801Reformat code removes escape inside string
BugWEB-22924Typescript Function Type Guard not recognized properly
BugWEB-28001TypeScript intellisense for the keyword "readonly"in constructor
PerformanceWEB-25450Losing or very slow TypeScript type information after some time
PerformanceWEB-28310IntelliJ hung indexing typescript config file (tsconfig.json)
PerformanceWEB-27488Freezes from JSParameterInfoHandler/TypeScriptParameterInfoHandler
UsabilityWEB-27910Suddenly 2 new menu items appearing in the context menu
UsabilityWEB-27772TypeScript errors are hard to read because they remove line breaks and white space
UsabilityWEB-18968Show red underline for file in Project view / editor tab if there are compiler errors
UsabilityWEB-22428TS: Prefer importing from index.ts & omit 'index' from source path
TaskWEB-28253Change signature. Change help link
TaskWEB-23465TypeScript: bundle TypeScript 2.0
ExceptionWEB-24739Typescript: exception is thrown on the first new TS file creating in the project
ExceptionWEB-23499TypeScript: exception is thrown on Auto-import invocation
ExceptionWEB-27296Error with TypeScriptLibraryIndexableSetContributor#getAdditionalRootsToIndex()
Unit TestsFeatureWEB-22793Support test names in "Navigate | Symbol..." popup
FeatureWEB-27863Create react app extension support
FeatureWEB-11104Mocha test runner: support --watch option
FeatureWEB-26153Unable to specify Node interpreter options for Jest run configurations
FeatureWEB-21636electron-mocha runner
BugWEB-23304Karma stacktrace not clickable after updating to karma 1.2.0
BugWEB-27246Jest plugin doesn't know how to parse javascript Jest configuration
BugWEB-23664Protractor: Tests tree: provide "Jump to Source" action
BugWEB-27144Can't debug Jest test with node 8.0.0
BugWEB-19754Stack trace does not link to local test code
BugWEB-26643add support to setuptests.js when running tests in webstorme #2016
BugWEB-15052Unit Tests: "View assertEquals difference" action is not suitable
BugWEB-23966Failed unit test results diff shortcut key (cmd+d) does not work
UsabilityWEB-27314Running Jest individual tests within describe doesn't focus the tests in the output pane
ExceptionWEB-28172AssertionError when run protractor tests
No subsystemBugIJSDK-251What is the recommendation for replacing AbstractExternalSystemTaskManager?
BugIJSDK-284Renaming changelists via ChangeListManagerGate.editName() causes NPE in 2017.2 EAP
No subsystemFeatureOC-13026Support Docker Integration plugin in AppCode
BugOC-13141QuickLook plugin breaks AppCode debugger in AppCode 3.4 EAP
BuildBugOC-14017"Before launch configurations" never not get executed, and prevent build if placed before build stage
Code: CompletionFeatureOC-13658Argument placeholders for Swift initialisers
Code: IndexingBugOC-13991AppCode won't update project symbols on start
Code: ResolvingBugOC-15345Resolve error in closure signature return type
BugOC-13667Infer type for @autoclosure parameters
IDE PreferencesBugOC-15550Tab closing Policy is not persisted
Project ViewBugOC-13411Name of selected target in "Manage targets" disappears
RunningUsabilityOC-15890Select platform automatically after adding new run configuration
User InterfaceUsabilityOC-13933Welcome Wizard is too big for 13" display, buttons hidden behind application dock
No subsystemFeatureIDEA-60161Automatically "inherit" quick javadoc for getters/setters from field
FeatureIDEA-158366Allow to run tests from find usages view
FeatureIDEA-147176Create "lowercaseAndDash" function for live templates
FeatureIDEA-143452Show Running List action shows run processes from the current project only
FeatureIDEA-164176Delete old thread dumps in the IDE log folder
FeatureIDEA-168089New outline for text field components with invalid values
FeatureIDEA-154920Support for max_line_length
FeatureIDEA-135255new Predefined Function "dashesToCamelCase()" to Use in Live Template Variables
FeatureIDEA-116686Limit code analysis to user-configurable number of CPU cores to prevent 100% of all cores utilization
BugIDEA-182140Last Idea eap spontaneously crash
BugIDEA-177314Call parsing procedure from EDT
BugIDEA-146669Enable Mac native file dialogs
BugIDEA-179213NullPointerException in com.intellij.openapi.externalSystem.settings.AbstractExternalSystemSettings.setLinkedProjectsSetting s in offline inspections mode
BugIDEA-155804LIVE TEMPLATE PROBLEM VARIABLES NEXT TO EACH OTHER
BugIDEA-156165WinPty process subprocesses are not killed
BugIDEA-180414Extra log verbosity upon exception in PersistentBTreeEnumerator.enumerate
BugIDEA-76804[yaml] sequence parsing improvement
BugIDEA-159840Impossible to select a boot jdk from disk with native file dialogs on mac
BugIDEA-159270Can't delete *.class file
BugIDEA-1724032017.2 EAP does not save changes to default font
BugIDEA-167541Font baseline is shifted down for default font settings
BugIDEA-151033Usability issue with multiple block carets
BugIDEA-165949[hidpi-jdk] IDEA main frame doesn't restore its bounds on the second monitor when reopened
BugIDEA-168010Editor notification should be updated on the file extension change
BugIDEA-172247Plugins: NPE at PluginManagerConfigurable.apply() on restart after installing a plugin
BugIDEA-177146Orphaned threads running ChooseByNameBase$CalcElementsThread
BugIDEA-151256Unable to switch boot JDK in minor IDEs
BugIDEA-171010Idea doesn't close properly some project windows
BugIDEA-171900Find in path popup isn't descriptive enough (poor feedback on search progress/status)
BugIDEA-176666"Call Hierarchy" tab in find usage steals focus
BugIDEA-157874ERROR - #com.intellij.ide.plugins.PluginManager - Argument for @NotNull parameter 'action' of com/intellij/openapi/actionSystem/AnActionEvent.createFromAnAction must not be null
BugIDEA-173405Show jdk build number in switcher
BugIDEA-166321Setting 'reopen last project on startup' doesn't work
BugIDEA-156846Color: "Default text" resets to white by itself, leads to brackets on white background
BugIDEA-146153Text label disappears when click on it
BugIDEA-77217[yaml] key value parsing improvement
BugIDEA-173613IDEA blocked while showing progress window after 'Generate JavaDoc...'
BugIDEA-156186Project names containing dot (.) causes display problem
BugIDEA-178179In "Edit File Type" the ":" symbol is ignored
BugIDEA-161165Per Project Modality: when Commit or Push dialog is shown in one IDEA window, Code Analyzing hangs with 99% completed in the other window
BugIDEA-161948CheckRegExp action: the results are not updated on sample or expression editing
BugIDEA-163567FileChooserFactoryImpl.createSaveFileDialog doesn't use native file chooser
BugIDEA-167694Live Templates: order of default values are reversed
BugIDEA-179514Non-pinned Spring and JavaEnterpise toolwindows are closed unexpectedly on clicking
BugIDEA-142156Project leak on SheetController$2
BugIDEA-167050After cut+paste some methods from class to new-created one the pasted code is shown as duplicate
BugIDEA-151656ProgressableTextEditorHighlightingPass breaks (at least) Inifinitest plugin
BugIDEA-143263Find In Path is not autopopulating a selection from Find Preview window
BugIDEA-140901Tip of the Day is not working nicely with HiDPI under Linux
BugIDEA-176419"Annotations to Copy" configuration is not get saved
BugIDEA-151107Resource bundle editor - disable auto escape - colon and exclamation mark
BugIDEA-159109Resource Bundles: PropagateValue... action should treat read-only files correctly
BugIDEA-158500macOS Sierra: Scrolling extremely sensitive
BugIDEA-179331Run Dashboard: it should not be possible to start the same configuration few times
BugIDEA-179333Can't install featured plugin
BugIDEA-178693Already disposed: com.intellij.util.messages.impl.MessageBusImpl in PlatformTestCase.teardown
BugIDEA-160461Sort fonts case-insensitively
BugIDEA-174005Suppress area is not highlighted
BugIDEA-156259idea.log spammed by "PerformanceWatcher - High memory usage"
BugIDEA-167089MacOSX: support tcsh shell for loading environment variables
BugIDEA-182065Redundant "The project used an invalid path to Node.js" warning for my java project
BugIDEA-165879Unguarded section in DocumentCommitThread that leads to spontaneous assertion
BugIDEA-162067Cannot create plain-text scratch file
BugIDEA-168781Mnemonics for run actions is broken in case of '_' and '&' in configuration name
BugIDEA-167799HiPDI menu arrows are too small for Darcula/IntelliJ themes on Windows and Linux
BugIDEA-146676Keyboard focus is lost after Ctrl-F in the detached editor
BugIDEA-95941Commit message Ctrl+Space completion of class name - stops working for the second line of the message
BugIDEA-174202smart pointer to method becomes invalid after shelve
BugIDEA-155763Memory leak detected: 'com.intellij.ui.BalloonImpl
BugIDEA-159850NPE on welcome screen (Import Project)
BugIDEA-180961Navigate | File - Camel Case no longer works
BugIDEA-172602Horrible performance when two IntelliJ instances are open at the same time
BugIDEA-131012Support "delete word left" command in quick search
BugIDEA-167880Dump data to file adds / to filename
BugIDEA-181581SSH logs are incomplete
BugIDEA-157371Error updating com.intellij.openapi.editor.ex.util.LexerEditorHighlighter
BugIDEA-173347 PSI invalidated outside transaction
BugIDEA-171543RtfTransferableData: java.io.IOException: mark/reset not supported
BugIDEA-153873Pressing Shift+Enter in Navigate File popup opens the file in a new window instead of the current window
BugIDEA-175058IDEA Out Of Memory on click Settings -> Editor -> Color Scheme -> Color Scheme Font -> Use color scheme font instead of *default*
BugIDEA-160282Lock not released in PagedFileStorage after VCS log exceptions
BugIDEA-159742IllegalArgumentException: parent must be showing
BugIDEA-170221Download Sources not working after 2017.1 update
BugIDEA-177352com.intellij.util.containers.ConcurrentHashMap needs to be updated
BugIDEA-167719Test Runner: missing info about skipped tests in results popup
BugIDEA-173669IOException from get / put / append should set corrupted state for PersistentHashMap
BugIDEA-176762Installing new versions of apps loses "font ligature" setting
BugIDEA-171238Keymap of Export Test Results does not function
BugIDEA-175445UI Inspector uses user object instead of node for trees
BugIDEA-153031Resource Bundles: close the RB editor on bundle deleting
BugIDEA-161604Deadlock on startup in Promises
BugIDEA-90488Php editing/Single quote duplication bug
BugIDEA-181314Exception appears when copy default run/configurations
BugIDEA-172231Incorrect rendering of text with combining marks
BugIDEA-156872MySQL dialect highlighting incorrect for 'TIMESTAMP ON UPDATE'
BugIDEA-67763tabs in split window view
BugIDEA-85304Icon for Use Soft Wraps doesn't show in the toolbar
BugIDEA-160763IDEA hangs on startup, during splash screen
BugIDEA-156993Project Name replaced with Directory Basename in Welcome Screen (EAP, Regression)
BugIDEA-180312Deadlock ? JarHandler
BugIDEA-156193Toggle using soft wraps in current editor not working
BugIDEA-155360Open In Browser : files from library jars cannot be opened
BugIDEA-155362Open In Browser : action should work for files versons from History or be disabled
BugIDEA-46170Double quote appears in wrong string literal when a language is injected
BugIDEA-172559Quick-search does not work in "Register new file type association" dialog
BugIDEA-172558Progress popup is small by default
BugIDEA-178388warn about running IDEA with not-bundled JDK
BugIDEA-161155Per Project Modality: when Commit or Push dialog is opened in one IDEA frame, it's impossible to hide or show tool windows in the other frame
BugIDEA-132965Hitting enter in the Expression field in the Edit Template Variables dialog does not save the value
BugIDEA-173017JavaFX WebView not HiDPI rendering on Windows 10
BugIDEA-138798Double click maximize tab should not close floating windows
BugIDEA-171717java.lang.IllegalArgumentException: Argument for @NotNull parameter 'fontFamily' of ... must not be null
BugIDEA-178622Column selection mode is too slow
BugIDEA-151469ImplementingFunctional2x.png is not used because it is named with capital letter
BugIDEA-128057Editor search closes dialog on Enter, if there are nothing find
BugIDEA-172705Big files marked as read-only can't be deleted
BugIDEA-182318VFS Exceptions after switch branches.
BugIDEA-166669FileTypeRegistry.FileTypeDetector should not be skipped for large files
BugIDEA-147100Default File Header template causes pointless javadocs in projects
BugIDEA-175646Performance issue while typing
BugIDEA-156970No classpath jar in command line on dynamic.classpath=true when too many files in tmp on Windows
BugIDEA-178347UI is frozen for a long time in ModuleManagerImpl.loadModules
BugIDEA-156284Force Touch: Keymap, Add/Find Mouse Shortcut panel: after Button 1 is clicked and set in shortcut preview, Force Touch is ignored
BugIDEA-180884Run Dashboard: on clicking in the run configurations tree the corresponding pane doesn't get focus
BugIDEA-165843PyCondaPackageService — defaults must be not saved, check roaming
BugIDEA-156065WinPty process does not kill agent on end
BugIDEA-156069Impossible to work with project which opened from starting window second time
BugIDEA-152628shift-F1 displays two URL
BugIDEA-156299Force Touch: 'Force Touch' is replaced with 'Button 1 click' after restart
BugIDEA-160926Backspace doesn't join empty lines in JTextArea
BugIDEA-74100[yaml] key-value parsing improvement
BugIDEA-157496Webstorm freezes at splash screen
BugIDEA-167627Reference search doesn't work for files added via AdditionalLibraryRootsProvider
BugIDEA-176658Changelog converted automatically to US-ASCII
BugIDEA-1761282017.2 Can't load project with character "|" in its name
BugIDEA-157266Safe delete: Exclude file is enable
BugIDEA-148512Regression: Import/Export Settings no longer supports 'Remote Tools' after upgrade to IntelliJ 15
BugIDEA-151527Sticky Selection cannot be escaped unless the cursor is in a different location than when toggled
BugIDEA-147470AddToFavorites action should work for ResourceBundle
BugIDEA-1721075+ minutes synchronize after remove of 11k files
BugIDEA-159941Mac native file chooser cannot select multiple files
BugIDEA-159940Wrong default location for new jdk mac open dialog
BugIDEA-162032Sonarqube results are not getting displayed in the Inspections Tab.
BugIDEA-160967Endless loop of "JetBrains Account authentication failed. Do you want to try again?" even if pressing No
BugIDEA-180450Indent provider behaves unexpectedly
BugIDEA-148696Contextual menu won't close
PerformanceIDEA-175217Do not send statistics on closing IDE
PerformanceIDEA-167733High CPU usage due to Component.setCursor
PerformanceIDEA-179003IntelliJ 2017.3 EAP takes longer to load list of actions in Ctrl-Shift-A than 2017.2
PerformanceIDEA-178385Intellij very slow
PerformanceIDEA-172762ProjectRootManagerComponent$1.fileTypesChanged on AWT causes 30-60s freeze
UsabilityIDEA-180386Verbose logging from BrowserStarted makes the logs useless
UsabilityIDEA-165002Can't Disable Message: Remote desktop detected, Animation disabled
UsabilityIDEA-158189Text is flickering when lines overlap vertically
UsabilityIDEA-126373File Structure could have less indenting
UsabilityIDEA-133381drag and drop file from project view tool window
UsabilityIDEA-157421Long shutdown due to built-in server
UsabilityIDEA-164993Support for macOS special character (emoji) insertion popover
UsabilityIDEA-138744Cannot drag & drop bookmarks
UsabilityIDEA-85255Tool window options like a "Autoscroll to Source", 'sort by type' etc. should be stored globally, not per-project
UsabilityIDEA-161094Option to disable "search everywhere"
UsabilityIDEA-158856Save File As Template dialog: Help is missing
UsabilityIDEA-167531During code completion, Home/End keys navigate the menu not the code editor
UsabilityIDEA-85375Run configurations dropbox should not change its width
UsabilityIDEA-114099Strip white space left of caret on manual save
UsabilityIDEA-166959Can't see full path to project in welcome screen
UsabilityIDEA-160816Search by abbreviation in Keymap configurable
UsabilityIDEA-158213Inconsistent soft wraps all state
UsabilityIDEA-98634Favorites List: sort entries
UsabilityIDEA-123307Squashed tree widget on Windows theme on HiDPI monitor
UsabilityIDEA-159110ResourceBundle Editor: property Copy should show the destination if the bundle is located not in src/resource root
Usability