Child pages
  • 1.8.0_112-release-736-b22 x86_64
Skip to end of metadata
Go to start of metadata
Highlights
  • Fixed crashes which happened at once after Rider was started.
Fixed issues
JRE-426Bug

Crash after launching Rider for a few seconds

Known issues
JRE-32BugReg test ''java/lang/Class/getDeclaredField/FieldSetAccessibleTest.java'' throws ClassNotFoundException: StyledFontLayoutTest
JRE-155Bug

java/awt/event/KeyEvent/8020209/bug8020209.java: KeyListener for 'meta pressed DECIMAL' called 5 times instead of 4!

JRE-196Bug

[8u152_8u152.3] java/util/Currency/ValidateISO4217.java: Test data and JRE's currency data are inconsistent.

JRE-198Bug

[8u152_8u152.3] sun/util/calendar/zi/TestZoneInfo310.java: availableIds don't match

JRE-269BugJLabel doesn't scale <code>text</code> HTML fragments.
JRE-277Bug

java/awt/Focus/RestoreFocusOnDisabledComponentTest/RestoreFocusOnDisabledComponentTest.java intermittently fails by timeout

JRE-320Bug[Fedora25] java/awt/WMSpecificTests/Mutter/MutterMaximizeTest.java: Bad location after maximize. Window location has not moved
JRE-321Bug

[Fedora25] javax/swing/JTableHeader/6884066/bug6884066.java fails by NPE

JRE-322Bug[Fedora25] javax/swing/text/Utilities/8142966/SwingFontMetricsTest.java: java.lang.RuntimeException: Test Failed!
JRE-323Bug[Fedora25] javax/swing/Popup/TaskbarPositionTest.java: java.lang.RuntimeException: We do not match! java.awt.Rectangle...
JRE-324Bug[Fedora25] javax/swing/JLabel/7004134/bug7004134.java: java.lang.RuntimeException: getToolTipComponent failed
JRE-325Bug[Fedora25] java/awt/Dialog/DialogAboveFrame/DialogAboveFrameTest.java crashed at [libawt_xawt.so+0x42b49] ReadRegionsInList.clone.0+0x2b9


  • No labels