Child pages
  • IntelliJ IDEA 2021.3 EAP (213.6461.79 build) Release Notes
Skip to end of metadata
Go to start of metadata
No subsystemBug IDEA-282192 Executing operations may freeze the IDE
Bug IDEA-284364 IllegalStateException: Shouldn't be possible to run a Git command in the safe mode when Share project on Space
Bug IDEA-281991 NoClassDefFoundError: org/junit/platform/launcher/TestIdentifier when trying to run test in Docker
Bug IDEA-282707 IDEA 2021.3 NullPointerException in LspServerManager
Exception IDEA-277575 Multimple java.lang.NoClassDefFoundError: fleet/rpc/client/SocketImplKind exception on WSL tests
Bug IDEA-281332 Python Interpreter widget doesn't work when Markdown file is open in Preview Only mode
Bug IDEA-146360 Disable run line markers for injected files
Bug IDEA-282645 Untrusted projects: for the not versioned projects opened in safe mode the 'create Git repository' action is suggested but fails with exception
Bug IDEA-282642 Untrusted projects: don't suggest to init git repository for the git-enabled projects opened in the safe mode
Exception IDEA-280424 SOE at org.jetbrains.uast.java.JavaUVariableKt.convertRecordConstructorParameterAlternatives
AndroidBug IDEA-256189 Error on project opening: Duplicate content roots detected
Bug IDEA-282354 Empty descriptions for UpdateTransitionLabel, TransitionPropertiesLabel inspections.
Bug IDEA-281716 java.lang.UnsatisfiedLinkError: Can't load library: .../layoutlib/data/mac-arm/lib64/libandroid_runtime.dylib
Bug IDEA-281780 Navigation editor does not work
Bug IDEA-259235 Cannot import Android Gradle module to existing project
BuildBug IDEA-282963 Shortcut to rebuild a module doesn't work on a module node in Project View
Build. Built-in (JPS)Bug IDEA-278932 Java compilation fails on JDK 6 and JDK 7
Bug IDEA-283502 Getting "Source file already exists error" on trying to incrementally build the project that uses source generation and Eclipse compiler
Bug IDEA-284089 Compiler -> "Build Project Automatically" Never Triggers
Bug IDEA-282231 Compilation fails with message `java: Compilation failed: internal java compiler error'
Build. GradleBug IDEA-281592 IntelliJ 2021.2.3 freezes on start up
Bug IDEA-278350 Should be able to create a valid gradle project for Java 17 project
Bug IDEA-277695 RunAnything: "." and "./" are recognized as Gradle commands
Exception IDEA-275459 NPE on com.intellij.openapi.externalSystem.service.execution.configuration.ExternalSystemRunConfigurationEx tensionManager$Companion.writeExternal(ExternalSystemRunConfigurationExtensionManager.kt:52)
Bug IDEA-280294 "Invalid Gradle JVM configuration" for Gradle 7.3 and JDK 17
Bug IDEA-280774 New `exploded_war` task should be generated more carefully
Bug IDEA-280385 'Reload all gradle projects' removes maven annotation processor in same project
Bug IDEA-277444 Gradle task run configuration: cannot paste into text field when completion is shown
Build. MavenBug IDEA-169048 Maven integration enables Annotation processors
Feature IDEA-205178 Support .mvn/jvm.config for defining JVM configuration for Maven builds
Bug IDEA-281436 Maven Indexes - too many pooled threads created
Bug IDEA-229600 Maven Reimport does not respect 'Settings for New Projects' in Compiler - Annotation Processors
Performance IDEA-273726 Out of Memory error when reading Maven index
Bug IDEA-284113 Unable to open Maven project (InvalidPathException: Illegal char <:> at index 8)
Bug IDEA-268521 Java Project in WSL2 /target/classes does not exist
Bug IDEA-279761 Extra colon in maven tool window
Bug IDEA-281121 Private Maven repo artifact downloading not working in WSL "Could not find artifact x.y.z in central (https://repo.maven.apache.org/maven2)"
Build. Package SearchBug IDEA-283543 The Dependencies toolwindow sometimes doesn't display any dependencies
Cosmetics IDEA-282326 Library names don't get their whitespace normalized
Cosmetics IDEA-282880 Details of dependencies not in the index aren't shown correctly
Bug IDEA-283760 Changing Gradle Configurations in Package Search Configuration throws exception
Usability IDEA-282015 Not ideal ordering of quickfixes for an outdated dependency version
Bug IDEA-282875 Undoing upgrade dependency operation doesn't re-run inspection
Bug IDEA-284443 Package Search: add an ability to choose result set size
Bug IDEA-283838 Disable computations during headless and unit tests
Code Analysis. DuplicatesBug IDEA-262587 Duplicate extraction is not suggested after Method extraction
Code Analysis. InspectionFeature IDEA-12674 Suggest adding String.trim() to the list of non-internationalised functions.
Bug IDEA-276197 Can't specify inspection severity for several scopes
Code Analysis. Language InjectionBug IDEA-275692 language injection settings > Advanced > Single file option doesn't save
Bug IDEA-282186 "IllegalStateException: Seems you haven't called addPlace()" on analysing of mixed php + html file with conditional comment
Bug IDEA-250588 Language Injection: some explicitly injected languages can't be uninjected via the context menu
CoreUsability IDEA-280910 Do not show welcome screen on starting IDE with gateway url
Support Request IDEA-281472 Recent regression in CodeStyleSettingsProvider requires getIndentOptionsProvider() to be overridden to include "Tabs and Indents" tab, but that's scheduled for removal soon...
Core. DebuggerBug IDEA-271771 Inline debugger hints are not updated when switching between debug sessions
Bug IDEA-279755 Evaluated values aren't updated in New Run/Debug UI
Cosmetics IDEA-283045 Gray icons background color in popup
Bug IDEA-281842 Inline watches: "Set value" and "Add as inline watch" options disappear from the popup on Linux
Bug IDEA-278406 Debugger: unify icons for Add to Watches action in Evaluate Expression toolbar and Variable context menu
Core. File SystemBug IDEA-283046 "External file changes sync may be slow" notification shows internal ID instead of text
Core. IDE SettingsBug IDEA-281327 Inlay hint settings don't open from context menu
Cosmetics IDEA-280642 Inlay hints settings: remove right margin from preview
Bug IDEA-280498 IDE antialiasing setting resets on restart
Bug IDEA-280720 New inlay hints: these settings are not searchable
Bug IDEA-280814 Method chains settings are ignored when updating to 2021.3
Bug IDEA-276949 Proxy authentication does not work after update to IntelliJ IDEA 2021.2.1
Core. InstallationBug IDEA-283631 phpstorm://open fails in 2021.3 RC
Bug IDEA-283217 "Data sharing" dialog has not rendered html tag
Core. LicensingBug IDEA-282717 IDEA 2021.3 RC NullPointerException from ClientAwareComponentManager
Usability IDEA-281659 Add more detailed message about what is the possible cause of the "Couldnt start {0} EAP due to a login problem. Please contact technical support for assistance" problem
Bug IDEA-283469 UI freeze on attempt to delete license with disabled internet access
Usability IDEA-281812 Hide "IDE authorization token" input field and "Check Token" bottom when the IDE fails to launch browser for Login/Trial
Bug IDEA-284532 PHPStorm 2021 failed to start, dropped a "Cannot start" stacktrace
Bug IDEA-282819 Some product EAP links are incorrect
Usability IDEA-283374 When trying to activate Trial without internet connection - no error message will be displayed
Core. Platform APIBug IDEA-279127 ComponentManagerImpl.unregisterComponent should remove the component from serviceInstanceHotCache
Core. Plugin ManagementBug IDEA-279700 Cannot cast class to itself after dynamically updating plugin through balloon popup
Bug IDEA-283546 Plugins which store META-INF/plugin.xml directly under the plugin directory cannot be installed
Bug IDEA-279479 Internal IDE error right after updating my plugin to latest version
Cosmetics IDEA-283165 "No" button should be "Cancel" in "Install Required Plugins" dialog
Usability IDEA-283690 Do not suggest to enable the plugin after 'do not suggest this plugin' is invoked for it
Bug IDEA-280107 Class cast exception caused by dynamic loading during plugin upgrade
Bug IDEA-279451 Dynamic plugin update issues
Bug IDEA-283260 No tooltip for installing a plugin
Exception IDEA-275822 PluginException: Class org.jetbrains.idea.maven.ext.jee.JavaeeFacetImporter must be not requested from main classloader of org.jetbrains.idea.maven.ext plugin [Plugin: org.jetbrains.idea.maven.ext]
Bug IDEA-277884 Plugin detection by class doesn't work with the new plugins model
Bug IDEA-279931 Do not suggest already ignored plugins
Core. ProfilerFeature IDEA-271400 Differential Flame Graphs
Task IDEA-281429 Colors for Snapshot Diffs
Core. Project SettingsBug IDEA-284273 Don't Open in Trust Project Dialogs shown on reopening multiple projects after IDE upgrade breaks IDE
Bug IDEA-280859 trust project dialog: "Don't open" doesn't work for idea started from the command line
Bug IDEA-282352 `Don't open` at `Trust and Open Project?` dialog has to be pressed twice if the project is drag-n-dropped to the welcome screen
Usability IDEA-277454 "Trust and Open Gradle Project" dialog is missing a project name
Bug IDEA-282826 Clicking 'Trust Project' in editor banner does nothing if untrusted project settings were migrated from previous version
Bug IDEA-284145 Don't Open in Trust Project dialog shown after IDE upgrade leaves the project in partially-closed state
Core. Quick DocumentationUsability IDEA-280184 Documentation Component: "Adjust Font Size" should be dumb-aware
Feature IDEA-152644 Provide the text search in the Quick Documentation (Ctrl + Q)
Bug IDEA-284186 Documentation popup jumps when invoked in Project View
Bug IDEA-284184 Edit Source (F4) does not work in quick-doc when pressing F4 on keyboard
Exception IDEA-280813 CCE at com.intellij.lang.documentation.ide.impl.DocumentationTargetHoverInfoKt.injectedThenHost
Exception IDEA-282063 java.lang.NullPointerException: element.text must not be null
Usability IDEA-282246 Shortcut to opening quick doc keeps tool window tab with open documentation
Bug IDEA-282593 IndexNotReadyException in DocumentationProvider
Usability IDEA-280982 [Regression] Quick Documentation window steals focus during code editing. "Auto update from source" is gone.
Exception IDEA-282959 ShowQuickDocInfoAction should handle INRE
Cosmetics IDEA-282417 Rename title of documentation window
Performance IDEA-284009 High CPU & GPU utilization with documentation docked and other dock open
Bug IDEA-280509 Documentation popup is shown over autocompletion window
Bug IDEA-280750 Documentation tool window ignores new background color when changing theme to dark / light
Bug IDEA-280749 Documentation tool window: unable to switch to the previous doc page
Core. Run. ConfigurationsBug IDEA-280925 Regression: Configuration editor doesn't save folders
Bug IDEA-281386 Can't pass selected system environment variables to WSL in Run configurations
Bug IDEA-197080 Select box of Run/Debug Configuration in Navigation Bar Toolbar is empty when deleting the last item of a specific template, "Add Configuration..." is shown in the dropdown instead of another configuration
Bug IDEA-282189 Run configuration templates are missing
Core. Run. TargetsFeature IDEA-268786 Container name of docker run target support
Bug IDEA-280608 Docker: Cryptic "unable to resolve docker endpoint" error due to incorrectly detected path to certificates
Bug IDEA-280935 Run Targets: Can't finish creating new ssh target with existed ssh connection
Bug IDEA-282727 DockerCompose target. Focus on the compose container is set only from the second time by debug
Core. SSHBug IDEA-281956 Deployment based on SSH configuration utilizing OpenSSH agent and config complains about "host no found"
Bug IDEA-283804 Parse config file checkbox doesn't work for Deployment configurations
Bug IDEA-281116 Remote SSH server version is not shown in logs
Usability IDEA-239091 Allow OpenSSH config to be enabled or disabled in authentication types "key pair" and "password"
Feature IDEA-277305 Support Windows 10 ssh-agent
Bug IDEA-268052 Datagrip does not reconnect through SSH tunnel if connection drops.
Bug IDEA-281819 SSH warning about an unknown host key is shown like the key has been changed
Bug IDEA-248772 SSH configuration doesn't consider empty password to be valid
Bug IDEA-281132 Set client identity in SSH
EditorBug IDEA-281047 Block caret allows no continuous selection after scrolling down
Bug IDEA-285649 Selection background isn't shown for rendered doc
Bug IDEA-281339 Block caret random text selection and "new line" selection at line end
Exception IDEA-280637 com.intellij.diagnostic.PluginException: Cannot create class com.intellij.lang.documentation.ide.impl.DocumentationToolWindowManager (classloader=com.intellij.util.lang.PathClassLoader@566776ad) [Plugin: com.intellij]
Bug IDEA-284402 IDE show the quick documentation even not hovering the cursor over that class when enabling the rendered javadoc
Exception IDEA-275403 Throwable: Light files should have PSI only in one project
Bug IDEA-281204 Ctrl+F1 doesn't work in EditorConfig
Editor. Code CompletionTask IDEA-282031 Provide icons for live templates, word completions and HTML tags
Editor. Diff and MergeBug IDEA-282202 Empty github pull request/space code review diff window after IDE restart
Bug IDEA-269841 Empty diff frame after IDE restart
Editor. FormatterUsability IDEA-281375 Don't run formatter on save on syntactically invalid file
Bug IDEA-280816 internal code analysis of Rider parses .editorconfig incorrectly
Editor. Intention ActionsTask IDEA-282911 Deprecate IntentionAction.invokeForPreview and LocalQuickFix.applyFixForPreview
FrameworksException IDEA-284189 Microservices: NCDFE at MicroserviceDebuggerSupportKt.setupEntranceBreakPoint
Bug IDEA-284288 Java smart step into is not working with "Smart Step-Into for Microservice Debugging" plugin
Bug IDEA-273996 JavaScript: endpoints completion doesn't work for `new Request()` in case of concatenated strings
Bug IDEA-280574 HttpClient: Can't remove HttpRequest Run Configuration from ServicesView
Bug IDEA-284796 Using NavigationGutterIconBuilder.setCellRenderer from pooled thread may lead to a deadlock
Bug IDEA-272457 Express: HTTP Client tab is not available for routes
Bug IDEA-274351 URL completion doesn't work in Angular projects
Frameworks. GrpcBug IDEA-284425 Do not highlight non-json request bodies for grpc requests in http-client
Feature IDEA-279112 Create `what's new` description for grpc features in http client
Exception IDEA-280805 GRPC: On open grpc http file get Cannot load class com.google.common.collect.Multimap in grpc plugin
Exception IDEA-283452 IDEA 3.x HTTP Client - GRPC How to import "google/protobuf/wrappers.proto";
Frameworks. LombokBug IDEA-279075 Lombok and @SuperBuilder failed to generate builder method with latest EAP
Frameworks. MicronautBug IDEA-282474 Micronaut: UI Blocked on MnCacheableLineMarker class init
Bug IDEA-283893 Micronaut: Controller class is shown as unused in Kotlin
Frameworks. OpenAPI (Swagger)Bug IDEA-282834 Swagger/OpenAPI: no completion for request method in openapi v3.1 spec
Performance IDEA-284083 Constant freezes while editing JSON
Bug IDEA-285089 OpenAPI/Swagger: Can't change schema with json schema status widget (no list available)
Bug IDEA-280350 Swagger/OpenAPI: Get Schema validation: Validates to more than one variant warning on valid parameters
Frameworks. ProtoeditorBug IDEA-285012 Protobuff: In case path to .proto files not specified in Protocol Buffers settings on run grpc request I get com.intellij.grpc.requests.RejectedRPCException: An error occurred during protocol buffers file binary assembly
Task IDEA-284420 Refactor protoeditor built in .proto files
Frameworks. QuarkusBug IDEA-283234 Quarkus: register .qute.yml for Qute (currently only .qute.yaml registered)
Bug IDEA-281016 Quarkus: No completion for Qute built-in command
Bug IDEA-272088 Quarkus: @TemplateExtension method is shown as unused
Bug IDEA-281400 Quarkus Qute: empty sections are not supported
Bug IDEA-279968 Qute: mutiple enum values are not supported in IN
Bug IDEA-279969 Qute: provide color settings for braces and brackets
Bug IDEA-282594 Quarkus Config Mapping: do not consider naming strategy while resolving properties with custom name
Bug IDEA-279966 Qute: Unexpected tokens error in typesafe template
Bug IDEA-279967 Qute: IS is not highlighted with when / else on cursor
Exception IDEA-280026 Quarkus: Get AssertionError: QUTE_FILE on open qute file
Bug IDEA-280029 Quarkus: Qute. Can't comment some lines in qute file
Exception IDEA-280330 Quarkus: Get UnsupportedOperationException in quarkus plugin on copy open spec file from o
Feature IDEA-267595 Quarkus: support property references in Scheduled annotation
Bug IDEA-281397 Quarkus Qute: eval section is not suppported
Task IDEA-279975 Qute: register .qute.json, .qute.yaml extensions
Bug IDEA-282381 Quarkus: false-positive injection inspection for POJO
Bug IDEA-281414 Quarkus Qute: IOOBE while editing a template
Feature IDEA-280072 Quarkus 2.1: support indexed properties assignment
Bug IDEA-274226 Quarkus: support @ReactiveDataSource qualifier
Bug IDEA-279971 Qute: include and insert are not supported
Feature IDEA-279970 Qute: provide braces matcher for () parentheses
Task IDEA-283620 Quarkus in the process of dropping @Deprecated shortId support on code.quarkus.io/api
Frameworks. ReactorBug IDEA-281545 Helidon: Mutiny inspection and quick fix shown in Helidon code
Bug IDEA-281050 Reactive streams: warning is shown even when boundedElastic scheduler is used
Bug IDEA-199018 Incorrect Reactor inspection on mock objects: Value is never used as Publisher
Bug IDEA-279457 Reactor: Throw statement in Reactor flatMap operator does not work for Flux concatMap, switchMap and flatMapSequential
Bug IDEA-280421 Reactor: Value is never used as Publisher shown for function return value
Feature IDEA-276605 Reactive Streams: support blocking subscribe inspection for Mutiny
Bug IDEA-279458 Reactor: incorrect return inserted after quick fix for Throw statement in Reactor flatMap operator in Kotlin
Bug IDEA-276018 Reactor: Inappropriate 'subscribe' call inspection incorrectly reports Fire-and-Forget pattern
Frameworks. SeleniumBug IDEA-281230 Selenium: On click pog gutter page not loaded in pog for groovy class
Bug IDEA-281235 Selenium: add selectors in page object generator for already generated code may lead to duplicated names
Feature IDEA-281213 Selenide 6.0 in new project templates
Bug IDEA-281585 Selenium: Page Object element gutter exception on click
Feature IDEA-281078 Selenium: provide new project template with Selenium 4
Feature IDEA-240932 Selenide: Highlight shouldHave(text("")) as error
Frameworks. SpringPerformance IDEA-283492 Spring plugin decrease performance of highlighting for large files in modules with many dependencies
Bug IDEA-282851 Spring Data: no gutter shown for named query in entity when used from @Repository
Bug IDEA-281282 Spring Data: reactive repositories: Publisher<T> should not be reported as an invalid return type for query methods
Feature IDEA-282870 Spring: show gutter icon for @Scheduled tasks
Bug IDEA-281284 Spring Data: Reactive repositories: Publisher<T> using as a query method parameter type should not be reported as error
Bug IDEA-249322 Spring Boot: enum value with underscore can be used in YAML with dash
Bug IDEA-282791 Spring: facet: Unmapped Spring configuration file warning is not hidden after file sets editing
Bug IDEA-282697 Spring Data: custom repository fragment class is shown as unused
Bug IDEA-280929 Spring Boot: multiple configuration files: if the same property is defined both in application.properties and config/application.properties, the last one should take precedence
Feature IDEA-258159 JPA: Provide code completion for JPA properties in Spring Boot configs
Performance IDEA-280635 Spring Boot facet configuration opening takes long time in case of imported/multiple configs
Bug IDEA-282701 Spring: Customize Spring Boot... action disappeared from the facet configuration dialog
Performance IDEA-284038 Slow URL search everywhere in Spring projects
Bug IDEA-280431 Spring: injection point from the record doesn't have icon in the gutter navigation popup
Bug IDEA-280003 Spring: unable to inject JpaContext
Exception IDEA-265869 SOE: : isValid leads to endless recursion in class com.intellij.freemarker.psi.files.FtlFileViewProvider: [Language: FTL>, Language: HTML]
Bug IDEA-280794 Spring Boot: for properties from YAML configuration files no value interpolation is available
Bug IDEA-145889 Spring: property usage in @Scheduled
Bug IDEA-280453 Spring Data: the projection records used in queries can't be renamed
Bug IDEA-281438 Spring Data: don't suggest the reactive-type parameters for the query methods in R2dbcRepository
Bug IDEA-280380 Spring: the @Component-annotated record is shown as used always
Bug IDEA-280745 Spring Boot: spring.config.import support: the properties from the imported YAML files are not resolved from @Value annotations
Bug IDEA-280811 SpringInitializr wizard does not apply custom package name from server config
Bug IDEA-281125 Spring: provide property value interpolation for @Scheduled annotation attributes
Bug IDEA-277604 Spring MVC / Kotlin: 'Path variable not consumed' warning when request object uses val instead of var
GraziePerformance IDEA-282252 High CPU usage as grammar checking always checks the whole file
Performance IDEA-283728 Grazie blocks write actions
Usability IDEA-283871 Remove submenu from "Rule settings" intention action
Bug IDEA-283294 Grazie complains about Kubernetes "cpu: 100m" specification snippet
GroovyBug IDEA-283839 IntelliJ IDEA 2021.3 can not parse `record` as a variable name correctly
Bug IDEA-284144 Variables named "record" get highlighted as faulty in Groovy classes, even when using JDK 11
Groovy. GrailsBug IDEA-284133 Grails 3 project cannot be built in 2021.3 was fine in 2021.2
Bug IDEA-280782 Cannot create Grails 5 project from New Project wizard
Groovy. InspectionsBug IDEA-283030 Base Properties Not Available from Dependent Project in Nested Classes
JavaBug IDEA-280912 Incorrect "Experimental Feature Alert" for Java 17 - Sealed types, always-strict floating-point semantics
Java. Code CompletionUsability IDEA-283424 IDEA insert redundant space after completion of Javadoc tag via space
Bug IDEA-281000 Completion suggests `final` after abstract in java 17+
Bug IDEA-283088 Code Completion inside annotation fails with NPE
Performance IDEA-281884 2 second UI freeze until auto-completion popup is shown in large IntelliJ projects
Java. Code CoverageBug IDEA-281195 ClassFormatError when running tests with coverage in IDEA 2021.2.3 and OpenJDK 11 on Windows 10 using Gradle
Java. Code FormattingBug IDEA-274778 Indentation of Java chained method calls changed unexpectedly after upgrading to IDEA 2021.2
Java. DebuggerBug IDEA-280752 debugger.positionManagerFactory order is not used
Bug IDEA-280967 Inline debugger nodes may be stuck at collecting data
Bug IDEA-284003 Evaluate does not work with disabled jb-jdi
Usability IDEA-281129 Evaluate is showing error (VM is not paused by breakpoint) even without trying to evaluate
Java. Eclipse IntegrationBug IDEA-282586 Project configuration completely broken for Eclipse based IPR projects
Java. Extract MethodBug IDEA-282265 Extract duplicates: scroll to duplicated occurrence when suggest to replace it
Bug IDEA-278213 Replace duplicates are not suggested during extract
Java. InspectionsBug IDEA-281171 Unwanted warning in Java code for StringBuilder in combination with yield
Bug IDEA-281151 Use '@SuppressWarnings("tainting")' to suppress errors from 'Non-safe string is passed to safe method' inspection
Bug IDEA-281767 'Method is too complex to analyze by data flow algorithm' for simple method with loop and pattern matching in instanceof
Bug IDEA-280483 Inspection: 'Numeric 'toString()' called in an internationalized context' should not report Boolean.toString()
Bug IDEA-281572 Wrong "Cast to" quick fix when using generics
Bug IDEA-283654 Cannot uncheck "Test" in "Class naming convention" inspection
Bug IDEA-280534 Constant conditions & exceptions. False positive "Result of 'getComment().equals(tag.getComment())' is always 'false'"
Bug IDEA-281445 Nullability annotation does not work on method references! Oh no!
Bug IDEA-277894 Incomprehensible warning when using recursive generics and CheckerFramework's annotations
Bug IDEA-283812 Assignment Used as Condition with Element of Array
Bug IDEA-283017 Incorrect warning and invalid quickfix for assigning new values to compact constructor arguments
Bug IDEA-281098 Unresponsible IDEA after I tried to batch-apply fixes from inspection '@NotNull/@Nullable problems'
Bug IDEA-280187 Inspections not consistent with IntelliJ IDEA
Java. Intention ActionsBug IDEA-280667 Converting a static final String to AtomicReference<String> doesn't ripple to references to that String
Feature IDEA-280422 Add a quickfix to enlarge the scope of dependency module in case of unresolved reference
Bug IDEA-281446 No "convert to method reference" for enum constructors! Oh no!
Java. JavaFXBug IDEA-266524 JavaFX Scene Builder on IntelliJ labels are unrecognizable on macOS
Java. Profiler. CPUBug IDEA-284682 Profiler Diff on jfr can't compare java 11 and java 17
Java. Tests. JUnitBug IDEA-282808 JUnit 4 -> 5 conversion doesn't work
Bug IDEA-283048 Running a single test class from already executed test suite fails with internal JUnit error
JavaX. AppServersException IDEA-283350 Missing extension point: com.intellij.javaee.app.servers.integration.webFacetImportCallback
JavaX. CDIBug IDEA-284362 Deadlock in com.intellij.cdi.gutter.CdiInjectionsClassAnnotator
Bug IDEA-271385 CDI: Navigate To Related Symbol drop-down invoked for the injected bean shows the confusing target group name
Bug IDEA-271984 CDI Diagram: incorrect dependencies are shown for the beans of the same base type by different qualifiers
Bug IDEA-280911 CDI. KT. Events: "Navigate to Fire Point " doesn't work
Feature IDEA-280820 CDI. KT. Provide CDI Dependencies Diagram
JavaX. JPABug IDEA-284716 "Generate persistence Mapping" -> "By Database Schema" not working in Intellij Idea
JavaX. JPA QLBug IDEA-139605 'elements' is highlighted in red in valid HQL
Bug IDEA-280070 Micronaut Data: @Query(..) : '(' or <input parameter> expected, got 'elements'
JavaX. Web ServicesBug IDEA-179691 JAX-WS: Generate XML Schema from Java using JAXB action does not work with JDK > 8
Lang. JSONTask IDEA-281610 JSONPath: size() is highlighted as unsupported function
Feature IDEA-281703 JSONPath: provide keys and functions completion for expression head
Bug IDEA-281681 JSONPath: repeated asterisks are reported as error
Lang. MarkdownBug IDEA-280724 Markdown Tables: top-right column control not getting active on hover when created
Feature IDEA-278353 Rename Generate action in the context menu to Insert and make it action group.
Usability IDEA-280722 Markdown Tables: table size can't be selected with keyboard arrows
Bug IDEA-280583 Injected code gutter Run line markers can't be executed
Bug IDEA-281673 TraceableDisposable$DisposalException: Editor is already disposed
Exception IDEA-280812 Markdown Tables: IndexOutOfBoundsException at com.intellij.util.text.ImmutableText.outOfRange
Bug IDEA-281650 Table of improper size is generated
Bug IDEA-280728 Markdown Tables: Table borders are broken on column swap
Bug IDEA-280804 Floating toolbar appears collapsed
Bug IDEA-279937 Markdown: the floating toolbar doesn't appear for the last line in file
Bug IDEA-280844 Markdown Tables: table grid is not extended smoothly
Bug IDEA-280199 Floating toolbar is not hidden after closing tabs with keyboard shortcut
Cosmetics IDEA-281241 Change color of "Insert Table" action in Darcula
Bug IDEA-282221 Markdown Mini-toolbar is distracting when using keyboard navigation
Bug IDEA-279665 Mermaid graphs not working
Lang. XPath and XSLTBug IDEA-284217 Unable to save changes to the "Run XSLT" dialog
Lang. YAMLBug IDEA-281699 Quickfix in the JSON injected into Yaml produces incorrect code
Bug IDEA-280717 Missing "Uninject language/reference" intention after using the "Inject language or reference" intention within a .yaml file
LocalizationBug IDEA-283057 i18n: Language plugin suggestion is not working
Plugin Development (DevKit)Bug IDEA-283327 DevKit: code insight for com.intellij.advancedSetting EP 'id' attribute
Performance IDEA-276001 Freeze on file opening (test data)
Feature IDEA-284320 DevKit: code insight for com.intellij.advancedSetting EP 'trailingLabelKey' attribute
SpaceCosmetics IDEA-277066 Beutify error message when merge request already exists
Bug IDEA-281018 Space: Cannot clone project by https if HTTP password wasn't deleted
Bug IDEA-280689 Hide Space actions in log for projects not hosted on Space
Exception IDEA-281579 Space Code Review: NPE when submitting a non-existing branch in the branch filter
Cosmetics IDEA-273981 Two same Space icons looks weird on history toolbar
Cosmetics IDEA-280685 Make "9+" label on read/unread status prettier
Usability IDEA-280705 Show read/unread status for file's parent folder
Usability IDEA-280915 Add tooltips for collapse / expand resolved discussions controls
Bug IDEA-277258 'null' error message when cancelling "Merge Request Branch" dialog
Usability IDEA-277949 Code Reviews: Show/Hide reviewers works extremely slow
Usability IDEA-275855 Add entry point for Merge Requests in main menu
Usability IDEA-273989 Select Next/Previous Tab action should be available during indexing
Bug IDEA-280660 Diff shows error for added files in the Create Merge Request mode
Bug IDEA-268650 Space Review: show old path for moved files
Bug IDEA-280943 Mentions are not working with the disabled Markdown plugin
Tools. DockerFeature IDEA-199206 Add support for ":Z" flag in Bind mounts for docker
Bug IDEA-277286 Docker. FileChooser. java.nio.file.InvalidPathException at refresh after creating new folders
Bug IDEA-280913 Docker. Images completion: Two strings are combined into one instead of showing the completion list
Bug IDEA-215742 Connecting Docker Integration causes dockerd to spike to 100% cpu
Bug IDEA-277333 Docker. java.nio.file.NoSuchFileException at pointing not-existing context folder
Bug IDEA-277148 Options added with Modify options for a Docker configuration aren't shown
Bug IDEA-280604 Cannot exit writing multi-line RUN statement in Dockerfile
Bug IDEA-280676 Docker. Container, "Show Processes" action displays wrong list with duplicated strings
Bug IDEA-280671 Docker Registry. Settings. Change the Address to empty or "space" example by choosing "JetBrains Space" registry
Bug IDEA-285039 Docker: exception on connection to JetBrains Space docker registry
Feature IDEA-178126 Mark file as Dockerfile if it is used as Dockerfile in run config
Bug IDEA-282591 Docker Registry. Pull/Push doesn't work for space jetbrains team registry
Bug IDEA-282176 Docker. Registry. Space. Empty namespaces list for jetbrains.team user
Bug IDEA-248584 Support --ssh build option for Docker
Bug IDEA-282409 Docker. java.util.NoSuchElementException at completion at "--platform" frag of FROM instruction in the Dockerfile
Bug IDEA-278320 Parsing of "host_ip" in docker-compose.yaml fails
Bug IDEA-280128 Provide possibility to add/edit docker registry from the Services view
Feature IDEA-283085 Docker: use registry HTTP API to check credentials instead of Docker login
Bug IDEA-281172 DockerCompose file. Resolve/ find usages doesn't work for services from the complex `depends_on` section
Bug IDEA-264715 Custom docker TCP socket setting is not persisted
Bug IDEA-279801 Red code for `--platform` option for FROM command in Dockerfile
Bug IDEA-281025 Docker. WinOS. Connection to Minikube doesn't work
Bug IDEA-281844 Minikube setting does not apply in GoLand
Feature IDEA-269719 Secrets argument not supported while build docker image
Bug IDEA-285527 Image push. Registry list by push is empty
Bug IDEA-285219 Docker: Registry configurable: test connection doesn't work
Exception IDEA-272618 java.lang.Throwable: Blocking SSH method called from the dispatch or write thread at calling Terminal for the first time
Bug IDEA-282686 Docker. Smart delete volumes with dependencies doesn't work.
Bug IDEA-280916 Docker. Registries. Images completion. Empty list if we call completion after or before "/"
Usability IDEA-281940 Docker. Settings: don't check/show red error for Minikube till this option is chosen
Bug IDEA-212068 Docker. File Chooser. Files tab is empty for images based on alpine, photon, busybox images
Bug IDEA-282389 "Cannot run program "minikube": error=2, No such file or directory" red exclamation error on default Docker settings
Performance IDEA-282416 Docker Registry. Adding space registry with many projects leaded to freezes and thread dumps
Usability IDEA-282141 Docker Registry. Connection to my space registry fails
Bug IDEA-282654 Dockerfile run configuration error with context path specified
Bug IDEA-280682 Docker. Push image dialog. Don't display it with scrollbars
Tools. HTTP ClientCosmetics IDEA-280591 HttpClient: Do not add # to request name in servicesView for requests with only ### or with empty name
Bug IDEA-283191 Http client fails with error internal_error with self signed certificates
Exception IDEA-282090 HttpClient: some times get exception failed for REQUEST_TARGET on Tools->HttpClient->Create new request
Bug IDEA-283799 HTTPRequest: client.global.set broken inside client.test callback
Bug IDEA-281434 HTTP Client: gRPC examples do not executed, because gRPC cannot find proto file
Performance IDEA-278252 Performance problem after running http tests
Bug IDEA-284499 HTTP Client: Do not show file name for run action in context menu
Feature IDEA-237751 Show request names instead of index in Request field inside run configuration
Usability IDEA-284470 HTTP Client does not print URL parameters in output
Bug IDEA-284148 HTTP Client: Variables are not substituted in response view
Bug IDEA-278832 Cookie didn‘t send to server when I use Http file in Idea2021.2.2
Bug IDEA-281242 HttpClient: Run request options doubled on gutter click
Usability IDEA-280979 Provide possibility to run request with environment from Run Anythyng
Bug IDEA-156476 REST Client Tool doesn't save cookies
Usability IDEA-239339 Order of contextual menu items for environments changing order in HTTP client
Tools. KubernetesBug IDEA-262463 Kubernetes. NodePort Services: External IP is not displayed
Bug IDEA-280707 K8s. Green screen in the background at changing the path to the kubeconfig file
Bug IDEA-281964 Kubernetes. Change context: the name of the context remained the old one
Bug IDEA-274228 Kubernetes. The deleted custom namespace remains in the list and near the cluster name if it is selected as the current
Bug IDEA-282174 Kubernetes: Access custom resources by full qualified name
Usability IDEA-281096 Kubernetes: Confusing Processing configuration change notification on project open
Bug IDEA-283438 Helm. Add error and update repos state by pressing "Update Repository" gutter in case if the repo is still displayed as added but really it is removed
Feature IDEA-245674 Provide possibility to inject language for ConfigMap/SecretMap key values in the Kubernetes view
Tools. TerminalBug IDEA-271438 API for optional persistent terminal tabs
Bug IDEA-283193 White text on white background
Tools. Test ManagementBug IDEA-282777 Test suite preview lacks a list of test cases
Bug IDEA-282775 Test suite metadata is not suggested in filters
Bug IDEA-282773 Metadata from test suite is not shown in test case preview
UI DSLBug IDEA-281347 Incorrect link color for comments in UI DSL
Task IDEA-281500 Rework label/comments API in new UI DSL
User InterfaceBug IDEA-280319 Status bar no longer displays popup action's description
Bug IDEA-283194 Deadlock while debugging
Usability IDEA-274904 Accidental tool window drag'n'drop instead of resizing
Usability IDEA-257432 Prioritize file path tooltip when editor tab is too narrow
Bug IDEA-272559 "Recent Find Usages" shortcut does not invoke "Recent Find Usages" popup
Cosmetics IDEA-271046 Checkbox jumps on hover in the "Rename also" dialog
Bug IDEA-284451 "Evaluation Feedback" popup keeps appearing every 30 sec
Cosmetics IDEA-231276 Hint in Search Everywhere is cut on macOS Catalina
Bug IDEA-283347 There is a separator under active project tab in non-fullscreen mode
Performance IDEA-275391 Modal dialog doesn't appear on copying a large number of files, UI isn't accessible
Bug IDEA-271741 Tool window is returned to "Dock Unpinned" mode instead of "Undock"
User Interface. Alerts, NotificationsBug IDEA-279902 Arrow navigation works in the opposite direction for buttons in the UI
User Interface. Console ViewBug IDEA-282942 Restore support for `run.processes.with.redirectedErrorStream` registry key in Java run configurations when using Targets API
User Interface. Embedded Browser (JCEF)Bug IDEA-283718 com.intellij.ui.jcef.JCEFHtmlPanel ctor causes disposal error
Bug IDEA-281261 switch to VolatileImage in OSR JCEF
Bug IDEA-281774 Memory leak detected: com.intellij.ui.jcef.JCEFHtmlPanel
User Interface. Favorites/BookmarksUsability IDEA-280568 Bookmarks window: go to source shortcut not supported
Bug IDEA-282938 Adding non-project file to Bookmarks is not supported
Usability IDEA-282476 Toggle Bookmark in newly set up project now shows dialog
Bug IDEA-284600 Excluded directories are not shown in directories in Bookmarks tool window
Bug IDEA-283981 Bookmarks context menu is grayed out on folders
Bug IDEA-284429 Different sorting for directories in Bookmark tool window comparing to Project View
Bug IDEA-284400 "Select In" action is not available in Bookmarks tool window
Usability IDEA-283956 Next/Previous Bookmark navigation no longer confined to single file
Bug IDEA-281897 Directory and file bookmarks break if the directory or file is deleted and recreated
Usability IDEA-282746 Drag-and-drop from Project View to Bookmarks tool window is not supported
Bug IDEA-282250 Next/Previous line bookmark action shortcut does not navigate in Editor if Bookmarks tool window is closed
Bug IDEA-284280 Inconsistent bookmarks behavior on clicks in gutter
Bug IDEA-282406 Quick search is not invoked in Bookmarks popup
Bug IDEA-282577 Moving class bookmark to another list is not supported in Bookmarks tool window
Bug IDEA-282848 Bookmark icon is invisible in Project View when plugin theme is applied
Usability IDEA-282926 Only one bookmark is dragged to another list if several bookmarks are selected
Bug IDEA-284610 Bookmark is not created with Cmd+Click after restoring default settings
Bug IDEA-283144 Directory content is not shown in Bookmarks list
Bug IDEA-270270 Next Bookmark doesn't work across different files.
Bug IDEA-283962 Add bookmark using mouse sets bookmark at wrong line
Bug IDEA-282288 Quick search in Bookmarks tool window is red even if there are matches
Cosmetics IDEA-282585 Bookmarks icon is displayed before class icon
Bug IDEA-284688 New bug in 2021.3 / Bookmarks menu / Cant do file diff
User Interface. Find UsagesBug IDEA-276558 Find usages doesn't work for injected languages anymore with 2021.2 upgrade
User Interface. Find, Replace, UsagesBug IDEA-273156 Invalid Find Usages result: shows "INVALID" twice
Bug IDEA-281183 Editor actions don't work in console's 'find' panel
Bug IDEA-247553 "Replace in Path" can't replace text if that text is the entire contents of a file
Bug IDEA-280620 Regex search does not match
User Interface. FocusBug IDEA-281015 On macOS, sometimes project window is not brought above other project windows when stopping on breakpoint
User Interface. Keymap, ShortcutsBug IDEA-280119 Keymap editor shows actions with `use-shortcut-of` under "Other" group
User Interface. MenusException IDEA-283051 Exception on closing second project tab
Bug IDEA-282646 There is a Git main menu item instead of VCS if Git repository is not enabled for a project
Bug IDEA-284421 No icons in menu for items with submenu
User Interface. NavigationUsability IDEA-259571 Ability to disable deleting files from Recent Files with backspace
User Interface. New Project WizardBug IDEA-282672 New project wizard: JavaScript fields remain on Empty project template
Bug IDEA-282058 HTML Wizard prompts for folder/project name twice.
User Interface. PluginsBug IDEA-278567 Buy plugin link from detail page can opens multiple links
Bug IDEA-283341 Installing plugin through tooltip causes an exception
Bug IDEA-282883 Two "Other Tools" groups in installed plugin list
User Interface. Project ViewCosmetics IDEA-282600 Yellow bookmark flags make file names misaligned
User Interface. Recent Files, SwitcherBug IDEA-284736 Can't close open files from Switcher
User Interface. Search EverywhereFeature IDEA-280849 Train the very first model for ranking files in Files tab of Search Everywhere
User Interface. Services ViewBug IDEA-283192 Services view. The item remains for some time in "All Services" by moving into a new tab
Performance IDEA-282843 Services view. Idea Freezes if we type in the Editor during loading data in the Services view
Bug IDEA-283093 ServicesView. Hanging node and ReadAction exception at running aconsole application
User Interface. TabsUsability IDEA-280818 Add tooltip for three-dots button on the tab bar
Bug IDEA-280819 "More" button overlaps tab label in Code Style Settings
Bug IDEA-280795 Toolbar buttons are hidden under "Show Hidden Tabs" button in the terminal toolwindow header when tabs overflow the header
Bug IDEA-280831 "More" and three-dots buttons on editor tabs pane are overlapped if "Show pinned tabs in a separate row" is on and there are no pinned tabs
Bug IDEA-280792 Three dots button remains visible after closing all tabs
Bug IDEA-280802 Grey line appears after first line in the Editor when opening tabs from second row
Cosmetics IDEA-280839 [Debug tool window] incorrectly displayed yellow arrow in the Console icon
Bug IDEA-283891 Editor tabs aren't highlighted on mouse hover when the focus is in a toolwindow
Bug IDEA-215364 Cannot see last open tab in vertical tab bar when there are too many tabs to fit on screen
User Interface. Tool WindowsBug IDEA-278414 A tool in View Mode Window is instantly getting closed
User Interface. TouchbarBug IDEA-277249 Debugger buttons on touchbar don't appear at all
Version ControlTask IDEA-282234 Additional FUS events for Commit dialog interactions
Task IDEA-281701 Disable Code Author inlay hints in 2021.3
Version Control. GitBug IDEA-283883 Git Log: wrong tab title when filtering log by date
Bug IDEA-280471 Push Commits up to Here: push rejected after update if the branch was not up-to-date before calling Push Commits up to Here
Bug IDEA-282605 Attempt to clone from Git fails from the Welcome Screen or with the untrusted project opened
Usability IDEA-280478 Focus moves away from Git log when opening and closing diff
Bug IDEA-282260 IDEA is not responding after a sequence of GIT actions
Bug IDEA-280808 Unshelve file with empty content located in the directory with whitespaces puts file in the wrong location
Bug IDEA-277226 Restoring a Diff moved to a separate Window could produce an empty frame.
No subsystemBug WEB-53574 Incorrect import quick fix order in case of several declarations with the same name
Bug WEB-53960 Should not report "Unrecognized attribute or property name" for custom attributes on custom web components
Task WEB-53582 Unify "require"/"import" support between auto-imports and quick fixes in JavaScript
Bug WEB-52811 ESLint with WSL seems to not working anymore on Webstorm 2021.3 EAP
Performance WEB-53279 PHPStorm low on memory
Bug WEB-53883 Deno: do not run service for built-in lib.d.ts
Performance WEB-52612 WebSymbolElementDescriptorsProvider causes noticeable slowdown when Find Usages is invoked in big project
Bug WEB-53358 Can't specify path to Deno or Deno cache via browse action
CSSFeature WEB-52425 Support v-bind CSS function in Vue Single-File Components.
Feature WEB-53033 CSS, TailwindCSS Support in EJS Files
Feature WEB-48542 Tailwind Plugin autocomplete for ERB / Rails helpers
Bug WEB-52720 Tailwind 2.2+: CSS classes completion doesn't work in *.php files (but works in *.blade.php)
Performance WEB-52607 Node process started by the Tailwind CSS plugin consumes much CPU
Bug WEB-53225 Stylelint Plugin is Incompatible with Stylelint v14 + SCSS
Bug WEB-53284 Tailwind 3: Completion for classes doesn't work
Bug WEB-53511 Unknown CSS property 'transform-box'
Bug WEB-41976 Can't decline suggestions and type `()` or `and` after @media in CSS
Bug WEB-41975 @media is shown twice in CSS code completion suggestions
Feature WEB-53150 Tailwind autocomplete support for mustache .hbs files
Feature WEB-53186 Tailwind Autocomplete class names for Smarty (.tpl) with JIT enable
Bug WEB-53264 Build 213.5281.x: deadlock (infinite loop) with TailwindDocumentationProvider in thread dumps
Feature WEB-25289 CSS/SCSS/SASS/LESS: add option "Add a space at comment start"
DebuggerBug WEB-53403 Can't open Debug tool window because of JCEF error
Bug WEB-53642 Debugger memory leak
File WatchersBug WEB-53599 File Watchers: programs running on WSL doesn't work if PATH variable to node is not specified
Feature WEB-38925 File Watchers: support programs running on WSL
HTMLBug WEB-53690 Typing '</' does not close the currently open HTML tag but instead opens an intelli-sense autocompletion popup with irrelevant choices
Exception WEB-53086 Exception while editing injected HTML fragment
Bug WEB-53723 False positive "Empty tag doesn't work in some browsers" for void tags in Angular template
JavaScriptBug WEB-52058 Click on path with alias, for opening js-file, is opening less-file instead (perhaps because name is same) (Webstorm)
Task WEB-53539 JavaScript: remove quick fixes with incorrect suggestions
Feature WEB-52552 Support import assertions proposal
Bug WEB-53441 Download library window shows truncated list of typings
Feature WEB-53257 Add advanced configuration for using file extensions in module imports
Task WEB-53276 Enable completion for top-level await in JS and TS files
Usability WEB-51859 Method chaining not working - unrecognised fluent methods, even when they return this.
Bug WEB-53258 Add an asterisk when pasting code snippet into a selected comment
Bug WEB-28630 NodeJS Modules imports going relative outside of package scope
Exception WEB-53470 StackOverflowError on JSTypeStructuralPartEvaluator
Feature WEB-51282 Support "imports" field of package.json
Bug WEB-53731 Editing template string causes an exception
Usability WEB-53220 In JSX context, existing variables/parameters should have higher priority in completion than HTML live templates with matching names
Bug WEB-51842 Default modules re-exported as named are imported as default if "Use paths relative to the project, resource or sources roots" is enabled
Bug WEB-53435 Wrong signature mismatch warnings: multiple Issues interpreting signatures of node child_process functions
Bug WEB-53521 Usages of functions added to ES6 class via @memberof are not found
Bug WEB-53436 WebStorm 2021.3 Beta copies wrong value
Bug WEB-53031 Wrong type mismatch errors are reported for React "useContext()"
Bug WEB-53235 Structure pane for JS exports in ES6 modules
Performance WEB-52693 high CPU and memory usage causing low memory notification
Bug WEB-53266 Generate getter/setter for Javascript fails with private class fields
JavaScript. FormatterBug WEB-53385 Apply 'ES6 import/export braces' option to import assertion
Feature WEB-51952 Provide a code style option to add white spaces within JSX comments
Feature WEB-52752 Add "block comment at first column" option for JavaScript
Bug WEB-53491 Import assertion is removed on optimizing imports
Bug WEB-53469 Code formatting breaks template strings by adding spaces
JavaScript. FrameworksBug WEB-37574 No completion for CSS properties inside inline style (jsx)
Bug WEB-53447 Angular: False Positive "Wrong attribute value" on all kinds of attributes
Bug WEB-53325 For Vue template file, ant-design component imports are marked unused
Bug WEB-29900 Angular: provide completion of CSS properties in style property binding
Bug WEB-53688 Angular. Event keyup.enter is not emitted
Bug WEB-52809 Vue 3: library (naive-ui) component import is marked unused
Performance WEB-53620 UI frozen on working with Vue components
Bug WEB-52834 Vue: `ref` attribute value in script setup should refer to local variable if one is defined
Bug WEB-53861 Angular animation callbacks not recognized
Bug WEB-53909 Angular support - fxFlex attribute is not recognized
Bug WEB-52125 Multiple imports are marked as unused in <script setup>
Bug WEB-52856 Unable to import VUE component from`@headlessui/vue` package
Feature WEB-47399 Angular: support events from custom EventManagerPlugin
Bug WEB-53635 decodeURIComponent() not resolved in Vue template
Bug WEB-53797 Unresolved type Object in Vue template
JavaScript. InspectionsBug WEB-53439 Invalid JavaScript warning: Condition is always false since types 'String' and 'StringConstructor' have no overlap
Bug WEB-52450 Use file extension in imports if type: "module" is used in package.json
Bug WEB-53532 Inconsistent / instabile behaviour of "Unused property" inspection
Bug WEB-53541 Slow operations are prohibited on EDT from ES6ConvertVarToLetConstQuickFix
Cosmetics WEB-53208 Typos in Inspection Descriptions for "JavaScript and TypeScript"
JavaScript. RefactoringBug WEB-53808 TypeScript: Inline field refactoring incorrectly handles getters
Bug WEB-50246 TypeScript: Refactor: Inline function breaks code
Bug WEB-51079 Typescript: Refactor: Flip if-else results in compile error when using Prettier as default formatter
LESSBug WEB-49795 @import in LESS does not resolve packages in node_modules if `~` is omitted
LintersBug WEB-52594 ESLint 8.0: doesn't work with YarnPnP
Bug WEB-53256 ESlint: update the bundled `.eslintrc-schema.json`
Feature WEB-53407 Limit the scope of files to be linted with StyleLint 14+
Node.jsBug WEB-53230 Don't show 'Update package to the latest version' after performing the action
Bug WEB-52175 package.json doesn't show suggestion for packages that only exist in private repositories when using yarn
Bug WEB-53716 Support Docker Compose Node.js interpreter when project is located under `\\wsl$\<distro>`
Bug WEB-53454 Windows: hidden command line when running Node.js run configuration
Bug WEB-48930 Yarn PnP: Webstorm doesn't find node dependencies on Windows with WSL
Bug WEB-42178 Yarn PnP: Indirect dependencies are not indexed
Bug WEB-52837 Run Script with npm throws errors in WSL
Feature WEB-33571 Add node_modules/.bin folder to PATH in Terminal for current project
Bug WEB-53350 NodeJS 17 debugger doesn't work on Windows with IPv6
Bug WEB-52590 Docker: `npm install` fails when project is located under `\\wsl$\<distro>`
Bug WEB-53378 Can't install dependencies if package.json file isn't in the root folder and use Node.js interpreter via docker-compose
Feature WEB-40509 Support "exports" field of package.json
Bug WEB-53972 Scratch node.js files aren't executed in project working directory anymore
Feature WEB-52942 Support Vagrant interpreter via Node.js Run Targets, e.g. Mocha, Jest, npm
Bug WEB-53381 Can't run tests with node via docker-compose without setting up File sharing
ProfilingBug WEB-41449 NullPointerException when attempting to load heap snapshot
SASSFeature WEB-30607 @import in scss does not resolve packages in node_modules
Bug WEB-53120 Sass @use / @import statements without tilde aren't being resolved correctly
TypeScriptUsability WEB-49388 Monorepo: prohibit auto-import from the same package using absolute paths
Feature WEB-53440 deno: show module urls/names instead of cache filenames
Bug WEB-52986 Show anonymous properties in the structure panel
Task WEB-53053 TypeScript 4.5: type Modifiers on Import Names
Bug WEB-53336 deno: "configuration.applicationArguments must not be null" error when running run configuration
Task WEB-52568 Update bundled TypeScript to 4.4
Task WEB-53042 TypeScript 4.5: ECMAScript Module Support in Node.js
Bug WEB-53183 'Use directory import when index.js is available' option doesn't work when re-export
Bug WEB-52762 pnpm: incorrect completion and auto-imports for Node.js built-in classes
Bug WEB-51447 "Use .js extension for module names" setting is not used for Javascript or Typescript
Bug WEB-50464 TypeScript: Cannot use paths without baseUrl
Bug WEB-40844 pressing Ctrl+Shift+Enter after key, value pair in object literal should insert comma
Bug WEB-53370 Deno LSP does not work for .tsx files ("Typescript JSX" file type)
Unit TestsBug WEB-48664 Test runner with WSL does not highlight failed assertions etc.
Bug WEB-47606 WSL 2: Jest Coverage tool window not showing any stats
Bug WEB-53519 Missing highlighting on gutter for covered by Jest/Mocha tests code lines
Bug WEB-52461 Jest: "Click to update snapshot" link fails with "Failed to prepare target. null" when using WSL node interpreter
Bug WEB-53632 Karma + Node.js 17: can't connect to karma server. There is no server listening on port 9876
AdministrationBug DBE-14418 MySQL users, modify object - grants show triple question marks ('???')
Code GenerationBug DBE-14339 sqlite3 syntax near EXPRESSION requires (EXPRESSION)
Bug DBE-14209 File -> New -> Shema Dialog has invalid layout
Code HighlightingBug DBE-14509 Unknown database function ARRAYAGG
Bug DBE-14518 Inspection issue "Unknown Database Function..."
Bug DBE-14528 "ANY" function is not recognized
Bug DBE-14549 Deterministic collation option is not recognized in Postgres dialect
Bug DBE-14517 Not all of Postgres 11 options for CREATE AGGREGATE are recognized
Bug DBE-12112 SQL Parameter hints do not show for functions
Bug DBE-12694 Exasol HASHTYPE
Bug DBE-14206 Invalid SQL inspection: condition xxx is always 'true'
Feature DBE-14311 Add support for UDFs in ClickHouse
Bug DBE-7547 Incorrect “always false” inspection in SQL
Bug DBE-10929 False warning when inserting column with same name as table
Bug DBE-14349 Invalid inspection: "Expression is always null"
Feature DBE-14291 Support defining user table functions in BigQuery
Feature DBE-14280 Support "TOP" syntax for Snowflake
Coding AssistanceBug DBE-14356 Subquery shortcut
ConnectivityBug DBE-14451 Informix DB - run keep alive query results in error
Feature DBE-13947 Add the Google User Account authentication type for BigQuery
Data Editor/ViewerUsability DBE-14545 "0 columns selected" in popup when I delete column in CSV table view
Bug DBE-13979 Data Editor: unable to edit column with daterange PostgreSQL data type.
Bug DBE-14112 Error: invalid input value for enum with underscore (_) preceded/escaped by pound (#)
Usability DBE-14233 Database dropdown won't open unless mouse click is under data columns
Usability DBE-14516 Cell size indicator
Bug DBE-14484 View as transpose is reset when i go back by mouse nav buttons
Bug DBE-14278 PostgreSQL bit string display issue
Bug DBE-7770 Incorrect results in DateTime columns when using DataGrip with Clickhouse
Bug DBE-14283 Can not paste integer values into 'UNSIGNED INT' columns
Bug DBE-13546 Clickhouse: nested arrays in map column are not displayed properly
Data Import/ExportBug DBE-14471 Import table: Invalid type conversion for bit varying (n) is set to varbit
Bug DBE-14473 Import table: in case we import table from one schema to another IDE sets unnecessary default precision for "timestamp/time/timestamp with time zone"
Bug DBE-14480 Import table: incorrect char, bpchar, "char" conversion if to copy in the same data source
Performance DBE-14389 Performance degradation in case of SQLite JSON fields with size ~300 kbytes
Bug DBE-14494 Import table: invalid conversion for geometry types from PostgreSQL to Greenplum and vice versa
Bug DBE-14493 Import table: if to copy table from PostgreSQL to Greenplum IDE sets invalid precision for `numeric` type
Bug DBE-7358 Copying mysql table to another schema generates wrong column types
Bug DBE-10788 Copy table inside one database converts types
Bug DBE-14075 'Copy table to' changes 'float' to 'real' in MSSQL
Database ExplorerBug DBE-14117 Hierarchy of MongoDB fields is broken
Bug DBE-14771 Data source disappears when DBMS is changed
Database MigrationsBug DBE-14665 Incorrect diff for identity column
Bug DBE-14296 Cannot modify or add new columns to tables using Modify Table dialog
Bug DBE-14383 indexes are missing from parent table in Postgres partitioned tables
Cosmetics DBE-14265 Text selection with mouse in Modify DB table fields broken
Bug DBE-12790 Modify Table > drop column > generates create index on deleted column
Files Tool WindowFeature DBE-14298 Add option to exclude project directories from being indexed
IntrospectionPerformance DBE-14531 Stuck introspecting at level 1
Bug DBE-14553 Error encountered when performing Introspect regular database stuff completely: ORA-00918: column ambiguously defined.
Bug DBE-14416 Introspection fails if no access to pg_user table
Bug DBE-14199 Not being able to introspect schema on Cockroach database
Bug DBE-14582 Error when connecting to IBM Db2 z/OS - THE SQL STATEMENT IS NOT SUPPORTED
Bug DBE-14606 DB tool: introspecting MySQL 8.0.15 database fails with "Unknown table 'APPLICABLE_ROLES' in information_schema"
Bug DBE-14276 Database plugin no longer supports queries with database name
Bug DBE-14286 Can't see "base for" / "based on" in table definition when tables in different schemas
Bug DBE-14287 Option 'no inherit' does not present in DDL for table
Feature DBE-14297 Snowflake database integration: add support for streams
Bug DBE-14639 Exception "Argument for @NotNull parameter 'name'" when introspecting Oracle server objects
Navigation & SearchBug DBE-13089 "Find usages" does not look for usages in routines
PL & DDL EditorBug DBE-14310 "Synchronize" doesn't synchronize
Query ConsoleUsability DBE-7070 MS SQL Can I suppress showing date and time for each string while using PRINT
Bug DBE-14215 Quoted user parameters do not work in BigQuery
Bug DBE-14084 In-editor results not separating by queries
Run ConfigurationsFeature DBE-12590 Respect data source color in run configuration UI
Schema DiffBug DBE-9350 Compare routines source code via ctrl-d
Bug DBE-14436 No source code for rules
Services Tool WindowUsability DBE-12538 Annoying: automatic focus on Services when query is finished
Feature DBE-12265 Option to control Services tool window behavior
  • No labels