Child pages
  • IntelliJ IDEA 2021.3 (213.5744.223 build) Release Notes
Skip to end of metadata
Go to start of metadata
No subsystemBug IDEA-281332 Python Interpreter widget doesn't work when Markdown file is open in Preview Only mode
Bug IDEA-146360 Disable run line markers for injected files
Bug IDEA-282707 IDEA 2021.3 NullPointerException in LspServerManager
Exception IDEA-280424 SOE at
AndroidBug IDEA-281716 java.lang.UnsatisfiedLinkError: Can't load library: .../layoutlib/data/mac-arm/lib64/libandroid_runtime.dylib
Bug IDEA-281780 Navigation editor does not work
Build. Built-in (JPS)Bug IDEA-278932 Java compilation fails on JDK 6 and JDK 7
Bug IDEA-282231 Compilation fails with message `java: Compilation failed: internal java compiler error'
Build. GradleBug IDEA-278350 Should be able to create a valid gradle project for Java 17 project
Bug IDEA-277695 RunAnything: "." and "./" are recognized as Gradle commands
Exception IDEA-275459 NPE on com.intellij.openapi.externalSystem.service.execution.configuration.ExternalSystemRunConfigurationEx tensionManager$Companion.writeExternal(ExternalSystemRunConfigurationExtensionManager.kt:52)
Bug IDEA-280294 "Invalid Gradle JVM configuration" for Gradle 7.3 and JDK 17
Bug IDEA-280774 New `exploded_war` task should be generated more carefully
Bug IDEA-280385 'Reload all gradle projects' removes maven annotation processor in same project
Bug IDEA-277444 Gradle task run configuration: cannot paste into text field when completion is shown
Build. MavenBug IDEA-169048 Maven integration enables Annotation processors
Performance IDEA-273726 Out of Memory error when reading Maven index
Bug IDEA-281436 Maven Indexes - too many pooled threads created
Bug IDEA-268521 Java Project in WSL2 /target/classes does not exist
Bug IDEA-279761 Extra colon in maven tool window
Build. Package SearchUsability IDEA-282015 Not ideal ordering of quickfixes for an outdated dependency version
Code Analysis. DuplicatesBug IDEA-262587 Duplicate extraction is not suggested after Method extraction
CoreUsability IDEA-280910 Do not show welcome screen on starting IDE with gateway url
Support Request IDEA-281472 Recent regression in CodeStyleSettingsProvider requires getIndentOptionsProvider() to be overridden to include "Tabs and Indents" tab, but that's scheduled for removal soon...
Core. DebuggerBug IDEA-279755 Evaluated values aren't updated in New Run/Debug UI
Bug IDEA-281842 Inline watches: "Set value" and "Add as inline watch" options disappear from the popup on Linux
Core. IDE SettingsBug IDEA-280814 Method chains settings are ignored when updating to 2021.3
Bug IDEA-281327 Inlay hint settings don't open from context menu
Cosmetics IDEA-280642 Inlay hints settings: remove right margin from preview
Bug IDEA-280498 IDE antialiasing setting resets on restart
Bug IDEA-280720 New inlay hints: these settings are not searchable
Core. InstallationBug IDEA-283217 "Data sharing" dialog has not rendered html tag
Core. LicensingUsability IDEA-281812 Hide "IDE authorization token" input field and "Check Token" bottom when the IDE fails to launch browser for Login/Trial
Bug IDEA-282717 IDEA 2021.3 RC NullPointerException from ClientAwareComponentManager
Core. Platform APIBug IDEA-279127 ComponentManagerImpl.unregisterComponent should remove the component from serviceInstanceHotCache
Core. Plugin ManagementBug IDEA-279700 Cannot cast class to itself after dynamically updating plugin through balloon popup
Bug IDEA-279479 Internal IDE error right after updating my plugin to latest version
Bug IDEA-279451 Dynamic plugin update issues
Bug IDEA-279931 Do not suggest already ignored plugins
Bug IDEA-280107 Class cast exception caused by dynamic loading during plugin upgrade
Core. ProfilerFeature IDEA-271400 Differential Flame Graphs
Task IDEA-281429 Colors for Snapshot Diffs
Core. Quick DocumentationUsability IDEA-280982 [Regression] Quick Documentation window steals focus during code editing. "Auto update from source" is gone.
Exception IDEA-280813 CCE at com.intellij.lang.documentation.ide.impl.DocumentationTargetHoverInfoKt.injectedThenHost
Exception IDEA-282063 java.lang.NullPointerException: element.text must not be null
Usability IDEA-282246 Shortcut to opening quick doc keeps tool window tab with open documentation
Bug IDEA-282593 IndexNotReadyException in DocumentationProvider
Cosmetics IDEA-282417 Rename title of documentation window
Bug IDEA-280750 Documentation tool window ignores new background color when changing theme to dark / light
Usability IDEA-280184 Documentation Component: "Adjust Font Size" should be dumb-aware
Bug IDEA-280509 Documentation popup is shown over autocompletion window
Bug IDEA-280749 Documentation tool window: unable to switch to the previous doc page
Core. Run. ConfigurationsBug IDEA-282189 Run configuration templates are missing
Bug IDEA-197080 Select box of Run/Debug Configuration in Navigation Bar Toolbar is empty when deleting the last item of a specific template, "Add Configuration..." is shown in the dropdown instead of another configuration
Bug IDEA-280925 Regression: Configuration editor doesn't save folders
Core. Run. TargetsFeature IDEA-268786 Container name of docker run target support
Bug IDEA-280608 Docker: Cryptic "unable to resolve docker endpoint" error due to incorrectly detected path to certificates
Bug IDEA-280935 Run Targets: Can't finish creating new ssh target with existed ssh connection
Core. SSHBug IDEA-281956 Deployment based on SSH configuration utilizing OpenSSH agent and config complains about "host no found"
Bug IDEA-281116 Remote SSH server version is not shown in logs
Usability IDEA-239091 Allow OpenSSH config to be enabled or disabled in authentication types "key pair" and "password"
Feature IDEA-277305 Support Windows 10 ssh-agent
Bug IDEA-281819 SSH warning about an unknown host key is shown like the key has been changed
Bug IDEA-248772 SSH configuration doesn't consider empty password to be valid
Bug IDEA-281132 Set client identity in SSH
EditorBug IDEA-281047 Block caret allows no continuous selection after scrolling down
Bug IDEA-281339 Block caret random text selection and "new line" selection at line end
Exception IDEA-275403 Throwable: Light files should have PSI only in one project
Editor. Diff and MergeBug IDEA-282202 Empty github pull request/space code review diff window after IDE restart
Bug IDEA-269841 Empty diff frame after IDE restart
Editor. FormatterBug IDEA-280816 internal code analysis of Rider parses .editorconfig incorrectly
Editor. Intention ActionsTask IDEA-282911 Deprecate IntentionAction.invokeForPreview and LocalQuickFix.applyFixForPreview
FrameworksBug IDEA-280574 HttpClient: Can't remove HttpRequest Run Configuration from ServicesView
Frameworks. GrpcFeature IDEA-279112 Create `what's new` description for grpc features in http client
Exception IDEA-280805 GRPC: On open grpc http file get Cannot load class in grpc plugin
Frameworks. MicronautBug IDEA-282474 Micronaut: UI Blocked on MnCacheableLineMarker class init
Frameworks. QuarkusException IDEA-280026 Quarkus: Get AssertionError: QUTE_FILE on open qute file
Bug IDEA-280029 Quarkus: Qute. Can't comment some lines in qute file
Bug IDEA-281414 Quarkus Qute: IOOBE while editing a template
Bug IDEA-281400 Quarkus Qute: empty sections are not supported
Bug IDEA-281016 Quarkus: No completion for Qute built-in command
Exception IDEA-280330 Quarkus: Get UnsupportedOperationException in quarkus plugin on copy open spec file from o
Bug IDEA-279968 Qute: mutiple enum values are not supported in IN
Bug IDEA-279969 Qute: provide color settings for braces and brackets
Bug IDEA-279967 Qute: IS is not highlighted with when / else on cursor
Bug IDEA-279971 Qute: include and insert are not supported
Feature IDEA-279970 Qute: provide braces matcher for () parentheses
Bug IDEA-279966 Qute: Unexpected tokens error in typesafe template
Bug IDEA-281397 Quarkus Qute: eval section is not suppported
Frameworks. ReactorBug IDEA-281545 Helidon: Mutiny inspection and quick fix shown in Helidon code
Bug IDEA-281050 Reactive streams: warning is shown even when boundedElastic scheduler is used
Bug IDEA-279457 Reactor: Throw statement in Reactor flatMap operator does not work for Flux concatMap, switchMap and flatMapSequential
Feature IDEA-276605 Reactive Streams: support blocking subscribe inspection for Mutiny
Bug IDEA-279458 Reactor: incorrect return inserted after quick fix for Throw statement in Reactor flatMap operator in Kotlin
Bug IDEA-276018 Reactor: Inappropriate 'subscribe' call inspection incorrectly reports Fire-and-Forget pattern
Frameworks. SeleniumFeature IDEA-281078 Selenium: provide new project template with Selenium 4
Feature IDEA-240932 Selenide: Highlight shouldHave(text("")) as error
Feature IDEA-281213 Selenide 6.0 in new project templates
Frameworks. SpringBug IDEA-280003 Spring: unable to inject JpaContext
Bug IDEA-281282 Spring Data: reactive repositories: Publisher<T> should not be reported as an invalid return type for query methods
Bug IDEA-249322 Spring Boot: enum value with underscore can be used in YAML with dash
Bug IDEA-280453 Spring Data: the projection records used in queries can't be renamed
Bug IDEA-280431 Spring: injection point from the record doesn't have icon in the gutter navigation popup
Bug IDEA-280380 Spring: the @Component-annotated record is shown as used always
Performance IDEA-280635 Spring Boot facet configuration opening takes long time in case of imported/multiple configs
Bug IDEA-281284 Spring Data: Reactive repositories: Publisher<T> using as a query method parameter type should not be reported as error
Bug IDEA-282701 Spring: Customize Spring Boot... action disappeared from the facet configuration dialog
Bug IDEA-280745 Spring Boot: spring.config.import support: the properties from the imported YAML files are not resolved from @Value annotations
GraziePerformance IDEA-282252 High CPU usage as grammar checking always checks the whole file
Groovy. GrailsBug IDEA-280782 Cannot create Grails 5 project from New Project wizard
JavaBug IDEA-280912 Incorrect "Experimental Feature Alert" for Java 17 - Sealed types, always-strict floating-point semantics
Java. Code CompletionBug IDEA-281000 Completion suggests `final` after abstract in java 17+
Java. Code CoverageBug IDEA-281195 ClassFormatError when running tests with coverage in IDEA 2021.2.3 and OpenJDK 11 on Windows 10 using Gradle
Java. DebuggerBug IDEA-280752 debugger.positionManagerFactory order is not used
Bug IDEA-280967 Inline debugger nodes may be stuck at collecting data
Usability IDEA-281129 Evaluate is showing error (VM is not paused by breakpoint) even without trying to evaluate
Java. InspectionsBug IDEA-280534 Constant conditions & exceptions. False positive "Result of 'getComment().equals(tag.getComment())' is always 'false'"
Bug IDEA-281767 'Method is too complex to analyze by data flow algorithm' for simple method with loop and pattern matching in instanceof
Bug IDEA-281151 Use '@SuppressWarnings("tainting")' to suppress errors from 'Non-safe string is passed to safe method' inspection
Bug IDEA-280187 Inspections not consistent with IntelliJ IDEA
Bug IDEA-277894 Incomprehensible warning when using recursive generics and CheckerFramework's annotations
Java. Intention ActionsBug IDEA-280667 Converting a static final String to AtomicReference<String> doesn't ripple to references to that String
Feature IDEA-280422 Add a quickfix to enlarge the scope of dependency module in case of unresolved reference
Bug IDEA-281446 No "convert to method reference" for enum constructors! Oh no!
Java. JavaFXBug IDEA-266524 JavaFX Scene Builder on IntelliJ labels are unrecognizable on macOS
JavaX. JPA QLBug IDEA-139605 'elements' is highlighted in red in valid HQL
Bug IDEA-280070 Micronaut Data: @Query(..) : '(' or <input parameter> expected, got 'elements'
Lang. JSONFeature IDEA-281703 JSONPath: provide keys and functions completion for expression head
Bug IDEA-281681 JSONPath: repeated asterisks are reported as error
Lang. MarkdownBug IDEA-280724 Markdown Tables: top-right column control not getting active on hover when created
Feature IDEA-278353 Rename Generate action in the context menu to Insert and make it action group.
Usability IDEA-280722 Markdown Tables: table size can't be selected with keyboard arrows
Bug IDEA-280583 Injected code gutter Run line markers can't be executed
Bug IDEA-281673 TraceableDisposable$DisposalException: Editor is already disposed
Exception IDEA-280812 Markdown Tables: IndexOutOfBoundsException at com.intellij.util.text.ImmutableText.outOfRange
Bug IDEA-281650 Table of improper size is generated
Bug IDEA-280728 Markdown Tables: Table borders are broken on column swap
Bug IDEA-280804 Floating toolbar appears collapsed
Bug IDEA-279937 Markdown: the floating toolbar doesn't appear for the last line in file
Bug IDEA-280844 Markdown Tables: table grid is not extended smoothly
Bug IDEA-280199 Floating toolbar is not hidden after closing tabs with keyboard shortcut
Cosmetics IDEA-281241 Change color of "Insert Table" action in Darcula
Bug IDEA-282221 Markdown Mini-toolbar is distracting when using keyboard navigation
Bug IDEA-279665 Mermaid graphs not working
SpaceCosmetics IDEA-277066 Beutify error message when merge request already exists
Bug IDEA-281018 Space: Cannot clone project by https if HTTP password wasn't deleted
Bug IDEA-280689 Hide Space actions in log for projects not hosted on Space
Exception IDEA-281579 Space Code Review: NPE when submitting a non-existing branch in the branch filter
Cosmetics IDEA-273981 Two same Space icons looks weird on history toolbar
Cosmetics IDEA-280685 Make "9+" label on read/unread status prettier
Usability IDEA-280705 Show read/unread status for file's parent folder
Usability IDEA-280915 Add tooltips for collapse / expand resolved discussions controls
Bug IDEA-277258 'null' error message when cancelling "Merge Request Branch" dialog
Usability IDEA-277949 Code Reviews: Show/Hide reviewers works extremely slow
Usability IDEA-275855 Add entry point for Merge Requests in main menu
Usability IDEA-273989 Select Next/Previous Tab action should be available during indexing
Bug IDEA-280660 Diff shows error for added files in the Create Merge Request mode
Bug IDEA-268650 Space Review: show old path for moved files
Bug IDEA-280943 Mentions are not working with the disabled Markdown plugin
Tools. DockerFeature IDEA-199206 Add support for ":Z" flag in Bind mounts for docker
Bug IDEA-280682 Docker. Push image dialog. Don't display it with scrollbars
Bug IDEA-280913 Docker. Images completion: Two strings are combined into one instead of showing the completion list
Bug IDEA-215742 Connecting Docker Integration causes dockerd to spike to 100% cpu
Bug IDEA-277333 Docker. java.nio.file.NoSuchFileException at pointing not-existing context folder
Exception IDEA-272618 java.lang.Throwable: Blocking SSH method called from the dispatch or write thread at calling Terminal for the first time
Bug IDEA-277286 Docker. FileChooser. java.nio.file.InvalidPathException at refresh after creating new folders
Bug IDEA-280676 Docker. Container, "Show Processes" action displays wrong list with duplicated strings
Bug IDEA-280671 Docker Registry. Settings. Change the Address to empty or "space" example by choosing "JetBrains Space" registry
Bug IDEA-281844 Minikube setting does not apply in GoLand
Bug IDEA-279801 Red code for `--platform` option for FROM command in Dockerfile
Bug IDEA-280128 Provide possibility to add/edit docker registry from the Services view
Bug IDEA-281172 DockerCompose file. Resolve/ find usages doesn't work for services from the complex `depends_on` section
Bug IDEA-264715 Custom docker TCP socket setting is not persisted
Bug IDEA-248584 Support --ssh build option for Docker
Bug IDEA-281025 Docker. WinOS. Connection to Minikube doesn't work
Feature IDEA-178126 Mark file as Dockerfile if it is used as Dockerfile in run config
Feature IDEA-269719 Secrets argument not supported while build docker image
Bug IDEA-278320 Parsing of "host_ip" in docker-compose.yaml fails
Bug IDEA-282686 Docker. Smart delete volumes with dependencies doesn't work.
Bug IDEA-280916 Docker. Registries. Images completion. Empty list if we call completion after or before "/"
Usability IDEA-281940 Docker. Settings: don't check/show red error for Minikube till this option is chosen
Bug IDEA-212068 Docker. File Chooser. Files tab is empty for images based on alpine, photon, busybox images
Bug IDEA-282389 "Cannot run program "minikube": error=2, No such file or directory" red exclamation error on default Docker settings
Usability IDEA-282141 Docker Registry. Connection to my space registry fails
Bug IDEA-282654 Dockerfile run configuration error with context path specified
Tools. HTTP ClientCosmetics IDEA-280591 HttpClient: Do not add # to request name in servicesView for requests with only ### or with empty name
Bug IDEA-281434 HTTP Client: gRPC examples do not executed, because gRPC cannot find proto file
Feature IDEA-237751 Show request names instead of index in Request field inside run configuration
Bug IDEA-156476 REST Client Tool doesn't save cookies
Bug IDEA-278832 Cookie didn‘t send to server when I use Http file in Idea2021.2.2
Bug IDEA-281242 HttpClient: Run request options doubled on gutter click
Usability IDEA-239339 Order of contextual menu items for environments changing order in HTTP client
Tools. KubernetesBug IDEA-280707 K8s. Green screen in the background at changing the path to the kubeconfig file
Usability IDEA-281096 Kubernetes: Confusing Processing configuration change notification on project open
Feature IDEA-245674 Provide possibility to inject language for ConfigMap/SecretMap key values in the Kubernetes view
Tools. TerminalBug IDEA-271438 API for optional persistent terminal tabs
User InterfaceBug IDEA-280319 Status bar no longer displays popup action's description
Bug IDEA-272559 "Recent Find Usages" shortcut does not invoke "Recent Find Usages" popup
Cosmetics IDEA-231276 Hint in Search Everywhere is cut on macOS Catalina
User Interface. Alerts, NotificationsBug IDEA-279902 Arrow navigation works in the opposite direction for buttons in the UI
User Interface. Favorites/BookmarksBug IDEA-282250 Next/Previous line bookmark action shortcut does not navigate in Editor if Bookmarks tool window is closed
Usability IDEA-280568 Bookmarks window: go to source shortcut not supported
Bug IDEA-270270 Next Bookmark doesn't work across different files.
User Interface. Find UsagesBug IDEA-276558 Find usages doesn't work for injected languages anymore with 2021.2 upgrade
User Interface. Find, Replace, UsagesBug IDEA-281183 Editor actions don't work in console's 'find' panel
Bug IDEA-280620 Regex search does not match
User Interface. FocusBug IDEA-281015 On macOS, sometimes project window is not brought above other project windows when stopping on breakpoint
User Interface. Keymap, ShortcutsBug IDEA-280119 Keymap editor shows actions with `use-shortcut-of` under "Other" group
User Interface. NavigationUsability IDEA-259571 Ability to disable deleting files from Recent Files with backspace
User Interface. New Project WizardBug IDEA-282058 HTML Wizard prompts for folder/project name twice.
User Interface. PluginsBug IDEA-278567 Buy plugin link from detail page can opens multiple links
User Interface. Search EverywhereFeature IDEA-280849 Train the very first model for ranking files in Files tab of Search Everywhere
User Interface. TabsUsability IDEA-280818 Add tooltip for three-dots button on the tab bar
Bug IDEA-280819 "More" button overlaps tab label in Code Style Settings
Bug IDEA-280795 Toolbar buttons are hidden under "Show Hidden Tabs" button in the terminal toolwindow header when tabs overflow the header
Bug IDEA-280831 "More" and three-dots buttons on editor tabs pane are overlapped if "Show pinned tabs in a separate row" is on and there are no pinned tabs
Bug IDEA-280792 Three dots button remains visible after closing all tabs
Bug IDEA-280802 Grey line appears after first line in the Editor when opening tabs from second row
Bug IDEA-215364 Cannot see last open tab in vertical tab bar when there are too many tabs to fit on screen
User Interface. TouchbarBug IDEA-277249 Debugger buttons on touchbar don't appear at all
Version ControlTask IDEA-281701 Disable Code Author inlay hints in 2021.3
Version Control. GitUsability IDEA-280478 Focus moves away from Git log when opening and closing diff
Bug IDEA-280471 Push Commits up to Here: push rejected after update if the branch was not up-to-date before calling Push Commits up to Here
Bug IDEA-277226 Restoring a Diff moved to a separate Window could produce an empty frame.
No subsystemPerformance WEB-52612 WebSymbolElementDescriptorsProvider causes noticeable slowdown when Find Usages is invoked in big project
Bug WEB-53358 Can't specify path to Deno or Deno cache via browse action
Bug WEB-52811 ESLint with WSL seems to not working anymore on Webstorm 2021.3 EAP
CSSBug WEB-52720 Tailwind 2.2+: CSS classes completion doesn't work in *.php files (but works in *.blade.php)
Feature WEB-48542 Tailwind Plugin autocomplete for ERB / Rails helpers
Bug WEB-53225 Stylelint Plugin is Incompatible with Stylelint v14 + SCSS
Performance WEB-52607 Node process started by the Tailwind CSS plugin consumes much CPU
Feature WEB-53033 CSS, TailwindCSS Support in EJS Files
Feature WEB-53150 Tailwind autocomplete support for mustache .hbs files
Feature WEB-53186 Tailwind Autocomplete class names for Smarty (.tpl) with JIT enable
Bug WEB-53264 Build 213.5281.x: deadlock (infinite loop) with TailwindDocumentationProvider in thread dumps
Feature WEB-25289 CSS/SCSS/SASS/LESS: add option "Add a space at comment start"
File WatchersFeature WEB-38925 File Watchers: support programs running on WSL
HTMLException WEB-53086 Exception while editing injected HTML fragment
JavaScriptBug WEB-52058 Click on path with alias, for opening js-file, is opening less-file instead (perhaps because name is same) (Webstorm)
Task WEB-53276 Enable completion for top-level await in JS and TS files
Feature WEB-52552 Support import assertions proposal
Feature WEB-53257 Add advanced configuration for using file extensions in module imports
Usability WEB-51859 Method chaining not working - unrecognised fluent methods, even when they return this.
Bug WEB-53258 Add an asterisk when pasting code snippet into a selected comment
Feature WEB-51282 Support "imports" field of package.json
Bug WEB-28630 NodeJS Modules imports going relative outside of package scope
Bug WEB-51842 Default modules re-exported as named are imported as default if "Use paths relative to the project, resource or sources roots" is enabled
Usability WEB-53220 In JSX context, existing variables/parameters should have higher priority in completion than HTML live templates with matching names
Bug WEB-53235 Structure pane for JS exports in ES6 modules
Bug WEB-53436 WebStorm 2021.3 Beta copies wrong value
Bug WEB-53031 Wrong type mismatch errors are reported for React "useContext()"
Performance WEB-52693 high CPU and memory usage causing low memory notification
Bug WEB-53266 Generate getter/setter for Javascript fails with private class fields
JavaScript. FormatterBug WEB-53385 Apply 'ES6 import/export braces' option to import assertion
Feature WEB-52752 Add "block comment at first column" option for JavaScript
Feature WEB-51952 Provide a code style option to add white spaces within JSX comments
JavaScript. FrameworksBug WEB-29900 Angular: provide completion of CSS properties in style property binding
Bug WEB-52834 Vue: `ref` attribute value in script setup should refer to local variable if one is defined
JavaScript. InspectionsBug WEB-53439 Invalid JavaScript warning: Condition is always false since types 'String' and 'StringConstructor' have no overlap
Bug WEB-52450 Use file extension in imports if type: "module" is used in package.json
Cosmetics WEB-53208 Typos in Inspection Descriptions for "JavaScript and TypeScript"
LintersBug WEB-53256 ESlint: update the bundled `.eslintrc-schema.json`
Node.jsBug WEB-53454 Windows: hidden command line when running Node.js run configuration
Bug WEB-48930 Yarn PnP: Webstorm doesn't find node dependencies on Windows with WSL
Bug WEB-52837 Run Script with npm throws errors in WSL
Bug WEB-53230 Don't show 'Update package to the latest version' after performing the action
Bug WEB-53378 Can't install dependencies if package.json file isn't in the root folder and use Node.js interpreter via docker-compose
Feature WEB-40509 Support "exports" field of package.json
Feature WEB-52942 Support Vagrant interpreter via Node.js Run Targets, e.g. Mocha, Jest, npm
Bug WEB-53381 Can't run tests with node via docker-compose without setting up File sharing
ProfilingBug WEB-41449 NullPointerException when attempting to load heap snapshot
TypeScriptUsability WEB-49388 Monorepo: prohibit auto-import from the same package using absolute paths
Bug WEB-53336 deno: "configuration.applicationArguments must not be null" error when running run configuration
Bug WEB-52986 Show anonymous properties in the structure panel
Bug WEB-50464 TypeScript: Cannot use paths without baseUrl
Task WEB-52568 Update bundled TypeScript to 4.4
Task WEB-53042 TypeScript 4.5: ECMAScript Module Support in Node.js
Bug WEB-51447 "Use .js extension for module names" setting is not used for Javascript or Typescript
Task WEB-53053 TypeScript 4.5: type Modifiers on Import Names
Bug WEB-53183 'Use directory import when index.js is available' option doesn't work when re-export
Unit TestsBug WEB-48664 Test runner with WSL does not highlight failed assertions etc.
Bug WEB-47606 WSL 2: Jest Coverage tool window not showing any stats
Bug WEB-52461 Jest: "Click to update snapshot" link fails with "Failed to prepare target. null" when using WSL node interpreter
Code GenerationBug DBE-14339 sqlite3 syntax near EXPRESSION requires (EXPRESSION)
Bug DBE-14209 File -> New -> Shema Dialog has invalid layout
Code HighlightingBug DBE-14349 Invalid inspection: "Expression is always null"
Bug DBE-12694 Exasol HASHTYPE
Bug DBE-14206 Invalid SQL inspection: condition xxx is always 'true'
Feature DBE-14311 Add support for UDFs in ClickHouse
Bug DBE-7547 Incorrect “always false” inspection in SQL
Bug DBE-10929 False warning when inserting column with same name as table
Feature DBE-14291 Support defining user table functions in BigQuery
Feature DBE-14280 Support "TOP" syntax for Snowflake
Coding AssistanceBug DBE-14356 Subquery shortcut
ConnectivityFeature DBE-13947 Add the Google User Account authentication type for BigQuery
Data Editor/ViewerUsability DBE-14233 Database dropdown won't open unless mouse click is under data columns
Bug DBE-14112 Error: invalid input value for enum with underscore (_) preceded/escaped by pound (#)
Bug DBE-14283 Can not paste integer values into 'UNSIGNED INT' columns
Bug DBE-14278 PostgreSQL bit string display issue
Data Import/ExportBug DBE-7358 Copying mysql table to another schema generates wrong column types
Bug DBE-10788 Copy table inside one database converts types
Database MigrationsBug DBE-14296 Cannot modify or add new columns to tables using Modify Table dialog
Bug DBE-14383 indexes are missing from parent table in Postgres partitioned tables
Cosmetics DBE-14265 Text selection with mouse in Modify DB table fields broken
Bug DBE-12790 Modify Table > drop column > generates create index on deleted column
Files Tool WindowFeature DBE-14298 Add option to exclude project directories from being indexed
IntrospectionBug DBE-14416 Introspection fails if no access to pg_user table
Bug DBE-14199 Not being able to introspect schema on Cockroach database
Bug DBE-14287 Option 'no inherit' does not present in DDL for table
Bug DBE-14286 Can't see "base for" / "based on" in table definition when tables in different schemas
Bug DBE-14276 Database plugin no longer supports queries with database name
Feature DBE-14297 Snowflake database integration: add support for streams
Query ConsoleUsability DBE-7070 MS SQL Can I suppress showing date and time for each string while using PRINT
Bug DBE-14215 Quoted user parameters do not work in BigQuery
Bug DBE-14084 In-editor results not separating by queries
Schema DiffBug DBE-9350 Compare routines source code via ctrl-d
Services Tool WindowUsability DBE-12538 Annoying: automatic focus on Services when query is finished
Feature DBE-12265 Option to control Services tool window behavior
  • No labels