Child pages
  • IntelliJ IDEA 2021.2 EAP (212.4535.15 build) Release Notes
Skip to end of metadata
Go to start of metadata
No subsystemBug IDEA-271853 Actions on save: Don't run dumb aware actions on save in dumb mode
Usability IDEA-272388 Performance Testing plugin: open support request leads provides non-rider link
Exception IDEA-272139 "java.lang.Throwable: Class com.jetbrains.packagesearch.intellij.plugin.maven.MavenProjectModuleType must be not requested from main classloader"
Exception IDEA-272029 com.intellij.serviceContainer.AlreadyDisposedException: Cannot create com.intellij.openapi.externalSystem.ExternalSystemModulePropertyManager because container is already disposed
AndroidBug IDEA-258250 Android SDK Manager fails on apple slicon (archer 64)
Build. Built-in (JPS)Bug IDEA-272409 Skipping Scala files without a Scala SDK in module(s) untitled814 when added scala sdk
Build. GradleBug IDEA-227167 Gradle composite build does invoke wrong target if includedBuild task is executed in gradle view and fails with exception
Bug IDEA-200371 IntelliJ Gradle integration selects wrong settings.gradle and build.gradle when having sub projects
Bug IDEA-207003 Gradle Composite Build included build has the same root project name as the main build
Build. MavenBug IDEA-271495 Suddenly Java version is no longer recognized by the build
Build. Package SearchBug IDEA-272032 [EA-296951] Rerunning code highlight may cause exceptions
Bug IDEA-271229 PackagesTable can create invalid NavigatableArray in getData()
Exception IDEA-271528 Exception on inspections pass
Code Analysis. InspectionBug IDEA-272286 org.eclipse.jdt.annotation.NonNullByDefault should not add @NonNull to Local variables
CoreBug IDEA-271664 Intellij Idea fails to start with VPN enabled
Core. IDE SettingsCosmetics IDEA-271651 Actions on Save: Show warning under `Upload to default server` when Deployment sever is not configured
Cosmetics IDEA-271786 Settings | Tools | Actions On Save | Rearrange Code: duplicated 'XML' entry in the 'configure arrangement rules' drop-down
Task IDEA-216133 Migrate macOS environment reader from Python
Core. IDE Settings. SharingBug IDEA-272508 Got all my toolchains removed
Core. IndexingTask IDEA-268796 Cleanup indexing diagnostics on cache invalidation
Task IDEA-269170 Indexing: add navigation link to project indexing diagnostics from Menu/Tools
Core. InstallationBug IDEA-272075 Last Used date shows "51 years" on mac for empty directories
Usability IDEA-271458 IDE should display notification when there are no leftover directories to cleanup
Exception IDEA-272114 Unhandled AccessDeniedException if try to clean-up the directory without required permissions
Core. Platform APIBug IDEA-270799 AboutPopupDescriptionProvider information no longer displayed on About screen
Bug IDEA-264792 Broken ToolWindowManagerImpl#unregisterToolWindow(String id)
Core. Plugin ManagementBug IDEA-272022 2021.2 EAP doesn't offer a restart after installing language pack plugin
Bug IDEA-271398 MissingResourceException after dynamic plugin installation
Bug IDEA-271488 PluginException: Cyclic service initialization: interface='com.intellij.openapi.keymap.KeymapManager'
Bug IDEA-271835 Class com.intellij.spring.persistence.integration.hibernate.SpringXmlHibernateSessionFactory must be not requested from main classloader of com.intellij.spring plugin
Bug IDEA-272165 `Restart` action in "Plugin list has changed" balloon requires smart mode
Exception IDEA-272436 PluginException: Class must be not requested from main classloader of com.intellij.spring.boot plugin [Plugin: com.intellij.spring.boot]
Exception IDEA-271785 Throwable: Class com.intellij.spring.el.SpringELLanguage must be not requested from main classloader of com.intellij.spring plugin
Core. Project SettingsBug IDEA-272025 IDEA fails to open project if it has incorrect value of 'type' attribute in 'orderEntry' tag in one of its iml files
Core. Run. TargetsCosmetics IDEA-260898 Run Targets. SSH wizard small fix
Core. SSHBug IDEA-272423 Broken ProxyJump emulation through ProxyCommand
Editor. Diff and MergeBug IDEA-269981 Shortcuts for Compare Previous/Next File don't work after first invocation
Editor. Editing TextBug IDEA-271601 Suppress scratch file intention in VCS dialogs
Frameworks. MicronautBug IDEA-272249 Micronaut: dashes in the groupId of a new project cause errors on attempt to create packages structure
Frameworks. SpringFeature IDEA-267075 Spring: add shared indexes consent option to Spring Initializr wizard
Feature IDEA-235953 Support @DynamicPropertySource methods in Spring 5.2.5
Bug IDEA-264916 Spring Integration: false autowiring error report for the @ServiceActivator-annotated method parameter
Bug IDEA-269955 Spring Security: role references are not inserted when mvcMatchers() method is used
Bug IDEA-269890 Group name in Spring Initializr project wizard incorrectly forbids entering dashes
Exception IDEA-271255 Exception "Cannot create class com.intellij.spring.el.parser.SpringELParserDefinition" which prevents proper indexing and analysis of classes
JavaBug IDEA-272190 Run configuration doesn't comply with modulepath/classpath distinction
Java. Code CoverageBug IDEA-272192 Error running tests with coverage: java.nio.file.FileAlreadyExistsException
Bug IDEA-269908 Detect tests covering line doesn't work with new tracing mode
Bug IDEA-266840 Cancel of prompt about outdated coverage removes all recorded coverage data
Performance IDEA-272132 Filtering default constructor takes a lot of time during coverage report loading.
Java. DebuggerBug IDEA-271607 Empty threads combobox (with read only attach)
Bug IDEA-271799 Unexpected JDWP Error: 41 on StepOver while debugging
Java. InspectionsBug IDEA-271523 False positive warning "Casting 's1.toArray()' to 'T[]' will produce 'ClassCastException' for any non-null value"
Java. RefactoringsUsability IDEA-271910 Rename "Generify" action to "Convert Raw Types to Generics"
Java. Tests. TestNGBug IDEA-271436 IntelliJ hides most of the failures for TestNG SoftAssert
JavaX. CDIUsability IDEA-255033 CDI tool window: Select the corresponding element(module) in the opened CDI view by clicking on the gutter
Usability IDEA-259905 CDI: Merge scope and injection gutter icons on class
JavaX. JPABug IDEA-272468 JPA: insert Entity Graph references to EntityManager.createEntityGraph
JavaX. JavaEEFeature IDEA-260092 Java EE: Provide a global refactoring to migrate to Jakarta
Task IDEA-270723 Java EE: add Hibernate to Jakarta libraries in New Project wizard
LocalizationBug IDEA-272098 Move to message top level
Plugin Development (DevKit)Bug IDEA-271874 Devkit: add main plugin as implicit dependency for module.xml
Bug IDEA-272164 Unable to run/debug plugin projects
Bug IDEA-271845 Devkit: use <dependencies/plugin|module> in calculating dependencies
Exception IDEA-271754 "Update IDE from sources" fails with MissingMethodException: eachFileRecurse
SpaceBug IDEA-271153 StringIndexOutOfBoundsException on editing comment with mention
Bug IDEA-270552 Notification about necessity to login to Space does not disappear after logging in
Bug IDEA-272593 Comment field is not focused when opened (e.g. by Reply link)
Usability IDEA-269081 Show number of draft comments on Accept Changes/Wait for Response button on review details page
Usability IDEA-271971 Space details: cannot hit Accept/Wait for Response buttons and review id link by keyboard
Cosmetics IDEA-271958 Space review: don't pluralize author and reviewer when there is the only one item
Cosmetics IDEA-271839 Space review acceptance status indicator looks blurred
Task IDEA-272142 Space details: add Leave review button
Tools. DockerBug IDEA-272228 Docker. No easy possibility to remove volumes without dependencies
Bug IDEA-272035 Docker. Image run configurations: Command Preview is absent
Bug IDEA-271920 Docker. Delete a volume: Correct the confirm dialog content
Bug IDEA-271873 Docker. Make it not possible to edit the output of the inspect action
Bug IDEA-271913 Docker. Rerun via Service view of a Dockerfile/Image doesn't include run config changes
Bug IDEA-262553 Docker. Dockerfile/Image run configurations: Command Preview is absent in the new options UI
Bug IDEA-272112 Docker-compose. Impossible to remove project name option
Bug IDEA-272064 Docker. Don't create a new run configuration by re-run with -p option
Bug IDEA-271868 Docker compose: "Enable synchronization with Services view" doesn't work
Cosmetics IDEA-271720 Docker. Container log tab: Fold log actions layout is inconvenient
Cosmetics IDEA-271836 Docker-compose. The icon of a new compose app looks line it is a simple container
Tools. HTTP ClientFeature IDEA-271808 HTTP Client: provide Generate HTTP Request intention for implicit web references
Tools. TerminalFeature IDEA-151206 SSH terminal add a new connection
User InterfaceBug IDEA-271374 Resizing tool windows in "Undock" view mode does not work/work wrong
Bug IDEA-271735 No plugin counter is visible in High Contrast theme
Bug IDEA-271330 Settings "Drag-and-drop with Alt pressed only" broken
Bug IDEA-271833 Wrong buttons order on touch bar for dialogs
Bug IDEA-271380 Selected item in the completion popup is unreadable with Mac OS Light theme
Bug IDEA-271880 Alerts: remove mnemonics from title and support line breaks in message
Usability IDEA-271622 "Quick definition" popup can't be moved
Cosmetics IDEA-270694 Some components background color looks wrong in macOS Light theme
Cosmetics IDEA-263411 Fix System settings layout
Cosmetics IDEA-271858 Detected sdk first element selection looks weird
Task IDEA-265429 Set minimal width and height of Welcome Screen
Task IDEA-272290 Don't show What's new page in the IDE on fresh install
User Interface. Action SystemBug IDEA-269626 "Compact View" button doesn't work
Bug IDEA-269110 "Configure inspections" does nothing in 212
User Interface. Find, Replace, UsagesBug IDEA-272143 "Show usages" popup is not closed with Esc key if Scope combobox is focused
Bug IDEA-268598 "Replace" is not invoked with Cmd+R if focus is in Find field
Bug IDEA-270761 Find in Files defaults to a "Directory" scope after serching in File
User Interface. NavigationBug IDEA-270835 Mnemonics in Switcher window not working with Ctrl+Shift pressed
Version Control. GitBug IDEA-271726 VcsException: Cannot run program "gpg": error=2, No such file or directory
Bug IDEA-272205 Git GPG Signing: cannot turn off commit signing when no private keys were found
Task IDEA-269501 Git GPG Signing: provide link to help when gpg-signing fails
Exception IDEA-272443 NPE at git4idea.config.GitExecutableDetector.getBashExecutablePath
Version Control. GitHubBug IDEA-272485 GitHub PullRequest: remote branch isn't detected on new PR creation
Bug IDEA-264976 Pull requests: reset filter should not set state:open
Bug IDEA-267608 Create PR is just doing a git push without actually creating a PR in PyCharm 2021.1
Bug IDEA-264973 Pull Request: Do not suggest to reset filters when the search query is empty
Bug IDEA-251331 Comments in diffs are not visible
Bug IDEA-264970 Create Pull Request: do not duplicate error about empty pull request on creation
Bug IDEA-270034 GitHub tab is not refreshed after authorization
Usability IDEA-264210 GIthub Pull Requests: New Pull Request tab is not focused after login
Cosmetics IDEA-264987 Create Pull Request: new text for "no changes" warning
Cosmetics IDEA-264969 Create Pull Request: use default font color for the errors, red icon is enough to attract attention
Cosmetics IDEA-263303 GitHub Pull Requests: beautify API error messages
Version Control. Local HistoryBug IDEA-271318 Search in Local History: Do not show diff if no results found
Usability IDEA-271431 Search in Local History: no keyboard navigation between items
Usability IDEA-271317 Search in Local History: Ctrl+F should set cursor into search field
No subsystemFeature WEB-50133 Enable "Copy/Paste with imports" feature for "require"-s
Feature WEB-51419 Web-types: show icons in documentation
Feature WEB-51150 Launching Microsoft Edge
Feature WEB-45326 Chromium-based browsers Edge and Opera are assigned to non-Chrome family in "Settings → Tools → Web Browsers" window
Bug WEB-51406 Memory leak editing Vue 2.x Typescript SFC
Bug WEB-50998 "js.namespace.index" seems to produce keys with quotes sometimes
Build toolsBug WEB-50500 Gulp tool window button on sidebar not available after phpStorm restart
Bug WEB-50622 Grunt tool window no longer persists between IntelliJ launches
CSSFeature WEB-51071 text-decoration-thickness is marked as Unknown CSS property
Bug WEB-50930 Unknown pseudo selector 'file-selector-button'
Bug WEB-51099 Support all steps function keywords for "transition-timing-function"
Bug WEB-50961 Add support for missing generic font families
DebuggerPerformance WEB-50909 Webstorm High Memory Usage Over Time (Suspected Memory Leak)
Usability WEB-48157 Node.js 15+: Step Into enters "async_hooks" on debugging async/await functions
Usability WEB-50777 Inline value of an array with an empty string looks unusual in Debugger
JavaScriptFeature WEB-51357 Autocomplete/highlighting/navigation broken when importing TypeScript file via a *.js suffix from a JavaScript file
Bug WEB-50015 Incorrect javascript import path using aliases when working on WSL2
Bug WEB-49054 No code completion in dynamic classNames in template strings after interpolation
Bug WEB-51311 Ctrl+Click on break inside switch statement jumps to the wrong place
Bug WEB-50897 live templates on keywords completion ignore semicolon termination preferences
Bug WEB-50996 Copying imports from a type declaration should respect types of import in a file
Bug WEB-50949 for-await-of doesn't unwrap promise type
Cosmetics WEB-51320 Update description for the ECMAScript 6 language level
Exception WEB-51366 Adding require import causes an exception: java.lang.Throwable: Threading assertion. psiFile
Exception WEB-51350 auto-import useState causes exception
JavaScript. FrameworksFeature WEB-26714 Add support for the classnames library when using React
Bug WEB-51339 Pattern info is shown in the Quick doc popup
Bug WEB-51335 Named slots shows 'Unrecognised Slot name'
Bug WEB-51329 No documentation & resolve for the 'template' tag in .vue
Bug WEB-51338 Unknown events (@input, @focus)
JavaScript. InspectionsBug WEB-51312 Add details/examples to "Pointless statement or boolean expression" inspection description
Bug WEB-50898 "Method expression is not of Function type" when accessing a prototype method using Symbol
Bug WEB-51274 "Mismatched query and update of collection" inspection not working correctly
JavaScript. RefactoringBug WEB-51370 Substring isn't removed from a function name when removing a state name
LintersFeature WEB-51288 Update bundled JSHint to 2.13
Live EditBug WEB-51423 Live reload stop working (Throwable: Timeout on waiting for client)
Node.jsBug WEB-51500 NPM install fails with StackOverflowError exception
Bug WEB-51389 Use https to fetch npm package versions
TypeScriptFeature WEB-51449 Add tsconfig.test.json to the list of associated file names for TypeScript Configuration Files
Bug WEB-51392 Update tsconfig.json schema to include ES2021 target.
Bug WEB-48764 React + typescript, React class component with generic type raise expected syntax error
Code CompletionFeature DBE-11902 On optimistic left join completion, improve priorization
Code FormatterFeature DBE-12690 Add formatting option for Place ON/USING under JOIN indented
Bug DBE-13485 Datagrip always wraps "Create or Alter Function" statement regardless of Code Style setting
Code GenerationBug DBE-13462 COMMENT and LANGUAGE positioned wrong
Code HighlightingFeature DBE-13476 ClickHouse: support EXPLAIN/EXPLAIN PIPELINE statement syntax
Bug DBE-10782 Wrong coalesce inspection detects in ClickHouse Dialect
Bug DBE-12304 Clickhouse correct SQL query shows an error in editor
Bug DBE-12343 ClickHouse toDecimalN could not take such arguments false positive
Bug DBE-13458 Clickhouse asof and semi join support
Bug DBE-13477 Support Redshift recursive CTE syntax
Bug DBE-12838 The Exasol IGNORE NULLS Option for Analytics Functions is not recognized
Bug DBE-13471 Support Full-Text Search capabilities of MS SQL Server 2016/2017/2019 / Azure SQL Database
Bug DBE-12682 clickhouse dialect don't support EXCEPT and REPLACE in select query
ConnectivityBug DBE-13468 Athena results in java.lang.NullPointerException
Data Editor/ViewerBug DBE-13450 Invalid query to fetch first referenced row(ERROR: operator does not exist: integer = character varying)
Bug DBE-13361 Image Preview of Blob only showing text in query results
Data Import/ExportFeature DBE-13448 export table data to the excel would lost precision for bigint field : 导出数据格式为bigint的数据到excel表格,数据精度丢失
Bug DBE-13328 Too big SQL query causes error when table is exported to Excel
Bug DBE-13449 Default exported file name doesn't use comment above query
Database MigrationsFeature DBE-12357 Additional option 'purge' in drop confirmation dialog for Oracle
Explain PlanBug DBE-13473 Failed to explain execution plan while using ClickHouse
IntrospectionBug DBE-13443 Presto: "primary keys not supported SQLException" after force refresh
Bug DBE-13425 Azure connection loses databases when refreshing a single database
Performance DBE-13427 Introspection queries needs to be optimized
SQL ResolveFeature DBE-12263 Unable to resolve object type 'SimpleAggregateFunction' for Clickhouse DDL
  • No labels