Child pages
  • IntelliJ IDEA 2021.1 (211.6693.111 build) Release Notes
Skip to end of metadata
Go to start of metadata
No subsystemFeature IDEA-263914 Support YK profiler for M1
Bug IDEA-263699 [new run config UI] Tooltips for command line fields blinking bug
Bug IDEA-263337 FileSystemException : Incorrect function in wsl
Bug IDEA-251691 NPE in com.intellij.openapi.editor.impl.EditorMarkupModelImpl$5.beforeActionPerformed when trying to implement coverage-by-test in custom plugin
Bug IDEA-262891 Webforms project doesn’t load, UI freezes
Bug IDEA-265522 WSL2: Cannot assign requested address: bind when /etc/resolv.conf changed
Bug IDEA-263502 Spock tests fail to start with java.lang.ClassNotFoundException: junit.framework.ComparisonFailure
Bug IDEA-262934 Cannot read clipboard data
Task IDEA-263881 Update choose runtime UI
Security Problem IDEA-261832 Possible DoS
Exception IDEA-262614 com.github.dockerjava.api.exception.BadRequestException at running a Dockerfile with ARGs before FROM
Exception IDEA-262420 Search everywhere throws exception: com.intellij.diagnostic.PluginException: Created extension classloader is not equal to plugin's one.
AndroidBug IDEA-264473 Android SDK is not being added automatically to the project structure
Bug IDEA-262429 Java library module class is unresolved in Android module
Bug IDEA-263893 Android plugin's database inspector does not work
Bug IDEA-246348 When open AVD Manager for Android Emulator an error
Bug IDEA-262057 Android designer. ClassNotFoundException: androidx.appcompat.R$styleable (Apple Silicon)
Bug IDEA-237650 Can't connect to database in emulator
Bug IDEA-264378 Android Layout Editor does not show issues in the issues panel
Bug IDEA-264009 Migrate bintray URLs to cacheredirector in Android Plugin
Bug IDEA-256189 Error on project opening: Duplicate content roots detected
Bug IDEA-261495 During the android app test, idea cannot open some files in the simulator
Bug IDEA-261070 Android Plugin should not show "Gradle files have changed..." in projects with no Android modules
Bug IDEA-264333 AssetStudio: no default ic_launcher icon
Bug IDEA-261858 IDEA 2021 EAP unable to debug on physical device via "Attach Debugger" action
Usability IDEA-231313 IDEA can't launch Android Emulator on Windows when IDEA itself is started from idea64.exe (OK when started from idea.bat)
BuildFeature IDEA-263998 Show warning if gradle script uses gradle-bintray-plugin
Bug IDEA-264085 BindException: Cannot assign requested address error When trying to build any project on WSL 1
Build. Built-in (JPS)Bug IDEA-260359 WSL: All files are up-to-date when compiling modified project
Build. GradleBug IDEA-264439 Gradle project on WSL: error message in the case of using the JDK located on Windows
Bug IDEA-264051 The specified Gradle installation directory '\\wsl$\Ubuntu-20.04\wsl$\Ubuntu-20.04\wsl$\Ubuntu-20.04\wsl$\Ubuntu-20.04\wsl$\Ubuntu-20.04\wsl$ ...
Bug IDEA-262879 Gradle project sync never completes
Bug IDEA-264107 Gradle groovy scripts debugging doesn't work for projects on WSL
Bug IDEA-254884 Tests not compatible with gradle configuration cache
Usability IDEA-263144 Double confirmation when opening a new Gradle project and not trusting it
Usability IDEA-260728 Gradle init script is not configuration cache compatible
Build. MavenBug IDEA-263481 java.lang.ClassNotFoundException: org.jetbrains.idea.maven.server.RemoteMavenServer36 when trying to open maven project located in WSL
Bug IDEA-261414 Maven distribution installed via package manager does not supported on WSL
Bug IDEA-262404 Can't import Maven Project in 212.17, Project is untrusted
Code Analysis. InspectionBug IDEA-192702 Clicking Edit Settings in Insepction Results does nothing
Bug IDEA-130333 Inspection settings: scopes order is not saved
Task IDEA-260048 Show Inspections results in Problems tool window
CoreBug IDEA-258519 IDE fails to open a project from the command line if another project is already opened (perhaps Windows-only)
Usability IDEA-229543 Command-line launcher should not ask which window it's supposed to open the project in
Core. DebuggerBug IDEA-262878 Click on toolbar button "Evaluate expression" no longer uses editor selected text
Bug IDEA-263014 XLightBreakpointPropertiesPanel#myCustomPropertiesPanelWrapper uses wrong layout
Core. DiagramsBug IDEA-211984 UML Diagrams: any action performed from diagram can't be Undone though Undo is shown enabled with correct last action name
Bug IDEA-265037 UML diagrams: Kotlin: constructor is shown for object
Bug IDEA-264693 Java Enterprise toolwindow: CDI Dependencies diagram is opened without layout
Bug IDEA-264029 UML diagrams fonts are too big in 2021.1 Beta when comparing with 2020.3.2
Bug IDEA-263119 JPA: ER Diagram opened not centered
Bug IDEA-263112 JPA: ER Diagram is not refreshed after adding the attribute
Bug IDEA-264684 JSF Navigation diagram: on unchecking the ShowSelectedNodesWithDependencies the resulted diagram layout is incorrect
Bug IDEA-263877 Spring Application Context Dependencies Diagram: on Show Library Models action the layout is not applied
Bug IDEA-265035 UML diagrams: Kotlin: tooltip over package item shows wrong statistics
Bug IDEA-264679 JSF Navigation diagram: no layout on diagram opening
Bug IDEA-264697 CDI Dependencies diagram is always empty
Bug IDEA-264695 CDI Dependencies diagram action appears outside the Diagrams menu group and causes exception only
Bug IDEA-264690 Spring Beans toolwindow: the beans graphs appear without layout
Bug IDEA-263868 Spring Diagrams: with `Show neighbours of the selected nodes` option the results of selection change is ugly (no layout)
Usability IDEA-264691 Add the ApplyCurrentLayout action to the context menu for the toolbar-less diagrams
Exception IDEA-264067 NPE at com.intellij.uml.java.dependency.JavaClassDependencyAnalyzer$MyDependencyCollectingVisitor.isCollect ion
Exception IDEA-263561 ISE at com.intellij.spring.perspectives.diagrams.SpringDiagramNode.getIdentifyingElement
Exception IDEA-262492 CCE at com.intellij.uml.presentation.DiagramPresentationModelImpl.getNodeTooltip
Exception IDEA-263489 IAE at com.intellij.diagram.presentation.DiagramState.restoreTo
Exception IDEA-262187 Throwable at com.intellij.psi.impl.file.impl.FileManagerImpl.checkHasNoOtherPsi
Exception IDEA-263255 NPE at com.intellij.uml.java.JavaUmlDataModel.createEdge
Exception IDEA-263414 Throwable at com.intellij.psi.impl.file.impl.FileManagerImpl.checkHasNoOtherPsi
Exception IDEA-263875 ICSE at com.intellij.uml.UmlFileEditorImpl.getData
Exception IDEA-222077 UML diagram: attempt to add note to diagram popup causes IOOBE
Exception IDEA-264064 NPE at com.intellij.openapi.graph.impl.view.FastNodeCellRendererPainter.paintNode
Exception IDEA-264685 Throwable: Read access is allowed from event dispatch thread or inside read-action only
Core. IDE SettingsBug IDEA-264893 [Choose Runtime dialog] there is no ability to add JBR if it isn't located in ~/Library/Java/JetBrainsRuntime/ folder
Bug IDEA-261869 Choose Runtime - polishing
Usability IDEA-259872 After IDEA update: Propose to use bundled runtime if configured runtime is older
Cosmetics IDEA-227451 Settings > Editor > Code Style > Java > Arrangement items disappear or move on mouse hover
Core. IndexingBug IDEA-264500 VFS cache can't recover automatically after content storage corruption
Bug IDEA-265212 IntelliJ IDEA 2021.1 beta 4 cannot resolves JDK classes
Bug IDEA-263504 Invalidate Caches dialog: reconsider the defaults
Bug IDEA-262899 Can't find a file using Search Everywhere/Goto File
Bug IDEA-263200 Shared index trying to attach non-existing chunk
Bug IDEA-262428 Do not show public CDN URLs
Core. InstallationBug IDEA-262571 clion.sh doesn't allow symlinks
Bug IDEA-263043 Idea fails to start from path contains spaces on linux
Usability IDEA-263364 App started from IDEA cannot access Bluetooth on macOS Big Sur
Usability IDEA-264060 2021.1 update journey is broken as it requires multiple "check for updates" to produce a fully working installation
Usability IDEA-252209 Avoid broken installation on Linux when distributive is unpacked into the same folder
Core. LicensingFeature IDEA-263678 License Panel: hide Evaluate radiobutton for CWM plugin
Bug IDEA-265183 Broken license dialog UI when user has several licenses
Task IDEA-263484 Docker Desktop causes wrong host name to be sent while obtaining floating license
Core. Platform APIBug IDEA-264897 A race condition that leaves daemon hanging
Core. Plugin ManagementBug IDEA-253978 "File type conflict found" on every IDEA start - 3rd party plugins
Exception IDEA-262837 Plugin installation failure - StackOverflowError in findPluginExtensionPointRecursive
Core. ProfilerBug IDEA-264221 "Profiler error: Invalid file format" after second profiling session in WSL
Bug IDEA-264587 Profiler executors unavailable in run toolbar after list of profiler configurations is changed
Core. Project SettingsBug IDEA-257476 Modules get lost on changing the 'store generated files externally' option for multimodule maven project
Bug IDEA-99596 Manifest file located under 'main/java' root in Maven module is shown in artifact editor even if it won't be really copied to artifact
Bug IDEA-257175 IJ resets content root to the incorrect directory
Bug IDEA-264113 Cannot change library scope second time after clicking "apply" in project structure dialog
Bug IDEA-260372 Maven projects can't be built after disabling the (not used) dependency
Bug IDEA-262946 New EAP prints many errors to the log about duplicating LibraryIds
Bug IDEA-222640 Library configured via Project Structure For New Project dialog appears incorrectly in the new projects preventing new project libraries configuring
Usability IDEA-116209 Allow to directly specify a jar's META-INF/MANIFEST.MF file
Exception IDEA-262073 java.lang.RuntimeException: Unable to get registered settings of #VueCodeStyleSettings when enabling Vue.js plugin with opened .vue file
Core. Run. ConfigurationsBug IDEA-264143 The root node is configurable in the Run/Debug Configurations dialog
Bug IDEA-264202 [new run config UI] invoking "command line" fields mnemonics don't move focus during indexing
Usability IDEA-263886 [new run config UI] Change 'modify option' hotkey on macOS to be Option-M
Usability IDEA-246087 [new run config UI] Improved keyboard navigation to fields
Exception IDEA-245958 Throwable: Directory index may not be queried for default project
Exception IDEA-262425 PluginException: Cyclic service initialization: RunManager
Core. Run. TargetsBug IDEA-262162 Run Targets: first introspection for WSL target fill JDK path incorrectly
Bug IDEA-261979 SSH target startup is very slow because of files syncing
Bug IDEA-262784 Run targets: SSH stops working after installing rsync on Windows
Bug IDEA-262446 Run Targets: SSH: contents of coverageNargs file is not uploaded
Bug IDEA-262289 Run Targets: SSH: attempt to run with coverage fails
Bug IDEA-264934 Eternal throbber in target creation wizard
Bug IDEA-264026 Run Targets: IDEA coverage/profiler stopped working on Docker target
Bug IDEA-264928 RunTargets. Quarkus. It fails to run on docker target
Performance IDEA-262457 Choose run configuration popup is slow on IntelliJ IDEA project
Usability IDEA-262430 Run Targets: SSH allow to select the Gradle home using the path chooser
Usability IDEA-265188 Show popup `Please add /Applications/GoLand.app to Resources -> File Sharing` when GoLand runs from /Applications/ path on macOS
Cosmetics IDEA-258266 Run Targets. Cosmetic UI bugs
Task IDEA-262277 Remote targets for Go Build: Introspection completed with error. Getting environment failed with exit value 1
Task IDEA-258455 Run Targets: download files from target
Exception IDEA-259929 java.nio.file.NoSuchFileException in Docker plugin on pulling the image by creation a run target
Core. Task ManagementUsability IDEA-254355 Provide an ability to assing shortcuts for "Start Timer" and "Stop Timer" actions
EditorBug IDEA-264440 Wrong bold font is used in editor
Bug IDEA-260496 Font Settings: dropdown uses wrong font when Monospaced selected
Bug IDEA-262699 Wrong variant of Iosevka is used for italics
Bug IDEA-263938 Character moves a little when typing, looks like bounce effect
Bug IDEA-258454 Reader Mode options are not applied for opened library file until reopening
Cosmetics IDEA-262330 Font Settings: adjust top of dialogue box (remove extra margins)
Task IDEA-260492 Font Settings: modify "Typography Settings" to a group that collapsed by default
Task IDEA-262329 Font Settings: improve search within font dropdown
Editor. Code CompletionBug IDEA-260190 Lookup popup window is incorrectly sized when there is only one item
Editor. Code Completion. MLBug IDEA-261990 "Machine Learning Code Completion" plugin visits .class files
Editor. Diff and MergeBug IDEA-262442 Diff detects changes incorrectly when add empty lines
Bug IDEA-257651 Diff view detects big diff but change was only small
Editor. Editing TextFeature IDEA-119451 Extend line selection via keyboard shortcut
Bug IDEA-264147 Chosen font variation is ignored in some dialogs
Bug IDEA-262434 Italic font is broken for Courier in 2021.1 EAP
Usability IDEA-260463 EditorTextFieldActionPromoter hides IdeaVim actions
Editor. FormatterBug IDEA-205999 "else" and "{}" indentation
Bug IDEA-157294 Exporting Code Style profile fails when name is not filesystem-friendly (e.g. it contains a slash in *NIX systems)
Bug IDEA-189817 Code format breaks long URLs in code comments
Editor. Intention ActionsBug IDEA-263507 Line join silently changes semantics for nested ifs
FrameworksBug IDEA-265383 IntelliJ cannot download thymeleaf library via Framework Support
Bug IDEA-262890 New project Wizards for JVM Frameworks: selected features can't be deleted if they are filtered out by search
Bug IDEA-262894 New Project Wizards for the JVM Frameworks: don't allow to select unavailable dependencies
Bug IDEA-265146 Frameworks: StackOverflowError in New Project wizards of Spring and Java EE
Usability IDEA-262888 Unified New Project Wizards for the JVM Frameworks: speed search should not be invoked on typing
Usability IDEA-263580 JavaEE Wizard. Save SDK selection for the next project creation
Frameworks. LombokBug IDEA-262693 lombok @Builder is broken
Performance IDEA-264579 Autocomplete is slow with the latest updates with Lombok plug-in querying indices
Frameworks. MicronautFeature IDEA-260140 Micronaut: load supported Java versions for new project wizard from server-side
Feature IDEA-246320 Micronaut: show version of Micronaut for new projects
Feature IDEA-233827 Micronaut: Fold internal stack frames for HTTP server
Bug IDEA-235429 Micronaut: setter methods of @ConfigurationProperties beans are reported as unused
Usability IDEA-257948 Micronaut project generating: check the selected java version to match the set project jdk
Frameworks. OSGiFeature IDEA-138550 Support bnd-maven-plugin
Frameworks. QuarkusFeature IDEA-262757 Quarkus: add Kotlin language and Gradle Kotlin options to new project wizard
Feature IDEA-233828 Quarkus: Fold internal stack frames for HTTP server
Bug IDEA-265675 Quarkus: application port is not shown in Services in debug mode
Bug IDEA-261500 Quarkus: false-positive CDI bean inspection for @Localized interfaces
Bug IDEA-265509 Docker container is not removed after stopping Quarkus run configuration on Docker target
Bug IDEA-255635 Quarkus: new quarkus project freezed on downloading funqy extensions
Bug IDEA-263335 Quarkus: Can't create new quarkus project with google cloud extensions
Frameworks. SeleniumUsability IDEA-264273 Selenium: provide Export and Copy actions for Page Object editor
Usability IDEA-263297 Selenium: support multiselect for Add Element to Page Object action
Frameworks. SpringFeature IDEA-242594 Spring Initializr: Open HELP.md automatically when a new project is created with the wizard
Feature IDEA-169655 Spring MVC model variables don't work with Kotlin
Feature IDEA-262592 "Navigate to the Spring bean declaration(s)" gutter icon not show for the library bean
Feature IDEA-199674 Spring MVC with Kotlin: kotlin configuration classes are not recognized
Bug IDEA-263751 Spring Cloud: cannot inject CircuitBreakerFactory bean
Bug IDEA-263615 Select in Spring Beans doesn't work for Sprint Boot auto configuration classes
Bug IDEA-186130 Spring MVC: parse ViewResolverRegistry explicit prefix()/suffix() calls
Bug IDEA-263811 Spring Initializr: Application Class Name is not changed for new project
Bug IDEA-192941 Spring Data: False positive warning on @Cacheable annotation in repository interface
Bug IDEA-222139 SpringMVC+Thymeleaf. Intellij idea cannot recognize view declaration
Bug IDEA-261959 Language injection for SQL queries does not work for the new extension methods in Spring Framework
Bug IDEA-262331 Configuring Thymeleaf ViewResolver via Kotlin is not recognized by the IDEA
Usability IDEA-263923 Spring Initializr. Cannot reset too long server URL
GroovyBug IDEA-26403 Maia 92.65 and 92.81 overwrite and destroy existing Grails run configurations on startup.
Infrastructure. Build ScriptsBug IDEA-262910 Duplicate entries in IDEA source archive
Java. Code CompletionFeature IDEA-262315 Complete current statement doesn't work for switch expression
Bug IDEA-262124 No primitive type suggestions after annotation
Bug IDEA-263178 Cannot accept boolean completion using exclamation mark in JSPs
Performance IDEA-261235 code completion in lamda is slow
Java. Code CoverageBug IDEA-263087 Coverage throws VerifyError on inline function with default args
Java. Code FormattingBug IDEA-227688 Unsetting keep line breaks option doesn't join the lines in method call on reformat
Java. DebuggerBug IDEA-263498 Argument for @NotNull parameter 'shortcutSet' of com/intellij/openapi/actionSystem/AnAction.setShortcutSet must not be null
Java. Extract MethodBug IDEA-263865 in-place extract method: send started/done events to `RefactoringEventListener`
Bug IDEA-262792 Extract method doesn't keep the new method name
Bug IDEA-262513 In-place extract method: rename method template is not created if Android plugin is enabled.
Java. InspectionsBug IDEA-262701 Dataflow analysis fails to detect overflow in expression
Bug IDEA-239837 Suspicious test for oddness not triggers when parentheses added
Bug IDEA-264394 equals and hashCode are not paired: do not report on Java records
Bug IDEA-262774 Text on tabs in 'Declaration has JavaDoc problems' inspection options is invisible
Bug IDEA-263589 Unused declaration entry point configuration dialog window hides some options
Java. Profiler. CPUBug IDEA-262219 Async-profiler does not start in wsl
Usability IDEA-253842 Inform that not all jfr events are shown
Java. RefactoringsBug IDEA-231997 Convert anonymous to inner should replace diamond operator with actual type
Performance IDEA-227870 IDEA freezes when moving files
Java. Tests. JUnitBug IDEA-263902 Run Configuration validation doesn't work when started from gutter icon
JavaX. AppServers. Google App EngineBug IDEA-264010 Unable to create new projects when Google App Engine plugin is enabled
Bug IDEA-261854 Cannot setup Google App Engine. Settings are not being saved after restart
JavaX. AppServers. JBossCosmetics IDEA-128947 JBoss is now officially named WildFly
JavaX. AppServers. WebSphere/LibertyFeature IDEA-254745 Add Liberty to the WebSphere application server option
Exception IDEA-255496 NPE at com.intellij.j2ee.webSphere.deployment.WebSphereDeploymentProvider.getSupportedArtifactTypes
JavaX. CDIBug IDEA-227178 Wrong warning in inspection 'CDI (Contexts and Dependency Injection) | Injection Points Ambiguous Dependencies'
Bug IDEA-245806 CDI: treat the @Named qualifier without value and the @Named qualifier with explicit default value as the same ones on bean injecting
Bug IDEA-260809 CDI inspection error: Serializable is not a decorated type
JavaX. JPABug IDEA-248315 Static string appended to column name in @Table @UniqueConstraint annotations not respected
Bug IDEA-260980 JPA. Ctrl+click on the table name should navigate to the table in the Database view. Now it opens ddl instead of it.
Bug IDEA-167500 Confusing representation of abstract generic classes on ER diagram
JavaX. JavaEEUsability IDEA-263622 JavaEE Wizard. Save App Server selection for the next project creation
JavaX. Web ServicesBug IDEA-264583 Microservices: URL Path rename does not work
Lang. Flash and FlexBug IDEA-262697 Unable to start Flex/AIR app debugging in 2021.1 EAP. Error running 'AppName': Unknown error.
Lang. JSONBug IDEA-261811 JsonPath support: the slice operator [start:end:step] is error-highlighted
Bug IDEA-262273 JSONPath: operators are not correctly highlighted on incremental highlighting
Usability IDEA-262172 JsonPath: provide completion by existing keys inside injected fragments
Usability IDEA-262180 Evaluate JSONPath: the font used for the jsonpath expression field should be the same as the editor one
Lang. MarkdownBug IDEA-260339 Formatting removes cpp code sections from Markdown files
Lang. RegExpBug IDEA-262576 Wrong warning about redundant non-capturing group
Lang. Shell ScriptBug IDEA-261565 Every invocation of a shell script create a new terminal tab
Plugin Development (DevKit)Bug IDEA-262082 Custom Themes: Cannot change any icon
SpaceFeature IDEA-263767 Add Show in Git Log action to the list of commits in Space reviews
Bug IDEA-259762 Space Code Reviews: Back to List doesn't refresh the list
Bug IDEA-246088 Space plugin: handle Share project on Space action being logged out
Usability IDEA-260515 Space: add an action to navigate to Space Code Reviews Toolwindow
Usability IDEA-263342 Shorter titles for code review tabs
Usability IDEA-262455 Always show Space icon on main toolbar
Usability IDEA-262242 Detect that repository belongs to Space using remote urls
Usability IDEA-263632 Better tooltip for Space toolbar button
Tools. DockerFeature IDEA-262611 Support --platform command line option
Feature IDEA-262658 Docker. Provide completion of stages names in case of multiple FROM statements in a Dockerfile
Feature IDEA-261892 Fold stages in multi-stage Dockerfile
Feature IDEA-171374 Docker: Provide completion for image names in the Dockerfile, DockerCompose files
Feature IDEA-179935 Docker: provide completion for the environment variables in the Dockerfile
Bug IDEA-263159 Docker. After an invalid connection all run configs fail until I re-connect to the Docker
Bug IDEA-262633 Dockerfile, Editor, images completion: remove `library/` at tags completion
Bug IDEA-262584 Docker. Dockerfile run configuration, Build options field: completion doesn't work after build options without arguments
Bug IDEA-262419 show running cli command in docker-compose deploy log
Bug IDEA-256721 Docker. Impossible to delete connections from the Services view.
Bug IDEA-263457 Docker. Run hangs after adding "Run built image" section and re-run
Bug IDEA-262881 Docker. Build image creates a run configuration with the "run" section
Bug IDEA-263462 Docker. Remove docker.log file
Bug IDEA-263058 Docker. BuildKit. Context folder always looks at the project folder
Bug IDEA-262568 Docker.Container Deploy log tab: Ctrl+C via keyboard doesn't work
Bug IDEA-263044 Docker. Exclude the current build stage name from the names completion list after `--from`
Bug IDEA-262324 Docker: when buildkit is enabled the image is always built on the Docker desktop, even if other connection is selected
Bug IDEA-262349 Docker-compose run configuration: add an explaining tooltip over each option
Bug IDEA-264653 Docker. Before launch. Compose in compose parent task doesn't run
Bug IDEA-263269 Docker. Support completion for ARGs in Dockerfiles
Bug IDEA-262619 Docker. Deploy Dockerfile with the pointed target never ends
Bug IDEA-263086 Options in Run section aren't persistent between Run configuration reopen
Bug IDEA-263039 Docker. WinOS. BuildKit: it fails to run a container
Bug IDEA-263419 Docker. Dockerfile/Image Run configuration.`Bind mounts` field is not removed at removing the option.
Bug IDEA-263418 Docker. Dockerfile/Image run configuration. Publish all option doesn't work as CLI option
Bug IDEA-263514 Rider does not work with docker rootless
Bug IDEA-262654 Dockerfile, Editor, image tags completion: the result list contains many items which are out of scope
Bug IDEA-234252 DockerCompose: image tags completion doesn't work
Bug IDEA-186080 Typed YAML: when keys are references, completion for them should not suggest existing sibling keys
Bug IDEA-263164 Docker-compose. Impossible to run docker-compose on docker-machine
Bug IDEA-235007 No quotes autocompletion
Bug IDEA-262345 DockerCompose. Run configuration. Scale:`Select Service to Scale` link doesn't add the service into the table
Bug IDEA-262501 Docker. Run Dockerfile with the pointed target fails
Usability IDEA-262806 Docker: recognize Dockerfiles for Quarkus example files
Usability IDEA-262657 Dockerfile, Editor, images completion: auto-appeared completion list contains not correct items list
Usability IDEA-196666 Add --rmi flag support for docker-compose integration
Cosmetics IDEA-264539 Docker. Connection Settings: the url for Rootless socket on UNIX systems overlaps the option name
Exception IDEA-263927 Exception when open Docker settings on windows
Exception IDEA-262627 com.github.dockerjava.api.exception.BadRequestException at running FROM without arguments by disabled BuildKit
Tools. HTTP ClientBug IDEA-239228 REST does not work with manually configured ssh tunnel SOCKS5 proxy
Bug IDEA-260741 HttpClient: Completion for SSLconfiguration on windows comes with wrong "/"
Exception IDEA-261390 HttpClient: On run request with certificate get java.lang.AssertionError: Wrong line separators: '...y>\n</html>\r\n' at offset 254 exception
Tools. KubernetesBug IDEA-262936 Kubernetes. Editor. Understand "null" value in resource files
Bug IDEA-263575 [kubernetes] java.lang.Throwable: DataContext shall not be created and queried inside another getData() call.
Bug IDEA-261966 Helm. Non-default values files: provide quick-help for the values dialog
Bug IDEA-239812 Kubernetes Plugin prevents normal YAML syntax highlighting.
Bug IDEA-263598 compute.cnrm.cloud.google.com/v1beta1 does not have editable resources
Tools. TerminalFeature IDEA-224561 API for custom highlighting of a found text in Terminal
Bug IDEA-180923 Terminal. Scroll bounce
Bug IDEA-264105 Using 2021.1 beta2, opening a terminal the mouse wheel scroll is not working. This used to work.
Bug IDEA-259452 Too fast scroll in Terminal
Task IDEA-228106 Provide API for getting Terminal cursor coordinates
User InterfaceBug IDEA-263928 Notification balloons do not appear when the corresponding status bar widget isn't displayed
Bug IDEA-262234 Native crash due to uncaught exception NSInvalidArgumentException on several modal dialogs on BigSur
Bug IDEA-263915 "Quick switch scheme" popup mnemonics display as "..." with larger appearance font sizes
Bug IDEA-264220 Initial path under \\wsl$\ is not selected in file tree on opening file chooser dialog
Bug IDEA-113995 Jump list: can't open recent projects that have spaces in paths
Bug IDEA-249791 Switcher cannot display all options
Bug IDEA-263404 EAP user agreement too small to read
Bug IDEA-265418 'Subpixel' mode is default for the Editor on macOS
Bug IDEA-263961 Certain combinations of bookmark icon colors are handled incorrectly
Bug IDEA-87703 Recent files doesn't close when floating Navigation bar appears
Bug IDEA-227657 "Recent files" popup has UI glitches after removing file
Bug IDEA-263574 Choose Boot Runtime: "Failed to set boot JDK runtime" error on attempt to select JDK in Download JDK dialog
Bug IDEA-261894 Editor tabs for modified files that contain errors have wrong text color
Bug IDEA-239130 The IDE gets stuck after cancelling opening a project
Bug IDEA-262148 UI inspector shortcut triggers Alt+Click action on the inspected component
Bug IDEA-262477 Submenu is not shown on mouse hover
Bug IDEA-261715 Modal progress dialog is hidden on ESC, but Task is not cancelled
Bug IDEA-265019 StackOverflowError on action update
Bug IDEA-261723 Welcome Screen size grows after each restart so that its frame doesn't fit the display
Usability IDEA-72536 Switcher shortcuts changing is confusing
Usability IDEA-187018 Make F2 "Go to next highlighted error" work in Recent Files/Recently Edited files popups
Usability IDEA-264770 [Choose Runtime dialog] Minimize button closes the Setting IDE boot runtime pop-up and IDE looks like frozen until downloading will be completed
Cosmetics IDEA-262259 Action text is not aligned with mnemonic in popups
Cosmetics IDEA-262729 cosmetic file watcher message
Cosmetics IDEA-262243 Mnemonics color in popups is not changed when the row is selected
Task IDEA-261797 Popups: mnemonics style
User Interface. AccessibilityBug IDEA-257258 camplition popup is not voiced on macOS
User Interface. Action SystemTask IDEA-263205 Action Popups: Disable separate "next step" button
Task IDEA-261330 Action names redefined in IdeUICustomization.projectMessage should be considered in goto action
User Interface. Console ViewBug IDEA-261792 Cannot normally input in Run console
User Interface. ControlsFeature IDEA-212299 Implement Select parent node in UI trees
Bug IDEA-250004 Big Sur: Context menu highlighting breaks if submenu invoked
Bug IDEA-261687 Arrows separators are shown in Copy Path popup
User Interface. Embedded Browser (JCEF)Bug IDEA-262267 Built-in html preview is not rendered from time to time
Bug IDEA-261496 Cancelled Navigation in JCEF preview shows error page
Bug IDEA-264004 JCEF JBCefOsrHandlerBrowser failed to invoke JS when global registry value ide.browser.jcef.jsQueryPoolSize is not set.
Task IDEA-263753 provide ability to configure proxy server for jcef
Task IDEA-262952 allow JBCefBrowser to take focus on show/navigation
User Interface. Find, Replace, UsagesBug IDEA-264313 Find in Files: dots in empty text
User Interface. FocusBug IDEA-263483 focus lost after Reformat code
Bug IDEA-249360 Project View scroll jumps down to the previously selected file with "Always select opened file" when switching from another app
Bug IDEA-209138 Entering/Exiting Full Screen Mode causes the IDE's window to lose focus
User Interface. Keyboard InputBug IDEA-261309 Character is typed in the editor when invoking a dialog through shortcut
Usability IDEA-177432 Switcher shortcut to navigate backwards does not work with combinations other than Shift
User Interface. NavigationBug IDEA-216720 "Ctrl+E" shortcut is displayed in "Recent Files" popup if it was removed from the keymap
Bug IDEA-261860 Navigation to an open file reopens it in active group
Bug IDEA-264890 Recent Files / Switcher chooses the first item by default
Bug IDEA-102409 Switcher with custom shortcut (e.g. Cmd-I) doesn't disappear when modifier released
Bug IDEA-207163 Recently Edited Files popup doesn't have shortcut for switching between RecentFiles and RecentlyEditedFiles
Bug IDEA-264409 Cannot open a recent file in splitted window
Bug IDEA-263874 No mnemonics in Switcher opened with one-key shortcut
Bug IDEA-265505 Backspace doesn't update speed search results in recent files
Usability IDEA-263890 "Recent Files": unexpected focus, does not only filter on files
Exception IDEA-262100 CME at com.intellij.ide.navigationToolbar.NavBarPanel.updateItems
User Interface. Project ViewBug IDEA-257211 Can't navigate to package in external libraries
User Interface. Search EverywhereUsability IDEA-263459 Support screen readers in search dialogs
Version ControlBug IDEA-237029 Selecting text shortcut conflicts with toolwindow resize in Commit toolwindow
Bug IDEA-260241 Ctrl + C copies editor line instead of previous changed chunk content
Version Control. GitBug IDEA-262301 Git Staging Area: don't group by repository changes in a single-root project
Bug IDEA-262518 Cherry-pick with conflict works incorrectly when conflicted file is open in the editor
Bug IDEA-262223 Git Commit Template: respect relative paths
Bug IDEA-263695 Can't commit staged changes on the first Commit toolwindow opening
Bug IDEA-248343 Git Remote add unable to cancel.
Bug IDEA-264428 Git: pressing OK in "Define Remote" dialog does nothing
Usability IDEA-262307 Git Staging Area: allow commit without checking the checkbox when changes from the only one repo are staged
Usability IDEA-262282 Staging operations should not be in the document undo stack.
Support Request IDEA-254998 Failed to start Git process: Unknown WSL distribution (Pengwin - Wlinux)
Exception IDEA-262818 Exception every time then git panel is open
Version Control. GitHubFeature IDEA-142717 GitHub pull request template
Feature IDEA-263016 Allow filtering branches when selecting one to create a PR
Feature IDEA-263015 Ability to start PR creation without opening the toolwindow first
Bug IDEA-264219 Github Pull Requests: file tree on Commits pane gets stuck in loading state on new pr creation
Bug IDEA-263925 GitHub Enterprise: can't view pull requests
Bug IDEA-262621 GitHub Pull Requests: Cannot display item - Icon cannot be found in 'GithubIcons.Branch', class='org.jetbrains.plugins.github.GithubIcons' for events with branch icon in timeline
Bug IDEA-263686 Pull Requests: changing metadata from no assignees to 1 moves the entire right block to the left
Bug IDEA-263510 GitHub Pull Requests: wrong line separators error on editing PR description
Bug IDEA-262590 GitHub Pull Requests: commits with PR links are displayed incorrectly
Bug IDEA-263227 GitHub Pull Requests: wrong branch is preselected in head branch on PR creation if branch checkout was performed while Pull Requests tool window was opened
Performance IDEA-263978 IntelliJ consumes 100% of one core while being idle
Usability IDEA-233137 GitHub Pull Requests: add tooltip to add comment
Usability IDEA-262857 GitHub Pull Requests: no way to switch between Title and Description inputs from keyboard
Usability IDEA-263396 GitHub Pull Requests: New Pull Request tab isn't focused when call Create Pull Request action without opening Pull Requests toolwindow
Usability IDEA-263182 GitHub Pull Requests: add shortcut to Create Pull Request
Usability IDEA-262835 GitHub Pull Requests: no focused item on "New Pull Request" tab opening
Usability IDEA-262613 GitHub Pull Requests: preselect head repo improvements on PR creation in project with multiple remotes
Usability IDEA-262615 GitHub Pull Requests: sort alphabetically head branch list on PR creation
Cosmetics IDEA-264072 GitHub Pull Requests: rename "Create Pull Request" action and button tooltip to "Create Pull Request..."
Cosmetics IDEA-264070 GitHub Pull Requests: add project name on New Pull Request tab
Exception IDEA-262607 GitHub Pull Requests: exception on successful PR creating after failed PR creation
No subsystemFeature WEB-49702 Provide docs for CSSImportRule
Bug WEB-49620 Provide docs for JavaScript global objects
Bug WEB-48451 Vuex symbol resolution not working with namespaced modules
Bug WEB-49598 ('string = is not valid Windows path') when debug Node.js app via interpreter from container
Bug WEB-49225 Quick documentation for some deprecated HTML tags should show warning and tag description
Bug WEB-49530 Quick documentation for pseudo CSS classes is not available in html files
Bug WEB-49900 MDN docs are not available for constructor calls
CSSBug WEB-35215 CSS modules, SCSS/Less: support selectors created using &_suffix
Bug WEB-49387 Show values for CSS properties in the quick documentation popup
DartBug WEB-50043 Dart file move: relative imports become absolute. (Windows only)
DebuggerBug WEB-49996 Throwable + IllegalArgumentException + can't press anything in IDE after Force step into
Bug WEB-50050 BlockingOperationException when debug electron app via npm script
Usability WEB-49896 Rename 'Console' for Node.js
HTMLBug WEB-49690 No documentation for 'onclick' attribute in button tag
Bug WEB-49285 "loading" attribute of "<img>" tag is reported as not allowed
Bug WEB-49654 `type` attribute on HTML 'script'/'style' is marked deprecated, but its not
Bug WEB-49386 Show supported browser versions for HTML tags in the quick documentation popup
JavaScriptBug WEB-37504 Flow: Works a lot worse than before
Bug WEB-49869 Highlighting issue in JSDoc @see tag
Bug WEB-49424 Documentation invoked from JSDoc tag can't render definition part properly
Bug WEB-49499 Highlight correct argument in parameter info when using spread in function calls
Bug WEB-49727 Auto SQL code inject doesn't work with variable in JavaScript string template
Bug WEB-49717 False-positive no overlap for destructured props
Bug WEB-49034 Broken formatting in TSX with HTML "Enforce single quote" + removing trailing commas
Bug WEB-49764 No suggestion to auto-import commonJS module if the module is required in other files
Bug WEB-43935 'Infer JSDoc parameter types from usages' should paste '*' instead of 'any' to JSDoc
Bug WEB-49850 'rulezzz' in suggested completion names
Bug WEB-49699 Type is not correctly inferred when iterating over a collection typed with JSDoc using "for .. of" loop
Bug WEB-49905 Incorrect refactoring rename property (js + jsdoc + ts)
Bug WEB-49462 Type of async function called with `await` is not evaluated correctly
Performance WEB-49859 High CPU usage on file change
JavaScript. FormatterBug WEB-50053 Spaces not removed after parameter property modifiers
JavaScript. FrameworksFeature WEB-43480 Quick documentation for Angular components
Feature WEB-49157 Provide support for Vuex 4 store
Feature WEB-34380 Vue.js: support recognition of CSS classes inside literals in :class bindings
Bug WEB-47477 cmd-click on a $refs in vue script should go to the ref in the template instead of where $refs is defined in the vue code
Bug WEB-44925 No completion for React Native component props with react-native@0.62.2 and higher
Bug WEB-49311 Vue 3 + Vuex 4 - Mutations, actions & getters: wrongly marked as unused
Bug WEB-47706 No props completion for function component with propTypes
Bug WEB-48778 Auto-import doesn't work for components with doc comments
Bug WEB-48085 Code completion and auto-import don't work for Chakra-UI components
Bug WEB-49901 Actions inside vuex 4 modules have no indication of being in use.
Bug WEB-49838 Infinite indexing with Vue plugin (EAP 2021.1)
Bug WEB-49920 Wrong props types validation in Vue 3
Bug WEB-49776 Invalid warning of required attributes for components from Chakra-UI
Bug WEB-49656 'React' is duplicated in completion
Bug WEB-49657 incorrect import suggestions in react+js for React.createElement()
Bug WEB-31701 Vue.js: `ref` attribute is not correctly handled
Bug WEB-48980 Unrecognized regular (not binded) "key" attribute in Vue templates
Bug WEB-47054 Vue: Support properties from super class of a decorated component
Performance WEB-49959 Freezes on vuex completion
Performance WEB-49122 Avoid accessing index if it's not built
Performance WEB-49596 Every press on the mouse right button cause a freezes for a few seconds (approximately: 5s) and is annoying
JavaScript. InspectionsBug WEB-49443 Can be simplified to [...] for (JSDoc + TypeScript)
Bug WEB-49796 "Void function return value used" inspection shouldn't work on IIFE
Usability WEB-46611 Add example to Unfiltered for..in loop inspection description
JavaScript. RefactoringBug WEB-50091 Do not change const to let when applying the 'Replace for...of' intention
Bug WEB-45292 Can‘t Refactor in TypeScript File
LintersFeature WEB-33429 Stylelint: provide a way to specify config file location
Feature WEB-25069 Stylelint: implement auto fixes
Bug WEB-49512 EslintConfigWrapper.RULES leaks references to extensions from unloaded plugins
Usability WEB-49705 "Please specify Node.js interpreter" popups should navigate to Node settings
Node.jsBug WEB-42169 Vue: Support Yarn 2 in PnP mode
TypeScriptFeature WEB-44914 Move refactoring on TS class or interface: default to file with same name
Feature WEB-49094 TypeScript 4.2: abstract Construct Signatures
Bug WEB-49888 Go to defintion and find usages not works with ts imports started with slash
Bug WEB-49621 Typescript unsuccessful auto-completion for known type. Syntax highlighting gets stuck.
Bug WEB-43140 export const [ destructured_1, desctructured_2 ] = my_array not being indexed in *.ts files
Bug WEB-50019 Syntax error using `import type thing = require('things')`
Bug WEB-49595 No import suggestions for variables that are assigned values vie destructuring
Bug WEB-50001 Package Type Inference Broken with Yarn 2
Bug WEB-46680 Union literal completion broken for type created from typeof when using type only import
Bug WEB-49826 false 'missing required attribute' error for styled components
Bug WEB-49779 wrong colour for inferred generics
Bug WEB-48295 Changes made to imported JSON not immediately recognized by Typescript language service
Bug WEB-49802 Provide docs for standard JavaScript interfaces in TS
Performance WEB-49847 Sluggish typing during autocomplete of big firebase angular material projects
Task WEB-49833 Update bundled TypeScript to 4.2
Unit TestsFeature WEB-46202 Jest "update failed snapshot"/"go to snapshot" not available for `toThrowErrorMatchingSnapshot`
Bug WEB-49452 Failed Jest test never completes when running with `--watch`
Bug WEB-32836 Coverage reporter is asking for `lcov.info` file if `coverage` is absent in karma.conf.js reporters
Bug WEB-49052 Running All Tests in Jest doesn't show the error message when there is a failed test.
Bug WEB-49873 'Cannot read coverageDirectory option' when re-run Jest tests
Bug WEB-48569 Error debugging Mocha tests run with Vue CLI due to "Unknown argument: jobs"
No subsystemBug DBE-12806 Jump to source not working correctly after updates
Code CompletionBug DBE-12780 No completion for system procedures if they are unquaified
Code GenerationBug DBE-12759 unable to get the comment information for the database view field. It's OK in version 2019.3.5.
Bug DBE-5615 Bug when set an existing column as auto increment primary key
Code HighlightingBug DBE-12833 Exasol: support FORCE/KERBEROS PRINCIPAL keywords for user creation
Bug DBE-12693 Exasol QUALIFY clause
Bug DBE-12517 False-positive "Unreachable code", PL/SQL
Bug DBE-12556 'RESTART' is not recognized in PostgreSQL
Bug DBE-12775 Outdated MariaDB dialect
ConnectivityBug DBE-12559 Database plugin doesn't handle MySQL expired passwords
Bug DBE-12522 Incorrect icons for basic support drivers
Usability DBE-12813 Pressing the "Plus" button in the Data Sources and Drivers does nothing
Data Editor/ViewerFeature DBE-12714 Add titled separators to context menu of column header
Bug DBE-12830 Grid quick-doc is broken. getDataContext is invoked on non-EDT
Bug DBE-12818 MongoDB: maximize doesn't show string values in a column that is detected as numeric
Database ExplorerFeature DBE-12685 'got it' tooltip about '0 of 23' control when first creating the data source.
Database MigrationsBug DBE-12730 Comment on routine not supported
Bug DBE-12678 Missing mandatory keywords when saving stored procedure
Bug DBE-12589 Unable to open "events" and view error when errors occur
Bug DBE-8721 `Create New Table` generates SQL that is not accepted by MySQL when {Auto inc, Unique} are set
GeneralBug DBE-12629 Context templates for select N rows in Oracle generates invalid query
Cosmetics DBE-12628 Incorrect size of resolution scope tree selection
IntrospectionFeature DBE-8295 Generating DDL for MariaDB: include table partition information
Feature DBE-6811 Show offline databases
Feature DBE-10584 Table structure in database window does not show partition information for MariaDB/MySQL
Bug DBE-12298 Cannot display DDL for mysql 8 view
Bug DBE-12786 Introspection fails with numeric overflow
Bug DBE-4797 Intospection interupted if one of DB is offline
Navigation & SearchBug DBE-12609 Broken behavior for going to object declaration
Query ConsoleBug DBE-8092 Database Console Editor Tab Filename Includes Path
SQL GeneralBug DBE-10132 IDE does not execute a PIVOT query
SQL ResolveBug DBE-12779 Go to declaration doesn't work with system procedures
Tools IntegrationBug DBE-12634 "Restore with mysql" fails with added parameter (max_allowed_packet)
  • No labels