Child pages
  • IntelliJ IDEA 2020.3 EAP (203.3645.34 build) Release Notes
Skip to end of metadata
Go to start of metadata
No subsystemFeature IDEA-246894 Introduce functionality to add links to missing plugins from its run configurations
Feature IDEA-236965 Light Editor mode should add --wait switch to wait for the files to be closed before returning
Feature IDEA-231903 Find action should search trough localized and original messages
Bug IDEA-245009 Running fails
Bug IDEA-246443 Reappearance of ThreadTracker fails to detect idle ForkJoin common pool threads on Java 11
Bug IDEA-246568 Idea stuck on attempt to open not existing file from the command line
Bug IDEA-245197 Event log shows non-printable characters
Bug IDEA-249155 "Hard Coded Literals" `@NonNls` is not inferred for Kotlin String concatenations
Bug IDEA-244934 All IDEs show misleading JVM crash messages from other / older IDEs
Bug IDEA-235329 Lots of "ProjectFrameHelper.getFrame must not return null" exceptions
Bug IDEA-244286 Add assertion `max >= min` for `com.intellij.util.MathUtil#clamp`
Bug IDEA-248652 Search everywhere: path matches have higher priority than name matches
Bug IDEA-247397 LightEdit: intentions incompatible with LightEdit should not be shown in Find Actions popup
Bug IDEA-243676 PluginException: Intention Description Dir URL is null: Define implicit variable in comment; DefineImplicitVariableIntentionLocal; while looking for description.html [Plugin: com.intellij.velocity]
Bug IDEA-244729 Missing coverage hit lines count on the gutter when open a file after running with coverage
Bug IDEA-246944 IntelliJ 2020.2 hidden StackOverFlow breaks analyse process and prevent text colours to finish display
Bug IDEA-249865 Javaee Bean Validation : i18n
Bug IDEA-249440 Internalization for "built-in-server", "bootstrap", "configuration-store-impl"
Bug IDEA-249469 Internalization for "yaml" plugin
Bug IDEA-245937 Return back IDE subpixel antialiasing for macOS 10.14-
Bug IDEA-249437 Internalization for "credential-store", "editor-ui*"
Bug IDEA-242605 PCE must not be logged during indexing in DomExtenderEP
Bug IDEA-248419 idea.log is flooded with "NodeModulesLibraryDirectory - Name property missing"
Bug IDEA-249463 Internalization for "terminal" plugin
Bug IDEA-249456 Internalization for "junit"
Bug IDEA-248287 Restore binary compatibility of InlayHintsSink#addInlineElement
Bug IDEA-174226 Adjust Code Style Settings In Evaluate Dialog
Bug IDEA-245153 Light Edit: Git widget is missing
Bug IDEA-245118 Analyze Data Flow To Here on Kotlin is broken in the latest EAP
Bug IDEA-249444 Internalization for "commander"
Bug IDEA-246978 Clicking the problems marker of a file should show the problems of *that file*
Bug IDEA-245437 Notification about plugin, which is already of desired version
Bug IDEA-244631 CSS: don't commit non-supported document in <enter> handler
Bug IDEA-249454 Internalization for "java-decompiler"
Bug IDEA-248544 Plugin search is broken on latest master
Bug IDEA-244081 Can't change hotkey for 'Smart command handling'
Bug IDEA-241978 Double click in the editor selects something else
Bug IDEA-243959 PCE must not be logged from XmlExtensionAdapter
Bug IDEA-247359 Color parameter outside of expected range: Red Green Blue
Bug IDEA-246596 Update method is set to Merge when new workspace model is enabled
Bug IDEA-245561 IllegalStateException: Source folder xxx and type '' was not found after adding
Bug IDEA-249450 Internalization for "google-app-engine"
Bug IDEA-244911 ProgressIndicator push/pop state does not work with delegation
Bug IDEA-239907 Terraform: validation block in variable marked as unknown block type
Bug IDEA-245823 Opening a project at the root of a drive on Windows fails with NullPointerException
Bug IDEA-246457 com.intellij.serviceContainer.AlreadyDisposedException on creating and closing new project
Bug IDEA-249335 jquery library documentation is causing build failure
Bug IDEA-244017 During heap analysius: Expected gnu.trove.THashMap, got it.unimi.dsi.fastutil.objects.Reference2ObjectOpenHashMap
Bug IDEA-246376 Disabling plugin breaks color scheme
Bug IDEA-249446 Internationalization for "coverage-common"
Usability IDEA-248605 Show folded substitutions for property key values
Usability IDEA-245116 Allow to avoid automatic restart on Profile Slow Startup action
Usability IDEA-234594 "Always select opened file" does not work if this file editor tab is currently active.
Usability IDEA-249413 Shared Index downloader has a confusing progress label
Usability IDEA-243796 No ability to undo quick fix invoked from Problems View without switching focus to editor
Task IDEA-250209 Unused keys in goland
Task IDEA-238772 Make scopeParserExtension EP dynamic
Task IDEA-244945 Doc rendering problem in Reader Mode
Task IDEA-249665 i18n Services tool window name
Task IDEA-249853 Remove unused keys in 'sourceglider'
Task IDEA-244848 Register notification groups in plugin.xml
Task IDEA-249453 Internalization for "IntelliLang"
Exception IDEA-224785 EditorConfig: exception for relative soft links, that point to the non-existent file
Exception IDEA-242883 IncorrectOperationException: You must not call performWhenAllCommitted()/cancelAndRunWhenCommitted() from within after-commit handler
Exception IDEA-244662 ISE at com.intellij.workspaceModel.ide.impl.legacyBridge.module.ModifiableModuleModelBridge.renameModule
Exception IDEA-242981 AlreadyDisposedException when create ts vuejs template project
Exception IDEA-244797 PersistentIdAlreadyExistsException at
AndroidBug IDEA-248934 "Tools > Android > Resource Manager" does nothing; doesn't open anything
Bug IDEA-245510 New Project/Module wizard: default values are not valid in localized (Chinese Simplified) IDEA
Bug IDEA-243103 Exception "Cannot create Project ... because container is already disposed" at$1.lambda$somethingChanged$0(AndroidProjectVi
Bug IDEA-247946 JPS build process for Android includes module which depends on modules available in IDE only
Bug IDEA-247128 Android Designer Attributes icons are not visible
Bug IDEA-245623 AVD Manager Not Accessible In Flutter Project
Bug IDEA-243649 java.lang.Throwable: Cannot add 'sdk-common- at building a newly created project by enabled Android plugin
Bug IDEA-243819 "Studio performance could be improved" message in the Idea
Bug IDEA-241731 IntelliJ IDEA crash with android plugin on linux and hidpi screen (3840x2160)
Bug IDEA-246228 Gradle JVM settings ignored in a project with Android modules
Bug IDEA-245480 Can't start Java application in debug using gradle
Bug IDEA-170707 Android Lint incorrectly assumes platform 1 on gradle java modules in a multi-module project that includes android modules.
Bug IDEA-241862 APK Wizard not compatible with JetBrains Runtime 11
Bug IDEA-243995 Android SDK required to fix JUnit library not found in Gradle project
Bug IDEA-238129 is not populated correctrly
Bug IDEA-247241 IDEA/Android Studio cant hide toolwindows in LayoutEditor in dumb mode
Bug IDEA-248474 IntelliJ 2020.2 - Debug Window Unavailable via Run > Attach Debugger to Android Process
Bug IDEA-246929 2020.2 is unable to build
Bug IDEA-242843 Vue html formatting not working if 'Use custom formatting' settings for Android XML files is enabled in Settings | Editor | Code Style | XML | Android
Bug IDEA-246840 A bug of toolbar on Android navigation file's disign window
Usability IDEA-202110 Plugins dialog: show the version of Android plugin
Usability IDEA-238770 Can't open Android Profiler toolwindow to analyze existing dumps until "Profile Application" is invoked at least once
Cosmetics IDEA-243771 Android project tooltip in the New Project wizard should be displayed correctly
BuildFeature IDEA-243517 Show notification about that idea can link gradle/maven project if new build script created
Bug IDEA-243526 HotSwap no longer works
Bug IDEA-246750 Automatically show first error in editor is ignored
Bug IDEA-240779 Auto-reload tracker doesn't separate partial project reload and full project reload
Bug IDEA-243907 Known external annotations lookup is broken
Usability IDEA-242897 Build tool window for JPS build: shows no line numbers in error messages on the left view
Build. AntBug IDEA-242513 Starting ant build target no longer closes Ant side panel
Build. Built-in (JPS)Bug IDEA-237157 Error compiling project after upgrading to latest version (Build #IU-201.6668.121)
Bug IDEA-243885 PLZ UPDATE THE JPS, THX !!!!!!
Bug IDEA-245262 IDEA won't recompile dependent class if import static value changes in another file
Bug IDEA-245707 Options not passed to ECJ
Bug IDEA-247245 THashSet error when building code
Bug IDEA-242211 JPS javac compiler is not working properly with generated class from a javac plugin
Usability IDEA-166687 IDE build: javac error on project build is different from Maven build and appears to be not relevant/clear
Build. GradleFeature IDEA-241038 Smart commands execution: add `./gradlew` to Gradle magic
Feature IDEA-248525 Support updating of the 'Override compiler parameters per-module' by gradle-idea-ext-plugin
Bug IDEA-244722 Android cam'tbuild gradle
Bug IDEA-245507 RunAnything: all commands starting with "gradle" are recognized as Gradle
Bug IDEA-246082 the Build toolwindow and the Messages toolwindow: Duplicate and display information
Bug IDEA-245377 Project structure: There is a need for a warning.
Bug IDEA-244368 Gradle Tasks with Spaces in the name fail to run properly
Bug IDEA-246340 Broken Gradle settings layout when there are several linked Gradle projects
Bug IDEA-244239 Project level library dependencies of buildSrc project are imported as module level libraries
Bug IDEA-245237 Two different versions of the Gradle are created in the new project folder
Bug IDEA-248727 The JDK7 support has been broken for Gradle import
Bug IDEA-250384 High memory consumption at Gradle project reload
Bug IDEA-242521 HotSwap is not triggered for FROM-CACHE tasks when build is delegated to Gradle
Bug IDEA-243919 java.lang.Throwable: Cannot record event because group '' is not registered: An exception appears during any gradle task execution
Bug IDEA-244432 New JavaEE project wizard: a new gradle project is not loaded as Gradle
Bug IDEA-228945 Build tw: show errors from custom model builders during a Gradle project import
Bug IDEA-243817 API for incremental gradle import: models for buildSrc and composite builds are missing in resolver
Bug IDEA-237290 Compile classpath is not populated with libraries for generated source set modules
Bug IDEA-246637 Stop daemon does not work with Gradle 6.6
Bug IDEA-231995 Do not highlight (known) properties in as "unused"
Usability IDEA-196628 Gradle: consider the import failed when custom model builders errors have been caught
Usability IDEA-237299 Gradle Plugin Auto-Import leads to multi minute waits anytime I pull a change from VCS
Usability IDEA-189043 "Automatically show first error in editor" does not work when using Gradle to build/test
Exception IDEA-243558 java.util.ConcurrentModificationException at project import
Build. MavenBug IDEA-244297 Maven Depencencies diagram: context menu misses Exclude action and contains the empty group instead
Bug IDEA-246953 False positive of "Usage of properties in parent description"
Bug IDEA-241016 Maven Import in Multi Module Project reimports ALL projects when only ONE modules POM changes
Bug IDEA-245360 New project model: the project structure is destroyed
Bug IDEA-243609 Maven wrapper: distributionUrl is highlighted as unused
Bug IDEA-219335 Wrong relativePath of parent tag in child-module's pom.xml when using any "spring-boot-starter-*" with independent parent project.
Bug IDEA-212384 Cannot build a Maven project which uses NullAway
Task IDEA-244981 Migrate Maven auto-reload settings from 2019.3
Exception IDEA-245799 REWA at com.intellij.openapi.application.impl.ApplicationImpl.assertIsWriteThread
CloudsBug IDEA-249971 Keymap shows internal IDs for actions related to remote service support
Code Analysis. DependenciesBug IDEA-242613 Broken usages disappears after removing comment
Code Analysis. InspectionFeature IDEA-247443 Option to ignore camel-case strings in i18n inspection
Feature IDEA-248175 i18n for groupPath in InspectionEP
Feature IDEA-249403 Support @Nls @NonNls and @NlsSafe annotations on function parameter in Kotlin
Bug IDEA-242690 Intention to open inspections options doesn't work from Problems view
Bug IDEA-45865 Invalid property key: problems with highlighting on warning and info levels
Bug IDEA-247986 Absence of an expected warning of "Hard coded strings" inspection
Bug IDEA-52705 False positive on "suspicious indentation after control statement without braces"
Bug IDEA-247998 InspectionProfileEntry.cleanup() not called when batch inspection has result
Bug IDEA-243833 Inspection widget: the Highlight dropdown disappears on hover
Bug IDEA-243718 JAX-RS: Wrong error message 'Incorrect MIME Type declaration'
Usability IDEA-232279 Improve the `Next highlighted error` UX on analysis
Code Analysis. Language InjectionBug IDEA-241908 Injected language fragments are not highlighted in 2020.2
Bug IDEA-241981 Inspection "Injected references": false positive for concatenations with MIME Types
Bug IDEA-250291 Language Injection settings are not properly reloaded when dynamic plugins changed
Bug IDEA-241419 intelliLang.Configuration$App leaks PatternCompilerImpl$LazyPresentablePattern
Code Analysis. Structural SearchFeature IDEA-244837 Custom SSR filters
Feature IDEA-249515 Automatically open replacement window when importing replace pattern
Feature IDEA-244596 Separate "Structural search" inspections based on language
Bug IDEA-249295 Structural search: some filters applicable for variable appear only on the second call
Bug IDEA-245668 NPE at pointing 'Find usages' in menu after adding SSR inspection
Bug IDEA-244045 Can't find tools for "e0bda819..." in the profile "Project Default" on switching to existing template
Bug IDEA-246940 Can't find lambda parameter
Bug IDEA-243626 Structural Search doesn't work after adding SSR inspection
Bug IDEA-245028 NPE when text cursor is on replacement variable
Bug IDEA-242879 @NotNull method com/intellij/codeInspection/ex/Descriptor.getKey must not return null
Bug IDEA-244784 Filters remain disabled when script filter has problem on opening of dialog
Bug IDEA-244786 Filters & Scope should be available in Dumb mode
Bug IDEA-244220 No syntax errors reported in filters
Bug IDEA-243629 Missing filters in SSR search for Java
Bug IDEA-243739 Comments containing variables don't match all comments types
Cosmetics IDEA-244617 Render templates list in inspection as disabled when inspection is disabled
Task IDEA-247138 Get rid of "Words" check box in text filter
Exception IDEA-247874 Constraint inSmartMode cannot be satisfied
Code Analysis. Syntax (PSI)Bug IDEA-246747 Excessive memory consumption
Support Request IDEA-248146 PsiInvalidElementAccessException 'psi is outdated invalidated' in Lombok Plugin
CoreBug IDEA-244768 "Plugin is not unload-safe because of unresolved EP" reported when a plugin has an optional descriptor defining an EP and its extensions
Bug IDEA-243130 GoLand 2020.1.3 closes main window and can't bring to front if press ESC on `goland --help` window.
Bug IDEA-245099 File type of unloaded plugin can be leaked due to file type caching
Bug IDEA-244431 PatternCompilerImpl leaks references to classloaders from unloaded plugins
Bug IDEA-243708 Deadlock between loggers
Bug IDEA-249530 Out of Memory Alert dialog is shown when memory is not a problem
Task IDEA-247475 API for HTML concatenations
Exception IDEA-244962 Unable to load system frameworks on macOS 11
Core. DebuggerUsability IDEA-246117 "Suspend" checkbox for breakpoints causes confusion
Exception IDEA-247496 Wrong line: 57. Available lines count: 27
Core. DiagramsBug IDEA-248404 New Module Dependencies Diagram does nothing
Exception IDEA-205430 NullPointerException occurs on double-clicking the item on the UML diagram
Core. File SystemFeature IDEA-246514 Implement VirtualFIle.isCaseSensitive()
Bug IDEA-247036 v2020.1 Won't Save To Disk
Core. IDE SettingsBug IDEA-244849 Custom font is not applied to settings element after Apply changes
Bug IDEA-250776 Use ApplicationNamesInfo.getScriptName() instead of ApplicationNamesInfo.getProductName() when generating custom VM options file name
Bug IDEA-239090 Intention settings is empty
Bug IDEA-247310 Changes in HashBang Patterns are not saved
Bug IDEA-245438 Endless "Can't get shell environment" warnings in the log
Bug IDEA-247817 "Windows Defender might impact performance" every time I open any project
Bug IDEA-209384 2018.3.5 importing from 2.4 causes "Antialiasing->subpixel" setting to not stick between runs
Bug IDEA-237376 Android RenderScript file type instead of Rust one on 2020.1
Bug IDEA-219420 "Editor | Inlay Hints" settings are not persisted between restarts
Usability IDEA-202548 Can't Export Settings when IDE settings sync is enabled
Core. IndexingBug IDEA-245911 Find in path doesn't work
Bug IDEA-245641 IncorrectOperationException when the project is closed at JDK indexing stage
Bug IDEA-239932 every IDEA restart entails long "indexing library..."
Bug IDEA-243768 JDK shared index can be downloaded on project creation
Bug IDEA-247316 Pausing Indexing Applies to All Windows Rather than Current Project
Bug IDEA-249792 SharedIndexes: indexes should be recalculated on shared index plugin disabling.
Bug IDEA-244308 Exception in shared indexes in IntelliJ project
Bug IDEA-245843 Z cannot be cast to com.intellij.psi.stubs.ObjectStubSerializer
Bug IDEA-237959 Shared Indexes: saves invalid state
Performance IDEA-247070 Find Usages has become slower in 2020.2
Performance IDEA-238706 Accessing index during PSI events
Performance IDEA-249369 Add an option to choose only distinct files to generate indexes
Exception IDEA-248099 IndexNotReadyException when try to use indexes in one project (with finished indexing) during indexing process in another project
Core. InstallationFeature IDEA-250333 Show comprehensible error message if user tries to start IDE under Java 8
Bug IDEA-245844 License server before proxy settings
Bug IDEA-231075 jbr directory is not completely deleted on IDEA uninstall
Task IDEA-250978 Bundle Kotlin 1.4.10 with IntelliJ IDEA 2020.3
Core. LicensingBug IDEA-246636 'br' tag is wrongly shown in "Thank you for evaluating {0}. Your evaluation license expires in {1}" message
Bug IDEA-244456 Wrong product name in the license expiration notification for paid plugins
Bug IDEA-243623 Dialog about expired 30 minutes session is tiny and shown on wrong space
Bug IDEA-243936 License dialog: not clear when product should be activated
Bug IDEA-245166 Do not popup license dialog for "optional"-licensed plugins, after license expiration
Core. Navigation and SearchFeature IDEA-135112 Search for actions by synonyms
Bug IDEA-247358 Navigate to file: wrong item is focused in the Project View with "Always Select Open File" enabled
Bug IDEA-243804 Retrofit/okHttp: can't select url path segment, whole url selected instead
Bug IDEA-234172 Enter / Exit / Toggle Distraction free mode via find action doesn't work
Bug IDEA-244647 Rerunning a pinned search opens a new result window
Performance IDEA-245035 Goto Implementation works very slow from a SAM method usage
Usability IDEA-248865 Unable to navigate to enum constructor since 2020.2
Usability IDEA-194817 Show enum constant usages on mouse middle-click
Core. Password ManagementBug IDEA-241881 KWallet access crashes intellij
Core. Platform APIBug IDEA-248823 PsiElement.contextOfType does not support the strict flag from PsiTreeUtil.getContextOfType.
Bug IDEA-244049 Dynamic Plugin: PluginManagerCore.getPlugin(String) sometimes returns null when tool window is loaded
Bug IDEA-247164 Race condition in com.intellij.psi.stubs.IStubElementType
Usability IDEA-245298 Tooltip for StatusBarWidget is not set unless StatusBar::updateWidget is called
Exception IDEA-246796 An occasional exception when ReadAction.nonBlocking is to be expired with something disposed outside a write action
Core. Plugin ManagementFeature IDEA-247472 Show plugins from custom repositories on top of Marketplace search result list
Bug IDEA-245629 Marketplace breaks with NPE
Bug IDEA-245634 Swagger: Ultimate is recommended instead of plugin in WebStorm
Bug IDEA-243698 IDEA 2020.2 doesn't import my installed plugin (RunInCmd) from 2020.1 settings
Bug IDEA-243180 Can't unload plugin if there is an unreported fatal error with a throwable containing the plugin classes
Bug IDEA-247627 Editor scheme is lost after updating a theme plugin if the jar name of the new version differs from the name of the old version
Bug IDEA-246111 'Plugins supporting filetype' notification shown for already-supported filetypes (IJ UE 2020.1.2)
Bug IDEA-246710 Disabled bundled plugins are not listed in the log
Bug IDEA-224874 Frame around plugin description appears after installing theme plugin
Bug IDEA-244250 IDEA freeze after updating plugins
Bug IDEA-242860 Plugin registry keys are being unloaded before plugin <projectListeners>
Bug IDEA-247774 Plugins: Unable to find plugin in Installed by word from description
Bug IDEA-247117 Error updating plugin
Bug IDEA-215935 "Plugins supporting *.md files found" doesn't suggest disabled plugin
Bug IDEA-246822 Detect plugins incompatibilities before downloading IDE upgrade
Bug IDEA-247329 IntelliJ Stuck Analyzing
Bug IDEA-248037 Disable button disappears after resizing plugin settings window
Bug IDEA-244319 Registry may throw exceptions on dynamic plugin load
Bug IDEA-244865 Hibernate plugin requires restart on disabling
Exception IDEA-246976 java.lang.NoClassDefFoundError: gnu/trove/TObjectHashingStrategy
Exception IDEA-241872 "Unexpected core classloasder" exception prevents startup
Exception IDEA-245772 java.lang.Throwable: Can't read descriptor layoutlib-native.xml for optional dependency of plugin being loaded/unloaded
Exception IDEA-249972 IllegalArgumentException: Missing extension point: com.intellij.languageBundle in container Application (containerState=PRE_INIT)
Exception IDEA-242828 NPE at com.intellij.ide.plugins.newui.MyPluginModel.removeProgress
Core. ProfilerFeature IDEA-250389 Export flame graph as an image
Bug IDEA-248989 Remove process path and separate PIDs
Bug IDEA-247798 Small freeze on jfr open
Core. Project SettingsBug IDEA-248714 i18n: html link in Project Structure -> Problems
Bug IDEA-242406 "Settings for new projects" are not applied for project created via Open action
Bug IDEA-244277 AddModuleWizard class allows null to be passed to a NotNull method parameter.
Bug IDEA-223801 Repeated and Zero Effect Windows Defender performance warning on symlinks to WSL2 paths
Bug IDEA-246731 If missing JDK is installed it isn't recognized until the project is reopened
Bug IDEA-250171 Explicitly assigned module groups are lost after opening project
Bug IDEA-222480 IDEA hangs on startup while initializing ProjectJdkTable
Bug IDEA-246772 Module already exists error on cloning project with new project model.
Bug IDEA-246621 Cannot import project with iml file
Bug IDEA-247042 Maven project imported with 'store project files externally' ON can't be built
Bug IDEA-245615 Artifact build ignores specified manifest
Bug IDEA-244773 Web and Persistence toolwindows are not available for the created projects until reopening
Bug IDEA-250999 Gradle project import: ISE: "ServiceManager.getServic… must not be null" at WorkspaceModel$Companion.getInstance()
Performance IDEA-245991 UI freeze in RootsChangeWatcher after changing many project configuration files
Task IDEA-243197 Log the reason why save is blocked for project configuration files
Exception IDEA-244663 PAEE at
Exception IDEA-246874 ArrayIndexOutOfBoundsException may be thrown in FacetEventsPublisher
Exception IDEA-246786 Module-level libraries in unloaded modules lead to exception on opening project
Core. Quick DocumentationBug IDEA-245671 rendered javadoc can't be selected with mouse click + drag on Windows
Usability IDEA-170168 Show method quick doc on modifiers
Usability IDEA-246276 view psi structure editor should disable in-editor doc rendering
Task IDEA-245688 add "Render All Doc Comments" action menu item to rendered documentation context menu
Core. RefactoringsBug IDEA-248815 Can't Refactor Rename Java Variable in IntelliJ IDEA When There Are Code and String Occurrences to a Combined Number Over 200
Bug IDEA-227176 Can't refactor a certain project
Bug IDEA-246628 VariableInplaceRenameHandler: misleading method contract
Bug IDEA-245589 Broken compatibility between IntelliJ IDEA 2020.2 and Kotlin plugin 1.3.72 202: NoSuchMethodError at org.jetbrains.kotlin.idea.refactoring.suggested.KotlinSuggestedRefactoringUI.extractNewParameterData
Bug IDEA-240885 fileType extension couldn't be unload after file rename
Core. Run. ConfigurationsFeature IDEA-245132 New Java Application run configuration UI module selector should support text search
Bug IDEA-250318 Unable to run/debug existing test in dumb mode
Bug IDEA-239627 Macros `$MODULE_WORKING_DIR$` and/or `$MODULE_DIR$` are missing
Bug IDEA-248113 Run/Debug Configuration window is black in nightly
Bug IDEA-248997 Can't exclude classes/packages from coverage in Run configurations
Bug IDEA-246862 [new run configs UI] with enlarged font the Main class field looks unreadable
Bug IDEA-244339 [new run config UI] mnemonic in Modify options is always shown and doesn't work
Bug IDEA-247956 Don't pass DESKTOP_STARTUP_ID environment variable to launched processes on Linux
Bug IDEA-247287 [new run config ui] not an editor font in the fields
Bug IDEA-242403 [new run config ui] support keyboard navigation inside Logs and Coverage blocks
Bug IDEA-250341 [new run config UI] Different fonts in the UI
Bug IDEA-238305 Run configuration templates keep references to classes of unloaded plugin
Bug IDEA-248180 Renamed JDKs are shown without names in the Run configurations JDK dropdown
Bug IDEA-244890 [new run config UI] Build task in before launch is always shown at the end of the list
Bug IDEA-247288 [new run config UI] expand field option is broken
Bug IDEA-247392 [new run config UI] Shortcuts are duplicated in the hints
Bug IDEA-249997 [new run config UI] Form broken when code coverage options are added
Bug IDEA-248090 Do not store relative path to bundled JDK in settings.
Bug IDEA-245965 Default JRE for modules which use module-specific JDK is shown incorrectly in new UI
Usability IDEA-243840 [new run config UI] Open file dialog starts in the wrong folder
Usability IDEA-245875 [new run config UI] Option tags are confusing to users
Usability IDEA-243716 [new run config UI] Please show the 'Environment Variables' field by default
Usability IDEA-245378 [new run config UI] Focus after run configuration creation
Usability IDEA-244073 [new run config UI] Change 'use classpath from module' field to be hidden by default
Usability IDEA-242894 [new run config UI] Change "Allow parallel run" to "Allow multiple instances" or something like that
Usability IDEA-249925 [new run config UI] Fields appear 'below the fold', without indication that the user could scroll down
Usability IDEA-245305 [new run config UI] Make hotkey for 'Manage Options' more visible
Usability IDEA-245375 [new run config UI] Make label-less fields screen reader compatible
Usability IDEA-242891 [new run config UI] Not enough descriptive text
Usability IDEA-245306 [new run config UI] Focus newly added text fields
Usability IDEA-244857 [new run config ui] leave placeholder when the focus is in the field
Usability IDEA-242925 [new run config UI] please add tooltips to the fields without labels
Usability IDEA-244646 [new run UI config] Open run/debug tool window when started should be enabled by default
Cosmetics IDEA-247760 [new run config UI] Replace '+' icon with the dialog icon for adding macros
Cosmetics IDEA-245398 [new run config UI] improve JDK field displaying
Cosmetics IDEA-242441 [new run config ui] before launch drag'n'drop - display a caret to show where tag will be placed
Cosmetics IDEA-242924 [new run config UI] when dialog resizing - extra artifacts appear near Main class field
Cosmetics IDEA-249664 "Add Before Launch Task" popup title should be "Add New Task" instead of "Add New Configuration"
Cosmetics IDEA-244935 [new run config UI] Increase minimum width of floating run config screen
Cosmetics IDEA-242394 [new run config ui] tags alignment with the rest fields
Cosmetics IDEA-249103 [new run config UI] Try new more rounded tags form
Task IDEA-249170 [new run config UI] Please change the 'Edit <run config>' context menu item
Core. Run. External ToolsBug IDEA-239635 [Settings Keymap] when searching for some action, External Tools are always shown
Exception IDEA-244452 NPE in Remote SSH External Tools plugin when cancel choosing of tool
Core. SSHBug IDEA-247738 Wrong behaviour of IdentitiesOnly with SSH Agent
Bug IDEA-243760 SSH configuration (for tunnel) doesn't suppor non-ascii characters
Bug IDEA-241477 Unified SSH: Detecting if SSH key requires passphrase
Bug IDEA-248446 Improper handling of connection to SFTP deployment servers which utilize 2FA
Bug IDEA-246307 Can't connect via SSH if there's a key that is not a file, or it is corrupted, or something similar
Core. StatisticsBug IDEA-233990 Data sharing dialog is shown twice
EditorFeature IDEA-237297 LightEdit: Opening a file that does not exist should create a blank editor
Feature IDEA-245762 Show empty boxes for newer emojis if the installed emoji font doesn't contain these
Bug IDEA-245070 nbsp as text in razor views
Bug IDEA-238020 LightEdit: order of recent files in popup differs from file order in main menu
Bug IDEA-247741 Broken text selection over an area with rendered documentation
Bug IDEA-246399 Quick doc pane is opened when clicking external links in rendered Doc
Bug IDEA-250404 Unable to open file in project mode from command line when another project is already open
Bug IDEA-237080 Light Edit: "Window" menu is missing (macOS)
Bug IDEA-246372 No documentation found in quickDoc
Bug IDEA-243837 IDE doesn't apply font changes without file reopening for exclude/included files
Bug IDEA-231946 LightEdit: Project menu is shown instead of LightEdit mode menu on Win 10
Bug IDEA-250312 Scroll to Center action doesn't work if "refrain from scrolling" is programmatically set
Bug IDEA-238700 Code vision: "Implementations" sounds odd in case of classes inheritance
Bug IDEA-241911 Highlight Usages in File doesn't show markers on scroll area anymore
Bug IDEA-250262 Unable to open file from Light Editor when file extension isn't specified in list to open
Bug IDEA-250462 Project file isn't opened from command line when another project is already opened and Light Edit frame is focused
Bug IDEA-245320 Folded code preview doesn't show the last line
Bug IDEA-246113 LightEdit: exception while trying to change file encoding
Bug IDEA-247170 LightEdit: files with the same name are displayed without a path in File | Open Recent
Bug IDEA-244167 Using "render documentation comments" makes "expand all" invalid
Bug IDEA-245580 Light Edit Mode: getCurrentTextEditor and getCurrentFileEditor methods of StatusBarUtil return null
Bug IDEA-245331 Rendered doc comment gutter icon does not disappear when gutter icons are hidden
Bug IDEA-248406 External annotations and code vision hints aren't shown if javadoc comment is shown in rendered form
Bug IDEA-246047 Reader Mode shouldn't be available in Previews
Bug IDEA-237793 LightEdit: disable "Select Opened File" in "Save As" dialog
Bug IDEA-245071 implement DaemonCodeAnalyzerImpl#runInjectedGeneralHighlightingPassAfterCompletionOfGeneralHighlightPass()
Bug IDEA-246368 Weird behavior when cursor is inside rendered Doc
Bug IDEA-232371 Dialog to save files doesn't appear when pressing Cmd + S for a new created file
Usability IDEA-236857 Close Welcome screen when light editor is opened
Usability IDEA-248255 Use LightEdit mode only for selected file extensions only
Cosmetics IDEA-248692 Make line numbers and annotation text of wrapped lines stick to top on scrolling
Cosmetics IDEA-233516 LightEdit: Don't suggest to save an empty file, don't show changed status
Cosmetics IDEA-238010 LightEdit: underscore is overlapped by the following characters in recent files list
Task IDEA-233497 LightEdit: Enable "Find Actions"
Task IDEA-234009 Restore Light Edit session
Editor. Code CompletionBug IDEA-247963 Unable to toggle "Quick Documentation" and "Quick Definition" in the suggestion list
Bug IDEA-242758 IntelliSense/Code Completion for EditorConfig doesn't propose "unset" as a possible value
Bug IDEA-247781 Unable to toggle sort order of the items in the suggestion list
Performance IDEA-247726 Autocomplete does not show suggestions
Cosmetics IDEA-196835 Different font used in code completion list for Korean
Task IDEA-246035 Add specification of kotlin-kind file in FUS collector for Code Completion
Exception IDEA-242751 Assertion failed at com.intellij.codeInsight.completion.CompletionInitializationUtil.setOriginalFile
Editor. Code Completion. MLBug IDEA-245573 OutOfMemory in NGram lexer on big files
Editor. Color SchemesBug IDEA-244177 Disabling Foreground Color for Hard Wrap Guide Disables Visual Guides
Task IDEA-249851 Internationalise color scheme names
Editor. Diff and MergeBug IDEA-193373 Diff in Commit Changes: cannot resize TTF preview below some limit
Usability IDEA-236763 Close diff editor tab if there are no changes after commit
Usability IDEA-246407 Revert button icon
Editor. Editing TextFeature IDEA-73585 drag and drop editor tabs to split vertically / split horizontally
Bug IDEA-247039 Add Carets to Ends of Selected Lines adds the caret in the middle of a line of the caret is there
Bug IDEA-243459 Go to Declaration - editor scrolls to a wrong position
Bug IDEA-226949 Frequent hangs whilst typing: com.intellij.ui.ScreenUtil.calcInsets
Bug IDEA-247210 PyCharm overwrites the mouse-highlight clipboard when I backspace an indentation
Bug IDEA-244306 Extracted variable's type is shown white-on-white on the execution point
Bug IDEA-248207 Can't create a new doc comment with new doc comment rendering enabled
Performance IDEA-244429 18K occurences, Select all occurrences, typing is slow
Usability IDEA-244895 Add closing curly bracket when introduce local interface or enum
Usability IDEA-243957 Unable to copy-paste Live Template unless top-level node is selected
Usability IDEA-244142 Make double-click and drag text selection treat every symbol as separate word
Editor. Error HighlightingBug IDEA-246273 Highlight Usages action shows incorrect usage counter
Bug IDEA-232560 Inlay hints for numeric enum values ​​do not scale in the editor
Usability IDEA-243927 Bad code green: enum constant without argument list
Editor. FormatterFeature IDEA-119281 Add option to remove blank lines at end of file on Save
Bug IDEA-225147 NPE when trying to reformat code with specific wrapping settings
Bug IDEA-215770 EditorConfig: ij_visual_guides option appears in the created .editorconfig only if it is enabled in settings
Task IDEA-244897 Default value for empty Code Style options in generated .editorconfig
Task IDEA-244626 Some HTML Code Style options don't appear in generated .editorconfig when these settings are empty
Editor. Intention ActionsCosmetics IDEA-249522 Flip arguments around comma should warn about semantic changes
Exception IDEA-248085 IOE at com.intellij.openapi.util.ObjectTree.register
Editor. Large FilesBug IDEA-243589 IDE freeze / crash when large file is truncated
Editor. SpellcheckFeature IDEA-202138 IDEA should have (programming) language-specific dictionary (in addition to project and application specific ones)
Bug IDEA-243510 CamelCased and UPPER_CASED words are not suggested correctly in a specific cases
Bug IDEA-244127 OOM on suggestion of complex UPPER_CASE words
FrameworksFeature IDEA-249584 Gauge: ability to create Maven/Gradle projects
Feature IDEA-224321 Microservices: supported HTTP methods in UrlPath completion
Feature IDEA-232802 MicroProfile: no URLs support for RegisterRestClient beans
Feature IDEA-224233 Microservices: icons for contributed paths in URL completion
Feature IDEA-246350 Microservices: show URL source in completion popup
Bug IDEA-225796 Microservices: support relative paths in
Bug IDEA-246585 Frameworks: no RegExp language in URL mapping with symbols constraint and two path variables
Bug IDEA-226790 Endpoints view is not opened automatically at adding classes with endpoints
Bug IDEA-246536 Java SQL: no SQL fragments in prepare of io.vertx.mutiny.*.*Connection
Bug IDEA-250693 Microservices: AWT events are prohibited inside getData exception while resolving UrlPath reference
Bug IDEA-244863 FrameworkStarter exception on creating microprofile project with terminating previous gradle process
Bug IDEA-248758 Endpoints View: Swagger remote specifications duplicated for each module
Bug IDEA-244346 Retrofit gutter
Bug IDEA-248644 Endpoints View: no MicroProfile Rest Client in framework filter
Bug IDEA-245382 UrlPathReference: good code is red: "Cannot resolve symbol '' "
Bug IDEA-245175 MicroProfile: project wizard: unsupported features can be selected and this breaks project creating
Bug IDEA-244050 Axios: If there is no `path` part in UrlPathRefernce then the whole URL will be threaten as Path
Bug IDEA-249861 Spring plugins i18n
Bug IDEA-249629 Endpoints: wrong result of Find Usages if an endpoint contains "/" at the end
Bug IDEA-244219 Microservices: query parameters of URL Path do not have underline highlighting
Usability IDEA-248517 New Endpoints view. Search field: the first item in the completion list should be pre-selected for completion
Usability IDEA-249109 Endpoints. The endpoints list is wrong scrolled up by "Generate HTTP request" action
Usability IDEA-249291 JAX-RS @PathParam resolve works with not needed additional step because the current item is present in the list by resolve
Usability IDEA-249312 Endpoints: make it possible to copy an endpoint path in the view
Cosmetics IDEA-245164 The URL completion should suggest the `http` over `https`
Task IDEA-249899 i18n frameworks: Vaadin
Task IDEA-245108 MicroProfile: new project wizard improvements: Use same width for version and runtime fields
Task IDEA-245109 MicroProfile: new project wizard improvements: Format version with space and dot, like `MP 3.3`
Exception IDEA-246112 Guice: IndexNotReadyException from `AbstractNewGuiceClassAction.hasGuice`
Exception IDEA-249296 PsiInvalidElementAccessException: Anchor hasn't survived after applying quickfix "Create String field annotated as PathParam"
Frameworks. GWTBug IDEA-246845 War artifacts configuration is not generated on Gradle project import when GWT plugin is installed
Bug IDEA-232019 "find usages" of GWT service method does not find usages of Async interface
Bug IDEA-240159 GWT RemoteService method link to its async version doesn't work
Frameworks. MicronautFeature IDEA-231312 Micronaut: @Requires annotation validation: validate the #pattern attribute value (inject regex)
Feature IDEA-246217 Micronaut: inject SQL fragments to JdbcOperations API
Feature IDEA-245664 Micronaut Websockets: inject REGEXP language into path variables
Bug IDEA-246891 Micronaut Websockets: inject REGEXP to path variables in @ClientWebSocket annotation
Bug IDEA-236719 High CPU usage on micronaut configuration files
Bug IDEA-247495 Micronaut: find usages for keys declaration doesn't show properties in configuration files
Bug IDEA-242705 Micronaut WebSockets: support path variables in the websocket urls
Bug IDEA-245402 Micronaut @Client: Cannot generate url from Endpoints view, if scheme is not provided
Bug IDEA-242598 Micronaut WebSockets: default URL is incorrectly displayed for @ServerWebSocket and @ClientWebSocket
Bug IDEA-245395 Micronaut: if both Get and Post controller methods exist for the same mapping url, completion doesn't suggest this url for both get and Post methods for client
Bug IDEA-244000 @Client -annotations in Micronaut does not support full URLs
Bug IDEA-246322 Micronaut: new project dialog does not handle errors from server
Bug IDEA-245578 Micronaut: incorrect HTTP request is generated for client url without protocol part
Usability IDEA-246321 Micronaut: search features by id in new project dialog
Usability IDEA-244871 Support Micronaut RabbitMQ 2.0
Usability IDEA-246318 Micronaut: Default values for new projects
Usability IDEA-243969 Micronaut: sort top 10 feature groups in new project wizard
Cosmetics IDEA-246319 Micronaut: strip Micronaut from application types in new project wizard
Frameworks. OSGiBug IDEA-248791 Unable to install OSGi to CE due to dependency on JavaEE
Frameworks. OpenAPI (Swagger)Feature IDEA-244864 OpenAPI/Swagger: Add option to scroll in swagger UI to endpoint selected in endpoints view
Feature IDEA-245115 Swagger UI: add auto-scroll preview as in markdown
Feature IDEA-245681 Make remote specifications consider their download url if relative/no server url/basepath and schema provided
Feature IDEA-244991 OpenAPI/Swagger: Support swagger UI for remote specification
Feature IDEA-247761 OpenApi plugin does not support "requestBodies" section
Feature IDEA-239281 Add run and create request gutter markers to swagger files
Bug IDEA-245103 Swagger Diff: incorrect comparison of identical json and yaml specs
Bug IDEA-245289 Swagger Diff: backslashes in path to source file
Bug IDEA-243722 OpenAPI/Swagger: Can't use codeGenerators for remote swagger/openapi specifications
Bug IDEA-244074 Microservices: highlight URL Path references in Swagger
Bug IDEA-250504 Swagger/OpenAPI: rename swaggerHub filter Spec name to Owner name
Bug IDEA-250500 Swagger/OpenAPI: public/private filter for swaggerHub doesn't work
Bug IDEA-244764 OpenAPI/Swagger: Swagger UI scroll doesn't work in case model already opened in UI
Bug IDEA-245015 Swagger UI: Idea crashed on attempt to choose file for upload with swagger UI
Bug IDEA-250514 Swagger/OpenAPI: wrong swaggerHub spec owner displayed with private filter applied
Bug IDEA-244982 OpenAPI/Swagger: swagger UI scroll doesn't work if we select parameters in endpoint
Bug IDEA-245033 Swagger Diff: some elements not compared with swagger diff
Bug IDEA-245484 Swagger: no completion in client with https scheme
Bug IDEA-245531 Swagger: query parameters inserted everywhere
Bug IDEA-244748 OpenAPI/Swagger: swagger UI doesn't scroll to selected path from json spec
Bug IDEA-245777 swagger/openAPI yaml file's folding state is not remember
Bug IDEA-244873 OpenAPI/Swagger: swagger UI scroll doesn't work for some specific cases
Performance IDEA-246138 Typing the path param in @GetMapping @PostMapping... in the RestController gets stuck or super-slow
Performance IDEA-249384 IDE freeze when decompiling
Usability IDEA-248338 Swagger: show languages list on click in Language field of Swagger Codegen configuration
Usability IDEA-245443 Swagger: Rename `Remote URL` to `Download` in Generator Path
Usability IDEA-250511 Swagger/OpenAPI: Add swaggerHub specification by double-click
Usability IDEA-248760 Swagger/OpenAPI: Add default path for swagger codeGen
Cosmetics IDEA-237656 Improvements for Swagger Codegen run configuration editor
Cosmetics IDEA-244589 Swagger UI: hide top bar in specification view
Cosmetics IDEA-244717 Swagger: provide CSS styles for Swagger Diff
Frameworks. QuarkusBug IDEA-246743 Neither Quarkus nor MicroProfile projects created from new project wizard
Bug IDEA-245820 Quarkus: Config: there are no completion variants for ''quarkus.log.level'
Bug IDEA-245706 Quarkus: IDE does not recognize as Docker file
Bug IDEA-246498 Quarkus: Config: config keys marked as deprecated are not highlighted in
Bug IDEA-246768 Quarkus: there are should be no completion variant for already existed parameter for predefined profiles
Bug IDEA-245816 Quarkus: Config: multiple 'quarkus.log.level' completion variants
Bug IDEA-245789 Quarkus: Config: invalid highlighting for quoted map keys with dots
Bug IDEA-245946 Quarkus: Config: problems with profile completion in application.yaml
Bug IDEA-245537 Quarkus: Find usages doesn't show some properties in yaml configuration file
Exception IDEA-245790 Quarkus: Config: SOE if @ConfigProperties annotated class has field of nested class type referred to itself
Frameworks. ReactorBug IDEA-248484 False warning: Value is never used as Publisher in kotlin 'when'
Bug IDEA-245136 Add registry key to turn off Kotlin intentions for Reactive Streams Plugin
Bug IDEA-245639 False positive "Value is never used as Publisher" in elvis expression with RxJava
Bug IDEA-245774 False positive unused publisher in try expression
Task IDEA-248353 ReactiveStreams internationalization
Frameworks. SeamPerformance IDEA-240967 IntelliJ freezes in `com/intellij/jam/model/util/JamCommonUtil.addModuleDependencies` after importing a large build
Frameworks. SeleniumFeature IDEA-245226 Selenium: add truth library to new project wizard
Bug IDEA-245605 Selenium plugin does not run in PyCharm
Bug IDEA-246866 Selenium: good code red in JDI Light cssClass call with two CSS class names
Bug IDEA-245144 Selenoid: Create a new selenoid run config with a not existing name
Bug IDEA-247382 Selenium: false positive inspections for pseudo-class selectors in Selenide
Bug IDEA-246918 Selenium: Fix JDI locators warnings with contains search
Cosmetics IDEA-245984 Selenium: hide version field with single item in project wizard
Task IDEA-245961 Selenium: make Allure and Selenide dependencies enabled by default for new projects
Task IDEA-246262 Selenium: drop Balin support
Frameworks. SpringFeature IDEA-201363 Code-based Spring Security configurations are not supported in Kotlin
Feature IDEA-246196 Spring: provide find usages on navigation for @Cacheable and @CacheEvict references
Bug IDEA-245564 HTTP Request generating: Spring: if the controller-level @RequestMapping annotation defines the #method attribute, only this method should be used for controller methods mappings
Bug IDEA-246403 Spring WebFlux: Nested paths are not resolved in URL navigation.
Bug IDEA-180094 Spring Data: for repository methods that use properties of collection type incorrect parameter is required
Bug IDEA-250279 Endpoints view: all endpoints from @FeignClient are shown empty
Bug IDEA-235006 Spring Webflux: RouterFunctions.nest support: if there is a single route, no endpoints are displayed in Endpoints or Spring MVC view
Bug IDEA-243889 "Cannot resolve path variable 'xxxx' in request mapping " when uses @PathVariable with regular expression
Bug IDEA-245554 Open In HTTP Client gutter: GoToRelatedSymbol shortcut doesn't open HTTP Client for Spring MVC mappings when SB application is running
Bug IDEA-237514 Spring Boot Feign Client should have a URL reference in url-attrubute
Bug IDEA-244622 Spring Feign Client: in case of missing protocol in client url HTTP requests can't be generated
Bug IDEA-244987 Highlighting of PathVariables is broken for Kotlin: Spring Mvc Path variable should target string in URL
Bug IDEA-242153 WebflowDomModelManager is leaked after plugin unload
Bug IDEA-246398 Spring WebFlux: Predicate mappings from router builder are missing in the Endpoints View and URL completion
Bug IDEA-245261 Spring MVC: consider the server.port property on HTTP requests generating for the request mappings
Bug IDEA-241839 Spring Feign Client: the provided base url should be considered on generating HTTP Requests for endpoints from Kotlin classes
Bug IDEA-242148 DomSpringBeanImpl.ourBeanNameCache leaks references to classloaders of unloaded plugins
Bug IDEA-244344 Spring: incorrect request parameter name is used in references when it is specified using @RequestParam#name attribute
Bug IDEA-245824 "Navigate to related views" shows all views twice
Bug IDEA-242031 Spring Feign: HTTP Request generating creates 4 similar requests in case of missing base url
Bug IDEA-247861 Spring: i18n: 'Spring Configuration Check ' notification is not internationalized
Bug IDEA-242145 BeanProviderRegistry leaks bean type providers from unloaded plugins
Bug IDEA-230884 Spring MVC: incorrect reference for the unresolved pathvariable is used in some cases
Bug IDEA-246995 When clicking on Spring bean it is not jumping to exact bean in spring xml
Usability IDEA-248002 Spring: highlight references to MVC views in controllers
Exception IDEA-237235 IOE at com.intellij.psi.impl.PsiJavaParserFacadeImpl.newException
Exception IDEA-247154 ISE at com.intellij.ui.CoreIconManager.$$$reportNull$$$0
GrazieFeature IDEA-236165 Show the suggested change in Alt+Enter popup
Usability IDEA-230091 Grazie does not treat multi-line comment as continuous text
Cosmetics IDEA-237406 Grazie wrongly spelled in Export Settings window: "GraziConfig" vs. "Grazie Config"
GroovyBug IDEA-244372 Groovy @Newify Pattern: import|ed Classes Marked as Obsolete, No Auto-import, Italic Rendering
Bug IDEA-121250 Good code is red in @TupleConstructor Groovy annotation
Bug IDEA-104021 Groovy: type inference in closures used "just now"
Bug IDEA-122052 Groovy: blinking red highlighting
Bug IDEA-201095 Improve support of @DelegatesTo
Bug IDEA-247027 Support new attributes of @TupleConstructor for Groovy 2.5
Task IDEA-242437 Groovy DFA results depends on initial state of flow
Support Request IDEA-242412 Groovy 3 support?
Exception IDEA-243461 StackOverflow error at groovy annotator
Groovy. GrailsBug IDEA-242595 GroovyFileType.GROOVY_FILE_TYPES leaks reference to GSP file type on Grails plugin unload
Groovy. InspectionsBug IDEA-235059 Support @MapConstructor
InfrastructureTask IDEA-222049 Get rid of conflicting dependencies on jps-build-script-dependencies-bootstrap library in tests modules
Infrastructure. Build ScriptsBug IDEA-248767 Multiple versions of kotlin-stdlib library are included into IDEA distribution causing errors at runtime
Bug IDEA-247360 unable to build 2020.2: invalid source release: 11 for intellij.javaFX.sceneBuilder
Bug IDEA-249524 Build scripts fails with ClassNotFoundException: kotlin.jvm.internal.DefaultConstructorMarker
Bug IDEA-245914 Unable to build 2020.1.2 on macOS: out of memory building
Task IDEA-241075 Use JDK 11 as the main JDK in IntelliJ project
Task IDEA-248086 Get rid of dependencies on JDK '1.8' and 'IDEA jdk' from modules of intellij project
JavaFeature IDEA-205455 JEP 330: Launch Single-File Source-Code Programs
Feature IDEA-243472 Forbid creation of classes with `sealed`, `permits` name
Feature IDEA-245739 IntelliLang: insert RegExp language to Truth library
Feature IDEA-216686 Support java shell script shebang
Feature IDEA-229921 .class stubs for JEP 359 "Records"
Bug IDEA-243891 Make special type for usage in permits clause
Bug IDEA-246761 Support type annotations in various places of class stubs
Bug IDEA-246334 Dataflow to here: filtering `long` variable with `<= 0` yields no results.
Bug IDEA-153093 Type annotations are missing in .class stubs
Bug IDEA-244963 ExternalAnnotationsManager leaks references to classes of unloaded plugin via cached values in userdata of PSI elements held by annotations cache
Bug IDEA-248069 "excluded from compilation" is mentioned twice in icon tooltip
Bug IDEA-245625 Parser can't recognise qualified type with "var" package
Usability IDEA-247279 Overriding member chooser proposes implementing equals/hashCode/toString methods in records by default
Java. Code CompletionFeature IDEA-244569 Complete 'interface' and 'enum' keywords on Java 15-preview
Feature IDEA-245077 Complete 'abstract class' inside methods
Feature IDEA-243906 Sealed Classes: Completion in permits list
Feature IDEA-247109 Complete top-level public class name based on the file name
Feature IDEA-246986 Add automatic parentheses where it's evident
Bug IDEA-248001 Annotation parameter completion in generics doesn't work correctly
Bug IDEA-249580 Completion for 'sealed' 'non-sealed' for inner class
Bug IDEA-247122 Variable initialization completion adds semicolon which breaks the code
Bug IDEA-247596 Auto completion shows classes with dollar '$' symbol
Bug IDEA-244215 Lower priority of `.stream().toString()` completion item
Bug IDEA-243790 Don't suggest `.stream().*` completion items for streams
Bug IDEA-246663 Inconsistent suggestion while typing for annotations
Bug IDEA-246339 Do not suggest stream methods on method reference completion
Bug IDEA-246067 Do not suggest static superclass members shadowed in subclass
Bug IDEA-229266 Completion selects random class among same-named non-imported ones
Bug IDEA-245952 Display variableName instead of variableName.field/variableName.method() *as first suggestion* in autocomplete.
Usability IDEA-246542 Smart completion for org.junit.Assert.assertNotEquals arguments should be the same as for assertEquals
Usability IDEA-166673 Autocompletion places useful 'new' item to end of the list
Usability IDEA-90157 Smart type completion is not so smart with non-imported classes
Usability IDEA-210581 Completion for Stream.mapToDouble should prefer method reference for double methods
Java. Code FormattingFeature IDEA-229706 Formatter for Java 14 Records
Feature IDEA-244728 Add setting for space within record header
Bug IDEA-249581 Formatting removes space after type parameter of sealed class
Bug IDEA-236012 Incorrect generics and array formatting in Java 14 records
Performance IDEA-235221 IntelliJ stall when comment block inserted between calls of chained methods
Java. Code GenerationBug IDEA-244562 Generate getters should add 'Override' annotation for records in Java 15-preview
Bug IDEA-238510 Generate equals & hashCode and toString ignores idea code style
Bug IDEA-244190 'Override method' action should produce method with sorted modifiers
Usability IDEA-246532 Record toString(), equals(), hashCode() not available in Override Methods
Java. DebuggerBug IDEA-246419 Deadlock in debugger
Bug IDEA-240241 Many Backgroud Process of Hot Swapping (Hot Swap)
Bug IDEA-247512 Debugger shows strange `[NullPointerException]`
Bug IDEA-249754 Wrong cursor when dragging breakpoint to another file
Bug IDEA-245663 'Unable to evaluate expression' in variables view
Bug IDEA-244494 IDEA hangs when attaching to the target JVM (for dumping threads) on Windows
Performance IDEA-247389 High CPU usage when I debug JUnit test
Usability IDEA-245526 "Waiting for Debugger Response" progress should allow to kill the process immediately
Java. DecompilerFeature IDEA-246839 Support java records in decompiler
Bug IDEA-247551 Exception on first opening of record .class file
Bug IDEA-196302 Fernflower decompiler produces incorrect code in comparisons with float and double
Java. Error HighlightingFeature IDEA-239088 Update records support for Java 15
Feature IDEA-243471 Basic highlighting for permits clauses
Feature IDEA-249603 Provide fix for classes in permits list that do not extend sealed parent class
Feature IDEA-243546 Allow local interfaces and enums on language level 15-preview
Feature IDEA-250654 Improve ambiguous method reference message
Feature IDEA-243902 Sealed classes: update permits list on changing hierarchy
Bug IDEA-244246 IDEA should take into account Language level for highlighting of preview features
Bug IDEA-244854 False positive error highlighting in ternary
Bug IDEA-247465 Compilation error not highlighted for generic method in ternary expression
Bug IDEA-245063 Problems related to class disappear after method change
Bug IDEA-238740 Support @jdk.internal.PreviewFeature annotation
Bug IDEA-231240 Intellij does not allow 'var' as label
Bug IDEA-246970 Local annotations should not be allowed in Java15-preview
Bug IDEA-248973 Compilation error not shown in editor
Bug IDEA-244252 IDEA shows no error for instantiation of @PreviewFeature class
Bug IDEA-246509 Sealed enum: do not suggest making enum sealed if it has no inheritors
Bug IDEA-247882 Sealed classes: sealed annotation type is not highlighted
Bug IDEA-242390 "Illegal forward reference error" not highlighted in the editor
Bug IDEA-248364 IDE does not error usages of annotations with var
Bug IDEA-245721 Good code is marked red: "the receiver should be the first parameter" when comment precedes 'this' parameter
Bug IDEA-249356 "Variable might not have been initialized" error in a valid Record constructor
Bug IDEA-246454 bad code is green: record component already defined
Bug IDEA-244248 Record not shown as errors on 15 Java language level
Bug IDEA-247104 Sealed classes: generic in permits list is not highlighted
Cosmetics IDEA-245318 Unusual wording when record constructor has improper level access
Task IDEA-243899 Property test for sealed classes
Exception IDEA-249293 Cache disabled due to recursion prevention [diamond operator + anonymous class + protected constructor]
Exception IDEA-249525 Recursive conflict resolution
Java. Extract MethodBug IDEA-244986 Extract method: pass fields as parameters may produce bad code
Bug IDEA-243597 'Extract Method' selects incorrect return type
Bug IDEA-244926 Extract method: do not pass implicit static fields as static parameters (interface fields).
Bug IDEA-244988 Extract method: make static should not be suggested for inner classes
Bug IDEA-244996 Extract method: fails after multiple expressions selection
Java. GUI DesignerBug IDEA-249968 Japanese text is not displayed if <font style="1"/> is used in UI form
Java. InspectionsFeature IDEA-217572 Inspection to replace String.toLowerCase().equals() with String.equalsIgnoreCase()
Feature IDEA-187536 notice unused assignment in try catch
Feature IDEA-247437 Hardcoded strings inspection should have a smart option to ignore HTML
Feature IDEA-244284 Suspicious collection method calls: support containsAll
Feature IDEA-231640 CountDownLatch.await and Condition.await must be in the default set of methods for 'Result of method call ignored' inspection
Feature IDEA-249154 "Hard Coded Strings" Kotlin regular expressions constructer calls should not be reported
Feature IDEA-244143 Infer not-null for protobuf generated accessors
Feature IDEA-241446 Provide batch mode for several keys generation in Hard coded strings
Feature IDEA-243886 Equality between newly created objects: use control-flow analysis to detect more cases
Feature IDEA-248564 "Hard coded strings" inspection: treat StringBuilder::toString result as @NlsSafe if StringBuilder is @NlsSafe
Feature IDEA-246382 flatMap(Stream::of) can be removed
Feature IDEA-246390 DFA skips the warning "Array index is out of bounds" in for-loop
Feature IDEA-248396 Reapply return type parameters when the receiver type is narrowed down
Feature IDEA-249510 "Incorrect string capitalization" inspection should reports problems in kotlin
Feature IDEA-244141 Report try-catch(AssertionError/Error/Throwable) if try ends with assertXyz or fail method
Feature IDEA-249263 org.jetbrains.annotations.PropertyKey should have ElementType.TYPE_USE target
Feature IDEA-249165 Redundant File creation in a stream constructor
Feature IDEA-244138 Pointless arithmetic expression: support float and double
Feature IDEA-246014 Enhance hardcoded strings inspection
Feature IDEA-230392 Support Java 14 annotation
Bug IDEA-211709 where is fix all intention for override?
Bug IDEA-249157 "Hard Coded Strings" `@Nls`/`@NonNls` annotations are not applied to mutable variables
Bug IDEA-247327 Hard coded string inspection exception Unexpected token: '!'
Bug IDEA-248487 Red code after "Remove unnecessary 'throws' declarations"
Bug IDEA-247322 IntelliJ constantly indexing Java files
Bug IDEA-249149 "Hard Coded Strings" `@NonNls` is not inferred for literal with space in Kotlin that is a named argument that skips an optional parameter
Bug IDEA-249641 False positive 'Reference to non-localized string is used where localized string is expected' on map key
Bug IDEA-249150 "Hard Coded Strings" Cannot annotate `StringBuilder` with `@NonNls` in Kotlin
Bug IDEA-244280 Do not report Old style JUnit test method in JUnit4 class if method is annotated as @Before/@After/@Ignore
Bug IDEA-229415 Incorrect code refactor: "manual array copy" warning
Bug IDEA-244140 Equals with itself inspection: support Objects.equals
Bug IDEA-249829 Java 14: records: data flow analysis fails to detect an existing null check.
Bug IDEA-247907 "Copy constructor misses field" inspection false negative
Bug IDEA-249621 Used enum is highlighted as not used and suggested for removal
Bug IDEA-247708 Duplication of record member annotation when convert to class
Bug IDEA-249747 "Hard coded strings" reports warning for @NlsSafe variable in kotlin
Bug IDEA-249786 Hard coded strings: support annotation values in Kotlin
Bug IDEA-250249 @NlsSafe StringBuilder#toString should not be reported
Bug IDEA-245323 Null analysis treats annotations for nested arrays in a wrong way
Bug IDEA-247775 The "Incorrect string capitalization" inspection does not understand html in properties
Bug IDEA-246008 "Constant condition" Inspection quick fix removes boolean value from string concatenation when between two values
Bug IDEA-249248 "Hard coded strings" doesn't report unannotated references if "Ignore if target is not annotated with @Nls" is off
Bug IDEA-248972 Replace with <> breaks compilation
Bug IDEA-248077 Inconsistent result when running inspection "SSBasedInspection"
Bug IDEA-248532 Java: "Hard coded strings" inspection shows a warning when string with external @Nls annotation is passed to @Nls context
Bug IDEA-248205 "Redundant suppression" false positive
Bug IDEA-248065 Incorrect ConstantConditions inspection warnings when assigning a not-null constant first to a @Nullable field and then to a @NotNull field
Bug IDEA-247626 The "Incorrect string capitalization" inspection does not understand conditionals in properties
Bug IDEA-200022 Convert C-style array declaration splits compound declaration of several arrays when applied in batch
Bug IDEA-247103 "Assert x != null" quick fix does nothing
Bug IDEA-246654 Incorrect replacement with Objects.requireNonNull()
Bug IDEA-246791 "Conditional can be pushed inside branch expression" inspection false positives
Bug IDEA-201714 Regression: Missing "fix all" for "Redundant throws clause"
Bug IDEA-246782 Three-argument Stream.collect is not intrinsified in data flow analysis
Bug IDEA-249151 "Hard Coded Strings" capitalized literal is reported when comparing with `@NonNls` string in Kotlin
Bug IDEA-244598 Integer multiplication cast to long: avoid reporting inside JUnit4 assertEquals
Bug IDEA-247587 Hardcoded strings inspection: improve @NonNls propagation from interfaces
Bug IDEA-245423 Incorrect "Condition X covered by subsequent condition Y" warning
Bug IDEA-242626 'Overridable method called during object construction' false positive
Bug IDEA-244356 Constant condition incorrect when declaring a list of integers with wildcard
Bug IDEA-238040 IntelliSense Issue - Incorrect C-Style array to Java-style array conversion when mixed with annotations
Bug IDEA-203748 Recognize Junit 5 methodSource
Bug IDEA-247080 String like "app\\rep" mistakenly flagged as Harcoded line separator '\r'
Bug IDEA-249105 "Hard coded string" inspection: "ignore for exception constructor arguments" option doesn't work in kotlin for Java exceptions
Bug IDEA-246336 Redundant deprecation highlighting for lambda
Bug IDEA-248579 NlsContexts are not inferred from Kotlin scope functions
Bug IDEA-248060 Incorrect SuspiciousSystemArraycopy inspection warning when copying array in constructor from same class parameter
Bug IDEA-250202 String concatenation in a loop fires on strings created in the loop
Bug IDEA-245797 IntelliJ suggests to simplify Void.class.isAssignableFrom(someClass) to false
Bug IDEA-246303 "Suspicious indent after control statement without braces" inspection problems
Bug IDEA-249100 "Hard coded stings" inspection reports strings in when cases
Bug IDEA-32977 "hardcoded string literal" inspection should not highlight addition operations on the @NonNls string.
Bug IDEA-148562 'suspicious indentation'-inspection: false positive within switch-statement
Bug IDEA-244147 Suspicious collection method calls doesn't report removeAll/retainAll with obviously inconvertible types
Bug IDEA-247739 Hardcoded strings inspection: ignore strings in ternary operator condition during propagation
Bug IDEA-247949 "Convert record to class" intention doesn't generate serialVersionUID
Bug IDEA-221360 Inspection: 'Result of method call ignored': inconsistent handling of CheckReturnValue and CanIgnoreReturnValue
Bug IDEA-243863 Hardcoded string literals inspection doesn't report non-interpolated strings in Kotlin
Bug IDEA-247547 UAST: i18n inspection does not report assignment of a hard-coded string to a Kotlin property annotated with @Nls
Bug IDEA-247441 Inconsistent behavior of external annotations for Kotlin annotation members in i18n inspection
Bug IDEA-246751 utility class with non-constant static field can't be enum
Bug IDEA-245415 Wrong redundant cast warning when casting to raw-type inside ternary expression
Bug IDEA-247866 UAST: Non-localized strings used in Kotlin with property assignment are not found with the i18n inspections
Bug IDEA-245487 Delete unnecessary method(s) fix of Empty Method inspection does not work
Bug IDEA-246500 DFA infers an instanceof expression result improperly
Bug IDEA-245775 'Condition is covered by further condition' false positive on exception instanceof check
Bug IDEA-250320 Kotlin: References to property keys inside literals in if expression aren't resolved
Bug IDEA-246519 Boxed Integer is reported to be equal to boxed Byte
Bug IDEA-248063 Incorrect ConstantConditions inspection warnings when calling getClass().getName() in an anonymous inner class
Bug IDEA-247618 Hardcoded strings inspection: improve @NonNls propagation from method return
Bug IDEA-246054 Incorrect condition is always true due to ignored ArrayIndexOutOfBounds catch
Usability IDEA-247625 Hard coded strings inpection: improve @NonNls propagation from class description
Usability IDEA-238645 Detect inefficient conversion from ByteArrayOutputStream into String
Usability IDEA-247598 "I18nize hardcoded string literal" quick fix: do not save suggested bundle
Usability IDEA-247494 Hard coded strings inpection: improve @NonNls propagation from method parameters
Usability IDEA-248139 "Add constructor parameter" quick fix works partly wrong in records
Usability IDEA-247605 i18n inspection: Provide a list instead of a single field for entering regexps to ignore
Usability IDEA-244666 Move text block inspections to 'Java 15' group
Usability IDEA-244845 Annoying red color for inaccessible members in javadoc
Usability IDEA-247493 Hardcoded strings inspection: improve @NonNls propagation from assignments
Usability IDEA-247588 Hardcoded strings inspection: ignore strings in switch cases and conditions
Java. Intention ActionsFeature IDEA-243848 Intention to make class sealed
Feature IDEA-20480 Passing int literal to Long parameter: expected QuickFix not available
Feature IDEA-24201 Improve auto-generated methods returning collections of final-class elements
Feature IDEA-243901 Intention to fill permits list from existing inheritors
Feature IDEA-243904 Make "move class to current package" available on class in permits list
Feature IDEA-249810 Automatically fix closing parentheses in nested calls
Feature IDEA-243900 Sealed classes: add class to the permits list if it inherits sealed class
Feature IDEA-246142 Intention: Convert record to class
Bug IDEA-243903 Misordered modifiers fix: support sealed/non-sealed
Bug IDEA-243749 Add explicit SearchableOptionsRegistrar initialization to IntentionDescriptionTest
Bug IDEA-246919 Implement Interface intention doesn't work
Bug IDEA-245407 Suggested "Remove type arguments" quickfix leads to "raw use of parametrized class" warning
Bug IDEA-245337 'Change field type' for record component field does nothing
Bug IDEA-246579 Incorrect type conversion from Enum to AtomicReference<Enum>
Bug IDEA-246491 Replace statement with 'Objects.requireNonNull()' drops NPE message
Bug IDEA-243750 "reverse direction of the loop" does nothing
Bug IDEA-249610 Safe Delete is never ending for a Java static method in 203
Bug IDEA-245312 Exception on removing throws clause from record constructor
Bug IDEA-244730 Create method suggests wrong return type
Usability IDEA-247438 The fix to add an external annotation to a method parameter doesn't seem to offer @NonNls for parameters of type Object
Usability IDEA-15337 Cursor should be put after class name when creating class from existing code
Task IDEA-244030 Modify record components from usage
Task IDEA-243633 Add a consistency test for unattended intentions descriptions
Exception IDEA-244540 NPE at conversion local interface to class
Exception IDEA-244889 NPE at conversion local class to interface
Exception IDEA-245317 Exception on type migration inside record constructor
Java. JavaFXBug IDEA-190964 fxml: Idea shows an error on the import statement with an inner class
Configuration Problem IDEA-203088 IdeaJ 2018.3 run command does not work with javafx based projects
Java. Profiler. CPUBug IDEA-250443 Support DnD of jfr files to IntelliJ IDEA
Bug IDEA-250328 Unstable JFR open
Java. Profiler. MemoryFeature IDEA-246363 Support DnD of hprof files to IntelliJ IDEA
Bug IDEA-245372 OutOfMemoryError in some cases while merged paths or shortest paths are being calculated
Cosmetics IDEA-248272 Typo "Tread" in profiler summary
Java. Properties FilesBug IDEA-246358 Can't create nested property in the Resource Bundle pane
Bug IDEA-195543 literal exprs assigned to problemKey in VarOrFieldInliner must be highlighted as property references
Java. RefactoringsFeature IDEA-232557 Safe delete: suggest to delete properties which were used from the class/method being deleted only
Bug IDEA-245193 IDEA highlights correct link in javadoc as error after move
Bug IDEA-247125 Warning about moving a package to another source root misses the package name
Bug IDEA-244603 Inline refactoring removes comments above and after the method
Bug IDEA-249148 Renaming record canonical constructor parameter doesn't change corresponding accessors or record components
Bug IDEA-249243 Change Method Signature: Propagate Parameters doesn't work anymore
Bug IDEA-250412 Introduce constant doesn't suggest to remove occurrences in annotations
Bug IDEA-245151 Change signature available but doesn't work for record definition
Bug IDEA-244925 Introduce variable should be forbidden on reference to class/package
Bug IDEA-250077 "Extract method" refactoring ignores method name and uses 'extracted' instead
Bug IDEA-247851 Inline field: wrong result for field with definition in constructor
Bug IDEA-242718 'Extract Method' dialog shouldn't propose to pass static variables as parameters when I use 'Declare static'
Bug IDEA-248324 Inline method: should find Kotlin usages where they called as synthetic property
Usability IDEA-247809 Inline method/field: allow to inline "this only" from other languages
Usability IDEA-245667 Refactor/Extract field doesn't save options on next invocation
Usability IDEA-246394 Refactor / Inline: rejections to inline Java field and Java method suggest different user scenarios
Usability IDEA-244902 IDEA suggest changing return type of method which is useless
Exception IDEA-229705 PIEAE when moving a directory with Java classes into a module with a different language level
Java. Tests. ArquillianBug IDEA-235587 Arquillian plugin sometimes requires restart on disabling due to ArquillianRunConfigurationTypeUtil
Java. Tests. JUnitFeature IDEA-163195 Inspection 'Message missing on JUnit/TestNG assertion' may suggest quickfix
Feature IDEA-241535 Include suggestion to change lifecycle configuration when parameterised test refers to non-static method
Bug IDEA-249511 JUnit. Unable to run test due to java.lang.VerifyError
Bug IDEA-245997 inconsistent during test run
Bug IDEA-243165 "The filename or extension is too long" error in forked mode (argfile shortener)
Bug IDEA-246118 IntelliJ incorrectly warns about missing method for JUnit5 @MethodSource
Bug IDEA-243861 Shorten command line: options for jdk 8 are available when JRE 11 would be used
Bug IDEA-226069 IDEA should report incompatibility to boolean as @ValueSource of ParametrizedTest
Bug IDEA-237718 Toggle auto-test doesn't work for Junit run config in Maven/Gradle projects
Bug IDEA-243039 Allows to select any method of the test when "Test kind" is "Method"
Usability IDEA-243920 Migrate JUnit 4 to JUnit 5 tests doesn't seem to migrate Assert
Usability IDEA-216145 Empty line(s) generated in Run console for each test case
Usability IDEA-223775 Unable to run a test multiple times in separate JVMs
Cosmetics IDEA-242512 Confusing test suite icon with ignored test
Cosmetics IDEA-246417 Test runner: inconsistent number presentation
Exception IDEA-249239 Throwable at com.intellij.openapi.roots.impl.RootIndex.<init>
Java. Tests. TestNGBug IDEA-244870 TestNG Run Configuration is shown for any YAML document
Bug IDEA-234765 Update TestNG IntelliJ plugin to generate suite file with "https"
Bug IDEA-250751 NCDFE: com/beust/jcommander/ParameterException at TestNGXmlSuiteHelper.writeSuite() on attempt to run TestNG test
Bug IDEA-246591 Gutter doesn't reflect test result for TestNG tests
Bug IDEA-206449 TestNG: test name is not displayed if it is identical to the suite name
Usability IDEA-218927 IDEATestNGTestListener adds empty lines to the console output
Java. Type MigrationBug IDEA-179780 StackOverflow during Guava refactoring
Java. i18nFeature IDEA-246848 Convert concatenation with conditional to choice pattern
Bug IDEA-247290 Add @Nls annotation from inspections view produces broken code
Bug IDEA-247231 PackageSet i18n problem
Bug IDEA-248347 "Reference to non-localized string" is not reported for kotlin local variables
Bug IDEA-247707 @NonNls inspection doesn't propagate to receiver expressions in Kotlin
Bug IDEA-247455 & is not escaped
Bug IDEA-246771 Title capitalization inspection doesn't warn on `messagePointer`s
Bug IDEA-247804 I18n fix: ensure special choice format symbols (< > | #) are escaped
Bug IDEA-249587 I18n fix: unable to fix Kotlin literal
Bug IDEA-249147 "Incorrect string capitalization" inspection could ignore references to file extensions
Bug IDEA-249858 Kubernetes i18n
Bug IDEA-248944 `Refactor | Internazionalize...` doesn't work for concatenation when inspection doesn't report a problem
Bug IDEA-248709 Quickfix for "Hard coded strings" expression incorrectly generate placeholders inside choice for conditional expressions
Bug IDEA-248924 Impossible to select a property bundle of a module dependency in "I18n Hardcoded String"
Bug IDEA-247453 I18n: recognize concatenation if started from literal in if-else
Bug IDEA-249116 Hardcoded string concatenation is not recognized inside conditional expressions
Bug IDEA-247473 I18nize concatenation should not escape quotes if all operands are literals
Bug IDEA-249030 "Unused property keys" fails in batch mode
Bug IDEA-248878 i18n: false-positive capitalization inspection for non-character symbols
Bug IDEA-248860 Kotlin: "Hard coded stings" doesn't report unannotated references inside ?: operator
Usability IDEA-248703 "Hard coded strings" inspection: batch fix for hardcoded string literals don't use prefixes/suffixes from NlsContext annotations
Usability IDEA-247353 Make suppress with NonNls available in batch mode
Usability IDEA-248707 Batch quick fix for "Hard coded strings" suggest to internationalize expressions and their sub-experssings
Usability IDEA-247350 Enable speed search for property files chooser in i18n dialog
JavaX. AppServersException IDEA-243692 Throwable at com.intellij.openapi.roots.impl.libraries.LibraryImpl.<init>
JavaX. AppServers. GlassFishBug IDEA-228381 No messages in the output and java.lang.Throwable in idea log after deploying on Glassfish4 with 10 java
Bug IDEA-244384 Support GlassFish 6
JavaX. AppServers. JBossBug IDEA-212633 CMP beans field mapping is not show in the user interface
JavaX. AppServers. JettyBug IDEA-250458 Jetty: plugin does not recognize successful deployment if the context contains "/"
JavaX. AppServers. TomcatBug IDEA-245597 "On frame deactivation: Update resources" does not work on Windows 10
Bug IDEA-235851 Tomcat: when the 'unnamed' run configuration is created in the localized IDEA, deployment fails
Bug IDEA-238233 Remote Tomcat deployment forgets the "Path from root" value on restart
JavaX. CDIBug IDEA-222460 CDI @Named components are listed unsorted
Bug IDEA-242999 Jakarta 8: CDI is not recognized in some valid project that uses CDI annotations
JavaX. JPABug IDEA-243657 New JavaEE project wizard. Auto-configure JPA facet if specification classes are available
Bug IDEA-248442 No completion in JPA interfaces methods name in Spring
Bug IDEA-243079 Import Database Schema action generates classes without @Entity annotation
Performance IDEA-244528 100% cpu while idle
JavaX. JSPException IDEA-247137 Throwable at com.intellij.codeInspection.ProblemDescriptorBase.assertPhysical
JavaX. JavaEEFeature IDEA-243715 New JavaEE project wizard. Provide possibility to add additional libraries
Bug IDEA-243652 New JavaEE project wizard. Don't reset wizard to default by returning to the previous page.
Bug IDEA-243650 New JavaEE project wizard. Correctly process errors: provide explaining msgs and don't remove the entered value
Bug IDEA-244830 New JavaEE project wizard. Gradle: auto-configure config file in JPA facet by project creation
Bug IDEA-243659 New JavaEE project wizard. Provide a not-existing default project name automatically
Bug IDEA-244827 New JavaEE project wizard. "Configure" link remains after auto-configuration of the facet
Bug IDEA-243808 New JavaEE project wizard. JPA, CDI: configs are generated into WEB-INF directory
Bug IDEA-243712 New JavaEE project wizard. Auto-select the "included" frameworks in the wizard.
Bug IDEA-245440 New JavaEE project wizard. JPA facet is not added for Jakarta by adding EclipseLink implementation
Usability IDEA-235561 JavaEE: validate group/artifact/version fields in new project wizard
Usability IDEA-245439 New JavaEE project wizard. Improve discoverability of Implementations section
Task IDEA-244556 New project wizard: show legacy Java EE items if there are old plugins installed
JavaX. Web ServicesBug IDEA-243576 KT. Jakarta. JAX-WS. WebSocket. Endpoint icons are absent in the Endpoint view.
Bug IDEA-211043 Wrong inspection warning (false positive) in Java EE8 JAX-RS SSE endpoint
Bug IDEA-243182 Jakarta. JAX-RS: add urls and pathParams support
Bug IDEA-244261 JAX-RS: HTTP Client gutter is shown for Path constructor
Bug IDEA-249432 JavaEE: @WebService annotation missing when project created with JAX-WS library
Usability IDEA-233346 Unused declaration inspection does not recognize entry point for WebMethod annotated methods
Lang. Flash and FlexBug IDEA-249328 AIR SDK 33.1 namespace is highlighted as error
Bug IDEA-245186 Cannot build Flash/Flex project in 2020.2 EAP
Lang. FreeMarkerException IDEA-214937 nonempty text is not covered by block in #<FreeMarker> #formatter
Lang. MarkdownFeature IDEA-213096 Support auto-scroll using a mouse wheel for the 'Markdown Support' plugin
Feature IDEA-213097 Add Support for Rendering of Mermaid.js in Markdown Preview
Bug IDEA-244817 Shell script is not highlighted in preview of Markdown
Bug IDEA-220392 Markdown hard line wrap inserting whitespace at beginning of new line
Bug IDEA-244546 Error on completion in code blocks
Bug IDEA-216229 Markdown plugin should obey line length
Bug IDEA-220660 Markdown: Shell script highlighting for 'bash' or 'sh'
Bug IDEA-210173 Support color themes for Markdown plugin
Task IDEA-243531 Support reformatting for Markdown
Lang. RegExpBug IDEA-241270 Regexp false position inspection in ternary expression
Bug IDEA-242520 Replace redundant character class with contents, quick fix
Lang. Shell ScriptFeature IDEA-247440 Feature request: Make Shell configurations execute in the Run window like BashSupport
Feature IDEA-226750 Update shellcheck to latest (currently 0.7)
Feature IDEA-245850 "Shell Script" run/debug configuration provides no easy way to set environment variables
Bug IDEA-244312 Shell: test command breaks highlighting
Bug IDEA-243118 Broken syntax highlighting: backslash escaped quotation marks
Bug IDEA-243154 Shell: Find usages broken with latest 2020.2 EAP
Usability IDEA-238259 Shell script support does not recognize executable files with shebang
Task IDEA-216508 [Shell Script] Provide folding
Lang. ThymeleafBug IDEA-244146 Code completion Thymeleaf fragments only works if fragments are in same directory
Lang. VelocityBug IDEA-224925 Code formatting and validation fails in velocity Template with Template Data Language JSON
Lang. XMLTask IDEA-248591 i18n: internationalize XML and HTML support
Lang. YAMLBug IDEA-214810 YAML formatter does not strip extra spaces after the colon
Bug IDEA-245643 JSON YAML file unlimited auto formatting
Bug IDEA-243973 Freezes when opening azure-pipelines.yml
LocalizationFeature IDEA-248366 Platform Core modules internationalization
Feature IDEA-249583 Internationalization for Structural Search
Feature IDEA-247660 AppCode internationalization
Feature IDEA-247635 Ruby Internationalization
Feature IDEA-249126 Internationalize messages in build process
Bug IDEA-248093 Internalzation for InstalledSearchOption
Bug IDEA-249462 Internalization for "stream-debugger"
Bug IDEA-249565 Internalization for "indexing-api"
Bug IDEA-249037 Missing @Nls/NonNls in com.jetbrains.jsonSchema.extension.JsonSchemaFileProvider
Bug IDEA-248549 Missing @Nls for com.intellij.codeInsight.navigation.NavigationGutterIconBuilder
Bug IDEA-248724 Move platform properties which are used from external plugins only to special bundle
Bug IDEA-249042 Missing @NonNls for org.jetbrains.plugins.gradle.frameworkSupport.BuildScriptDataBuilder
Bug IDEA-249466 Internalization for "ui-designer-core"/"ui-designer" plugins
Bug IDEA-249617 Missing @Nls for com.intellij.util.text.DateTimeFormatterBean
Bug IDEA-249465 Internalization for "textmate" plugin
Bug IDEA-248933 Internalize Power save mode notification
Bug IDEA-249693 Missing @NonNls in &
Bug IDEA-249613 Missing @Nls for com.intellij.openapi.diagnostic.ErrorReportSubmitter#getPrivacyNoticeText
Bug IDEA-249740 Internalization for "notification" subsystem
Bug IDEA-249457 Internalization for "laf"
Bug IDEA-249742 More internalizations
Bug IDEA-247987 i18n: internationalize export options
Bug IDEA-249616 Missing @Nls for com.intellij.ide.externalComponents.ExternalComponentSource
Bug IDEA-248512 I18n Code Style Scheme name problem: "Default" and "Project" should be localizable
Bug IDEA-249875 Javaee Jps validator: i18n
Bug IDEA-249618 Missing @Nls for com.intellij.ide.AboutPopupDescriptionProvider#getDescription
Bug IDEA-245885 Exception on attempt to open Search Everywhere with enabled language pack
Bug IDEA-249468 Internalization for "xslt-debugger"
Bug IDEA-247875 When removing mnemonics, remove Japanese mnemonics in parentheses completely.
Bug IDEA-249034 Missing @Nls for com.intellij.ide.fileTemplates.FileTemplateDescriptor
Bug IDEA-249470 Internalization for "duplicates-*"
Bug IDEA-248466 intellij.platform.ssh module internationalization
Bug IDEA-249467 Internalization for "xpath" plugin
Bug IDEA-249738 Internalization for "facet/frameworks"
Bug IDEA-249455 Internalization for "javaFX"
Bug IDEA-247980 i18n: internationalize message 'Select configuration element in the tree' in Code style
Bug IDEA-249472 Internalization for "jam-support"
Bug IDEA-249707 Internalization for "build"
Bug IDEA-248539 Missing @Nls com.intellij.navigation.GotoRelatedItem#myGroup
Bug IDEA-247912 i18n: internationalize options in Non-Project Files Protection dialog
Bug IDEA-249889 javaee i18n: JSP
Bug IDEA-249710 Internalization for "code insight"
Bug IDEA-249721 Internalization for "SE"
Bug IDEA-248436 Missing @Nls for "location String"
Bug IDEA-248538 Missing @Nls com.intellij.openapi.ui.popup.ListSeparator
Bug IDEA-249619 Missing @Nls for com.intellij.codeInsight.hints.settings.InlayProviderSettingsModel#getName
Task IDEA-249724 Internalization for views
Task IDEA-249758 Internalization for "uml"
Task IDEA-247675 External System internationalization
Task IDEA-249739 Internalization for "diagnostic"
Task IDEA-249054 Internationalize large files
Task IDEA-248434 Missing @Nls: search scopes
Task IDEA-249756 Internalization for "nodeJS"
Task IDEA-247699 GWT internationalization
Task IDEA-248560 WebDeployment module internationalization
Task IDEA-247684 Eclipse internationalization
Task IDEA-249730 Internalization for "openapi"
Task IDEA-249732 Internalization for "ui"
Task IDEA-247653 Maven internationalization
Task IDEA-249895 i18n frameworks: Freemarker
Task IDEA-247683 App servers & Cloud internationalization
Task IDEA-247656 Profiler internationalization
Task IDEA-249728 Internalization for "file templates"
Task IDEA-248639 remote-run module internationalization
Task IDEA-249741 Internalization for "plugins"
Task IDEA-249460 Internalization for "sh"
Task IDEA-247672 OSGi internationalization
Task IDEA-247663 GoLang internationalization
Task IDEA-247670 Gradle internationalization
Task IDEA-249755 Internalization for "javaScriptPlugin"
Task IDEA-247698 Ant internationalization
Task IDEA-247671 JPS Cache internationalization
Task IDEA-249737 More internalizations
Task IDEA-249436 Internalization for "testRunner", "usageView", "analysis-*"
Task IDEA-248926 Internationalize error messages about failed to load plugins
Task IDEA-249901 i18n: intellij.xml.refactorings
Task IDEA-247643 Groovy internationalization
Task IDEA-247706 Swift internationalization
Task IDEA-249736 Internalization for "lang-impl"/"ide"
Task IDEA-247693 Tasks internationalization
Task IDEA-249731 Internalization for "code style"
Task IDEA-249028 License check code internationalization
Task IDEA-249441 Internalization for "platform-resources", "platform-util-io"
Task IDEA-247680 EditorConfig internationalization
Task IDEA-247655 Debugger internationalization
Task IDEA-249734 Internalization for "lang-impl"/"psi"
Task IDEA-248708 Internationalization of remote in platform-impl module
Localization. ChineseBug IDEA-246607 Docker: not translated strings.
Localization. JapaneseBug IDEA-242331 mnemonics do not work as mnemonics for Windows are shown on macOS when Japanese/Chinese/Korean language packs are enabled
Plugin Development (DevKit)Feature IDEA-250437 Devkit PluginXmlI18nInspection: highlight override-text "text" attribute
Feature IDEA-249646 Devkit: support key/bundle for com.intellij.notification.impl.NotificationGroupEP
Feature IDEA-250261 Devkit: support nameKey/nameBundle for com.intellij.openapi.options.SchemeConvertorEPBase
Feature IDEA-130292 'Unused Property' inspection: don't mark exportable.* as unused
Feature IDEA-223195 Provide an action to update IntelliJ IDEA from sources
Feature IDEA-249171 Devkit: ConfigurableGroupEP code insight
Feature IDEA-244325 [devkit] Convert InspectionDescriptionNotFoundInspection to UAST
Feature IDEA-250281 DevKit: support <synonym> "key"
Feature IDEA-229067 DevKit setup: show notification to suggest migration to Gradle-based setup
Feature IDEA-249611 Devkit - Plugin.xml i18n verification: additional EP properties to check
Bug IDEA-250280 Action text properties with place qualified are reported as unused
Bug IDEA-249051 'Unused Property' inspection: live template descriptions are marked as unused properties in properties bundles
Bug IDEA-250544 Inspection "Unused property" incorrectly reports plugin.pluginID.description properties
Bug IDEA-250283 "action.ID.text" properties may be reported as unused if there are several definitions of action with the specified ID
Bug IDEA-244774 [devkit] Improve "language" resolving/code insight
Bug IDEA-250381 "Plugin.xml text capitalization" inspection false positive
Usability IDEA-245277 "New action" dialog: hide anonymous groups
Task IDEA-247667 Devkit internationalization
Task IDEA-245855 Inspection to detect maps using FileType or Language as key in plugin code
SpaceBug IDEA-248174 Space: Key field highlighted when Name is invalid in Create New Project on Space dialog
Bug IDEA-248167 Commits and branches count are swapped in clone dialog
Exception IDEA-247631 Space: exception on update space plugin
Tools. DockerFeature IDEA-212147 Docker. Support --init command line option
Bug IDEA-246160 'Docker API URL is not specified' when debug Node.js project via built-in Docker image
Bug IDEA-245127 Selenoid: Container port is not changed to the custom one
Bug IDEA-178654 Docker: Rename the Dockerfile/compose file doesn't rename it in run configurations
Bug IDEA-243835 Docker: "All pipe instances are busy" after creating some connections
Bug IDEA-245940 java.lang.IllegalArgumentException: Argument for @NotNull parameter 'parameterString' at creating docker run configurations and opening projects with docker run configs
Bug IDEA-250305 Refactoring of folder name replaces entire line when checking for references
Bug IDEA-248828 Dockerfile Error: <path segment> expected, got '@'
Bug IDEA-245468 Selenoid: Incorrect behaviour by moving browsers.json file, renaming folders with browsers.json
Bug IDEA-243967 Docker: images completion doesn't work
Bug IDEA-244593 Wrong dependency configuration of intellij.clouds.docker.agent.impl.rt in idea ultimate project
Bug IDEA-243048 Cant start docker conteiners from docker-compose file
Bug IDEA-245610 Docker CLI Parser thinks --cpus should be between 0 and 1
Usability IDEA-245206 Docker: Unclear exception message in case of stopped Docker service
Usability IDEA-244644 Helidon: Dockerfile.jlink is not detected as Docker config
Tools. HTTP ClientFeature IDEA-143889 REST Client Needs Export as Curl Option
Feature IDEA-245037 Open in HTTP Client Gutter: Use Go to related shortcut to open
Feature IDEA-246759 API for 'indexing' HTTP Client scratches
Feature IDEA-239332 HTTP Client: Provide completion for 'application/yaml' Content-Type
Bug IDEA-242957 HttpClient: Can't generate request for endpoint with empty path
Bug IDEA-241517 HTTP Client shows null for path variable on generation of URL from Spring controller
Bug IDEA-244668 HttpClient: cursor is not set on the generated URL from gutter
Bug IDEA-246989 HttpClient: After change env name in scratches, it not changes in http client right away
Bug IDEA-244655 HttpClient: PUT converted to POST on paste from cURL
Bug IDEA-242378 HttpClient: Can't use env variable as domain port
Bug IDEA-239250 REST Client exception with Content-Length header
Usability IDEA-247296 Ability to Run (new) Http Client from the "Find Action"
Task IDEA-247690 RestClient internationalization
Task IDEA-239387 Test RESTfull Web Services action must create new HTTP Client file
Task IDEA-239388 Provide action to convert legacy HTTP Client files to the new format
Exception IDEA-249112 java.lang.IllegalArgumentException at "Generate HTTP request" action
Exception IDEA-249122 IAE at com.intellij.codeInsight.highlighting.BackgroundHighlighter.$$$reportNull$$$0
Exception IDEA-245301 Throwable at com.intellij.openapi.editor.impl.DocumentImpl.createRangeMarker
Tools. KubernetesFeature IDEA-248622 KubernetesView. Provide possibility to download logs into the custom place
Feature IDEA-248626 KubernetesView. Download logs: place the downloaded logs into one folder with time-stamping in log file names
Feature IDEA-224826 KubernetesView: Possibility to download logs
Feature IDEA-240410 Add browsing of ConfigMap and Secret entries to the Kubernetes cluster browser
Bug IDEA-246444 Kubernetes: Add FindUsages item into context menu for ConfigMaps/Secrets table
Bug IDEA-248618 K8s. Download log: doesn't navigate to the file location by Navigate->Select in->ProjectView in the Editor
Bug IDEA-242682 Kubernetes. ConfigMaps: resolve doesn't work in case of configmap presence in both cluster and project
Bug IDEA-248614 K8s. Follow log: make log info read-only in the tab
Bug IDEA-244703 Helm3, folder name can be different than name in Chart.yaml
Bug IDEA-248688 KubernetesView. "Follow Log" action should result in the whole log if before we cleared it.
Bug IDEA-247142 High CPU usage with Kubernetes plugin enabled
Bug IDEA-245606 Kubernetes Helm Plugin Requires `repository` field in `Chart.yaml` and `requirements.yaml`
Bug IDEA-246520 Kubernetes Plugin shows false positive error while parsing custom resource
Bug IDEA-246275 Kubernetes Plugin - Object value key completion should respect YAML indent size.
Bug IDEA-244995 K8s view: update global configuration in the all opened projects
Bug IDEA-245243 Kubernetes: Apply action doesn't work
Bug IDEA-248903 Kubernetes: "Refresh configuration" never ends for projects with the option "... for the current project" if we change Settings globally
Bug IDEA-245673 Kubernetes: ReadOnlyModificationException at calling intention actions for ConfigMap/SecretMap key values
Bug IDEA-245367 Helm: Template action doesn't work if the name of the chart differs from the chart folder name
Bug IDEA-248895 Kubernetes. Settings. Add validation to the "Path to download pod logs" field
Performance IDEA-248830 Goland IDE UI Frozen for 1s on keypress when Kubernetes plugin is enabled
Performance IDEA-248285 High CPU usage with YAML plugin
Usability IDEA-248894 Kubernetes: add "Settings" button for pods on the toolbar to have possibility to change logs location
Usability IDEA-242988 Kubernetes: [All namespaces] selection doesn't survive IDEA restart
Usability IDEA-245000 Kubernetes: Custom kubeconfig file: save editor changes before "Refresh configuration" action
Cosmetics IDEA-248657 KubernetesView. Display disabled log buttons for Pods table view in case if nothing selected
Tools. TerminalFeature IDEA-243838 Smart command handling: start debugging a command with Ctrl-Alt-Enter
Bug IDEA-118877 Terminal: not able to rename tab in Editor
Bug IDEA-241445 Smart commands execution message is printed on every keystroke
Bug IDEA-246827 Terminal shell path resets to default for the existing projects after updating to 2020.2
Bug IDEA-230084 In Idea's terminal on Linux, shortcuts Ctrl-C and Ctrl-Shift-C are swapped
Bug IDEA-201379 Line spacing for console font has no effect in Terminal
Bug IDEA-247172 Terminal: 'Ctrl / Shift + Insert' not working in 2020.2
Bug IDEA-243745 Terminal: smart command handling: open... smart command should ignore the tail space
Bug IDEA-247113 Have to configure Terminal shell for every.single.project
Bug IDEA-248147 Cannot open Local Terminal (index 0 out of bounds) after updating to 2020.2.1 Preview
Bug IDEA-208328 CTRL-C in terminal does not work in IDEA JDK 11 but works fine on IDEA JDK 8 (Mac)
Bug IDEA-244159 Smart command handling in Terminal: Gradle: highlighting
Bug IDEA-245793 Do not share "Shell path" and other terminal project settings with a team
Bug IDEA-236794 Cannot open terminal in Linux on ARM
Bug IDEA-244170 Terminal shell path is not saved
Bug IDEA-250490 Moving tool window terminal tab to editor shows confirmation dialog about closing it
Bug IDEA-247892 "Run IDE features from the Terminal" not working on Windows when git-bash is used as terminal shell
Usability IDEA-244778 Consider renaming 'Smart Command Handling' to 'Run Commands using IDE'
Usability IDEA-243824 Add option to disable 'Smart Command Handling' globally in the Settings
Usability IDEA-199122 Custom shortcuts do not work in Terminal
Usability IDEA-242835 Smart Commands execution: misleading shortcut for MacOS
Usability IDEA-244338 Smart command handling: text in tooltip is incorrect for Windows and Linux
Usability IDEA-245276 "Smart command handling" background highlighting flashes on each letter typed
User InterfaceFeature IDEA-242373 Implement notification for breakpoint hit action
Feature IDEA-127464 Editor Tabs options: Keep pinned tabs on top left of tab bar.
Feature IDEA-164238 Provide an easier way to clear the status bar
Bug IDEA-235925 Show file name and product name in Light Edit mode on Windows
Bug IDEA-251030 Icons are not shown in Database toolwindow popup menu
Bug IDEA-244323 NPE when opening some menu groups
Bug IDEA-243184 Inspection widget shows wrong numbers when custom severity used
Bug IDEA-243695 Load context: context isn't restoring editor tabs on a second monitor/display
Bug IDEA-246624 Table header expands awkwardly
Bug IDEA-243918 Icons tooltip in Project tree does not work
Bug IDEA-246421 New Color Picker: make the hex field focused by default
Bug IDEA-242989 Colorpicker doesn't work for setting TODO color
Bug IDEA-248447 Keyboard shortcuts don't work when Russian keyboard layout is active
Bug IDEA-134723 Column alignment incorrect in 'distraction free mode' when using split editor
Bug IDEA-246497 Search Everywhere: "Top Hit" section is missing
Bug IDEA-229319 `Command + ~` doesn't work if non-focused popup is active
Bug IDEA-246622 CSS styles do not update after theme switch
Bug IDEA-246207 "Clear Event Log" action is disabled after running a test
Bug IDEA-250834 No "View Mode" group in tool window menu
Bug IDEA-243192 Bulb in context menu of Problems view should have the same color as in the Editor
Bug IDEA-248756 Drag and drop doesn't work with new Welcome Screen
Bug IDEA-245587 IDEA shows 'Analyzing Test.class' for decompiled Java file
Bug IDEA-247257 Low-resolution taskbar icon on Windows
Bug IDEA-244850 Convert to Repository Library missing translation texts on title and button
Bug IDEA-250138 Wrong icon in confirmation dialogs on macOS
Bug IDEA-249212 GoLand new project wizard: title of new project window was changed from `New Project` to `New Project...`
Bug IDEA-244229 Windows control buttons color is not updated on changing theme
Bug IDEA-245391 Project tool window is not closed with Alt+1 if "Always Select Opened File" option is on
Bug IDEA-244800 Problem icon stays red when code is green
Bug IDEA-233480 "Recompile" action doesn't show up when typing full name in Find Action
Bug IDEA-244131 Structure view is grayed out when opened on startup without editor tabs
Bug IDEA-249801 Darcula theme is not applied when if "Sync with OS" option is selected while macOS theme is dark
Bug IDEA-247600 Missing additional actions on Welcome Screen
Bug IDEA-244307 Inspection wigdet: Highlighting level is applied for all inspection types when changing for one type
Bug IDEA-244086 macOS native menu is misaligned
Bug IDEA-246380 UI becomes corrupted after reducing editor width with opened "Find" field
Bug IDEA-239645 Extract to bundles Settings->Android Device FIle Explorer
Bug IDEA-244355 Empty context action for some issues in Problems View
Bug IDEA-243690 File name is not shown in Light Edit mode
Bug IDEA-250690 "Close button position" setting is not applied
Bug IDEA-237643 Add hints to options tooltips in Find
Bug IDEA-247601 New project button doesn't work
Bug IDEA-223082 Toggling distraction free mode continuously increases size of bottom tool panel until it eclipses editor
Bug IDEA-244808 Productivity Guide is shown small
Bug IDEA-237472 Change the wording for Windows Defender warning
Bug IDEA-186748 Debug toolbar doesn't stay hidden
Usability IDEA-248766 New Welcome Screen: It's hard to see current IDE version
Usability IDEA-153814 Horizontal scrolling is accidentally applied when scrolling vertically with touchpad
Usability IDEA-209250 Cannot open file in detached window via Project View
Usability IDEA-242906 Better representation for long inspection description.
Usability IDEA-237473 It's not clear that `Check for updates` does nothing in case of using Toolbox
Usability IDEA-108043 Action "Reopen last closed tab" fails with no open tabs
Usability IDEA-230328 Search everywhere popup opens partially offscreen
Usability IDEA-230715 Double click in treeview shouldn't expand / collapse the node
Usability IDEA-219394 "Hide tabs if there is no space" should be inactive for vertical tabs placement
Usability IDEA-246224 Text of "Pre-built Maven shared indexes" notification is unclear
Usability IDEA-152174 `Enter` on navigating items should open corresponding file (like in Project view)
Usability IDEA-219212 Option to disable merging main menu into window title
Usability IDEA-244580 Change name of closing tabs options to match Google Chrome, Firefox and Safari
Usability IDEA-246635 Custom UI theme keys are missing for occurrence filenames in Find in Path
Usability IDEA-246526 Find action: show Reformat code on top of the list when typing `Format code` / add synonym
Usability IDEA-243190 Inspection warning with error severity is not shown when highlighting set to 'Error only'
Usability IDEA-247607 All settings are not equal to settings for new project (only application-level settings are shown)
Usability IDEA-233887 Is hex format in color picker valid?
Usability IDEA-247948 Error dialog "Running tests is disabled during index update" has no title
Usability IDEA-242544 Search Everywhere: Recent files are not shown at the top of results if case does not match
Cosmetics IDEA-248490 Status line and menu - different row/:column separator shown
Cosmetics IDEA-244609 Progress text shrinking is broken
Cosmetics IDEA-244209 Settings | Editor | General | Auto Import: the text in 'exclude from autoimport and completion' is not fully visible
Cosmetics IDEA-243171 Detected frameworks aren't properly aligned in libraries view
Cosmetics IDEA-246463 Newer IDE versions may... not fully shown
Exception IDEA-244083 ConcurrentModificationException: NotificationsManagerImpl
Exception IDEA-232782 Exception occurs on clicking pipette in Color picker popup
User Interface. AccessibilityBug IDEA-243240 Path field not signed on SDKs page
Bug IDEA-236480 In screen reader mode is not possible to select a JDK for a project
Bug IDEA-244335 On the tab "modules" not signed fields and combo boxes
Bug IDEA-245469 On the project creation screen, the "project SDK" label is very strangely linked to the JDK combobox.
Bug IDEA-250268 Exception on loading Settings when NVDA screen reader is launched
Bug IDEA-243239 On the tab "artifacts" not signed fields and combined lists
Bug IDEA-245472 In the VCS Log window, when the focus is on the commit filter buttons, the screen reader speaks the word "panel" instead of filters
Bug IDEA-243237 In the project structure settings on the project page, the settings are not associated with labels
Bug IDEA-245470 When the focus is on the collapsed combobox, NVDA does not speak the selected item.
Cosmetics IDEA-244311 Fixes in screen readers support dialog
User Interface. Action SystemBug IDEA-243703 Wrong action selected after typing an abbreviation in 'Find Action' popup
User Interface. ControlsBug IDEA-244623 "Sorry but parent has already been disposed" in ThreeComponentsSplitter
Bug IDEA-248445 Inspection widget: Wrong traffic light icon
Usability IDEA-242975 Tools resize area is clickable through an undocked tool behind it
Task IDEA-250699 Unify toolbar popups with action popups
User Interface. Embedded Browser (JCEF)Bug IDEA-232594 JS injection callback is called twice
Bug IDEA-245703 jcef added to a ballon is shown underneath
Bug IDEA-246306 two JBCefBrowser instances can mix JBCefJSQuery
Bug IDEA-241019 Progress window is shown under the Markdown preview
Bug IDEA-247743 JCEF on linux: Doubled keys when typing in search everwhere
Bug IDEA-241604 Cmd+C does not copy text in markdown preview
Bug IDEA-233393 Markdown Preview is not rendered with JCEF browser if opening *.md files more than Editor tab limit
Bug IDEA-245254 If JavaFX is a default Preview Browser, on update there is an exception and editor is broken
Bug IDEA-244716 JCEF: IAE from JBCefBrowser$5.onPreKeyEvent
User Interface. Find, Replace, UsagesFeature IDEA-19888 highlight usages of element at caret: don't wait for reparsing if nothing changed
Feature IDEA-246023 Support multiple choice popup menu: state of dependant actions should be shown in UI immediately.
Bug IDEA-227412 Function "Navigate -> File" does not show folder path in status bar while it shows for files
Bug IDEA-242557 Navigate to file/Search everywhere doesn't place the exact match on the top
Bug IDEA-238647 Find In File (ctrl-F) changes cursor position in editor if search was cancelled
Bug IDEA-241447 Switching search to regex disables "whole words" option, but it stays in effect
Usability IDEA-235288 Cannot get "Regular expressions syntax" popup from the new find popup UI
Cosmetics IDEA-235578 "found in editor highlighting" jumps on fast text editing before the highlight item
User Interface. FocusBug IDEA-247102 No focus in terminal after performing "Open in Terminal" if Terminal tool window view mode is Window or Float
Bug IDEA-221129 Input goes to Terminal when Editor is focused
Bug IDEA-204581 Shortcut conflict for Ctrl+F5 in Find view
Bug IDEA-196575 No cursor in editor when opening file from project view with Enter
Bug IDEA-199755 Focus doesn't go to editor split after switching from other application
Bug IDEA-198293 Missed focus on IDE window on breakpoint
User Interface. GraphicsBug IDEA-241878 Large disabled icons
User Interface. Keyboard InputBug IDEA-197762 Shift and layer 4 on the neo layout do not work together in Idea
User Interface. Look and FeelFeature IDEA-203554 Propose to switch IDE appearance theme (Light/Dark) to match operating system theme
Bug IDEA-212530 Idea startup/welcome screen of Idea CE doesn't show project icons in Darcula mode
Bug IDEA-250338 Plugin theme is applied when "Sync with OS" theme is set
Bug IDEA-236214 Setting Checkbox and Radiobox background color does not have any effect for a custom light UI theme
Cosmetics IDEA-244738 Darcula theme not correctly applied to "Check for Updates" dialog
Cosmetics IDEA-203820 Old-styled question icon appears on dialogs
User Interface. NavigationBug IDEA-229734 Can't navigate to second split window after upgrade to IDEA 2019.3.1
Bug IDEA-216720 "Ctrl+E" shortcut is displayed in "Recent Files" popup if it was removed from the keymap
Bug IDEA-223194 Strange pattern matching when searching for action
Bug IDEA-243681 Exception on attempt to open Switcher if one file is opened in splitted tabs
Bug IDEA-245547 Abbreviations are broken in new Search Everywhere
Performance IDEA-243754 Memory leak: GotoClassModel2
Usability IDEA-216170 Add mnemonic for "Appearance" item in View menu
User Interface. Project ViewFeature IDEA-244648 "Always select open file": center file in project tree vertically
Bug IDEA-236737 Project View: Cmd-Click file no longer adds file to selection
Bug IDEA-242597 Uninitialized project view pane leaked on plugin unload
Bug IDEA-231175 Cannot open/switch tabs with single-click when scratch file selected
Bug IDEA-245149 IDEA doesn't create record file when paste definition in Project view
Performance IDEA-247254 UI hangs for no apparent reason while typing
Performance IDEA-245093 IntelliJ freezes in com.intellij.ide.todo.TodoTreeBuilder$MyPsiTreeChangeListener.beforeChildRemoval
Performance IDEA-237974 UI freeze: com.intellij.openapi.module.impl.ModuleGroupersKt.splitByDotsJoiningIncorrectIdentifiers
Usability IDEA-249246 'Enter' on a module source or content root opens Project Structure dialog
Version ControlBug IDEA-249292 VCS: Squashing comments in rebase dialog takes into account only 1st comment
Bug IDEA-234968 Get from Version Control: wrong "Clone" button behaviour
Bug IDEA-247324 New Git main menu: Wrong name for VCS menu on Mercurial/SVN/Perforce project opening
Bug IDEA-247848 Japanese placeholder is not properly displayed in commit window
Bug IDEA-216828 Non-modal commit: file name completion in the commit message field doesn't work after switching off/on non-modal commit option
Bug IDEA-245728 Get from Version Control: "Clone" button is enabled when URL is empty
Bug IDEA-243552 SVN (possibly other VCS?) plugin never updates internal cache of changes - UI always reports outdated files
Bug IDEA-249948 New git repositories do not show up in VCS dialog
Bug IDEA-244969 Mnemonic not shown for "Amend" in new commit tool window
Bug IDEA-250251 VCS Editor gutter markers do not work with "Render documentation comments" option
Bug IDEA-189479 Check TODOs should check only in commited chunks
Performance IDEA-241363 BranchTreeNode#equals consumes a lot of CPU
Usability IDEA-243802 Show errors in VCS console even if project has no mappings
Usability IDEA-233754 Branch selection shouldn't update branch filters in Log
Usability IDEA-220868 Add action "VCS Commits tree" to the Main Menu -> VCS
Cosmetics IDEA-246727 Use different icon for Restore size in Branches popup
Task IDEA-228969 Change the VCS Main menu to Git
Task IDEA-250208 VCS i18n in forms
Task IDEA-244040 Add display ID for VCS notifications
Task IDEA-249269 Cleanup unused properties in VCS bundles
Version Control. GitFeature IDEA-241520 Collapse custom config parameters of git command in Console
Feature IDEA-249119 Remember selected options in Git Pull Dialog
Bug IDEA-245907 New rebase dialog incorrectly uses "--onto" value twice
Bug IDEA-245047 Git menu: on first opening the menu is doubled
Bug IDEA-243170 New Git Merge dialog - show only branches that have commits to merge in the list
Bug IDEA-247426 Incorrect file history when a rename is not detected in a non-trivial merge commit.
Bug IDEA-241916 Do not allow to squash commits from different repositories
Bug IDEA-245878 Can't type properly in new Rebase dialog
Bug IDEA-249256 Push Commits dialog contains raw HTML in commit message tooltip
Bug IDEA-248796 Git Merge Dialog: considers all roots with the same name as a single one.
Bug IDEA-250008 Incorrect branch name in notification about branch renaming
Bug IDEA-247284 Since PyCharm 2020.2 update git is reporting an error: schannel: next InitializeSecurityContext failed: Unknown error (0x80092012)
Bug IDEA-245319 Redundant branches in Git Merge dialog for project with submodules
Bug IDEA-248536 Git rebase: incorrect branch name in Rebase Successful notification on performing rebase with --root option
Bug IDEA-244887 Project tree doesn't update if dropped commit contains renaming file
Bug IDEA-246033 Make branch filter in Merge and Pull dialogs case insensitive
Bug IDEA-246077 Delete tracked branch link does not expire
Bug IDEA-248332 git pull --rebase executes only rebase
Bug IDEA-152902 Git4Idea doesn't work on windows if home directory contains whitespaces
Bug IDEA-242834 Rider and Android studio Git token problem
Bug IDEA-250697 Incorrect branch is using on performing git merge/pull/rebase actions if branch was typed manually
Bug IDEA-243634 New Pull dialog: conflict resolver doesn't appear after pull with --rebase option from branch with conflicts
Bug IDEA-245284 Don't show HEAD reference in branches list in Git Merge dialog
Bug IDEA-246914 Git remote operations fail with Could not set SSL backend
Bug IDEA-244472 Pull dialog appears second time after press on button Pull (master)
Bug IDEA-243711 New pull dialog: can't remove some options in Modify options window after adding --squash option
Bug IDEA-244214 Compare Branches: the tab is displayed at incorrect place in Recent Files
Performance IDEA-242261 Do not attempt to update Git branches tree if the Branches panel is hidden
Performance IDEA-244005 Redesigned rebase dialog takes long to load
Usability IDEA-250101 Do not auto-center Branches list
Usability IDEA-242330 Map "Copy revision number" action to shortcut of "Copy reference" by default
Usability IDEA-245016 Don't select the "interactive" option by default in the rebase dialog
Usability IDEA-160372 Flatten git context menu
Usability IDEA-244777 Add action "edit" when double click emitted on item
Usability IDEA-248375 Git Rebase dialog: onto help button is not reachable by keyboard
Usability IDEA-247178 Merge git branch alphabetical order
Usability IDEA-245695 Get rid of git prefixes from ref list in rebase dialog
Usability IDEA-245686 Rebase dialog should default to tracked branch
Usability IDEA-159217 Add filtering to dropdown for "Onto" and "From" in "Rebase branch" dialog
Usability IDEA-232141 Branches: improve Selected Branch Updated message
Usability IDEA-243574 New dialogs: focus never sets on options already added
Usability IDEA-122424 Consider renaming Annotate to Blame
Usability IDEA-247286 Branch completion in Git Pull, Git Merge, and Git Rebase dialogs
Usability IDEA-245371 Rebase dialog: rename Switch to another branch before rebasing option
Usability IDEA-250551 Put caret into the branch selection field
Usability IDEA-250735 Git Merge/Pull/Rebase dialogs: Missed placeholders in fields with branch completion
Usability IDEA-243606 New dialogs: add placeholder for empty inputs
Usability IDEA-250579 Pull dialog: missed update info in branch dropdown list
Usability IDEA-250775 Git Merge/Pull/Rebase dialogs: Unuseful spellchecking in branches comboboxes
Usability IDEA-247456 Fetch should be visible even if there are no remotes
Usability IDEA-243980 Allow undoing `Squash Commits...` action
Usability IDEA-238751 Non-folder branches can be confused as a branches in last branch folder
Usability IDEA-250742 Branch completion is covered by dropdown list when start typing in empty field.
Usability IDEA-248378 Git Rebase dialog: onto help popup covers old base when start typing in empty field
Usability IDEA-249240 The default branch in the merge dialog should be chosen more intelligently
Usability IDEA-145065 Better handling of specifying shell (e.g. git-cmd) as a git executable
Usability IDEA-243725 New git merge dialogs - needs additional clicks to modify options
Usability IDEA-243981 Allow undoing `Drop Commits` action
Usability IDEA-244365 Git Rebase dialog: Remember selected options
Usability IDEA-247704 Branches: group nodes don't collapse/expand by Enter
Usability IDEA-244369 Git Rebase dialog: use better error messages
Usability IDEA-219231 Git Pull: use git remote update instead of git ls-remote
Cosmetics IDEA-244860 New rebase dialog: Text is not aligned.
Task IDEA-248666 Git internationalization
Exception IDEA-250502 IllegalArgumentException on perfoming git pull action without modify options
Exception IDEA-250113 Exception on new branch creation
Exception IDEA-248374 Exception is thrown on rebase action invocation
Version Control. GitHubFeature IDEA-242106 Show pull request info from timeline tab
Feature IDEA-244314 Ability to mark pull request ready for review
Feature IDEA-244232 Check all git remotes for potential GitHub Enterprise instances
Feature IDEA-247904 GitHub Pull Request: shortcut for leaving comment while reviewing changes
Feature IDEA-202815 When authenticating to, use Login to GitHub dialog directly
Feature IDEA-244758 At times when GitHub is down, degrade gracefully and show error messages
Bug IDEA-246079 GitHub Pull Requests: "add review comment" icon is shifted when soft wrapping is enabled
Bug IDEA-247259 When GitHub Enterprise URL starts with "" Pull Requests don't work
Bug IDEA-245302 Login to GitHub dialog doesn't shown when performing remote operations after revoking access on github site.
Bug IDEA-233136 GitHub Pull Requests: Delete tooltip appears on unexpected place
Bug IDEA-248658 For remotes with GitHub account is not used, regular Git login is requested
Bug IDEA-245474 Github: incorrect results on attempt to login on performing remote operations after personal token revoking
Bug IDEA-245656 GitHub: Merge button is disabled after marking PR ready for review
Bug IDEA-248423 GitHub Pull Requests: exception in timeline when PR contains ConnectedEvent
Bug IDEA-244636 GitHub PullRequests: PR's title and root comment don't update on refresh timeline
Bug IDEA-246931 GitHub: Do not allow adding multiple accounts that differ only by server protocol
Bug IDEA-247240 exception viewing a pull request
Bug IDEA-246404 GitHub: clone dialog doesn't update on re-login after revoking access on github site.
Bug IDEA-244358 Incorrect hint for some github pull requests tabs
Usability IDEA-243599 Use better wording for Add GitHub account actions
Usability IDEA-242105 Cannot navigate to changes from pull request timeline
Usability IDEA-242104 Resolved threads shown in pull request timeline
Exception IDEA-245560 GitHub: Throwable: Other thread is already running under this indicator on opening timeline
Version Control. Local HistoryBug IDEA-241935 WSL Local History is empty
Version Control. LogFeature IDEA-238847 Set minimal size for the panes in Log and History
Bug IDEA-245715 DVCS Log tab can permanently lose the ability to refresh
Bug IDEA-238289 Popup shown from toolbar contiuation is not usable
Performance IDEA-241581 Sometimes opening File History tab causes multiple freezes inside RootCellRenderer.getTableCellRendererComponent
Version Control. PerforcePerformance IDEA-136602 Perforce ignored file check is executed for all suspicious files including project output
Performance IDEA-232125 Perforce plugin executes p4 files command against excluded files.
Version Control. SubversionBug IDEA-248635 filter svn history does not work when choose filter by user
Bug IDEA-244031 Unable to click 'Fix working copy' popup
No subsystemFeature WEB-44435 Intention: "Use optional chaining or nullish coalescing" should handle more cases
Feature WEB-42706 Mark .next folder as excluded by default
Bug WEB-45978 Prettier config file is ignored under WSL 2
Bug WEB-45705 Too many roots update events in headless log on IntelliJ Ultimate
Bug WEB-46053 Webp images aren't rendered in quick doc
Bug WEB-46419 JSX: rename doesn't work for destructuring props with propTypes
Bug WEB-46943 i18n: internationalize JSON code style settings
Bug WEB-45655 PropertyPusher may yield a deep recursion in headless mode
Bug WEB-46941 i18n: internationalize 'Punctuation' tab in Code Style JS/TS settings
Bug WEB-46772 Jest monorepo triggers Cyclic service initialization, soft-locking IDE (requiring force killing via task manager)
Bug WEB-47350 Nested injections cause misleading errors
Performance WEB-46791 IDEA 2020.1.4 -> 2020.2: IDE unusable after upgrade to latest stable version
Usability WEB-46733 Change default option in Inspection "TypeScript | Equality operator may cause type coercion" to second (except null, typeof)
Usability WEB-44639 Confusing item in 'Create CSS file' popup: just ellipsis (...)
Task WEB-46962 JSHint: update the bundled version to 2.12.0
Task WEB-47030 NodeJS internationalization
Task WEB-46940 i18n: internationalize HTML code style settings
Exception WEB-46550 Removing rendered doc caused an exception
Exception WEB-46332 IllegalArgumentException: Failed requirement when resolving a variable
CSSFeature WEB-47335 Can we add support for the css font-size: xxx-large?
Feature WEB-46152 IntelliJ does not recognise max() CSS Function
Feature WEB-46356 SCSS/CSS subgrid
Bug WEB-45869 Overflow-wrap property value gives an error
Bug WEB-45484 Unknown function 'max' in .css file leads to broken formating
Bug WEB-46939 i18n: internationalize fields in "Minimum blank lines" from Code style | Style Sheets
Bug WEB-44253 CSS font-weight valid property value is highlighted as error
Bug WEB-45260 CSS: Unknown function clamp
Bug WEB-46938 i18n: internationalize tab 'Other' in Code Style | Style Sheets
Bug WEB-46982 Mismatched property value for CSS stroke-dasharray
Bug WEB-34812 Mismatched parameters error for CSS custom properties with default value on shorthand properties
Bug WEB-46751 Angular elements are shown as unknown in stylesheets
Task WEB-46840 Do not show deprecated system color keywords in completion
Task WEB-47063 PostCSS internationalization
Task WEB-47045 CSS internationalization
DartBug WEB-45962 Dart Get is ignored forever
Bug WEB-47147 Images disappeared from the Dart doc preview
Usability WEB-44323 Dart comment indent level
Task WEB-46427 External Variable Declarations and Abstract Variable Declarations syntax change
Task WEB-47031 Dart internationalization
Task WEB-47145 Dart plugin: stop auto-excluding 'packages' folders.
DebuggerFeature WEB-46084 Start JavaScript debugger from run or debug tool window
Feature WEB-44816 Start debugging from run tool window
Feature WEB-46083 Attach Node.js debugger to a debug process from run or debug tool window
Feature WEB-45756 Add support for running debugger with node.js 14 on Windows 7
Bug WEB-46876 Console shows wrong duplicated label
Bug WEB-46853 React Native objects logged as [Object object]
Bug WEB-43011 Evaluate in Console action called from the editor doesn't switch focus to console
Bug WEB-46062 JavaScript Debugger Stuck "Collecting data..."
Bug WEB-45535 Debug connector doesn't seem to work with Nodist as NODIST_PREFIX isn't provided to the interpreter environment.
Bug WEB-45982 NodeJS debugging: run to cursor just resumes execution without stopping
Bug WEB-46446 Can't expand an object in a Debugger Console
Bug WEB-46334 Environment variables missing when running "debug connector"
Bug WEB-44510 Can't debug react-native app (Windows)
Bug WEB-45431 Stops on invisible breakpoints
Bug WEB-46623 Windows: Can't debug an app via node interpreter from docker ( 'Cannot establish connection - promptly closed after open error )
Task WEB-47382 Remove the default browser option from the JavaScript debug configuration
Task WEB-46085 Restore ability to use JavaFX Web View in JS Debugger console
Exception WEB-46487 Debugger: frames not available because of InvalidPathException
File WatchersBug WEB-46232 Localized scopes in File Watchers dialog cause 'unknown scope' error.
Usability WEB-47300 Ensure that settings search can find File Watchers templates
Task WEB-47299 Provide explanatory text in File Watchers settings page
Task WEB-47056 File Watchers plugin internationalization
HTMLBug WEB-43892 'Inspections | HTML' section is shown twice
Bug WEB-38331 Support vue-loader in file references in Vue template section
Bug WEB-46818 HTML arrangement rules don't work for Vue.js templates
Performance WEB-44857 Optimize caching of XML descriptors
Task WEB-46921 RelaxNG internationalization
JSONBug WEB-46080 SchemaStore schemas should be matched against project-relative paths
JavaScriptFeature WEB-45700 Expand optional chaining and nullish coalescing to explicit checks
Feature WEB-46785 Support WeakRefs and FinalizationRegistry
Feature WEB-46234 TypeScript: Move members refactoring should respect index.js files
Bug WEB-46411 JavaScript: incorrect caching of references in JSLiteralExpression
Bug WEB-46604 Lost reading operation on complex expression
Bug WEB-46136 Cannot download @types/node: java.lang.NullPointerException when opening a project without internet
Bug WEB-47289 Javascript MDN documentation is broken
Bug WEB-46684 'undefined' is not highlighted as a keyword if Node.js coding assistance is enabled
Bug WEB-46855 `parent is null` error when importing `framer-motion` library
Bug WEB-46618 Adding unwanted {} block when pressing Cmd-Shift-Enter (JavaScript editing)
Bug WEB-46149 Don't show Array method names in completion within `[]`
Bug WEB-46445 React bootstrap autocompletion disappeared
Bug WEB-43024 CodeceptJS methods parameter types can't be inferred from typings
Bug WEB-45755 Find usages with ctrl+click or ctrl+B suddenly stopped working
Bug WEB-46300 JS: infinite loop in JSTypeSerializer leading to OOM
Bug WEB-46578 Rendered JSDoc doesn't work for interface fields
Bug WEB-44965 Navigate > Class doesn't work for ExtJS classes if "JavaScript Language version" is set to "ECMAScript 5.1"
Bug WEB-46905 putting parentheses inside jsx breaks syntax
Bug WEB-46191 JavaScript functions no longer available as Symbols in ECMAScript 5 projects
Bug WEB-46325 Code disappears when invoking 'Use optional chaining or nullish coalescing'
Bug WEB-46142 Support Logical Assignment semantics
Bug WEB-25367 @callback-defined @type of function misinterpret as @param
Bug WEB-46297 Incorrectly creating a function from "Compare" window
Bug WEB-45802 JSStringLiteralCopyPasteProcessor replaces tabs with \t in template literals
Bug WEB-46761 No JavaScript suggestions anymore
Bug WEB-46292 False positive warning 'Argument types do not match parameters'
Bug WEB-46541 Rework intention: 'Expand optional chaining and nullish coalescing to explicit checks'
Bug WEB-46087 Go to declaration doesn't work for AngularJS DI
Performance WEB-46096 Freezes because of recursive indexing and StackOverflow
Cosmetics WEB-46061 Fix description for 'Split or-ed condition to equivalent ifs' intention
Task WEB-46050 JavaScript: disable "unresolved variable/function" errors in Markdown js/ts injections
JavaScript. FormatterFeature WEB-31028 Code style for JS6 destructured object lacks settings in wrapping and braces
Feature WEB-28540 Support formatting injections with more than one part in JS strings
Bug WEB-46752 Prettier "On code reformat" breaks live templates expanding
JavaScript. FrameworksFeature WEB-46170 Nuxt.js: provide web-types for nuxt components
Feature WEB-45737 Add documentation for React components exported using wrapper
Feature WEB-46171 Nuxt.js: Index TS typings from @nuxt/* packages
Feature WEB-32614 Nuxt.js: support webpack module resolution
Feature WEB-36567 Attributes arrangements for Vue.js
Feature WEB-46173 Nuxt.js: provide resource resolution root for `static`
Feature WEB-34901 Create a React component from usage
Feature WEB-45605 Angular: support type inference for structural directives on <ng-template> tag
Feature WEB-46314 Nuxt.js: ask user to install @nuxt/types dependency for CodeInsight features
Feature WEB-46424 Import default Prettier rules to Vue and HTML code style
Feature WEB-46423 Automatically exclude .nuxt folder from the project
Feature WEB-46169 Nuxt.js: support completion in nuxt.config.js file
Bug WEB-46176 React: add id reference for the htmlFor attribute
Bug WEB-41551 transitionend event attribute is not supported by Angular plugin
Bug WEB-44281 cannot 'find declaration to go to ' when using antd v^4.0
Bug WEB-46566 JSX components starting with "$" (dollar) are not recognized by the IDE
Bug WEB-46422 No completion and auto import for components without export in Nuxt.js projects
Bug WEB-45901 WebP items are duplicated in completion suggestions in .vue files
Bug WEB-45350 Recognize Vue components without "<script>" section
Bug WEB-46016 JSX: Required label is shown in completion while typing
Bug WEB-47181 Unnecessary file codeStyleConfig.xml under .idea is created for new projects if Vue plugin is enabled
Bug WEB-39275 Add a path to webpack config when opening existing vue-cli projects
Bug WEB-46754 File extension is changed from .vue to .js in import statement on file moving
Bug WEB-28294 template with angular ng-options reports errors for valid syntax for (angular 1.6.X)
Bug WEB-46479 False positive warning 'Argument types do not match parameters' in ReactDOM.render
Performance WEB-44589 Angular: high CPU usage due to excessive calls for getting attribute descriptors
Performance WEB-45860 WebStorm High CPU usage
Performance WEB-46800 High CPU usage when breadcrumbs are enabled
Performance WEB-46184 AngularJSAttributeDescriptorsProvider.getAttributeDescriptors(XmlTag) takes a lot of time
Task WEB-46935 Vuejs internationalization
Task WEB-46920 AngularJS internationalization
Task WEB-46484 Webpack: do not show notification after successfully analysing a config
JavaScript. InspectionsFeature WEB-36319 More inspections related to 'switch' statements
Bug WEB-46910 Inspection 'Anonymous function' doesn't appear in return expression
Bug WEB-46434 A default export can only be used in an ECMAScript-style module
Bug WEB-45803 Expression marked as "can be simplified" has its semantics changed by simplification
Bug WEB-46702 No inspection ('Use of caller property') while use caller property
Bug WEB-41775 JS. Replace foreach with indexed for intention
Bug WEB-42132 Nullable parameters should be passed correctrly
Bug WEB-43529 "Variable might not have been initialized" being shown in some unnecessary cases
Bug WEB-46118 Array.prototype.reduce inspection thinks that it takes only 1 argument
Cosmetics WEB-46709 Improve tooltip for arrow function triggered by inspection ‘Anonymous function’
JavaScript. RefactoringBug WEB-46797 Support 'this' expressions in expand optional chaining intention
Bug WEB-46750 Link to the essential plugin in the intention description window leads to nowhere
Bug WEB-46805 Null propagation intention should handle indexers and 'this' expressions
Bug WEB-45911 Relative paths in imports not updated when moving a referencing file
Bug WEB-46656 Support null propagation intention in expressions
Bug WEB-46467 Transform into functional component removes decorators
Bug WEB-46379 Intellij Javascript refactoring worse than before. Stop the magic.
Usability WEB-47338 TypeScript Inline Renaming for Generics never works.
Usability WEB-46787 Improve intention visibility for "expand optional chaining"
JavaScript. TemplatesBug WEB-47068 StringIndexOutOfBoundsException on analyzing Handlebars template
LESSTask WEB-47084 Less internationalization
LintersBug WEB-44936 EsLint: wrong working directory is used in lerna monorepo
Bug WEB-46371 ESlint: Timeout on starting language service process
Bug WEB-42999 ESLint: webstorm chooses wrong working directory in lerna project
Bug WEB-44133 Creating react app as subproject breaks Webstorm linter with message: 'Cannot find module 'eslint-plugin-flowtype''
Bug WEB-42903 ESLint linter not detecting plugins (cli runs fine)
Bug WEB-43462 Prompts to install ESLint in subpackage when using automatic configuration in monorepo
Cosmetics WEB-46289 Wrong ESLint config file name in Help popup
Task WEB-42451 JSHint: update the bundled version to 2.11.1
Task WEB-47062 Prettier internationalization
Node.jsFeature WEB-46583 Yarn2: navigate from Yarn library in Project View to package.json
Feature WEB-46881 Use interactive terminal console for Node.js run/debug tool window
Feature WEB-46471 Automatically set pnpm as package manager if pnpm-lock.yaml is in the project root
Bug WEB-47366 Support ESLint and TypeScript with Yarn PnP and Node.js 10.x
Bug WEB-45695 Support for Yarn PnP portal
Bug WEB-46804 Detect asdf pnpm installations
Bug WEB-44355 Yarn2 workspaces: cross-package dependencies not resolved
Bug WEB-47250 Broken hyperlink in "Cannot find package manager"
Bug WEB-43707 Package names in "External libraries" are incomplete with Yarn 2 PnP
Bug WEB-46803 Add "pnpm" package manager alias
Bug WEB-45622 process.env destructured vars validation has false negative no overlap
Bug WEB-45414 IntelliJ does not find global pnpm installation managed by pnpm itself
Bug WEB-44826 Imports not resolved from a namespaced dependency in Yarn Workspaces
Pug (ex-Jade)Bug WEB-46263 Pug: tags nesting is lost on reformatting
SASSBug WEB-46074 SASS: resolve don't work for @use with chained @import
Bug WEB-37203 Bracketed lists not parsed correctly in sass files
Bug WEB-42904 File Watcher Not Running Properly for Sass @Use/@Forward
Bug WEB-47139 SASS plugin doesn't recognize min(), max(), or clamp()
Bug WEB-46090 sass @forward with a "with" clause seems to cause false positive errors
Bug WEB-47149 Multiline-style comment in a Vue Single File Component in the <style> section (SASS) causes glitch
Bug WEB-46651 Sass: @use is not resolving index files
Bug WEB-46595 Importing scss files using tilde (~) as path relative to root doesn't work
Bug WEB-46066 Sass module function invocation gets weirdly reformatted
Bug WEB-47270 Sass attribute selectors give fatal code errors when combined with placeholders
Bug WEB-46072 SASS: Code completion of qualified vars/functions/mixins doesn't work with @forward in resolution chain
Task WEB-47046 Sass internationalization
Exception WEB-46071 SASS: Exception while completing newly created variable
StylusTask WEB-47047 Stylus internationalization
TypeScriptFeature WEB-45890 TypeScript 4.0: this-property assignments should use autoType in constructor
Feature WEB-46324 Angular 10 cli: do not show "experimentalDecorators" error for files are are not referenced from "main.ts"
Bug WEB-46630 Changes to @types/node means that webstorm has impacted support for globals like console, process, etc
Bug WEB-41024 Webstorm does't show some installed packages in imports when using autocomplete
Bug WEB-43871 Yarn 2: Typescript go to declaration moves to Import instead of declaration
Bug WEB-46206 Code analysis works partly
Bug WEB-45912 wrong import when exists namespace and export at same time
Bug WEB-46097 wrong insert import when exists `declare module`
Bug WEB-46896 Find usages in ts work incorrectly
Bug WEB-44610 Typescript inconvenince
Bug WEB-40456 No auto-completion for props in extended component (styled-components)
Bug WEB-46221 Angular: @nativescript/angular is not indexed
Bug WEB-46669 Extending Vue or Nuxt types broken since 2020.2
Bug WEB-46455 Typescript: missing string literal suggestion for generic interface intersections
Bug WEB-45661 "Use directory import" option doesn't work for TypeScript functions with overloads
Bug WEB-45428 No type narrowing with 'instanceof' generic class
Bug WEB-46727 Ignoring package.json `main` field causing overly-verbose auto imports and syntax highlight issues
Bug WEB-46667 ideaRulezzz in code auto-complete
Performance WEB-47089 Awful performance of TypeScript with optics-ts
Performance WEB-46798 Lag on tying plus high CPU usage when editing Vue + Typescript files
Task WEB-47343 TypeScript 4.1: Syntax support for "export * as default"
Unit TestsFeature WEB-46360 Jest not be detected when just open a package as workspace of lerna project packages
Feature WEB-44961 Enable Jest support for `@jest/globals` package
Bug WEB-46642 Error tooltip for Jest reporter includes HTML styles
Bug WEB-46109 Node.js configuration shouldn't be offered in test files
Bug WEB-45801 Jest failed to transform files with which have failed tests if running from IDE
Bug WEB-46993 Jest: "Click to update snapshot" link is not responsible when rerunning failed tests
Bug WEB-47021 "nyc" added as production dependency when using yarn
Bug WEB-47328 Jest: escape square brackets in test name pattern when running individual tests
Bug WEB-47306 Jest: support running individual tests when using @testdeck/jest decorators
DB AdministrationBug DBE-11325 User containing an '@' symbol are displayed wrong in database -> users tab.
DB ConnectivityFeature DBE-11284 Make an embedded shell command like DBeaver has
Feature DBE-9112 Add ability to connect to a Snowflake account using a key pair
Feature DBE-11601 Couchbase: add a default bucket option to the jdbc connection string template
Feature DBE-11378 Support DNS Seedlist Connection Format for MongoDB as Connection Type
Bug DBE-11048 Can't connect to Yandex cloud ClickHouse with CA certificated
Bug DBE-11410 MongoDB: incorrect keep alive query
Bug DBE-11271 DataSource configuration ignores JVM command line parameters specified in driver configuration
Bug DBE-11409 MongoDB: fail test connection for ssl enabled data source if no valid keys provided and for disabled ssl on client side
Bug DBE-11125 pgpass: colon in user name causes error
Bug DBE-11340 Database connect: Username and password fields have vanished
DB ConsoleBug DBE-11463 Schema picker dropdown in editor does not show schemas from multiple connections
Bug DBE-1895 Explain Plan tab requires horizontal scroll or wrapping the mouse over popup text
Bug DBE-11268 Right click on parametrized SQL query shows popup with parameters instead of context menu
DB DiagramFeature DBE-8440 Is there any way to display column's comment when using `Diagrams -> Show Visualisation...`.
DB DiffBug DBE-11243 DataGrip database compare
DB IntrospectionFeature DBE-5399 Introspect OWNER, TABLESPACE, INDEX METHOD for Postgres
Feature DBE-7207 Postgres: Support event triggers
Feature DBE-2629 Postgres: Display granted permissions on objects
Bug DBE-6813 schemas tables, routines not updated after changes
Bug DBE-5139 Incorrect DDL script creation for triggers
Bug DBE-10711 MongoDB is not introspected when new collection is created
Bug DBE-11037 Procedure parameters starting with underscore disappearing in routine editor.
Bug DBE-11347 DataGrip doesn't understand INCLUDE constraints on PostgreSQL
Bug DBE-6550 Database window incorrectly displays columns order in SQLServer composite primary key
Bug DBE-11174 Empty group is displayed in database tab
Bug DBE-11346 Database Cleanup issue - ORA-01795: maximum number of expressions in a list is 1000
Bug DBE-11163 No any indicators while creating DDL data source
Bug DBE-421 Database tool window: Oracle: overloaded package procedures are shown as one item
DB RefactoringBug DBE-11127 renaming pl/sql package in datagrip will not delete the body of the pacakge
Bug DBE-11440 Submit changes to database (SQL Server) no longer working for PROC
Bug DBE-2462 Modifying a table doesn't refresh the DDL view
Bug DBE-1882 MS SQL Introspector uses wrong order for index and PK columns
Bug DBE-11156 Submit changes alter procedure
DB Schema ViewsBug DBE-11165 Highlight the changed routines in a schema tree, just like with files in a project
Data Import & ExportFeature DBE-11211 Bundle two more extractors
Bug DBE-8676 Extractor outputs binary strings as binary literals
Bug DBE-10590 High memory consumption during export to Excel
Data ViewsFeature DBE-9896 make transpose the default table view
Bug DBE-11387 Tree view: the row is stuck after filtering
Bug DBE-6340 While writing a filter in a data view, Shift-SPACE will perform "Select Row" in the results of the dataview, rather than typing a space into the filter view.
Bug DBE-11510 Database DataViews Limit page size to not working
Bug DBE-4842 Cloning a row with a truncated column (due to size) results in the cloned row ONLY having the truncated value
Bug DBE-11311 MySQL BLOB Fields are not editable anymore
Bug DBE-11015 If MongoDB collection is read-only unable to exit the "Cannot Apply Changes" prompt by clicking OK
Performance DBE-10951 Freeze when opening CSV file
Usability DBE-9763 Change keyboard shortcut DOWN ARROW to ALT+DOWN ARROW in the table data grid FILTER window to show the filter history
Navigation & SearchBug DBE-11084 'Go to declaration or usages' not working on routines in query console window
PL & DDL EditorCosmetics DBE-11289 Preview of changes from Database Changes tool window shouldn't be scrolled to the bottom
SQL CompletionFeature DBE-11045 Better OUTER JOIN completion
Feature DBE-2541 Add completion for Oracle database links
Feature DBE-10668 Add an intention to flip 2 sides of a comparison
Bug DBE-10053 JOIN completion is not automatically invoked in subqueries
Bug DBE-11248 Qualify object on collisions doesn't affect ORDER BY
Bug DBE-10749 PhpStorm, Pycharm DataGrip: postgresql "PARTITION BY" not recognized since 2019.3 (including 2020.x). Works in DataGrip 2019.2
SQL Format and StyleBug DBE-11093 Formatting rules are ignored when formatting a constructor inside type body
Bug DBE-11070 Formatter breaks a custom placeholder when it appears in a column reference
SQL GeneralFeature DBE-11173 Missing Index Suggestion
Bug DBE-11148 BigQuery: unable to resolve name if multiple parts of it are in one pair of quotes
Bug DBE-11124 Parser failed to handle CREATE DATABASE LINK with hashed password
Bug DBE-11169 Support SEARCH INDEX syntax for Cassandra (DataStax Enterprise)
Bug DBE-11529 Show correct Couchbase type names in SQL
Bug DBE-11119 Oracle: alter shared database link command is not supported by parser
Bug DBE-11130 BigQuery: Unknown database function 'SAFE_CAST'
SQL GenerationBug DBE-11297 Some tables work well with the SQL Generator, while others are infinite loading.
SQL HighlightingFeature DBE-11273 Snowflake: Stored procedure syntax highlight feature: Javascript language syntax and SQL logic instead of simple text
Feature DBE-11383 ClickHouse SQL does not know SYSTEM STOP TTL MERGES
Feature DBE-10949 Support "default on conversion error" clause for Oracle 12c
Bug DBE-10468 Postgres / named notation with the same argument names
Bug DBE-11201 Snowflake's SQL Dialect parsing error for STREAM
Bug DBE-11545 Support window statement in BigQuery
Bug DBE-8937 Cassandra CQL error highlighting wrong on ALTER statements
Bug DBE-11541 Couchbase: don't highlight target field in UPDATE statement as unresolved
Bug DBE-11072 Snowflake SQL Dialect parsing error
Bug DBE-10662 DataGrip does not behave correctly about overloaded functions/procedures in packages
Bug DBE-10975 Missing table field is not marked as error in insert into (a,b,c) select (a,b,c) from...
Bug DBE-9657 Exasol bracket qualifiers
Bug DBE-11261 Snowflake ALTER TABLE RENAME syntax highlights valid syntax as incorrect
Bug DBE-11380 Unknown database function 'sysdate' - Snowflake JDBC
Bug DBE-11525 Don't highlight unresolved fields in Couchbase insert statement
Bug DBE-11051 Support BigQuery _SESSION, clustered table from result set syntax
Bug DBE-11544 Support Trailing commas for BigQuery
Bug DBE-10977 Introspection hangs (SQL Server, 2020.1)
Bug DBE-11433 Snowflake Geospatial Function Support
Bug DBE-11356 Redshift dialect doesnt regognize key word GENERATED
Bug DBE-11385 PostgreSQL Statement level trigger - Syntax Highlighting Issue
Bug DBE-11104 Bigquery Comment Highlighting incorrect when no space is left between the "--" and the comment text
Bug DBE-10658 SQL inspection warning with more then one CROSS APPLY statement
Bug DBE-11550 Couchbase UPDATE statement parser error
Bug DBE-11432 DataGrip stopping valid syntax on Redshift
Bug DBE-11080 Spurious error highlights in PostgreSQL function
Bug DBE-9899 Add support to KILL QUERY syntax highlight for Clickhouse dialect
Bug DBE-10407 Support new JSON datatype in H2
Bug DBE-11375 SQLite syntax "VACUUM INTO 'file'" is not recognized
Bug DBE-11050 Support BigQuery alternate JOIN syntax
Bug DBE-11533 RATIO_TO_REPORT() function not recognized in Snowflake dialect
Bug DBE-11049 Support BigQuery scripting syntax
Bug DBE-11493 Add BOOLEAN type to BigQuery grammar
Bug DBE-11118 DateTime64 column type cannot be recognized
SQL ResolveBug DBE-10919 Incorrect inspection on recursive SQL, unable to resolve column
Bug DBE-11090 pl/sql - unresolved collection in forall
Bug DBE-11056 Unknown Oracle keyword "external"
Bug DBE-11551 Couchbase table reference inside `meta()` is unresolved
Bug DBE-11059 Exasol OVER() using non default window frames does not work
Bug DBE-11523 Resolve Couchbase fields when FROM clause contains map literal
Bug DBE-11528 Couchbase and Cassandra resolves duplicate field prefix
  • No labels