Child pages
  • IntelliJ IDEA 2020.2 EAP (202.4357.6 build) Release Notes
Skip to end of metadata
Go to start of metadata
No subsystemFeature IDEA-238147 UnkownSdkTracker should check valid SDKs
Feature IDEA-182563 EditorConfig: support "utf-8-bom" charset
Feature IDEA-238017 Make projectOpenProcessor EP dynamic
Feature IDEA-240187 Make webHelpProvider a dynamic extension point
Bug IDEA-234381 No Project SDK should not be accepted in the new project wizard
Bug IDEA-235348 Shared Indexes - Assertion failed
Bug IDEA-234249 Open or Import is broken
Bug IDEA-236600 "Add Id Attribute" does nothing
Bug IDEA-237884 IDEA 202+ reports Kotlin SDK as "corrupted or broken JDK"
Bug IDEA-234276 JDK downloader should preserve macOS bundle layout
Bug IDEA-235645 Action registered with xml stuck in myAction2Presentation
Bug IDEA-235607 Endpoints view doesn't react to unloading of framework plugins
Bug IDEA-235980 rendered javadoc is clipped
Bug IDEA-232377 orderEntriesEquals ignores Library Kind
Bug IDEA-238956 Plugin with status bar widgets cannot be unloaded
Bug IDEA-239803 Tooltips never update
Bug IDEA-239069 "String ' is not properly capitalized" false positive
Bug IDEA-237181 IDE crashes on startup when FindBugs-IDEA plug-in is present
Bug IDEA-235533 IDEA Nls Annotations
Bug IDEA-234240 Extra slash after `JavaVirtualMachines` in Location path in "Download JDK" dialog on macos
Bug IDEA-237727 'idea duplocate' fails with java.lang.IndexOutOfBoundsException stacktrace instead of showing help
Bug IDEA-237780 address JBR-2282 [jcef] update to JCEF/80.0.4+g74f7b0c+chromium-80.0.3987.122
Bug IDEA-238640 IdeTooltipManager -> HelpTooltipManager in unload Subversion plugin snapshot
Bug IDEA-236512 ThreadTracker fails to detect idle ForkJoin common pool threads on Java 11
Bug IDEA-231049 com.intellij.diagnostic.WindowsDefenderCheckerActivity#runActivity checks only our main executable
Bug IDEA-136712 Optimize imports on module should not process files from test data
Bug IDEA-235835 HtmlFileHighlighter.ourMap leaks references to languages from plugins being unloaded
Bug IDEA-234238 Unable to add Reactor postfix completion template
Bug IDEA-235793 Prettier plugin requires restart on disabling
Bug IDEA-234280 Plugin dialog suggests "Search in marketplace" when no outdated plugins are found
Bug IDEA-230489 Plugin built with latest intellij master will not run in 2019.3
Bug IDEA-237390 NPE thrown when switching from non-bundled JRE to bundled
Bug IDEA-234643 Commit tool window is opened on IDE start
Bug IDEA-237696 Sometimes tool window panel is not shown after project open, but stripe button is "clicked"
Bug IDEA-238969 remove deprecated createXXXAnnotation() from PhpVisitor
Bug IDEA-21717 "Add unambiguous imports on the fly" has no effect with "Show import popup" = No
Bug IDEA-234263 Exception while closing a project
Bug IDEA-239729 ConfigurationType Memory leak
Bug IDEA-234604 "Show usages" popup displays "89/101 usages shown"
Bug IDEA-233757 Generation of HTTP requests can be unsuccessful
Bug IDEA-238221 Deadlock on start.
Bug IDEA-234956 New Module added from Project Structure may miss JDK
Bug IDEA-237610 Find usages optimization: search in this file first, then farther and farther away
Bug IDEA-236549 EditorConfig with Kotlin preview prevents project from being opened (Project Disposed on project opening)
Bug IDEA-239383 Enable "Smart command handling"
Bug IDEA-234377 LightEdit: Changes are highlighted only after saving the file
Bug IDEA-238967 remove deprecated createXXXAnnotation() from FtlAnnotator
Bug IDEA-231568 Declarative listener defined in optional dependency xml does not work
Bug IDEA-239850 "Collect Logs and Diagnostic Data" doesn't accept "No" as an answer
Bug IDEA-238961 Added PsiReferenceContributor is not called after dynamic plugin enabled
Bug IDEA-238971 remove deprecated createXXXAnnotation() from ActionSCriptVisitor and the like
Performance IDEA-234691 Navbar updating in EDT slows down naviagtion
Performance IDEA-238575 ShowIntentionsPass.getActionsToShow holds IntervalTreeImpl.l lock while calling expensive "isAvailable" in quick fixes and intentions
Usability IDEA-233469 Let choose system to import with Open or Import... if there are several matching import providers
Usability IDEA-234706 Annotations are displayed in unchecked warning
Usability IDEA-150090 Server Certificates file name extensions too restrictive
Usability IDEA-228236 SDK preselection
Task IDEA-234246 Structure view: Move text to the bundles
Task IDEA-236020 Invoke "Preview Intention" on PsiFile related to the original file
Task IDEA-238357 Make remote credentials EPs dynamic
Task IDEA-238426 make orderEnumerationHandlerFactory EP dynamic
Task IDEA-238273 Make java.elementFinder EP dynamic
Task IDEA-238392 Make com.jetbrains.liveEdit.updateConfigurationProvider dynamic
Task IDEA-238358 Make images.themeFilter EP dynamic
Task IDEA-240653 Doc Rendering per editor
Exception IDEA-238682 Blank page and exception when open settings (Argument for @NotNull parameter 's' of )
Exception IDEA-235795 Exceptions on disabling/enabling Pug(ex-Jade) plugin
Exception IDEA-235922 Performance plugin exception in headless mode
AndroidFeature IDEA-233748 Merge AndroidStudio 3.6.0-Final into IJ
Bug IDEA-234257 Cannot run Android Instrumented Test from gutter
Bug IDEA-231315 Project Structure: Facets: Android-Gradle tab is empty
Bug IDEA-133793 Android database configuration doesn't list all databases
Bug IDEA-237650 Can't connect to database in emulator
Bug IDEA-234142 In android/java project ViewBinding::getRoot() is not resolved
Bug IDEA-159120 unable to connect to sqlite android db
Bug IDEA-236203 Download progress indicator is not shown when Idea downloads layoutlib-resources on first open of android layout designer
Bug IDEA-232434 Idea freeze at editing comments in Android project
Bug IDEA-166366 Android SQLite Data Source Synchronisation Error: File exists
Bug IDEA-231288 Android Designer: some tooltips are missing
Bug IDEA-232311 The physical device name can't show when creating an Android SQLite data source
Bug IDEA-235837 Run configuration execution hangs up when running Java main() with Platform runner in presence of Android modules
Bug IDEA-233268 There are two "Deployment" sections in Preferences
Bug IDEA-235129 Logs read `Low memory signal received` while working on Android project
Bug IDEA-179033 android 7.0(nuga) error Cannot synchronize 'Android SQLite' Permission denied
Bug IDEA-234445 Kotlin version of New Project Wizard is not reusable
Bug IDEA-232414 Android SQLite data source dialog unable to show the device's database list in some Android device
Performance IDEA-216052 25-second freeze in com.android.tools.idea.res.ProjectLightResourceClassService$2.rootsChanged
Usability IDEA-236387 Open/Import: for gradle project, the prompt to select between 'android gradle' and 'gradle' is always shown with Android Gradle option pre-selected by default
Exception IDEA-231287 ISE: @NotNull method com/android/tools/idea/avdmanager/AvdListDialog.getComponent must not return null
Exception IDEA-235428 ADE: "Aleady disposed: Project" through DetachedToolWindowManager.getActiveWorkBench()
Exception IDEA-240331 Throwable: Assertion failed: Please don't register startup activities for the default project: they won't ever be run
BuildBug IDEA-241013 Show build tool window after failure project reload that is submitted explicitly
Task IDEA-238263 Make EPs related to packaging dynamic
Task IDEA-238817 Add API for build tool window for Code With Me
Task IDEA-238274 Make compilation EPs dynamic
Build. Built-in (JPS)Bug IDEA-240318 Missing extension point: com.intellij.compilerSettingsFactory in container Application
Bug IDEA-200826 IDEA Scratch File (java) seems cannot handle Chinese code
Exception IDEA-226215 java.lang.Throwable: Multiple invocation of the same callback at running the attached class with errors
Build. GradleBug IDEA-236605 Idea doesn't generate preview project structure for grade project with invalid `org.gradle.java.home`
Bug IDEA-235772 set higher priority to explicitly defined dependencies in gradle.build
Bug IDEA-236001 All tests are run when running tests using Gradle and Gradle instant execution is enabled
Bug IDEA-236062 Idea suggest Gradle JVM as 13 or lower if exists java 14 for Gradle 6.3
Bug IDEA-234355 Directories configured in gradle as sourceSetOutput should be excluded from indexing/processing
Bug IDEA-238228 `Auto-reload external changes` setting reset after IDEA update in JetBrains Toolbox
Bug IDEA-238045 Modules for source-sets do not follow deduplicated "parent" module name
Bug IDEA-207968 "Click to see difference" doesn't work with Gradle runner + JUnit5
Bug IDEA-237901 [Auto-import] add toggle auto-import action into Gradle tool-window
Bug IDEA-235737 Default Project language level changes back to 13 after running "Reimport" Gradle command
Bug IDEA-231604 Composite Gradle Build tasks are executed with root project
Bug IDEA-235948 Error letting IDEA "Build and run" Gradle project
Bug IDEA-232052 Highlighting broken for variables and classes
Bug IDEA-237667 Gradle user home in Preferences doesn't trim whitespace from value and keeps creating .gradle directory
Bug IDEA-235648 Gradle daemon is started with debugging enabled when debugging tests and delegating to Gradle
Performance IDEA-232663 Gradle auto-import causes UI freeze on project save
Usability IDEA-235282 Gradle error on open project: Gradle may fail to build project from command line. Please specify JAVA_HOME environment variable or org.gradle.java.home in gradle.properties
Usability IDEA-234730 Use newer Gradle version than 6.1 when generating new Gradle version due to OOM problem with intellij-gradle-plugin
Build. MavenFeature IDEA-221517 Create maven server pool instead of single per-application service
Feature IDEA-146205 Add support for Maven wrapper scripts
Bug IDEA-237369 Maven groovy-eclipse-compiler: Path to groovy-eclipse-batch jar is not set if dependency is declared in maven-compiler-plugin section
Bug IDEA-238195 New "Import Maven Changes" option does load changes immediately, but rather on second import in 2020.1
Bug IDEA-230004 Maven lifecycle set to execute Before/After Build don't complete before IntelliJ moves on
Bug IDEA-227715 Maven pom.xml testResources causing wrong assignment of "MODULE_WORKING_DIR"
Bug IDEA-147167 Duplicate entries in .iml files on re-import
Bug IDEA-227700 IntelliJ searches for local dependencies in maven central
Bug IDEA-232585 Maven. Add Maven Dependency: adds dependency duplicated to the already existed
Bug IDEA-223442 Maven build reports errors on screen, but build succeeded
Bug IDEA-238534 Maven is highlighted in the settings
Bug IDEA-235060 Maven settings use old JDK control
Performance IDEA-238707 Maven accessing disk on EDT
Task IDEA-236419 Unable to run Quarkus 1.3.1 with bundled Maven 3.6.1
Task IDEA-233390 Maven: to localize the labels
Clouds. OpenShiftTask IDEA-225047 Discontinue Openshift plugin
Code Analysis. DependenciesBug IDEA-237275 Exception when open settings for Usages opened from Code vision hint
Code Analysis. InspectionFeature IDEA-239390 Inspection to detect mixed characters in strings (strings containing both ASCII and non-ASCII)
Feature IDEA-236487 Support preview for inspection quick-fixes
Bug IDEA-237104 Navigation through errors opens Problem View at first usage
Bug IDEA-238496 IntentionsUIImpl > IntentionHintComponent leaks PsiFile on plugin unload
Bug IDEA-237250 Buttons for 'Next/Previous Error' should always be enabled
Bug IDEA-235616 UnusedDeclarationInspection keeps references to EntryPoint instances after plugin has been unloaded
Bug IDEA-237251 Rename 'Show Toolbar' to 'Compact View'
Bug IDEA-186991 ProblemsHolder.registerProblem treats escaped html in template as an unescaped, so it drops arrows from view
Bug IDEA-195784 'Inspect code' uses default severity for inspections instead of current
Bug IDEA-235093 Inspection Results: HTML/Pug: Simplify description misses open angular bracket
Bug IDEA-236824 Close popup when user clicks 'Open Problems View' link
Bug IDEA-238616 Inspection 'Return null or something nullable from lambda in transformation method' incorrectly flags Consumer in Mono.doOnNext
Bug IDEA-236959 Problems view displays nothing for Markdown files
Usability IDEA-237248 Do not show analysis completed
Usability IDEA-236819 Sync problems view cursor when navigate through problems in the editor
Usability IDEA-236818 Cursor loses position and disappears when focus leaves Problem view
Usability IDEA-237249 Add icons to traffic light widget
Task IDEA-238581 Make refGraphAnnotator EP dynamic
Task IDEA-217579 Inspections widget
Exception IDEA-237137 Setting Highlighting to None causes exception
Exception IDEA-240846 Inspection exception: java.lang.IllegalStateException: No reference type for class com.intellij.psi.impl.source.PsiParameterImpl
Exception IDEA-240898 ArrayIndexOutOfBoundsException: Index -1 out of bounds for length 2 at com.intellij.codeInspection.i18n.NlsInfo.fromMethodParameter
Code Analysis. Language InjectionBug IDEA-235519 Cannot inject language 'Language: file-reference' because it has no ParserDefinition
Task IDEA-235294 Make <patterns.patternClass> EP dynamic
Code Analysis. Structural SearchBug IDEA-233908 'No filters added' is always on SSR panel
Bug IDEA-236671 Cannot create new SSR inspection
Bug IDEA-240463 StructuralSearchUtil.cache keeps references to languages from unloaded plugins
Bug IDEA-235951 "with search hierarchy" checkbox has no effect in `implements` clause
Bug IDEA-239687 Retrieving pattern from history sometimes loses match variable
Bug IDEA-236685 Description for SSR inspection is not displayed
Bug IDEA-239967 Structural search doesn't work with inner typescript React
Task IDEA-238267 Make EPs related to structural search dynamic
Code Analysis. Syntax (PSI)Bug IDEA-207979 Java PsiIdentifier should not produce `USimpleNameReferenceExpression`
Bug IDEA-234749 UAST: Catch Clause does not visit its parameters
CoreFeature IDEA-238725 Log the values of _JAVA_OPTIONS/JDK_JAVA_OPTIONS and JAVA_TOOL_OPTIONS environment variables on startup
Bug IDEA-240456 DaemonListeners.myActiveEditors sometimes keeps reference to released editor
Bug IDEA-233936 WSL2: Folder .idea is not found for projects on WSL host
Bug IDEA-239021 FileTypeManagerImpl.DETECTED_FROM_CONTENT_FILE_TYPE_KEY leaks FileType reference on plugin unload
Bug IDEA-236153 Maven dependency change triggers JDK detection in a loop
Bug IDEA-239100 Angular2ReferenceExpressionResolver leaks through Disposer backtrace on plugin unload
Bug IDEA-238409 PsiCopyPasteManager leaks PsiFile on plugin unload
Bug IDEA-239124 PathMacrosImpl state is not persisted
Bug IDEA-231783 Sometimes IDEA does not start after installation on Windows
Bug IDEA-237519 2020.1 doesn't start when %APPDATA% points to a UNC share (enterprise Windows setup)
Bug IDEA-236342 The license dialog isn't shown when I press 'Enter license'
Bug IDEA-240825 Seeing lots of "fish: Could not set up terminal." / "fish: TERM environment variable not set" on Mac on Startup
Task IDEA-238580 Make pathMacroExpandableProtocol dynamic
Task IDEA-238818 Clear range highlighters with plugin class used as custom renderer when plugin is unloaded
Task IDEA-238257 Make pathMacroFilter EP dynamic
Task IDEA-235291 Make EPs related to module types dynamic
Exception IDEA-230983 InvalidPathException: Illegal char <:> at index 9: jetbrains://
Core. DebuggerTask IDEA-238226 Make com.jetbrains.fileUrlMapper extension point dynamic
Core. DiagramsBug IDEA-235873 Unnecessarily thick separator line in class diagrams
Task IDEA-235593 UML plugin requires restart on enabling and disabling because of non-dynamic EP <diagram.changesProvider>
Core. File SystemBug IDEA-238210 File watcher failed to start. Heap corruption.
Bug IDEA-227977 Project under network mount doesn't open anymore after upgrade to 2019.3
Bug IDEA-236701 JARs with case-sensitive class names do not work properly on case-insensitive OS
Bug IDEA-236854 Completion does not work in File Chooser
Bug IDEA-65174 OS fsnotifier unable to see changes under symlink/subfolders until restart/no notifier works correctly.
Bug IDEA-207169 Files cut (Ctrl+X) from one project fail to be pasted in another
Bug IDEA-240983 VfsImplUtil.ourHandlers leaks reference to ArchiveFileSystem instance after plugin unload
Usability IDEA-238396 Show a progress during file system synchronization processing
Exception IDEA-235071 "Already disposed" exception during VFS refresh
Exception IDEA-236946 Throwable at com.intellij.openapi.application.TransactionGuardImpl.assertWriteSafeContext
Exception IDEA-234557 RejectedExecutionException: Already shutdown
Core. IDE SettingsFeature IDEA-31438 Add IntelliJ IDEA (No Plugins) Start Menu entry ala Firefox/Thunderbird/etc.
Feature IDEA-175757 Support File Type mapping based on shebang
Feature IDEA-235494 Add a command line parameter to start IDEA without opening any projects
Bug IDEA-235857 "Cannot read scheme" - IDE fails to load its own configuration xml file from .idea folder if the file contains byte-order mark
Bug IDEA-239026 'Broken Usages' and 'Code Vision' should be preselected in settings when open them from the Editor
Bug IDEA-235940 SSH Configurations steal focus
Bug IDEA-235853 After Restore Default Settings invocation IDEA restarts with previously used vmoptions instead of clear default ones
Bug IDEA-235697 Settings search via "Find Action" doesn't work
Bug IDEA-233499 Rename SSH configuration dynamically
Bug IDEA-236874 When IDEA starts after RestoreDefaultSettings invocation, no Customize IDEA wizard is shown, if there were custom vmoptions in original config
Bug IDEA-236989 Auto update to 2020.1 made JDK configuration invalid
Bug IDEA-209241 Rider does not recognise '.PEM' (uppercase) extension files when importing Server Certificates
Bug IDEA-233857 Do not check "Visible only for this project" by default when create SSH configuration
Bug IDEA-238800 Add an extension point to define a configurable group
Bug IDEA-235413 AbstractTreeUi.myElementToNodeMap leaks reference to configurable of unloaded plugin
Bug IDEA-235713 Don't automatically import configs for debug IDEA instance
Bug IDEA-237277 IndexOutOfBoundsException at enabling 'Render Documentation comments'
Bug IDEA-237012 Critical startup error after updating PyCharm CE that have paid marketplace plugin installed via Toolbox
Bug IDEA-237059 SSH Configurations: allow saving password until IDE restart
Bug IDEA-235325 After Restore Default Settings invocation IDEA treats the plugins incorrectly
Bug IDEA-237709 Unable to add just installed JDK to IDEA's list of runtimes
Usability IDEA-240607 Import Settings should warn if user has incorrectly selected a folder without settings
Usability IDEA-233305 Provide ability to start the IDE with an empty config
Usability IDEA-190397 cacerts from previous IDEA version in user profile is not copied with IDEA upgrade
Usability IDEA-234079 Show Import Config dialog if idea.config.path is explicitly specified in vmoptions.
Task IDEA-233301 Log the automatically imported configs
Task IDEA-236420 Make internalFileTemplate EP dynamic
Exception IDEA-226651 Internal error when create Desktop Entry
Core. IDE Settings. SharingException IDEA-234617 java.lang.Throwable at com.intellij.cloudConfig.CloudConfigManager.connectThisInstanceOperation
Core. IndexingBug IDEA-238381 Deadlock in indexing
Bug IDEA-238557 Problem with stubs element initialization on dynamic load of Pug (ex-Jade) plugin
Bug IDEA-238557 Problem with stubs element initialization on dynamic load of Pug (ex-Jade) plugin
Bug IDEA-237219 Deadlock when updating plugins during indexing
Performance IDEA-237487 IDEA updates indexed_versions.next files constantly
Performance IDEA-238701 Index internals load VFS on EDT during project closing
Exception IDEA-238411 java.lang.Throwable on creating Java project
Exception IDEA-231678 AE at com.intellij.util.indexing.MemoryIndexStorage.setBufferingEnabled
Exception IDEA-236587 NPE at com.intellij.util.indexing.ChangedFilesCollector$2.afterVfsChange(ChangedFilesCollector.java:157)
Core. InstallationBug IDEA-205262 Batch update fails when the target directory is a symlink
Bug IDEA-215497 jbr/bin/java Access Denied during update from IC-192.4205.45 to IC-192.4488.21
Bug IDEA-237332 "Cannot load a JDK class: com.sun.jdi.Field" error when a custom JRE 8 is used instead of a bundled one
Bug IDEA-228859 Wrong project name and path when opening project with shell script
Bug IDEA-233867 bin/clion.sh (and bin/goland.sh) script uses "-" as argument to grep
Bug IDEA-239103 bin/fsnotifier64 Access denied during update from 2020.1.1 to 2020.1.1 Build #IC-201.7223.58
Bug IDEA-235899 On updating IDEA, a new Python plugin version is downloaded but not actually installed
Bug IDEA-233816 Symlinked Rubymine Configuration leads to being unable to open multiple projects via CLI
Task IDEA-208372 Upgrade ASM to 7.1
Core. LicensingBug IDEA-235344 Licence server address is cleared when it's unreachable
Bug IDEA-237175 IDEA 2020.1 Activation Window repeatedly requests activation when using Activation Code
Bug IDEA-237100 Missing license validation error messages in the license dialog
Bug IDEA-236244 Confirmation dialog which appears on attempt to close License Activation is tiny (no text only buttons)
Bug IDEA-231811 Excessive number of writes to idea.key
Cosmetics IDEA-227658 Date in license dialog is not fully visible
Exception IDEA-237330 Could not open windows registry node Software\JavaSoft\Prefs at root 0xffffffff80000001: Access denied
Core. Navigation and SearchFeature IDEA-219697 Navigate to File should honor the Sources directories first
Feature IDEA-130931 Shift+Ctrl+F7 hit on exception in throws clause of method declaration should highlight where exception is thrown
Core. Platform APIFeature IDEA-234013 Add Extension Point to contribute additional details into About popup
Bug IDEA-229756 UAST: super constructor call has different UastCallKind in Java and Kotlin
Bug IDEA-236404 @NotNull PsiSubstitutor.EMPTY can be null
Bug IDEA-238501 Make jsonRpcDomain EP dynamic
Bug IDEA-239832 `SystemHealthMonitor` notifications are lost
Bug IDEA-238172 Make postponed formatting consistent in tests and production
Bug IDEA-238508 Language holds annotator instances from plugins in user data
Bug IDEA-235572 Project is leaked after being closed via smart pointer reference queue
Bug IDEA-233075 MethodImplementor extension point doesn't suggest methods properly
Bug IDEA-233783 Deadlock in InterfaceExtensionPoint
Task IDEA-236887 Allow updating lookup element presentation after showing
Core. Plugin ManagementFeature IDEA-237986 Make scratch.rootType EP dynamic
Bug IDEA-235313 When IDEA is started with clear/imported configs but with not cleared plugins, the Plugins dialog displayed by 'Plugin updates available...' notification is incorrect
Bug IDEA-238292 'Code Coverage for Java' plugin requires restart on unload
Bug IDEA-234729 Restart suggestion not always shown on plugin unload failure
Bug IDEA-240659 ResourceBundleEditor plugin requires restart after disabling
Bug IDEA-236608 Gradle import error: Could not initialize class org.jetbrains.kotlin.android.synthetic.idea.AndroidExtensionsProjectResolverExtensionKt
Bug IDEA-240454 com.intellij.jbpm (JBoss jBPM) plugin requires restart on unloading
Bug IDEA-235176 Do not suggest plugins supporting exact filenames for files already supported by exact filename by installed plugins
Bug IDEA-237554 Disabled plug-ins are shown as enabled in Settings | Plugins
Bug IDEA-235397 Unreadable error message
Bug IDEA-234122 Exception and freeze on disabling Markdown plugin when .md file is opened
Bug IDEA-235169 Disabling of Time Tracking plugin requires IDE restart
Bug IDEA-234060 Unable to save settings popup on enabling Shell script plugin
Bug IDEA-237407 Disabled plug-ins are no longer logged in idea.log
Bug IDEA-240299 Less plugin can suggest restart on disabling
Bug IDEA-235901 Plugins settings broken in 2020.1 beta
Bug IDEA-235487 OpenAPI Specification (Swagger) plugin requires restart on disabling (light services are not cleared on plugin unload)
Bug IDEA-234528 Can't execute shell script after enabling shell plugin without restart
Bug IDEA-235665 Unclear wording for update of paid plugin in IDE
Bug IDEA-235025 IDEA freeze on Spring Messaging plugin disabling
Bug IDEA-233742 Bundled dynamic plugin become downloaded and has strictly defined version after disable/enable
Bug IDEA-235393 'BeanExtensionPoint.unregisterExtensions' doesn't fork with 'area="IDEA_PROJECT"'
Bug IDEA-232675 3rd party incompatible plugin from brokenPlugins.txt can't be seen in the Plugins view
Bug IDEA-235945 Plugins, installed during IDE customization, not-installed after IDE launch
Bug IDEA-236699 Welcome Wizard: disabling default plugins doesn't work
Bug IDEA-234917 Updatable plugin is not shown after following "Plugin Updates Available" link from Welcome screen
Bug IDEA-235506 Updated dynamic plugins are duplicated in plugins list until restart
Bug IDEA-237141 Opening a database table "db.messages" causes PhpStorm to suggest "messages files area supported by IntelliJ IDEA Ultimate"
Bug IDEA-234849 Exception when unloading REST client plugin
Bug IDEA-234660 Plugins which keep their own CodeStyleSettings instances lead to leaks when a plugin with custom settings is unloaded
Bug IDEA-238973 java.nio.file.ClosedFileSystemException on trying to enable intellilang
Bug IDEA-237282 Disabling Gradle plugin does not ask about Android plugin, but Android blocks the disabling
Bug IDEA-235485 Guice plugin sometimes requires restart on disabling
Usability IDEA-237811 "Install plugin from disk" should check brokenPlugins.txt
Usability IDEA-231815 Treat the situation when both bundled and downloaded plugin exist more user-friendly
Cosmetics IDEA-226009 Plugin icons are blinking when we change status
Cosmetics IDEA-227302 Help | AnalyzePluginStartupPerformance action: correct text displayed in DisablePlugins dialog
Task IDEA-239712 DragHelper leaks reference to disposed project
Task IDEA-238441 Make performancePlugin.commandProvider dynamic
Exception IDEA-230987 Throwable at com.intellij.util.indexing.FileBasedIndexImpl.dropRegisteredIndexes after updating plugins
Exception IDEA-234123 Exception on enabling Commander plugin
Exception IDEA-238390 Dynamic plugins: IllegalStateException on enabling Mercurial, Git plugins
Exception IDEA-234030 Exceptions when invoking Search everywhere after disabling HTTP Client plugin
Core. ProfilerFeature IDEA-231588 Allow to open hprof in IDEA after diagnostic "capture memory snapshot"
Bug IDEA-237880 `AttachProfilerToProcessAction` doesn't work during indexation
Bug IDEA-235365 Profiler's Flame Graphs are barely visible in High Contrast theme
Bug IDEA-234718 Profile indexing: no snapshot is created
Task IDEA-238475 Make com.intellij.profiler.profilerConfigurationType extension point dynamic
Core. Project SettingsBug IDEA-146107 Window drive root problem: Creating a New project shows invalid path
Bug IDEA-235984 Wrong file encoding is used while IDE starting
Bug IDEA-229737 Empty error message box on stopping JDK downloading
Bug IDEA-235636 Cannot open .ipr
Bug IDEA-238053 Project Structure dialog does not apply changes when Eclipse project format is used
Bug IDEA-235968 Improper detection of JDK version
Bug IDEA-235717 Validation settings use localizable strings as keys in configuration files
Bug IDEA-230707 unable to multi select when adding library dependency
Bug IDEA-232634 IJ 2020 EAP regression for project hot reload after 'gradle idea'
Bug IDEA-237873 Do not suggest to download already installed JDKs
Core. Quick DocumentationFeature IDEA-230655 Generate type-use annotations in quick-documentation
Bug IDEA-229804 Quick doc on hover is shown after mouse moving away from editor area
Bug IDEA-235078 JavaDoc: Empty space before parameters in rendered documentation fragment
Usability IDEA-235934 Change option for showing rendered javadocs to "Render all documentation comments"
Cosmetics IDEA-208369 Don't show module in quickdoc for local declarations
Core. RefactoringsBug IDEA-233425 Unnecessary Refactoring gutter after Undo signature change
Bug IDEA-233700 Inline rename suggestion is no longer shown after undoing changes
Bug IDEA-238440 Multiple RenameHandlers for single element triggers HandlersChooser on element right click
Bug IDEA-236875 No rename suggestion after erasing declaration name and typing-in another one
Performance IDEA-235908 Moving directory takes forever
Core. Run. ConfigurationsBug IDEA-230493 Runner debug is not registered
Bug IDEA-235710 Rider: incorrect run configuration share location being shown in the run configuration editor
Bug IDEA-235725 WSL2: unable to run application
Bug IDEA-237594 IntelliJ 2020.1: Module path is empty if run configuration uses "@argfile" or "JAR manifest"
Bug IDEA-236969 Current run configuration is not shown in the combo box after project reopen if it is the only run config in the project and it is stored as a file.
Bug IDEA-230986 Z-Order for dialog validation error
Cosmetics IDEA-238382 The button in 'Store as project file' dialog not fully visible
Core. Run. External ToolsBug IDEA-229467 External tool in run configuration before launch stops run configuration from running
Bug IDEA-233252 Context menu (right click) stops working when there're remote and usual external tools with the same name
Core. Run. TargetsBug IDEA-236232 [run.target] Pull docker target always pulls "latest" tag, even for "openjdk:8"
Bug IDEA-236233 Avoid Prepare step for local running
Task IDEA-233588 Change experimental flag to "run.targets"
Core. SSHFeature IDEA-237529 Add Copy action to SSH Configurations settings
Feature IDEA-234840 Custom name and rename for SSH config
Bug IDEA-236520 SSH configuration changes disappear from Settings dialog on Apply pressing
Bug IDEA-236693 SSH configurations: no events while settings' loading
Bug IDEA-238394 Link "Setup SSH configurations" in SSH Terminal settings page doesn't work in master
Bug IDEA-237896 SSH Configuration: username is lost when user opens deployment configuration
Bug IDEA-237455 net.schmizz.sshj.sftp.SFTPException: No such file
Usability IDEA-236191 Add button to rename ssh config to toolbar
EditorFeature IDEA-237118 Add -p (--project) command-line option to force opening a non-project file in one of already open projects
Feature IDEA-235535 make <editorActionHandler> dynamic
Feature IDEA-67379 Change splitter position via keyboard
Feature IDEA-234837 Light Edit: Show Live Templates in completion list
Bug IDEA-236411 LightEdit: Non-project file protection message on attempt to edit a new file
Bug IDEA-235938 Rendered representation is not updated after editing javadoc contents
Bug IDEA-237927 Wrong icons for Java class in Editor tabs
Bug IDEA-233938 Inlay hints cover the code
Bug IDEA-239009 Vue: VueImplicitElement leaks through SmartPsiElementPointer on plugin unload
Bug IDEA-236723 New rendered comment view does not appear for class with annotations
Bug IDEA-234457 Unable able to show CJK characters in inspection tooltip from the editor's right corner
Bug IDEA-236015 NPE when switching to project mode
Bug IDEA-235052 EA-224809: java.lang.UnsupportedOperationException: Smart mode is not available when LightEdit is active
Bug IDEA-236097 Documentation is not rendered in package-info.java
Bug IDEA-234317 LightEdit: Git integration doesn't work
Bug IDEA-233927 Closing a Light Editor closes the main project, too
Bug IDEA-240181 Leaked references to EditorProvider on plugin unload
Bug IDEA-238402 Reference to Language object leaked through TrafficLightRenderer$DefaultUIController on plugin unload
Bug IDEA-236584 List bullets are cropped in rendered documentation
Bug IDEA-238298 CompositeFoldingBuilder keeps reference to FoldingBuilder via cache in Language userdata after plugin has been unloaded
Bug IDEA-235182 Javadoc Rendered View Cuts Off Text
Bug IDEA-232960 Memory leak in TemplateState: myListeners collection is not always cleared on dispose
Bug IDEA-234306 LightEdit: Impossible to switch between IDE Exceptions
Bug IDEA-235849 Editor leaks reference to highlighter of unloaded plugin
Bug IDEA-239005 EditorLastActionTracker leaks reference to PsiFile via EditorWindowImpl on plugin unload
Bug IDEA-233891 Collapsed gutter does not show context menu (Show line numbers, Soft-wraps)
Bug IDEA-235209 JavaDoc in-editor rendering's gutter icon doesn't appear if first line comment
Bug IDEA-233517 LightEdit: Name files as "untitled_#"
Bug IDEA-236496 In-editor javadoc moves with caret when related code remains in place
Bug IDEA-236317 Documentation comments in-place rendering: empty comments get no gutter icon if rendered
Bug IDEA-236712 Can't open a file after exception on project loading
Bug IDEA-235834 Unable to open file again after closing LightEdit frame
Bug IDEA-237629 When I change the line separator to LF the change is not taken into account until I save the file. If I change from LF to CR then the file is saved automatically
Bug IDEA-234312 LightEdit: Possible to call Run Anything
Bug IDEA-234369 There is no indexing in Light Edit mode (confusing message)
Bug IDEA-231726 LightEdit: IDEA enters into a strange state when closing opened windows in a certain order
Bug IDEA-233073 Dragging text inside a JavaScript multi-line string replaces tabs with "\t"
Bug IDEA-240930 Brace highlighting inconsistencies
Bug IDEA-231883 LightEdit: Unable to close tab with Command + W
Bug IDEA-234530 Editor: GutterIconRenderer is not rendered in empty Editor
Bug IDEA-231253 Double Shift (search everywhere) in LightEdit mode
Bug IDEA-234746 LightEdit: Missing exception reporting widget
Bug IDEA-236689 Vertical scroll bar is shown unnecessarily in editor hover popup
Bug IDEA-236626 Section titles are wrapped in rendered javadoc
Bug IDEA-238339 Rendered Javadoc: cursor image is stuck on old place after toggling javadoc view after search inside javadoc
Performance IDEA-238114 IntelliJ Idea 2020.1 memory runaway and crash
Performance IDEA-237965 2020.1 performance regression: High CPU usage during navigation (UnifiedEditorRangeHighlighter)
Usability IDEA-236518 New javadoc rendered view doesn't display multiple authors
Usability IDEA-237082 Improve Page Up/Down actions behaviour in presence of block inlays (e.g. rendered documentation)
Usability IDEA-236536 Javadoc icons enabling/disabling comes into effect only after file reopening
Usability IDEA-227056 EditorConfig suggestions almost only include ij_* (make standard options more visible)
Usability IDEA-236498 Rendered Javadoc switches to edit mode when changing code below
Cosmetics IDEA-234985 Inline doc preview: render "external link" icon
Cosmetics IDEA-236952 LightEdit: Remove "Show Context Actions" from context menu
Cosmetics IDEA-236497 Insets between comment and code are more than usual when javadoc contains tags
Cosmetics IDEA-236427 Alignment is broken in rendered javadoc
Task IDEA-236538 Add new parameters of doc comment to Color Scheme preview
Task IDEA-238415 Support rendered documentation view in module-info.java
Task IDEA-233403 LightEdit: extract to bundles
Task IDEA-237300 Show rendered doc switch icon only on mouse hover
Task IDEA-232722 Add "Open file in project" to the main menu and the context menu
Task IDEA-236787 'Promote' bidi text base direction setting when file containing RTL fragments is opened
Task IDEA-233257 com.intellij.lang.folding.CustomFoldingProvider isn't dynamic
Task IDEA-237045 Correct rendering hints for rendered comments
Exception IDEA-236548 LightEdit: opening binary files should not fail
Exception IDEA-236539 NullPointerException on Control click in rendered javadoc when doc gutter is not displayed
Editor. Code CompletionBug IDEA-238623 Completion is not sorted by ML because of new weighers
Bug IDEA-238617 Don't check relevance features if model trained without positions from standard ranking algorithm
Performance IDEA-201824 Completion item rendering shouldn't access PSI, index and file system on UI thread
Performance IDEA-235762 Spring Data JPA Query by Method Name Performance Issue
Performance IDEA-236322 Automatic completion is started on every new typed character when there are no suggestions
Exception IDEA-238546 Throwable at com.intellij.completion.ngram.NGramFileListener.beforeFileOpened
Editor. Code Completion. MLFeature IDEA-240174 Allow using a simple class name instead of fully qualified name
Bug IDEA-240352 MLFeaturesUtil.classNameSafeCache leaks references to plugin classes after plugin unload
Exception IDEA-239003 PsiInvalidElementAccessException on disabling ChangeReminder plugin
Exception IDEA-239695 "java.lang.Throwable: File is not valid" on deleting a package with an opened file
Editor. Diff and MergeFeature IDEA-238361 Please implement collapse on the three way merge
Feature IDEA-234251 Allow to "Accept Theirs" for folders in the "Conflicts" dialog
Feature IDEA-238389 Image three way merge don't feature compare left/right/base/middle...
Bug IDEA-238054 Missing method name when collapsing unchanged fragments in diff
Bug IDEA-234614 When launching `charm diff` splash screen remains
Bug IDEA-240641 'Synchronized Scrolling' in diff jumps up/down 1 line on smooth scrolling if 'code vision' inlays are enabled
Performance IDEA-235817 Editor freezes for seconds while comparing two big xml files
Usability IDEA-233728 "Show details" in Diff is too close to the line breaks style indicator
Usability IDEA-236053 Conflicts dialog is opened extremely small
Exception IDEA-231544 RuntimeException when delete class from Local History
Editor. Editing TextFeature IDEA-235063 Support inline inferred type hints for Java 10+
Feature IDEA-238341 Vertical padding/margin for rendered JavaDoc comments
Feature IDEA-168218 'Copy as Rich Text' should use some fallback font
Bug IDEA-232792 Double click on a parameter does not highlight usages in function
Bug IDEA-235044 Multicaret allows to have matched braces away from caret
Bug IDEA-234928 Modified file is not saved automatically by IDE on frame deactivation if it was opened in LightEdit previously
Bug IDEA-235890 Delete lines above 'in-editor Javadoc rendering' deletes Javadoc
Bug IDEA-236834 Invalid Block Uncomment with Multicursor
Bug IDEA-235034 Undo should revert argument indent in one step
Bug IDEA-235703 In-editor Javadoc leaves large gap between comment and code
Bug IDEA-238541 Honor CamelHumps selection when selecting on double click is not respected on mouse drag
Usability IDEA-235716 Broken GoTo (ctrl+click) in rendered javadocs
Cosmetics IDEA-236045 misalignment of indent guides and whitespace visuals
Cosmetics IDEA-238872 Cursor On Folded Block Is Not Intuitive
Task IDEA-240654 Ligatures per editor
Exception IDEA-236288 Macro stop working because of extreme editor wrapping settings
Editor. Error HighlightingBug IDEA-238504 MarkupModelImpl > RangeHighlighter leaks tokens and PsiFiles through HighlighInfo on plugin unload
Bug IDEA-239006 TrafficLightRenderer$DefaultUIController leaks PsiFile through FileIncludeContextHectorPanel on plugin unload
Bug IDEA-150333 Some warnings are still highlighted even though I selected "Syntax" for Highlight Level
Editor. FormatterBug IDEA-230976 IDEA is modifying .idea\codeStyles\Project.xml
Bug IDEA-239008 CodeStyleCachedValueProvider$AsyncComputation leaks reference to PSI File via TransientCodeSettings on plugin unload
Bug IDEA-233647 Log contains too many ' INFO - rojectCodeStyleSettingsManager - Saving Project code style '
Bug IDEA-237737 EA-218146 - IOOBE: LineSet.findLineIndex
Bug IDEA-231481 Detected file indent does not seem to be invalidated after the code is fully re-formatted
Editor. Intention ActionsBug IDEA-236039 Intention preview: always unavailable on the last line in a file
Bug IDEA-234662 Replace with end-of-line comment – extra blank lines
Bug IDEA-237047 "Preview not available" is displayed when intention only deletes some lines
Bug IDEA-233784 Intention preview: Infinite loading and exception(Should be invoked only when having a document)
Bug IDEA-236961 idea hangs on "removing redundant imports", seems like on a single file
Bug IDEA-238615 HintManagerImpl > IntentionHintComponent leaks PsiFile on plugin unload
Usability IDEA-236926 Intention preview: alignment is broken if there are several parts diff parts and number of digits in line number is different
Exception IDEA-233778 Intention preview: Exception when preview is not available
Editor. Large FilesBug IDEA-234404 [Large File Editor] AssertionError: File text mismatch
Bug IDEA-234864 [Large File Editor] AssertionError: file/doc text length different
Editor. TextMate BundlesBug IDEA-236482 Bad syntax highlight in Dockerfile if docker plugin is turned off
Bug IDEA-237128 TextMate bundles don't work for injections
Bug IDEA-232235 '<' in HTML DOCTYPE is highlighted as bad character when using textmate bundles
FrameworksFeature IDEA-235117 Allow renaming URL references even if they have multiple resolve targets
Feature IDEA-236038 JMS: message queue references for JMSContext usages
Feature IDEA-232069 Microservices: custom highlighting for UrlPath and MQ references
Bug IDEA-227452 False positive Optional used as field for CDI frameworks
Bug IDEA-233120 Android Volley HTTP Client: the second `http://` and `https://` endpoints should not be suggested in the concatenated string
Bug IDEA-236604 Project web starters. Exception when searching among dependencies.
Bug IDEA-234373 Project starters. Quarkus. Error: Request fails with status code 414 at creating a quarkus project with all possible extensions
Bug IDEA-233687 JavaScript: no endpoints completion for concatenated urls from json form of axios
Bug IDEA-234988 Spring Initializr project creation : F1 should lead to the corresponding help page for all settings steps excluding module settings step (last step)
Bug IDEA-235887 Quarkus project creation. The project is not generated with the "failed to create directory" error for some Artifact values
Bug IDEA-234477 Quarkus project creation. Gradle. Double dependencies are generated in case of adding `RESTEasy JAX-RS` extension
Bug IDEA-234899 Microservices: usages of MIME Type cannot be found from independent modules
Bug IDEA-236873 HTTP Client: Can't generate requests for all endpoints in endpoint source (Helidon)
Bug IDEA-232835 Microservices: completion doesn't work in case of the added slash in the interface part
Bug IDEA-234395 Quarkus, MicroProfile project creation : F1 should lead to the corresponding help page
Bug IDEA-233495 JavaScript: don't show http and https for axios in the completion list
Bug IDEA-235441 Quarkus project creation. Project creation fails if version field contains `&` or `<` symbol
Usability IDEA-235603 Endpoints View should be available from View - Tool windows for empty projects
Usability IDEA-234478 Quarkus project creation. Validate artifact/project names.
Cosmetics IDEA-236132 Wrong place of external link icon in new project starters
Cosmetics IDEA-234239 Microprofile: hide category pane and selected dependencies pane in new project wizard
Cosmetics IDEA-234192 Project starters: gap between list and selected extensions is too big
Task IDEA-235189 Hide Persistence Frameworks Support from plugins
Task IDEA-235399 Quarkus project creation. Human readable messages for validation artifact/project names
Task IDEA-235483 Quarkus project creation. UI. Include "RESTEasy JAX-RS" by default like web-service do.
Exception IDEA-232689 StringIndexOutOfBoundsException: Can't extract range from 'null' at moving null param from URI
Exception IDEA-234608 java.lang.Throwable: Incorrect CachedValue use at working with some microservices projects
Frameworks. GWTBug IDEA-234464 Tomcat run configuration created in new GWT project has invalid initial URL
Bug IDEA-234441 GWT templates do not use HTML5
Frameworks. HibernateBug IDEA-232200 Hibernate-reverse-engineering mapping: "scale" is ignored
Frameworks. MicronautFeature IDEA-230847 Micronaut: message queue references
Feature IDEA-232201 Micronaut: detect JPA facet automatically for projects with micronaut-data
Feature IDEA-235110 Provide an action for Micronaut Client request mappings to open request in HTTP Editor
Bug IDEA-233712 Micronaut: parameter name part of parameterized key in application.yaml is not highlighted
Bug IDEA-233711 Micronaut: parameter name is removed when completing properties parameterized key
Bug IDEA-233886 Micronaut: user-defined properties (from spring-configuration-metadata.json) are not supported
Bug IDEA-233878 Micronaut: completion popup shouldn't be shown while typing parameter for parametrized key
Exception IDEA-234042 Exception on enabling Micronaut plugin
Frameworks. OpenAPI (Swagger)Feature IDEA-237110 Remove java/execution-java plugin dependencies from swagger plugin so it can be installed into any ide
Feature IDEA-233894 Open API/Swagger: Add option for navigating to folder where located files generated by CodeGen
Bug IDEA-233583 Open API/Swagger: Add validation for incompatible versions of swagger code generator and specification file
Bug IDEA-234003 Open API/Swagger: Find Usages not worked from structure view for swagger specification files
Bug IDEA-234273 Make live templates with openapi/swagger basic structure available only in empty yaml/json files
Bug IDEA-235466 Swagger/Open Api: remove option to choose specification on local machine from Add Remote Open Api Specification manager in endpoints view
Bug IDEA-235517 Swagger/Open API: CodeGen search generator jar by wrong path in case I specify local generator on Windows
Bug IDEA-234898 Swagger: Update support EndpointsViewProvider.URL_TARGET_INFO
Bug IDEA-234005 Open API/Swagger: not all servers displayed in structure view for swagger specification after sort enabled
Bug IDEA-235489 Swagger/Open API: Add remote specification not updated specifications list
Usability IDEA-235505 Swagger: the 'Add Remote OpenAPI Specification' action is confusing and inconvenient
Cosmetics IDEA-235499 Swagger/Open API: Add description in topic and align generator width download generator popup menu
Frameworks. QuarkusFeature IDEA-224099 Support for @DefaultBean in Quarkus
Feature IDEA-224098 Support for @AlternativePriority in Quarkus
Feature IDEA-224091 Quarkus bean injection with only Qualifiers
Feature IDEA-224097 Support implicit usages for @ConfigProperties beans in Quarkus
Bug IDEA-235913 Quarkus: No warnings for private method and consume/produce annotations absence
Usability IDEA-234051 Quarkus: Sort top 5 categories in new project wizard
Task IDEA-236227 Quarkus project creation. Provide guide-links for Quarkus extensions
Frameworks. ReactorBug IDEA-234430 No description for batch fix of 'Throw statement in Reactive operator' inspection
Bug IDEA-241202 False positive "Value is never used as Publisher" in elvis expression with RxJava
Bug IDEA-237767 Idea don't understand RxJava @NonNull, @Nullable annotations
Frameworks. SeleniumFeature IDEA-236664 Selenium: add support for FluentLenium library
Bug IDEA-240583 Selenium: incorrect declaration of maven-surefire-plugin in pom.xml
Bug IDEA-234586 Selenium: Missing groovy-all and kotlin-stdlib-jdk8 in new Gradle projects created with wizard
Bug IDEA-240173 Selenium: Unable to run tests on JDK 11 with Maven
Bug IDEA-234611 Selenium: no selectors highlighting for Serenity BDD
Bug IDEA-234880 Selenium/Allure: navigation to @Owner usages does not work
Bug IDEA-234668 Selenium: no issue navigation for Serenity @Issue and @Issues
Bug IDEA-234364 Selenium: Null name for PSI element class com.intellij.selenium.jvm.utils.NavigatableForwarderElement
Bug IDEA-236855 Selenium: find usages action shows two elements for Allure owner
Bug IDEA-234363 Selenium/Allure: Gutter with navigation to issues for Allure @Issue annotation doesn't work
Cosmetics IDEA-234688 Selenium: use same width for build tool and test runner options
Task IDEA-235681 Selenium: dependency on XPath View plugin should be optional
Task IDEA-236636 Selenium: new project dependency updates for 2020.1.1
Frameworks. SpringFeature IDEA-235109 Provide an action for Spring Feign request mappings to open request in HTTP Editor
Feature IDEA-233375 Spring AMQP: support @RabbitListener bean references
Bug IDEA-232236 Spring MVC: confusing results on attempt to rename @RequestMapping url that contains the property placeholder
Bug IDEA-225083 Spring boot annotation processor documentation link returns 404 error
Bug IDEA-224690 Unsupported tag 'inbound-gateway' for namespace 'http://www.springframework.org/schema/integration/webflux'
Bug IDEA-234547 Spring Webflux: the view name is not resolved from ServerResponse.ok().render()
Bug IDEA-191721 Spring Boot: application.yml: intention that replaces the deprecated property with one having different prefix leaves the old prefix
Bug IDEA-233850 Generate HTTP Requests: add the missing leading slash automatically
Bug IDEA-233849 HTTP requests generating is not correct in case of path variables with regexp
Bug IDEA-233373 Spring AMQP: support @RabbitListeners and @RabbitListener repeatable annotation
Bug IDEA-233602 Spring Kafka: support @KafkaListeners and @KafkaListener repeatable annotation
Bug IDEA-233758 Spring: i18n: 'Cannot resolve @PathVariable' waring is not internationalized
Bug IDEA-226065 Spring Webflux: path variable is not resolved in the router function when lambda is used
Bug IDEA-240428 Spring Feign: group is / while url is specified
Bug IDEA-234057 EAP: Failed to create new project/new module due to NoClassDefFoundError: WebStarterModuleBuilder
Bug IDEA-233759 Spring: i18n: tooltip for the 'usage in Spring Boot Confguration Files' gutter icon for the sb configuration property is not internationalized
Bug IDEA-233348 Intellij Ultimate 2019.3.3 cannot detect some Spring Annotations e.g. @Autowired, @Component, @Service
Bug IDEA-234522 Spring: i18n: the 'usages of configuration property' popup is not internationalized
Bug IDEA-236043 Spring AMQP: XML <rabbit:annotation-driven/> element is not supported
Bug IDEA-234431 Spring Initializr: incorrect icons for external links
Bug IDEA-235342 Spring Feign Client: Generate HTTP Request from endpoints should consider the client base URL
Bug IDEA-233761 Spring: i18n: 'related views' gutter icon tooltip for the request mapping methods is not internationalized
Bug IDEA-237127 Spring Boot: there is no 'missing map key' error if key is in camel case
Bug IDEA-235150 Spring Messaging: Unsupported tag 'broker' in activemq XML namespace
Bug IDEA-236326 Wrong Quick Documentation on any DomElement/XmlAttributeValue
Bug IDEA-235425 Spring Feign Client: navigation and refactoring don't work for requests with API URL prefix in HTTP client
Bug IDEA-233054 Spring Webflux: Freemarker views are not resolved
Bug IDEA-235095 Default artifactId of the Spring Initializr wizard should use default values from the metadata
Bug IDEA-233400 Spring MVC View Reference warning incorrectly shown when calling function that receives lambda with string interpolation
Bug IDEA-233377 Spring AMQP: provide completion and references for queues and exchanges used as Binding constructor parameters
Bug IDEA-234533 Spring Webflux: support custom reactive ViewResolvers
Bug IDEA-234546 Spring Webflux: Kotlin: path variables are not navigable in some cases
Bug IDEA-235427 Spring: i18n: 'navigate to Registration in spring.factories' gutter icon tooltip is not internationalized
Cosmetics IDEA-233756 Spring: incorrect tag escaping in the EditApplicationContext dialog text
Exception IDEA-236013 NPE at JamAnnotationAttributeMeta$Single.getJam in SpringRabbitQueueBinding
GrazieBug IDEA-229314 Grazie recognizes 'Whitespace repetition' in XML CDATA Block
Bug IDEA-232519 Wrong warning about missing punctuation in Git commit message headline
Bug IDEA-235308 "<suggestion>" has appeared in Grazie tooltip
Bug IDEA-229250 Grazie should recognize Javadoc conventions
Bug IDEA-233865 Natural text analysis should not be done on code
Performance IDEA-239122 PsiUtilsKt.isInjectedFragment takes a lot of time
GroovyFeature IDEA-235989 Separate Java and Groovy live templates
Feature IDEA-235611 Please make `logback.groovy` into a File Type so we can associate it with files with other names.
Bug IDEA-239977 GrLiteralImpl.getValue() returns null for integer literals longer than an int without a suffix
Bug IDEA-228890 [groovy] Failed to infer type of lambda parameters
Bug IDEA-240977 Groovy live template 'soutm' lost context
Bug IDEA-223186 False-positive error in Groovy syntax
Bug IDEA-232467 Groovy resolves wrong method with null parameter, and generic parameter type
Bug IDEA-234046 formatting interpolated gstring is broken
Bug IDEA-234806 Groovy @Newify Pattern Parameter Support
Bug IDEA-233323 Ability to change Groovy version for Groovy Console other than the bundled on
Bug IDEA-236545 Groovy: content of {@code } tags isn't shown in quick documentation popup
Bug IDEA-235108 Groovy - Delegates in Script classes no longer recognize properties
Task IDEA-209501 Use Groovy 2.5 (or later) library in IDEA project
Task IDEA-238214 Make Groovy plugin EP's dynamic
Groovy. GrailsBug IDEA-237674 GSP control tags missing from autocomplete/code hinting
Exception IDEA-236328 IAE at org.jetbrains.plugins.grails.gradle.GrailsModuleData.$$$reportNull$$$0
Groovy. InspectionsBug IDEA-231867 Suppress for that inserts @SuppressWarnings annotation in Groovy should use single quotes
Infrastructure. Build ScriptsBug IDEA-236896 failure of any of parallel tasks at building installation packages of IntelliJ IDEA CE causes broken tar.gz archive
Task IDEA-180474 [Build] Cleanup downloaded JBRE/SDK in build/dependencies folders
JavaFeature IDEA-227220 Parse Java 14 helpful NPEs to point exactly at the dereferenced value
Feature IDEA-236668 Position cursor to ClassCastException cause
Feature IDEA-237983 Console folding doesn't work for java 11
Feature IDEA-240402 Dataflow to here: narrow filters during the dataflow
Feature IDEA-235555 sout to System.out::println in Consumer<?> scope
Feature IDEA-227219 Dataflow to here: filter by target value
Feature IDEA-223129 Group java live templates under Java branch
Feature IDEA-240403 Analyze dataflow to here: perform backpropagation through simple expressions
Feature IDEA-229844 Quick documentation support for record components
Bug IDEA-235191 UastReferenceContributorChunk keeps references to classes from unloaded plugins
Bug IDEA-174043 Implement method with @NotNull/@Nullable array return type
Task IDEA-235296 Refactor ensureCodeBlock
Java. Code CompletionBug IDEA-238095 Why does IntelliJ suggest "void[];" as a code-completion for an array?
Bug IDEA-238826 'fori' live template misses "int" part
Usability IDEA-239386 Completion for $Class$.class should be suggested first if Class parameter is expected
Usability IDEA-227534 Autocomplete for variable names in exception handlers does not work
Usability IDEA-233490 Java: Code completion does not suggest Enum values where appropriate
Java. Code CoverageBug IDEA-240028 IntelliJ coverage runner fails with JDK14 records
Java. Code GenerationBug IDEA-236474 IDEA adds @NotNull annotation twice while generating methods
Usability IDEA-233024 Nullability annotations on overridden methods do not respect configured nullability annotations
Java. DebuggerFeature IDEA-236953 Log async stack trace on breakpoint
Feature IDEA-231769 Debugger evaluation: support instanceof with pattern variable
Feature IDEA-236609 Attach to process from the console
Feature IDEA-208110 Support evaluation of JDK 12 switch expressions in java debugger
Bug IDEA-218906 Compiling evaluator does not work for decompiled files
Bug IDEA-235398 Cannot 'step into' method with lamdas and conditional expressions in parameters
Bug IDEA-237411 Debugger mode "Listen to remote JVM" host parameter not working
Bug IDEA-223505 Critical Error in IDEA Async Stacktraces (IndexOutOfBOundsException)
Bug IDEA-229494 Compilation fails in debugger when invoking Evaluate Expression with static import
Bug IDEA-237888 Exceptions incorrectly detected for unrelated input in docker log console
Bug IDEA-237222 Strange NPE suggestion from debugger dfa
Bug IDEA-238356 Generic classes don't work in renderers
Bug IDEA-236485 Icons are displayed despite renderers being muted
Bug IDEA-232180 "No executable code found at line..." message is given after code change and auto recompile (groovy/grails app)
Bug IDEA-236306 Types in DfaAssist are incorrectly passed sometimes
Bug IDEA-229590 Compiling evaluator fails
Usability IDEA-235956 Debug: Do not step into JUnit 5 and Spock internal classes
Java. Debugger. StreamsFeature IDEA-238349 Make debugger.streams.librarySupport EP dynamic
Java. DecompilerFeature IDEA-135721 In decompiled sources, only keywords and values are highlighted
Java. Error HighlightingBug IDEA-239116 Switch expression without any results is not highligted as erroneous
Bug IDEA-238925 Javadoc @param does not work for Java Records
Bug IDEA-238526 Wrong compilation error reported when anonymous class is defined inside private interface method
Bug IDEA-235214 Highlighting freezes when captured wildcard used on the type with cyclic dependency in type variable
Bug IDEA-236735 Java enum constant is called “Anonymous inner class”
Bug IDEA-239649 Increase language level fix is not suggested for records
Bug IDEA-237446 Incorrect "Bad return type in lambda expression"
Bug IDEA-234810 Bad code green: qualified anonymous class creation with qualified superclass reference
Bug IDEA-233551 false negative: cast wildcard to primitive
Bug IDEA-237774 IDEA IntelliSense shows an error for a perfectly valid Java's Annotation Type Element Declaration.
Bug IDEA-238812 Cannot use `+=` operator on `CharSequence`
Java. Extract MethodUsability IDEA-236590 Make extracted method code better
Java. GUI DesignerBug IDEA-235872 Incorrect code generation from UI builder in latest 2020.1 EAP (IU-201.6487.11)
Bug IDEA-234892 Regression: Autogenerated code from Form Designer creates invalid code (IdeBorderFactory.PlainSmallWithIndent)
Bug IDEA-237293 GUI Designer unable to preview form because of FormPreviewFrame.class missing
Task IDEA-238427 Get rid of components in GUI Designer plugin
Java. InspectionsFeature IDEA-240494 Inspection "Logger initialized with foreign class" does not work for Log4J 2
Feature IDEA-234434 Ignore annotated objects in Type parameter explicitly extends java.lang.Object inspection
Feature IDEA-238074 NullPointerException in the Ternary Operator with autoboxing
Feature IDEA-231906 IDEA should check violations of array/collection component nullability in overridden methods
Feature IDEA-240285 ConstantConditions: improve detection of pointless 'Math.min' and 'Math.max' operations
Feature IDEA-239776 Add Inspection warning for AssertJ assertThat(x).isEqualTo(y) when x and y are inconvertible.
Feature IDEA-237601 Infer mutation signature from the bytecode
Feature IDEA-143315 Extend 'constant conditions' inspection to detect difference of equal expressions
Feature IDEA-153125 Create inspection to match the intention "Insert underscores into literal"
Feature IDEA-240288 Inspection for StringBuilder.toString().substring()
Feature IDEA-237678 Do not flush all fields when calling method with mutation signature
Feature IDEA-235801 Support Nls as meta-annotation
Feature IDEA-113640 Provide intention to combine System.out.println(String.format(...)) into System.out.printf
Feature IDEA-235072 Add def-use analysis for i18n inspection in Nls-only mode
Feature IDEA-236682 Warn about detectable ArrayStoreExceptions
Feature IDEA-236142 warn about inconsistent Contract/NotNull annotations
Feature IDEA-240870 "Implicit usage of platform's default charset" should know about Apache commons-io
Feature IDEA-204608 Integrate production stacktraces into static nullability analysis
Feature IDEA-237717 Support inlining in DFA for methods, which accepts and calls given lambda
Bug IDEA-221292 Incorrectly "corrected" redundant cast
Bug IDEA-162080 Redundant cast is not reported 2
Bug IDEA-205885 False-positive redundant cast is reported for lambda which invoked in erased context
Bug IDEA-234237 IDEA can't decide which escaping to complain about
Bug IDEA-239079 Join concatenation string literals don't respect '\s' escape
Bug IDEA-235454 Unnecessary 'toString' call reintroduces non-compiling code when working with generics and overloading.
Bug IDEA-234874 i18n: "Hard coded strings" should find a text in a function with an expression body
Bug IDEA-239099 I18n: do not ignore external annotations on packages
Bug IDEA-239945 'Suspicious date format pattern' inspection false positive
Bug IDEA-238619 Wrong warning in for-loop over float
Bug IDEA-235896 Redundant cast false positive with ternary expression
Bug IDEA-238171 Move declaration closer to its usages does nothing
Bug IDEA-232714 "Parameter hides field" inspections should not warn on record constructor
Bug IDEA-240631 "Switch label is unreachable" false positive with OptionalInt
Bug IDEA-236740 NonNullByDefault not working with Generic Types.
Bug IDEA-159178 Incorrect inspection of redundant casting
Bug IDEA-234820 Inspection 'Unnecessary unicode escape sequence' reports U+FFFD as unnecessary
Bug IDEA-240834 Unnecessary escape character fix makes incorrect replacement
Bug IDEA-240650 Don't report "will produce ClassCastException for any non-null value" when the value is known to be null
Bug IDEA-235649 'Unwrap if statement' of 'if' statement inside 'case' statement removes subsequent 'case' statements
Bug IDEA-236509 "Map is always empty" false positive when using a ternary operator and Map.compute
Bug IDEA-233879 PsiCodeFragmentImpl cannot be cast to class com.intellij.psi.PsiJavaFile
Bug IDEA-234412 There is no warning for method .get() in Optional after .map()
Bug IDEA-240328 Condition always false inspection is wrong if using switch expressions
Bug IDEA-234780 i18n: invalid bunch fix for string template
Bug IDEA-222542 Incorrect "redundant cast" suggestion
Bug IDEA-240073 Concurrency annotations inspections should work with android.support.annotation
Bug IDEA-236574 False-positive warning appears when inheritDoc is used in @throws tag
Bug IDEA-236413 Java: incorrect text for unused public fields with Inject
Bug IDEA-234725 OptionalInt: Wrong warning "Condition is always false"
Bug IDEA-237992 Incorrect contract inference when method returns result of class.cast
Bug IDEA-234860 OverridableMethodCallDuringObjectConstructionInspection: "Make method final" does nothing
Bug IDEA-238060 'Find cause' points to wrong IF branch
Bug IDEA-240195 Unnecessary string escape produces wrong result when applied in batch
Bug IDEA-234781 "Hard coded strings" should find text in a super type call
Bug IDEA-215022 Wrong inspection: remove redundant cast
Bug IDEA-227076 List.of(...).clear() has no warning
Bug IDEA-237669 Spurious error "switch label is unreachable"
Bug IDEA-184330 Redundant cast false positive
Bug IDEA-197979 "Replace with lambda" suggestion removes type annotation (JSR 308) in IDEA 2018.2
Bug IDEA-235495 "Utility class without 'private' constructor" inspection shows notification several times when run on several classes
Bug IDEA-232812 Redundant Suppression inspection ignores profile with which inspections were started
Bug IDEA-216871 "Assertion expression can be replaced with assertThat method call" fails with missing import
Bug IDEA-237019 False positive Scope of variable too broad when saving property
Bug IDEA-240684 Possible bug in inspection "Java | Probable bugs | New object is compared using '=='"
Bug IDEA-233359 Unnecessary 'return' statement false positive
Bug IDEA-238023 Call to substring is redundant shown twice in popup
Bug IDEA-239004 Spring nullability annotations aren't honored when there's JSR-305 dependency in an unrelated module
Bug IDEA-235734 false positive "Test-only class is referenced in production code"
Bug IDEA-233462 Method reference and lambda, not compatible conversion
Bug IDEA-233940 transform body to single exit point fails with try clause
Bug IDEA-234248 Constant conditions & exceptions: argument BigDecimal.ZERO might be null
Bug IDEA-218757 False positive: redundant cast to primitive long.
Bug IDEA-207495 incorrect code inspection warning: 'while' statement cannot complete without throwing an exception
Usability IDEA-239118 'Method is identical to its super method' inspection doesn't report overrides from standard library
Usability IDEA-234753 Inconsistent behavior of Java | Method metrics | Overly long method inspection
Usability IDEA-221139 "Redundant type cast" inspection conflict with "Confusing argument to varargs method" inspection
Cosmetics IDEA-233889 Annotation name shown wrong in the tooltip
Cosmetics IDEA-231994 IDEA replaces collection.stream().toArray(Integer[]::new) with collection.toArray(new Integer[0]) in Java 11
Cosmetics IDEA-233859 String Value Comparison
Cosmetics IDEA-234241 Link to "Code Generation" Java code style settings tab in "Lambda can be replaced with method reference" inspection does not work
Cosmetics IDEA-234256 QuickFix for "Unnecessary call to 'toString'" could be more explicit
Exception IDEA-234521 PublicMethodNotExposedInInterfaceInspection: StackOverflowError on red code
Java. Intention ActionsFeature IDEA-238738 Suggest `.formatted()` instead of `String.format()` when text blocks are available
Feature IDEA-151487 Simplification of if-statements only after transition into ternary operator provided
Bug IDEA-234360 AnnotateOverriddenMethodsIntention: properly place type_use annotation
Bug IDEA-177643 Action "Generate Delegate Method" creates double annotation when method parameter is annotated array
Bug IDEA-236383 Ensure "Expand boolean return to `if else`" matches project code style
Bug IDEA-237659 Invalid i18n: do not translate access modifier names
Bug IDEA-238608 Fix 'default' modifier when changing interface method access level
Bug IDEA-238075 Intention to change method return type not offered when return type is void
Usability IDEA-237506 Provide quick-fix to make class public/protected for class which is generic parameter class
Usability IDEA-238838 Generated identifier names for Void types could be improved
Java. JavaFXFeature IDEA-240037 Show FXML File and JavaFXApplication in New... popup only if JavaFX is configured
Bug IDEA-209569 JavaFX: artifacts: application class can't be selected
Exception IDEA-240813 INRE at com.intellij.openapi.project.IndexNotReadyException.create
Java. Profiler. MemoryFeature IDEA-238442 Make "Open Profiler Snapshot" open Hprof files
Bug IDEA-238385 IllegalArgumentException when opening hprof
Java. Properties FilesFeature IDEA-233762 Inplace rename for properties keys
Java. RefactoringsFeature IDEA-61551 Introduce variable: provide more options for nested scopes
Bug IDEA-234943 Move Inner Class shows spurious warnings
Bug IDEA-233185 No refactoring gutter after 'Inplace' rename
Bug IDEA-235090 "Change signature" action removing @NotNull does nothing
Bug IDEA-237759 Unable to extract field/variable from values() call
Bug IDEA-230807 Change Signature refactoring inserts annotations for return type fully-qualified
Bug IDEA-235318 "Extract Constant is not finished yet"
Bug IDEA-236058 Dialog to rename parameter shown twice when rename field with post-edit refactoring
Bug IDEA-236793 Post-edit refactoring confuses rename parameter with signature change, when name fully changed
Bug IDEA-237710 Moving package does not move files to the correct Root folder into account
Java. Tests. CucumberBug IDEA-222254 Right-click on a data table in a .feature file asks which rename handler to use then shows an unresponsive context menu
Bug IDEA-234422 Create step dialog shouldn't automatically create suggested step definition directory
Bug IDEA-229722 2020.1 Lost Cucumber run configurations created in 2019.3
Bug IDEA-233474 When Cucumber tests are as a module inside bigger Java project then Working Directory path of autogenerated runner is not valid
Java. Tests. JUnitFeature IDEA-229355 Add inspection+quick fix "JUnit 3 test can be JUnit 4"
Bug IDEA-231482 Missing Run Test Decorator when Jupiter-API is not in dependencies
Bug IDEA-236788 @Disabled tests are skipped when run explisitly
Bug IDEA-238311 JUnitConfiguration.myUserMap leaks reference to JavaCoverageEnabledConfiguration
Bug IDEA-235884 JUnit5MalformedParameterizedInspection exception
Usability IDEA-240984 "Sort by duration" option can't be enabled when "Select first failed test when finished" is enabled
Java. Tests. TestNGBug IDEA-238461 Test runners should add test packages to module path
Bug IDEA-234149 Throwable at enabling TestNG/JUnit plugin
Usability IDEA-239752 Context menu UI improvement suggestion
Java. i18nBug IDEA-237258 Resource Bundle Editor doesn't save values
Bug IDEA-233945 "Hardcoded string literal in a UI form" inspection ignores external @NonNls annotations
Bug IDEA-234115 "I18nize hardcoded string literal" quick fix works incorrectly for strings containing line breaks
Bug IDEA-238548 NlsInfo#computeFromAnnotationOwner not working for Kotlin field
JavaX. AppServers. GlassFishBug IDEA-216528 Payara Server 5.192 cannot be started with JDK 11 from IntelliJ
JavaX. AppServers. TomcatFeature IDEA-233724 Add Apache Tomcat 10 support
Bug IDEA-228150 Update resources rebuilds project.
Bug IDEA-221196 Tomcat 9.0.24 port out of range -1
JavaX. CDIBug IDEA-236094 CDI: @Observes parameter shown as unused
JavaX. JPABug IDEA-232266 JPA: Quick fix "Add Id Attribute" doesn't work
JavaX. JSFBug IDEA-216645 Cannot resolve variable p_messages in JSF, although it is defined in faces-config.xml
JavaX. JSPBug IDEA-192792 Wrong warning from XML "Redundant default attribute value assignment " inspection
Bug IDEA-86538 @elvariable jsp comment doesn't work with whitespace
JavaX. Web ServicesBug IDEA-231162 java.lang.Throwable: paths in UrlPath concatenated incorrectly in URLPathReference at calling completion after / in `//anySectionName`
Bug IDEA-237260 JAX-RS: no injection gutter icons in @Path
Bug IDEA-233691 WebSocket: Cannot refactor-rename the last path segment if it doesn't contain `/` at the end
Bug IDEA-234018 @PathParam URI template variable name with valid special character(s) is incorrectly displaying resolution error
Bug IDEA-234823 JAX-RS: Rename `@PathParam` to one with `-` doesn't work
Lang. FreeMarkerTask IDEA-238777 Make freemarker.globalVariableProvider EP dynamic
Lang. RegExpFeature IDEA-215101 Regexp: Quick-fix for 'Duplicate character inside character class'
Bug IDEA-221089 escaping a `#` in regex with comment mode is not redundant
Bug IDEA-236620 Redundant nested character class inspection
Bug IDEA-234581 Escaped single/double quote in regex syntax highlighting is wrong
Bug IDEA-233477 literal dash in regex character set colored as special character
Bug IDEA-233769 Adjacent closing tags for regex character classes are incorrectly parsed (e.g. in XMLSchema xs:pattern elements)
Usability IDEA-173849 Check RegExp dialog: Ctrl-F and Ctrl-R are enabled in the 'sample' field leading to ugly results
Lang. Shell ScriptFeature IDEA-240918 Support copyright formatting for shell script files
Bug IDEA-232910 Shell: nested expressions of parameter expansion are not highlighted/parsed
Bug IDEA-229741 New Shell Script Run Configuration breaks Debugging of Java applications when using shell script in before launch setup
Cosmetics IDEA-239877 Shell Script settings: label hides &
Lang. XMLBug IDEA-234908 Invalid XML syntax is not detected by editor
Bug IDEA-199733 Xml declaration should precede all document content wrongly shown for <?xml-stylesheet?> processing instruction
Bug IDEA-238406 Reference to Language object leaked through XmlTagNameSynchronizer on plugin unload
Task IDEA-238268 Make EPs related to XML dynamic
Lang. XPath and XSLTFeature IDEA-133468 XSLT 3.0 Support Crippled
Bug IDEA-231202 XSLT run/debug configuration does not have Classpath and JDK field in products other than IDEA
Plugin Development (DevKit)Feature IDEA-233343 Devkit: support "os" attribute for <listener>
Feature IDEA-239682 [devkit] Convert IntentionDescriptionNotFoundInspection & PostfixTemplateDescriptionNotFoundInspection to UAST
Feature IDEA-239028 Devkit: make TestDataLineMarkerProvider work for UAST
Feature IDEA-232818 Theme JSON Editor toolbar: add link to Custom Theme Reference Docs
Feature IDEA-236344 devkit: code insight for "action" extension point attribute
Feature IDEA-233379 Improve default values in I18nize Hardcoded String dialog for IntelliJ project
Feature IDEA-214819 Support "Goto EP declaration in plugin.xml" for EPN<KeyedLazyInstance<T>>
Feature IDEA-234603 plugin.xml: <name> must have Title capitalization
Bug IDEA-81939 Include native libraries to plugin distribution
Bug IDEA-238824 Support "Goto EP declaration in plugin.xml" for ProjectExtensionPointName
Bug IDEA-238270 Devkit: don't show "should be registered in module" error for 'with' tag of extensionPoint tags
Bug IDEA-234074 Devkit: <listener> highlighting must not require specifying "since-build" in plugin.xml for Gradle setups
Bug IDEA-240030 "Navigate to Test Data" must not take precedence over Run/Debug
Usability IDEA-238280 Devkit: show "component should be registered in module where its class if defined" as warning, not error
Tools. DockerFeature IDEA-219125 Docker. Support --gpus command line option
Bug IDEA-234250 Docker. Image Console: the old Pull dialog is called from context menus and via buttons
Bug IDEA-234944 DockerCompose: Add navigation from images in quotes to the docker hub
Bug IDEA-234233 Docker: Don't pull all the images by "tomcat: "
Bug IDEA-233884 Docker: inspect container doesn't work
Bug IDEA-234210 Docker: support `--sysctl` in docker run configuration CLI options
Bug IDEA-235678 Docker: error about parsing this key for some forms of --gpus
Bug IDEA-216531 Docker: support custom credential stores / helpers
Bug IDEA-237999 Remote docker stop working after update
Bug IDEA-240719 Docker's multi-tab drawing problem
Bug IDEA-234942 DockerCompose: Errors about invalid format by using env. vars in images values
Bug IDEA-234229 Docker. Pull images. No result by completion with one symbol
Bug IDEA-234261 DockerCompose: completion should work for images in quotes
Bug IDEA-234231 IOException: Pipe broken, pipe id: `ImagePullPanel.pipe:plug` at attempt to pull an image
Bug IDEA-234512 Images console: F1 should lead to the new help
Bug IDEA-234265 DockerCompose: provide inspection errors for invalid images format
Bug IDEA-234981 Docker: Save in containers doesn't work
Performance IDEA-235826 Rider freezes after Clean and Build inside DockerFileDetector
Usability IDEA-234994 Recognize Dockerfile.jvm and Dockerfile.native as docker files
Usability IDEA-234982 Docker: Set focus at console command line by Exec->bash on a container
Cosmetics IDEA-190344 DockerCompose: Avoid green DeployLog tab by "down" of our compose node
Cosmetics IDEA-232754 Docker Plugin - bad English in error message when plugin can't reach file system root
Task IDEA-230603 Refactor DockerFileDetector so that it's no longer a component
Task IDEA-234571 Internationalize Docker plugin. Round 2
Exception IDEA-234266 java.util.concurrent.ExecutionException at completion for invalid tags
Exception IDEA-233298 Docker: com.github.dockerjava.api.exception.InternalServerErrorException at calling Exec command
Exception IDEA-233998 IDE exception when trying to run Dockerfile configuration with `Run build image` option disabled
Tools. HTTP ClientBug IDEA-236157 Link in scratch file is broken
Bug IDEA-239147 HTTP Client: environment file is generated in Scratches for the HTTP Requests file from scratches but can't be used
Bug IDEA-234435 Generate HTTP Request: correctly treat read-only files
Bug IDEA-234539 HTTP Client: Server base path marked as red without error
Bug IDEA-238760 HTTP Client shows null in completion on generation of URL from Spring controller
Bug IDEA-234891 Can't rename host in http client
Bug IDEA-234388 Provide more fast way to create HTTP Request via gutter.
Bug IDEA-235298 HTTP Client: Can't generate all requests from MultipleBasePaths yaml specification
Bug IDEA-234656 Completion hint is disappearing after "clear read-only flag" dialog
Bug IDEA-237516 Rest Client doesn't have URL-references if schema is missing
Bug IDEA-236414 HTTP Client: not specified path variables values treating: action links don't work
Usability IDEA-235915 HTTP Client: Move requests refactoring is not discoverable
Usability IDEA-235921 HTTP Client: Move Requests refactoring: provide more convenient way to select/deselect all requests
Usability IDEA-234659 Add text and selection in template
Usability IDEA-236212 Do not show popup if there is only one environment
Usability IDEA-235677 Provide more descriptive message about unknown variable in HTTP Client
Usability IDEA-239686 Micronaut: if absolute url is specified for @Client annotation, don't activate live template for the host part on the HTTP Request generating for client endpoints
Usability IDEA-234739 Http Client: more comfortable "move refactoring"
Cosmetics IDEA-235914 HTTP Client: Move HTTP Requests dialog looks bad with custom (enlarged) font
Cosmetics IDEA-240184 [Upsource] Discussion in HttpRequestErrorFixFilter.kt in review IDEA-CR-62118
Task IDEA-235567 Add FUS to generation in HTTP Editor
Exception IDEA-238004 HTTP Client: show ClearReadOnlyStatus dialog on MoveHTTPRequests refactoring performing in case of read-only files
Tools. KubernetesFeature IDEA-236363 Kubernetes. Kustomize. Provide the inspection error and quick-fix in case of the absent required patchesJson6902 fields
Feature IDEA-223067 Kubernetes: no run(apply) button for k8s files (good to have it as a gutter/context menu)
Feature IDEA-230386 Kubernetes. Kustomize. Allow selection of kustomize api
Feature IDEA-223064 KubernetesView: Add custom resources into k8s view
Feature IDEA-236366 Kubernetes. Kustomize. Add completion for all "vars" required keys.
Feature IDEA-195348 Helm. Add Quick help for requirements.yaml fields
Feature IDEA-203733 K8s: Provide the list of k8s clusters with a possibility to switch to the cluster context
Bug IDEA-236348 Kustomize: newTag field: Wrong inspection error for numeric values
Bug IDEA-239753 Latest build of Kubernetes plugin (and possibly others) fails to parse YAML CRD definitions and functionality, actions, configuration disappear from menus.
Bug IDEA-236434 Services tool window is always active after reopen when it contains only Kubernetes root node
Bug IDEA-235673 Kubernetes: No completion if we set the cursor inside the key
Bug IDEA-240979 Kubernetes plugin stores static references to instances of Go template plugin classes
Bug IDEA-236042 Kubernetes: CRD changes are not applied in other projects till pressing "Re-read"
Bug IDEA-235349 Kubernetes: Save the file before "apply" action
Bug IDEA-202835 Helm go template variable tip shows tip for wrong case variables
Usability IDEA-235113 Kubernetes: the newly installed cluster info appears only after idea restart
Usability IDEA-235957 Kubernetes: CRD table in Settings: make the table bigger, grey empty part smaller
Usability IDEA-235102 Kubernetes, contexts with limited access: make error messages on the right pane possible to copy and display them completely
Usability IDEA-234696 Kubernetes: Switch namespace in cached configuration
Cosmetics IDEA-239738 Kubernetes: don't display the right part in "green" by "Refresh Configuration"
Cosmetics IDEA-237057 Kubernetes view: Add an icon to a "Custom Resources" node
Task IDEA-234572 Internationalize Kubernetes plugin. Round 2
Exception IDEA-235002 RuntimeExceptionWithAttachments at apply action
Exception IDEA-238673 com.intellij.openapi.project.IndexNotReadyException in Kubernetes plugin
Exception IDEA-234997 com.intellij.util.IncorrectOperationException at Refresh action
Tools. TerminalBug IDEA-234503 Provide keyboard navigation between split terminals
Bug IDEA-136139 Settings -> Tools -> Terminal -> Shell path: sh.exe -login -i throws Error
Bug IDEA-239942 CreateProcess failed. Code 267 when myProjectPath is not valid
Bug IDEA-234406 Split sessions are lost when moving terminal tab to the editor – disable the action for split sessions
Bug IDEA-209282 IDEA Terminal uses wrong PATH environment variable when go plugin is installed
Task IDEA-238296 Replace service override used for CloudTerminalProvider with a different mechanism
Exception IDEA-234523 Throwable when move terminal tab to editor
User InterfaceFeature IDEA-233416 Add "Copy Filename" to context menu
Feature IDEA-237052 Ability to change the width of free painters area in the gutter
Feature IDEA-224049 Allow disabling change markers on the scrollbar
Feature IDEA-234078 Make it possible to remove undesired offset in components built using Kotlin UI DSL
Bug IDEA-240549 Minor: missing space in Reopen Project dialog
Bug IDEA-220087 "Open new tabs at the end" preference has no effect whatsoever
Bug IDEA-234468 Completion popup trims items
Bug IDEA-231003 Position of Structure tool window is set to Top Left when opening project if running IDEA with clean settings
Bug IDEA-233160 Editor tab names are cut on macOS Catalina
Bug IDEA-233233 Can not mouse click on "Select Library Type" popup
Bug IDEA-206880 Renaming profiles, keymaps, color schemes does not work
Bug IDEA-220281 Sometimes text on commit message is black on grey background (Darcula)
Bug IDEA-222902 Path to active tab is copied to clipboard if "Copy Reference" action was invoked for any other tab
Bug IDEA-236949 Entering zen mode closes "other" open files
Bug IDEA-234177 Cannot close a maximized borderless frame (except main) when clicking in the top right corner of the screen
Bug IDEA-236234 If a ThreeComponentSplitter is used in a tool window, it will lose its ability to be resized after the tool windows "View Mode" is changed to/from "Window" and "Docked Pinned"
Bug IDEA-234063 Project Structure: move to bundles some buttons and texts
Bug IDEA-233592 No popup appears after "Check for updates..." from menu
Bug IDEA-230912 "Don't show tips" option is shown as switched on in "Find Action" when it is switched off
Bug IDEA-236760 gutter's tooltips are not auto hiding on mouse move outside gutter
Bug IDEA-233792 Confusing operation of the File Colors settings
Bug IDEA-233188 Programming languages names should not be internationalized
Bug IDEA-234105 System Settings: extract strings into bundles
Bug IDEA-235755 Knob icon has artifacts on HiDPI in new Color Picker
Bug IDEA-236253 Project tree painting high cpu when scrolling with large selection
Bug IDEA-234043 LightEdit: provide toolbar action to select opened file in "Open File" dialog
Bug IDEA-234916 "Find" field change its size on entering first symbol
Bug IDEA-237226 Appearance in "Subversion working copies" tab does not correspond to dark theme
Bug IDEA-234065 Loading dialog: extract text to bundle
Bug IDEA-239014 EditorTextField releases Editor too late
Bug IDEA-238805 Creating a disabled icon prevents unloading of plugin
Bug IDEA-226916 Crash on clicking scope combobox on MacBook Pro with TouchBar
Bug IDEA-234634 Exception on attempt to detach a tab
Bug IDEA-236176 click the mouse wheel not show usages
Bug IDEA-235385 Tab is not detached when crossing the IDEA frame
Bug IDEA-232821 Adding SDK from editor banner shows popup in the middle of the screen
Bug IDEA-228353 Recent files action is not available in dumb mode
Bug IDEA-232070 Context menu on project view or editor tabs does not show at all, main menu slowed
Bug IDEA-240400 Wrong position of window control buttons in borderless UI
Bug IDEA-234088 Notification dialog: extract dialog header into bundle
Bug IDEA-234129 Double-border on Commit toolwindow
Bug IDEA-239761 Thread pool thread leaks reference to plugin classloader via JComponent.acc
Bug IDEA-234116 Settings: File Colors: extract strings into bundles
Bug IDEA-237471 Close button is hidden with "Tab placement: Right"
Bug IDEA-237691 Kotlin update is failing on IDEA 2020.1
Bug IDEA-234199 "Path From Repository Root" is missing in "Copy" submenu
Usability IDEA-235124 IDEA allows choosing folder in WSL outside user directory when creating project
Usability IDEA-235417 New highlighting status indicator doesn't make it clear whether highlighting is finished
Usability IDEA-234565 Settings "Choose Color" - allow paste hex color with # prefix
Usability IDEA-234304 Show dependency name as "module" in window title for dependency classes / resources
Usability IDEA-235674 Close context menus and popups on the second click
Usability IDEA-227816 Find in Path preview and list are empty between updating the results
Usability IDEA-235322 Async profiler snapshots names are too similar
Usability IDEA-231790 Small tooltips
Usability IDEA-234396 Status Bar elements inconsistent behavior
Cosmetics IDEA-215438 bookmarks tool window icon inconsistency
Cosmetics IDEA-238209 Create Desktop Entry - Result wording badly structured
Cosmetics IDEA-235917 Selection looks weird when rendered doc is active
Cosmetics IDEA-236192 Large padding in dialogs in 2020.1
Cosmetics IDEA-231276 Hint in Search Everywhere is cut on macOS Catalina
Cosmetics IDEA-234710 Find in Path: Missing bottom border of a "Find" field
Cosmetics IDEA-236911 Re-word Search Everywhere tooltip
Cosmetics IDEA-232767 Extra border is visible on tree nodes multi selection
Cosmetics IDEA-219374 Missed top border in all windows
Cosmetics IDEA-237130 "OK" Button in Copy Dialog is incorrectly now labeled "Refactor"
Task IDEA-238281 Make getDataRule EP dynamic
Task IDEA-235017 Inspection widget in Diff and Merge dialogs
Task IDEA-238264 Make keymapExtension EP dynamic
Task IDEA-234632 Make backgroundable tasks start in background by default
Task IDEA-238261 Make com.intellij.favoriteNodeProvider EP dynamic
Exception IDEA-236507 Argument for @NotNull parameter 'c' of com/intellij/openapi/wm/impl/IdeFocusManagerImpl.requestFocus must not be null
Exception IDEA-235581 "cannot share data context between Swing events" when invoking actions from VCS Operations Popup
Exception IDEA-233977 NPE on project opening (at com.intellij.ui.EditorNotificationsImpl$5.run)
Exception IDEA-240459 Throwable: Notification posted too early (no window to display)
Exception IDEA-235877 SOE while walking through the live templates in Settings
User Interface. AccessibilityBug IDEA-237378 [a11] action labels are not accessible in the welcome frame
Bug IDEA-235610 Do not speak the results of a file search or global search
Bug IDEA-234307 Actions in Search Everywhere does not support Screen Readers
Bug IDEA-235804 In screen reader mode, it is not possible to add an SSH interpreter
Bug IDEA-236984 Labels in search forms are not associated with the find and replace fields
Bug IDEA-236098 Screen reader detecting statistics
Bug IDEA-234801 In screen reader mode, it is not possible to select a compiler
Bug IDEA-234385 Screen reader does not read "Search Everywhere" dialog name when it is invoked
Bug IDEA-236610 In screen reader mode, it is impossible to call a designer from a gatter ui
Bug IDEA-226881 IntelliJ IDEA should detect a11y mode on the first start
User Interface. Action SystemException IDEA-234033 NPE at com.intellij.openapi.actionSystem.impl.ActionManagerImpl.unregisterAction
User Interface. Console ViewFeature IDEA-237479 Make exceptions in stacktraces navigatable
Task IDEA-238247 Make com.intellij.console.folding extension point dynamic
User Interface. ControlsBug IDEA-229090 memory leak in MoveFilesOrDirectoriesDialog via FileChooserFactory.getInstance().installFileCompletion
Bug IDEA-236138 Node arrow is not visible after creating the connection
Performance IDEA-236848 ExpandableTextField performance is very bad for non-monospace case on macOS
User Interface. Embedded Browser (JCEF)Bug IDEA-240913 [jcef] ExceptionInInitializerError when opening md file with non-default jdk
Bug IDEA-236310 [mac] JCEF crashes when run after JavaFX
Bug IDEA-240461 enable JCEF by default in IDEA
Bug IDEA-231071 JCEF keyboard focus issues
User Interface. Find, Replace, UsagesFeature IDEA-120620 Directory tree grouping in search
Bug IDEA-236772 Setting bookmarks from `Find in path`s preview does not work
Bug IDEA-240868 File Mask isn't applied in Find in Path
Bug IDEA-218741 An item is not marked as bookmarked despite the toggling
Usability IDEA-89522 Show Usages popup: N usages were filtered out.
User Interface. FocusBug IDEA-235551 Esc does not return focus to Editor from Find panel if a toggle is focused
Bug IDEA-235391 Some tool windows are not focused on opening
Bug IDEA-232518 A balloon panel of a breakpoint is not FocusCycleRoot
User Interface. GraphicsBug IDEA-236845 circle svg shape is curved
User Interface. Keyboard InputUsability IDEA-237099 Fix mnemonics on Mac to work with Alt
User Interface. Look and FeelBug IDEA-227157 Some text in "IDE and Plugin Updates" popups in dark themes is gloom
Bug IDEA-235462 Extra space in "New file" dialog
Bug IDEA-206402 Mac proxy icon missing in the title bar
Cosmetics IDEA-236160 Invalid gaps in 'Code Style' settings
User Interface. NavigationFeature IDEA-236263 Add tooltip on the tabs in the search everywhere popup dialog
Bug IDEA-236137 Alt+Home shows class members despite them being explicitly hidden from navigation bar
Task IDEA-238431 Make search.topHitProvider EP dynamic
User Interface. Project ViewBug IDEA-238310 CompoundProjectViewNodeDecorator keeps reference to decorator after plugin has been unloaded
Bug IDEA-223785 Project Tree view during Drag/Drop horizontal scroll is jarring and gets in the way
Bug IDEA-236105 Select In Project View does not work for the first time when Project View is Dock Unpinned
Usability IDEA-231440 can i control `details in tree view` format?
User Interface. Services ViewBug IDEA-236784 Services: green blink in details part when closing table editor
Version ControlFeature IDEA-209622 VCS Ignore minor changes
Feature IDEA-234016 Allow configuring locations to skip in Git Root Detector
Feature IDEA-235328 Support navigation to specific messages in VCS console
Bug IDEA-230833 Commit changes / Unversioned files - Add to VCS and Show Diff are executed for all unversioned files
Bug IDEA-231108 Apply patch fails to add some new files to source control
Bug IDEA-234274 Commit message field size is not updated when there're no commits to show
Bug IDEA-238620 Shelve button doesn't have a mnemonic
Bug IDEA-235943 Diff Preview tab header is not updated when files are switched
Bug IDEA-207789 Can't create a patch from shelve if a file has been moved
Bug IDEA-238011 "Extra commit for .java > .kt renames" checkbox is not shown if commit options popup was opened before java->kotlin conversion
Bug IDEA-79274 can't export patch from shelf
Usability IDEA-235382 Commit button isn't triggerred using Cmd+Enter on macOS
Usability IDEA-235746 Non-modal commit: if the Commit toolwindow is moved to the bottom then place the commit message field at the right
Usability IDEA-238506 Annoying tooltip "Code completion available" in new commit options
Usability IDEA-230989 Non-modal commit: Commit toolbar can be too wide
Usability IDEA-231260 Alt/Cmd+9 should open the GIt toolwindow
Usability IDEA-231586 Non-modal commit: preview diff in editor is too agressive
Cosmetics IDEA-224988 Increase gap from borders for commit button and commit message text
Cosmetics IDEA-238353 Add `Help` for interactive rebase dialog
Cosmetics IDEA-237658 Apply patch conflict resolving: remove underlined chars from the message
Task IDEA-233456 Advertise non-modal commit from commit dialog
Task IDEA-235893 Allow toggling non-modal commit setting from "Find Action"
Version Control. GitFeature IDEA-238559 Show 2 logs tabs in Editor instead of the separate Compare branches dialog
Feature IDEA-85434 Allow to squash local commits from the log
Bug IDEA-234159 Changes of submodule objects do not appear in Local Changes
Bug IDEA-236088 Interactive rebase: wrong hight of reworded lines on IDE with adjusted font size
Bug IDEA-234795 Can no longer select differences in new commit tab
Bug IDEA-234374 Strange sorting when "Group by directory" is enabled
Bug IDEA-234107 Duplicate Git branches menu in the status bar
Bug IDEA-234426 AssertionError when opening changed project file in light mode on Windows
Bug IDEA-235233 Selecting a group node in Branches resets all filters
Usability IDEA-237492 Improve Can't Update wording
Usability IDEA-233381 After restart selected tab is switched from "Local Changes" to "Log"
Usability IDEA-216780 Amend button is undiscoverable
Usability IDEA-128375 GIT Integration: Unhelpful Message "no tracked branch" on a Failed Update Attempt
Usability IDEA-170834 Add link to the console to VCS error notifications
Usability IDEA-236897 Make "Edit Commit message" input resizable
Usability IDEA-216382 "Compare with Current" could produce confusing results
Usability IDEA-233918 Show notification on unstash
Usability IDEA-174600 Git Interactive Rebase dialog: allow to remove commit via Backspace or Delete
Usability IDEA-189303 Checkboxes in commit dialog and partial changelists should not depend on gutter highlighting
Task IDEA-230903 Drop builtin SSH client
Exception IDEA-241100 IllegalStateException: @NotNull method git4idea/repo/GitRepositoryManager.getInstance must not return null
Exception IDEA-240960 ClassCastException on enabling Git plugin
Exception IDEA-235134 NPE when trying to disable synced branches feature
Version Control. GitHubBug IDEA-240325 GitHub create Gist: Cant upload binary file: {0}
Bug IDEA-240312 GitHub checkout new branch: branch name appears as {0}
Bug IDEA-233345 GitHub account: improper on-hover link underlying on Re-Login
Bug IDEA-240320 GitHub: The branch {0} is not fully merged to the branch {1}
Bug IDEA-240309 Visual Atifacts after removing reviewer
Bug IDEA-240702 GitHub Pull Requests: Cannot submit Reply to comment after review was started
Bug IDEA-240197 GitHub PullRequests: could not calculate merge base
Bug IDEA-238290 GitHub Pull Requests: default github account setting via PullRequests view doesn't work
Bug IDEA-240324 GitHub Pull Requests: description is not shown in Timeline
Bug IDEA-238860 Cannot see changed files for pull request, and cannot even copy error message from the window
Bug IDEA-238781 Create Pull Request - branch name is parameterized
Bug IDEA-240333 GitHub: account {0} is already added
Bug IDEA-240356 GitHub Pull Requests: comments are not shown at once
Version Control. Local HistoryBug IDEA-229645 NullPointerException
Version Control. LogBug IDEA-221930 Checkout revision keymap is gone.
Usability IDEA-233823 "Show My Branches" should hide empty directories
Cosmetics IDEA-232199 Add a tooltip for the HEAD icon in the new branch list
Cosmetics IDEA-231532 Remove ":all" from Log tab
Version Control. MercurialBug IDEA-233629 Mercurial auth script is not compatible with older python versions.
Exception IDEA-233283 update failed for AnAction with ID=hg4idea.CompareWithBranch
Version Control. SubversionBug IDEA-234491 Cannot checkout Subversion project from Welcome screen
Bug IDEA-228828 IDEA does not propose to delete dir in svn when deleting a dir
No subsystemFeature WEB-39819 Support for Node.js and tools with WSL2
Feature WEB-44187 Run Prettier on save - add jsx and tsx files by default
Feature WEB-30930 No icon for Firefox Developer Edition browser
Bug WEB-45424 LinterCodeStyleImportSourceTracker uses Project as parent disposable for PsiTreeChangeListener
Bug WEB-44485 JavaScript: inspection-based intentions don't work in scratch files
Bug WEB-45444 GjsLintConfigFileChangeTracker registers listeners with incorrect disposable
Bug WEB-44222 Completion for object literal properties with 'this.' doesn't properly handle non-identifier property names
Bug WEB-45159 WSL2: Can't analyse webpack.config.js in vue template project
Bug WEB-45384 WSL2: Prettier: Error applying code style rules from configuration file
Bug WEB-45382 WSL2: TSLint: Error applying code style rules from configuration file
Bug WEB-43941 VueJS plugin with vuex-smart-module not working in IntelliJ IDEA v 2019.3 with destructuring assignment
Bug WEB-44076 IndexOutOfBoundsException when Introduce field
Bug WEB-42930 Duplicate script tag message for multiple <script> tags in Laravel Blade file
Bug WEB-44221 Completion for object literal properties with "this." behaves incorrectly for TypeScript explicit this specifications
Bug WEB-45570 Go to declaration doesn't work for ES6 import specifiers
Bug WEB-44149 Run prettier on save triggers in other project "Non-Project Files Protection
Bug WEB-33323 Emmet doesn't keep Vue.js attribute values
Bug WEB-44183 Remove inspection 'Unresolved JavaScript variable' from injections
Bug WEB-43906 Run prettier on save: freeze while saving file
Bug WEB-44978 .env.local, .env.development and other .env.* files have Text file type by default since 2020.1
Bug WEB-45155 WSL2: ESLint: Error applying code style rules from configuration file
Performance WEB-43007 Import optimization in TypeScript is too slow to be used as a trigger on save
Performance WEB-44548 WebStorm 2019.3.4 stops responding after unfocused main window
Usability WEB-44108 Improve presentation of long paths
Cosmetics WEB-44417 To update an Edge icon for Edge Chromium
Task WEB-44337 Bundle the Grazie plugin with WebStorm
Task WEB-45542 CommonJS quick fixes: limit depth of warnings to 2 (similar to the ES6 missing imports inspection)
Task WEB-44295 Do not show browser icons in XML files
CSSBug WEB-39217 Ignore duplicates among LESS/SASS/SCSS and CSS files generated by File Watcher.
Usability WEB-10013 CSS/SCSS formatter needs to be aware of CSS3 grid-layout properties
Task WEB-45098 Don't use service override for com.intellij.lang.css.watcher.clones.FileWatcherAwareCssDuplicatesService
CoffeeScriptBug WEB-45537 CoffeeScript import can no longer be automatically inserted
Bug WEB-35585 support dynamic imports in coffeescript
DartFeature WEB-44567 Dart plugin: Support pub outdated action
Feature WEB-34709 Spelling typos are not shown in Dart string literals
Bug WEB-44834 Dart: Show Parameter Info doesn't work in v2020.1
Bug WEB-44896 Dart code highlighting flashes on typing in 2020.1
Bug WEB-44984 Dart plugin is using the old dart logo as icon
Task WEB-44167 Create 'Dart Web' run configuration type by default to run/debug Dart web applications
DebuggerBug WEB-43829 Debugging Vue.js with TypeScript in .vue file is only randomly recognizing the RemoteUrl
Bug WEB-44721 Go plugin breaks node debugger in Intellij Ultimate 2020.1 RC
Bug WEB-44425 Apply 'do not step into' to library roots other than 'node_modules'
Bug WEB-44400 When re-run failed Karma tests in debug mode, debugger doesn't stop on breakpoint
Bug WEB-44313 JS Debugger: problems with source resolution when content is symlinked
Bug WEB-44306 Reference Error in the list of threads when debugging an npm script with nodemon
Bug WEB-44245 Debugger works improperly
Bug WEB-39223 Show some placeholder for inner objects in Variables View
Bug WEB-43747 When attaching to a running Mocha test, debugger doesn't consider breakpoints in the first launch
Bug WEB-44064 Electron Main Debug Not Working
Bug WEB-44470 Console output is missed sometimes (linux)
Bug WEB-34979 Electron render process debugging for Angular app served by `ng serve` + electron '--serve' doesn't work
Usability WEB-41277 JS debug: "Sort values alphabetically" is missing in Debug toolbar
Usability WEB-43215 Remove line separator between input and corresponding output in JavaScript debug console
Usability WEB-43277 Replace Drop Frame with Restart Frame action
File WatchersBug WEB-43873 Exception from FileWatcher plugin when the plugin is being disabled
Task WEB-21872 File watchers: remove outdated templates
HTMLFeature WEB-40474 Support Vue in HTML files containing a Vue CDN or local file link
Bug WEB-44955 Unify indentation rules of language blocks in HTML
Bug WEB-45429 SVG: Attributes are shown as invalid when using `svg:` prefix
Bug WEB-45089 'data-*' attributes not recognized in html inside xslt
Bug WEB-43138 Angular: image paths are incorrectly resolved in HTML file
Bug WEB-31198 Webstorm throws error because of not knowing Angular's '&ngsp;' html entity
Performance WEB-43760 UI freezing because of calling XmlTag#getDescriptor on EDT
JSONBug WEB-33705 Unintended autocomplete list pop-ups when typing B or P inside quotes in JSON strings
JavaScriptFeature WEB-44208 Inject TypeScript JSX and JSX when `jsx` and `tsx` language tags are used
Bug WEB-42929 Type hint of "this" keyword malfunctioning in WebStorm.
Bug WEB-44737 Date.now() is not of type function bug.
Bug WEB-42099 incorrect classification of a for on loop variable as global
Bug WEB-45578 Properties added to Node.js 'global' namespace are not resolved
Bug WEB-44177 Inspection 'Unused global symbol' doesn't work for methods whose name consists of one / two letters
Bug WEB-34403 JSDoc: wrong type mismatch errors when extending typedefs
Bug WEB-44843 Wrong type inference with discord.js
Bug WEB-37405 Javascript RegExp error: Unclosed character class
Bug WEB-44168 Can't go to declaration for modules imported from sub namespaces.
Bug WEB-36237 Structure view: different view of Setter & Getter in js & ts
Bug WEB-45549 JavaScript assistance for augmented classes
Bug WEB-44332 Typings resolution is broken when adding 'node_modules' to webpack resolve.modules
Bug WEB-38449 Show inferred type in completion when using ES6 getters/setters
Bug WEB-44162 Quick documentation is empty
Bug WEB-36755 No autocompletion if npm package's package.json doesn't contain types property
Bug WEB-45572 Syntax errors when using `as` keyword as variable name
Bug WEB-38447 Properties defined with ES6 getters/setters are shown as functions in quick documentation
Bug WEB-43955 Show empty custom JSDoc tags in quick documentation
Bug WEB-44256 TypeScript constrained @template in jsdoc
Bug WEB-44959 JSDoc: Inherited <pre> elements from another class are not displayed properly
Bug WEB-44541 Awful WebStorm type checking error: "Condition is always true since types '...' and 'null' have no overlap"
Bug WEB-44535 Don't suggest let/const in completion for ES 5.1
Bug WEB-44520 TypeScript: completion doesn't work for aliases inside generic parameters
Bug WEB-45290 Type is always unset for destructuring props in a functional component signature
Bug WEB-44308 Inline function should parenthesize object literals if inlining inside shorthand arrow
Bug WEB-43689 Resolve for symbols from JavaScript libraries doesn't work in test files in IntelliJ IDEA
Bug WEB-45181 Material UI: Unstable resolve of props in react components(JSX)
Bug WEB-44008 Incorrect import from Node.js core modules
Bug WEB-45528 Go to declaration doesn't work on a variable to the right-hand of assignment
Bug WEB-44370 Exception showing JSDoc comment containing "pre" tag
Bug WEB-44878 [JS] "Unused" constructor of static inner class
Bug WEB-44874 [JS] Missed signatures for a library (node-fetch)
Bug WEB-43389 Quick Documentation: line breaks are not rendered in @example section
Bug WEB-41997 an unresolved identifier "type" is highlighted as a used local var
Bug WEB-43923 JavaScript: Vue 2.6.11 not properly analyzed
Bug WEB-45498 JavaScript: import/require isn't suggested for CommonJS export with a name reference
Bug WEB-44255 JSX: parse several consecutive tags
Bug WEB-44997 CommonJS module usages are not marked as not resolved if it's imported in other file
Bug WEB-45520 Go to definition jumps to the import statement for default exports
Bug WEB-32548 Remove redundant escape quickfix breaks the regexp
Bug WEB-31303 Quick Doc: Markdown: recognize table syntax
Bug WEB-45220 Missing default value after "=" in function declaration should be highlighted as syntax error
Bug WEB-44175 No autocomplete on material-ui createStyles in pure JS
Performance WEB-44069 Quick Documentation: Fetching documentation takes a lot of time (~5 sec)
Performance WEB-45028 UI Freeze on project opening with JSFileStubBuilder.buildStubTree
Performance WEB-45024 High CPU usage on editing
Performance WEB-45371 Recursive generators: JS code analysis never ends
Performance WEB-44844 CPU spikes when editing after updating to 2020.1
Usability WEB-44119 fn.call() does not prompt import
Usability WEB-40680 no method separators when using arrow functions
Usability WEB-44720 Allow disabling live templates on keywords completion
Task WEB-45552 JavaScript: move code from module-based inspection to the regular "unresolved reference" inspection
JavaScript. FormatterFeature WEB-30456 Indent the *.vue file with 4 spaces, for template, script and style
Feature WEB-37591 Vue.js indentation (.vue files)
Feature WEB-30382 Wrong indentation of <script> and <style> in .vue files
Bug WEB-42840 Vue Component - CSS Indentation ignored, HTML used instead
JavaScript. FrameworksFeature WEB-41565 Vue: Support for Composition API
Feature WEB-43988 data properties of Vue single file component exported with module.exports not resolved
Feature WEB-44180 Angular: Support new Ivy metadata format and enable Ivy by default
Feature WEB-41697 Vue: Vuelidate support
Feature WEB-43773 Hammerjs events are not recognized in Angular templates
Feature WEB-33084 Vue computed type hinting
Feature WEB-44650 Support vue.js syntax in Thymeleaf templates
Feature WEB-44976 Support for vuex modules created via functions
Feature WEB-36254 Make Vue.js instance properties autocompletion component-aware
Feature WEB-44371 Vue: improve type evaluation with composition API and support Vue 3
Feature WEB-44920 Vuex: support doesn't work with Nuxt.js project structure
Feature WEB-41451 Vue.js: support v-slot in PHP, Twigs and other file types
Feature WEB-8192 Inject CSS in querySelector the same as is done in jQuery
Feature WEB-25971 Vuex: implement special resolve for mapped properties on `this`
Feature WEB-25863 Language-specific code style in .vue files
Bug WEB-45270 Inherited component or directive properties not recognized, when built with Ivy
Bug WEB-45252 Constant re-indexing when two projects are opened.
Bug WEB-37615 Angular: properly implement type for template and reference variables
Bug WEB-44140 Incorrect Angular "Missing or invalid component declaration in module" inspection
Bug WEB-36253 Vue.js instance properties are not available in template autocomplete
Bug WEB-45531 Error reported when using Vue filters with specific names
Bug WEB-44601 Angular: attributes contributed with @Attribute are sometimes not recognized.
Bug WEB-44487 Vue.js: SOE when `include` tag present in HTML file
Bug WEB-42364 Angular modules aren't recognized if installed with pnpm
Bug WEB-36561 Vue.js: Support expression statements in event bindings
Bug WEB-44880 Class NgxsFeatureModule is not an Angular module
Bug WEB-42458 WebStorm complains about class not being in Angular module
Bug WEB-40709 Angular: Component or directive properties inherited from an abstract library class are not recognized
Bug WEB-39018 Autocompletion not working for "react-testing-library" and "dom-testing-library" modules
Bug WEB-40778 Angular directives with the transloco library
Bug WEB-44766 Suggestions for ExtJs classes do not work
Bug WEB-35714 Vue Single File Component - Typescript - data properties not resolved when using 'Vue.extend()' to create component
Bug WEB-44388 Wrong Copy and Paste in TSX files
Bug WEB-41402 `innerHTML` is not recognized as valid attribute if the brackets are omitted
Bug WEB-43160 Completion for compound React components from semantic-ui-react
Bug WEB-36252 Broken Vue.js component data properties autocompletion
Bug WEB-45546 Vuex: inspection text is empty on unresolved Vuex symbols
Bug WEB-42056 Vue.js: don't suggest same attribute again
Bug WEB-43035 Code completion doesn't work with Angular plugin if `export default` is used
Usability WEB-43720 Customizable VueJs language injection
Usability WEB-44181 Don't use override completion for standard React component methods in TypeScript
Task WEB-45099 Update bundled react.d.ts to the latest version
Task WEB-42901 Use "npx" as the default option for all generators (that support the npx command)
Task WEB-44730 I18n Angular plugin
Task WEB-44559 Angular: Enable 'Inaccessible component member in AOT mode' inspection by default
JavaScript. InspectionsFeature WEB-11796 Result of assignment expression used - additional way to suppress
Feature WEB-44004 Javascript unused symbols: allow to supress on whole class
Feature WEB-22023 Inspection "JavaScript | Code style issues | Variable declarations are at the scope start" triggers for let and const declarations
Bug WEB-44972 ES/TS: Conditional expression with identical branches in ternary expression - false positive (regression)
Bug WEB-45483 "local variable naming convention" inspection treats enum fields as local variables
Bug WEB-42918 "const variable without initializer" from assigning PHP to inline JS, not short tags
Bug WEB-44343 unary operator with exponential operator error
Bug WEB-30679 JS: invalid "redefining of eval is not allowed" error
Bug WEB-44053 False positive 'Expression statement is not assigned or call' inside js expression statement fragment fully injected in a literal
Bug WEB-44314 JavaScript inspection "Duplicate case label" assumes incorrect comparison operator
Bug WEB-44528 invalid error inspection for `delete window.Worker`
Usability WEB-45501 Add 1000 to the exception list of the "Magic number" inspection
JavaScript. RefactoringFeature WEB-44617 Add '.map()' to 'for..of' intention
Feature WEB-45287 'Type Mismatch' Quick fixes could suggest union type with actual (if actual type is nullable of expected? / always?)
Bug WEB-44283 Inline function only inlines the first line of the function if used in shorthanded arrow function
Bug WEB-20177 Incorrect handling of 'this' in lambda in extract method
Bug WEB-44614 Move refactoring ignores multiple lines of single-line comments
Bug WEB-37983 Cancelled move class to file action still creates a new file
Bug WEB-45247 JS `extract variable`suggest illegal name
Bug WEB-44619 Improve "Replace with function property" intention for object literals
Usability WEB-43163 Perform inline rename for global top-level symbols used only in the current file or is unused
Task WEB-45475 JavaScript: implement flip intention for base arithmetic operations (+-/*)
Task WEB-45476 JS: add fori postfix template similar to java
LintersFeature WEB-44070 Support ESLint 6.7 Suggestions API
Feature WEB-24452 Allow to run ESLint fix on save
Live EditBug WEB-37042 LiveEdit HTML element highlight feature not working
Bug WEB-43334 Live Edit in HTML does not work with vue installed via npm
Bug WEB-43476 Live edit does not work with XHTML file
Task WEB-45083 Make liveEdit.compilerInvoker EP dynamic
Node.jsBug WEB-44322 Show brew installations of pnpm in "Package manager" drop-down list
Bug WEB-45203 Show node packages with WSL UNC paths properly
Bug WEB-44507 WSL2: Node process can't be stopped from the IDE
Bug WEB-44714 Rubymine cannot find asdf-installed yarn executable
Bug WEB-41288 Destructuring makes the variable resolution fails
Bug WEB-45519 Enable "Missing require() statement" inspection for projects without enabled Node.js code assistance
Bug WEB-44669 [pnpm] Code Completion and indexing does not work
Bug WEB-44392 Show "pnpm install" instead of "npm install" if pnpm configured
Performance WEB-39488 Scanning node_modules directory with many files freezes IDE on project open
Usability WEB-25409 node_modules and linked subproject does not refresh automaticaly
Task WEB-44491 Get 'Can not enable node.js coding assistance' warning when debug via remote interpreter
Pug (ex-Jade)Bug WEB-43803 Syntax error for arrow functions inside objects in Pug
SASSFeature WEB-45196 SASS math module: support new functions and variables
Feature WEB-37969 baseUrl in tsconfig.json is ignored when resolving Sass imports via ~file.scss
Bug WEB-39261 Duplicates should not be set between source and generated file
TypeScriptFeature WEB-44952 Consider tsconfig*.json as extended json (in addition to tsconfig.json itself)
Bug WEB-38460 TypeScript: jest.spyOn no longer auto-completes parameter values (2019.1.1)
Bug WEB-44137 Optimize incompatible literals and literal vs primitive combinations to 'never'
Bug WEB-44000 JSDoc: do not show mdn urls for non-standard types from lib.d.ts
Bug WEB-44003 Shouldn't expand conditional types for raw generics
Bug WEB-44052 Paired ' or " is not inserted in generics lists before '>'
Bug WEB-44236 No properties are suggested for conditional type which involves generics
Bug WEB-44995 Can't start TypeScript service in projects with Yarn pnp when TypeScript is not in the root folder
Bug WEB-44237 Generic constraints are not always taken into account and are buggy with conditionals when expanding generic type to object type
Bug WEB-44746 `Create field`intention scrambling enum order
Bug WEB-34561 Code completion/types when using the React.createContext-API is inaccurate (with TypeScript)
Bug WEB-44909 No class name completion on default classes
Bug WEB-31257 No 'number'/'string' items in completion for enum members in static context
Bug WEB-44312 TS: problems with inference of generic default values of generics
Bug WEB-44046 Type guards are not applied in TSX markup
Bug WEB-44262 Typescript readonly parsing with indexed types
Bug WEB-44859 Vue: "Optimize import" should keep "type" keyword
Bug WEB-44463 TypeScript service doesn't work when project is in WSL2
Bug WEB-44160 Incorrect editor highlighting when using generic function as a generic parameter
Bug WEB-44394 Resolve is broken when import is shorthand
Bug WEB-35365 No autocomplete on material-ui createStyles
Bug WEB-44009 JSDoc: incorrect type presentation for properties
Bug WEB-39705 Auto-import should use library name when importing modules/components from Angular libraries
Bug WEB-44060 Literal vaules are not suggested in template strings
Bug WEB-44335 Show information about an object when calling the quick doc on 'this'
Bug WEB-44321 TS: problem with generics in Vue composition API with reactive wrapper.
Bug WEB-45261 Typo info duplicates in the popup when a function parameter has the type of a function
Bug WEB-43997 Incorrect inferring from a type with multiple call signatures
Bug WEB-28642 TypeScript. Go To Declaration opens base class instead of needed. Idea [2017.2.3].
Bug WEB-44258 Invalid 'static method is not accessible' for static member access via 'this'
Bug WEB-44273 Number literals are not considered when evaluating possible branches for switch statements (i.e for "create missing switch branch" inspection)
Bug WEB-39540 Not support tsx in SFC of vue.js
Bug WEB-44166 Quick documentation hangs when react HOC is defined
Bug WEB-44775 No method separators when using arrow functions in TypeScript
Bug WEB-44037 TypeScript: quick navigate/ quick doc should escape element name from the typescript service
Bug WEB-44557 Can't find constructor usages of class from imported module while using Node.js and TypeScript
Bug WEB-44011 JSDoc: do not expand simple typescript aliases
Bug WEB-44848 TypeScript quick doc: show type alias member for object types
Bug WEB-43636 'Implement all members' fix suggests extra properties when using spreads
Bug WEB-43927 Generate @type annotation for TypeScript class fields if "Include types in JSDoc" is enabled
Bug WEB-44981 Freezes in TypeScript projects because of slow tsservice responses
Bug WEB-45309 2020.1 breaks my JavaScript extensions for bundled type libs
Bug WEB-42460 Autocompletion suggests properties that are not allowed by TypeScript (generics + property map)
Bug WEB-44214 Quick documentation shows link only to one related declaration when they are merged
Bug WEB-45003 Broken syntax highlighting in some TypeScript type aliases
Bug WEB-44966 "Navigate | Type Declaration" does not work for union types
Bug WEB-44613 Imports using typings inserted as `from "@types/<package>"` instead of `from "<package>"`
Performance WEB-43982 High cpu usage when editing typescript
Performance WEB-45369 IDE freezes during TypeScript code completion in react projects with styled components
Task WEB-44294 Support TS 3.9 awaited type (at least minimally)
Task WEB-44027 Update bundled TypeScript to 3.8
Task WEB-44105 TypeScript: use quick doc from service for unresolved references
Unit TestsBug WEB-44377 Failed mocha tests cannot be rerun in debug mode
Bug WEB-44698 WebStorm does not use the right mocha executable
Bug WEB-43995 'Highlight problem line in test' inspection doesn't work for jest when using WSL node interpreter
No subsystemBug DBE-10532 Incorrect splitting of prefixed literal strings for Spellchecker.
Bug DBE-10189 "Preview update" does not work when table is not introspected
DB AdministrationFeature DBE-7018 MySQL: ability to configure expired password
DB ConnectivityFeature DBE-3594 Oracle: Offer to set new password when current password has expired
Bug DBE-10067 Cannot connect to MySQL via SSH with $ in database name
Bug DBE-10100 DataGrip drops the driver icon when a driver configuration is duplicated.
Bug DBE-5439 Can not connect to MySQL using SSL CA root certificate
Bug DBE-10087 SSL Handshake Error Connecting to newly built MySQL 5.7.29 Server
DB ConsoleFeature DBE-8332 Navigation to Execute options from query-chooser dropdown
Feature DBE-9417 Improve usability of "Run script" feature.
Bug DBE-10383 Can not copy cell parts from In-Editor results
Bug DBE-7578 Introspection runs after read-only mode restriction
Bug DBE-9957 "Always Select Opened Element" in Services window can't be disabled
Performance DBE-10408 UI freeze when editing SQL string
DB DiffBug DBE-10727 Compare schemas does not respect the column order
DB IntrospectionFeature DBE-6868 Support sparse columns
Feature DBE-8674 Display indexes for view
Feature DBE-6417 MS SQL: support rules introspection
Bug DBE-10715 2020.1.3 version throws error on running queries and tables refresh: time zone abbreviation "novst" is not used in time zone "Asia/Novosibirsk"
Bug DBE-10290 New schemas are not displayed in the Database view even after a refresh of the view.
Bug DBE-10298 Stored procedures support in Redshift introspection
Bug DBE-4769 MS SQL/Azure: Support sequences
Bug DBE-9436 Can't Synchronize Schemas with latest Redshift drivers
Bug DBE-10034 snowflake introspection does not handle composite primary keys
Bug DBE-10319 Using Presto Jdbc driver results with bad queries while refreshing schema
DB RefactoringBug DBE-10185 "Preview update" does not work when using alias
Usability DBE-10543 Button layout exactly the wrong way round (Compare DDL with Database)
DB Schema ViewsFeature DBE-8121 Dedicated node for trigger functions in the database tree view
Bug DBE-10429 ExecutionException when refreshing schemas with schema patterns specified
Data Import & ExportFeature DBE-10338 New action: export to database... in the context menu of CSV file
Feature DBE-10484 A slightly pleasant usability for Dump Data dialog
Feature DBE-5858 Better error message when importing data
Bug DBE-9654 CSV/TXT Import to MSSQL Database without importing an id value
Bug DBE-5082 CSV export doesn't escape a double quote
Bug DBE-10113 Some background tasks are not viewable / findable
Bug DBE-10172 CSV Formats settings are reset on restart
Bug DBE-10754 Dump Data to FIle - XML Extractor doesn't convert special characters to character entities
Usability DBE-10577 Add Column Header and Row Header checkboxes to Export Data dialog
Usability DBE-10333 Make CSV extractor default
Data ViewsFeature DBE-4123 Support native excel format export
Feature DBE-9993 Pasting dataset exceeding current data view should create new lines
Bug DBE-9272 Cannot Save LOB from results of complex queries (double WHERE)
Bug DBE-10489 SAP HANA updates in table editor fails due to lack of quotes
Bug DBE-7816 Timestamp errors when manually appending, updating Redshift records
Bug DBE-9171 Database result for Clikhouse shows null in non-nullable column
Bug DBE-10775 Table View does not show new line at the end of a text
Usability DBE-2752 Edit as Table: provide predefined Space placeholder for separators
Usability DBE-8733 Enable "Hide column" actions inside data view
Usability DBE-8019 Database table view scrollable past the last row
Usability DBE-10572 Selection is not restored when table is transposed
Usability DBE-1845 Automatic CSV data editor
Usability DBE-10707 Generated filter from Filter By context menu clears MongoDB projection
Usability DBE-4039 data view > clone selected record (lack of icon)
Usability DBE-10139 Keep title text when renaming tab
Usability DBE-10307 Text search hides all the other buttons
Usability DBE-6414 Databrowser Escape from Search Ctrl-F
Navigation & SearchBug DBE-10350 Filtered objects appears in search/database navigation
Usability DBE-10340 Improve difference between database objects and file objects in Go To Table
PL & DDL EditorFeature DBE-5756 Database - Adding datasource as DDL - adding whole folders besides files only
SQL CompletionBug DBE-9758 Database console autocomplete autoquotes everything in jdbc presto connection
Bug DBE-10012 Bad completion for GROUPING SETS
Bug DBE-7307 Abbreviation completion doesn't work in Modify table
Bug DBE-9882 SQL editor needlessly quotes identifiers (tables, columns, stored procedures) for Intersystems Caché databases
SQL Format and StyleFeature DBE-10604 Add support for wrapping/chopping for long DDL statements
Bug DBE-10467 Postgres formatting OFFSET clause
Bug DBE-10202 Case sensitivity not respected for procedures/functions in packages
Bug DBE-10779 Wrong indent when a command starts with a comment
Bug DBE-10602 Inconsistent code reformat using language injection
SQL GeneralBug DBE-10412 Index/Foreign Key Code Generation Name formatting
Bug DBE-10726 No ability to create a DDL data source if there are no folders attached
Bug DBE-10309 Oracle: create search index statement fails to execute from DataGrip
SQL GenerationBug DBE-10219 Deleting Column with Column-Owned Sequence Generates Unnecessary DROP Statement
Bug DBE-10259 The drop cascade checkbox of the Confirm Drop Schema Dialog does nothing!
Bug DBE-10396 Unable to resolve class com.intellij.database.model.DasObjectWithSource
Bug DBE-10724 Snowflake Table Creation Generates Invalid DDL w/ Comments on Primary Keys
Bug DBE-10431 Datagrip trigger charset
SQL HighlightingFeature DBE-8365 Redshift stored procedures support
Feature DBE-10410 Amazon Redshift MATERIALIZED VIEW Syntax Not Supported
Bug DBE-10182 Cassandra 'CONSISTENCY' command is not supported
Bug DBE-9695 Invalid highlight of automatically named columns
Bug DBE-10295 In PostgreSQL, `generate_series` is incorrectly highlighted as an error
Bug DBE-10273 Good code red: CAST to varchar without length not accepted by DataGrip
Bug DBE-10778 MariaDB Dialect JSON_QUERY not recognized
Bug DBE-10561 SQL syntax highlight issue - Doesn't recognize `INDEXED BY` keyword
Bug DBE-10294 IntelliJ IDEA Ultimate considers GRANT ROLE TO USER being wrong in MariaDB
Bug DBE-10268 PostgrSQL Identity columns syntax check bug
Bug DBE-10354 "SELECT FOR SHARE" syntax not supported by console
Bug DBE-10548 Editor does not recognize "accessible by" clause on Package-method level
Bug DBE-10748 Errors in SQL Editor for correct Oracle SQL statements
Bug DBE-10328 Parsing error with SQLite FILTER() without OVER Window
SQL RefactoringFeature DBE-10581 "Extract variable" refactoring for SQL Server
Feature DBE-10321 Implement "Suggested Rename" for SQL
SQL ResolveFeature DBE-10457 New quick fix: refresh schema
Bug DBE-10482 Resolve MongoDB collections with dots in name
Bug DBE-9952 PostgreSQL driver doesn't correctly handle "unnest" functions
Bug DBE-10483 Resolve MongoDB collections that are accessed using bracket notation
Tools IntegrationBug DBE-7623 "Restore with mysql" is possible on read-only database connection
  • No labels