Child pages
  • IntelliJ IDEA 2019.3 Release (193.5233.102 build) Release Notes
Skip to end of metadata
Go to start of metadata
No subsystemFeatureIDEA-217473File/recent location relative view time
FeatureIDEA-147849Find Action By Name should not consider word order
BugIDEA-224633If a file is opened from a command line, the IDE unconditionally creates a project directory
BugIDEA-225436Crash when trying to select run configuration
BugIDEA-223233Error popup height is too small (message line is cut off, redundant scroll bar)
BugIDEA-221944Deadlock on opening second project
BugIDEA-219624ETagCloudConfigFileClient loading issues
BugIDEA-216297Deadlock on IDE exit
BugIDEA-221859NullPointerException on switching on the Toolbar
BugIDEA-222889WinProcessListHelper parsing doesn't handle carriage returns in command line args
BugIDEA-224309Splitter resize cursor is visible even when commit panel is hidden
BugIDEA-217798Exception when uncheck Inlay Hints
BugIDEA-223977RunAnything: on 'incorrect' command entering NSEE at kotlin.collections.CollectionsKt___CollectionsKt.last is thrown
BugIDEA-220088Should be called at least at the phase COMPONENT_REGISTERED, the current phase is: SPLASH
BugIDEA-217783Project leak in tests
BugIDEA-224222Reactor False positive in implements Publisher/Subscriber
BugIDEA-223539Crash on Alt+Enter
BugIDEA-222775SOE during loading state of CustomActionsSchema which prevents IDE from starting
BugIDEA-219354Inspection text cutoff in error popup
BugIDEA-222713Cyrillic character in an IDEA CE source file name
BugIDEA-221329Concurrent modification exception: FUS & KeymapImpl
BugIDEA-221328Exception in Rider test.
BugIDEA-223503IntelliJ crash
BugIDEA-190956Creating a new file with keyboard closes file navigator bar
BugIDEA-224868Should be called at least at the phase CONFIGURATION_STORE_INITIALIZED, the current phase is: COMPONENT_REGISTERED Current violators count: 1
BugIDEA-127997Gutter changed lines regions not shown when the changed lines are "folded"
BugIDEA-221822Settings for new projects are ignored when creating a new project in WebStorm
BugIDEA-220232Recent Locations advertising in Recent Files
BugIDEA-215794onHoverChange() doesn't work with block inlays
BugIDEA-222090Show Usages popup closes right after opening
BugIDEA-222315editorConfig indent_size and style not honored in handlebars
BugIDEA-222427Esc doesn't close diff window
BugIDEA-212652Switch Boot Runtime: IOException: Cannot download jbr-file Request failed with status code 404
BugIDEA-224884Deadlock on project opening due to VCS
BugIDEA-222446While editing debug watches Esc moves focus to the main editor
BugIDEA-159091Analyse > Analyse Stack Trace > Unscramble - Text is confusing
BugIDEA-223377java.lang.Throwable when invoking Tools menu right after project opening on Windows/Linux
BugIDEA-220733We need to extend ApplicationEx API for elevated restart for Rider.
BugIDEA-217898Unexpected full reindex
BugIDEA-224470Startup Time Cost per Plugin dialog confusing confirmation to disable plugins
BugIDEA-224292New Gradle based Kotlin project doesn't allow you to select a directory
BugIDEA-221164Incorrect tabs headers painting
BugIDEA-221459Plugin to be enabled should be shown and selected in the list
BugIDEA-220692Speedup SVG icons loading
BugIDEA-225607NPE on calling Export to HTML
BugIDEA-208267.editorconfig `trim_trailing_whitespace` is ignored for Markdown files
PerformanceIDEA-218463Project code style settings should be loaded asynchronously, not on EDT though status bar
PerformanceIDEA-214768avoid creating default project on startup because it's bad for performance
PerformanceIDEA-212711Improve performance for editor with large number of highlighters
PerformanceIDEA-218654Get rid of lifetime, lifetime/disposable bridges loading and execution on EDT during start
UsabilityIDEA-85303Context menu is not displayed if right clicking on bookmark symbol in editor gutter
UsabilityIDEA-219484Services View: provide ability to add all run configurations to the list of ones to be run in Services
UsabilityIDEA-110828Method Hierarchy view should start at the top level class/interface where the method is defined, not at the class where the action has been invoked
UsabilityIDEA-219363Run Anything input is not being saved between invocations
CosmeticsIDEA-224245Cosmetic: Commit button reads "Comm it" when in Window mode
CosmeticsIDEA-203148Class hierarchy items appear as expandable even if there are no children
TaskIDEA-218725Remove RELAX-NG from inspections settings popup
TaskIDEA-218097Prebuilt indexes should respect stub serialization version
ExceptionIDEA-223733ISE at com.intellij.velocity.psi.VtlImplicitVariable.$$$reportNull$$$0
ExceptionIDEA-222892Exception is thrown on file opening
ExceptionIDEA-222785ProcessCanceledException causes "Could not initialize class com.intellij.psi.search.searches.IndexPatternSearch$Holder"
ExceptionIDEA-226828Reactor: PIEAE at com.intellij.psi.impl.source.tree.ChangeUtil.generateTreeElement
AndroidBugIDEA-221306Android Plugin - Designer attributes not working
BugIDEA-225595Android: Useless tab `Resource Manager`
PerformanceIDEA-217279Idea hangs completely after `git reset` in terminal
BuildTaskIDEA-216941Rename Gradle/Maven Integration Extension plugins
Build. AntPerformanceIDEA-217970Freezes in AntConfigurationImpl$3.beforeFileDeletion
Build. Built-in (JPS)FeatureIDEA-53161Cannot hide compiler info messages
BugIDEA-222510Internal Error when using AJC compiler
BugIDEA-222092After a crash, IntelliJ no longer works
BugIDEA-223774Use the same classpath, modulepath as Maven when using the internal compiler
Build. GradleFeatureIDEA-132286Enable annotation processing from Gradle IDEA config
FeatureIDEA-182577Support compileJava.options.annotationProcessorGeneratedSourcesDirectory property
FeatureIDEA-83361Support homebrew-packaged gradle
FeatureIDEA-187868Support annotationProcessor scope of Gradle 4.6
BugIDEA-219018New gradle module is always added to settings.gradle even if there is a settings.gradle.kts
BugIDEA-222258Exception when creating a new Gradle module
BugIDEA-124090Annotation processor generated classes are not found in editor in a gradle project
BugIDEA-208205Regression: Gradle: generate project structure fails to set sources properly, when Gradle annotationProcessor configuration is present
BugIDEA-225189Gradle project with name not set in settings.gradle and directory name consisting only of dots and digits is no longer imported correctly
BugIDEA-163780Downloading dependencies with gradle in offline mode should be friendlier
BugIDEA-224720Gradle tab hides nested subprojects when they have leaf name in common
BugIDEA-217731Gradle dependecy completeion removes library version
BugIDEA-224030Gradle project main() run replace task deprecated warning.
BugIDEA-221141Multiple Gradle projects break "Run Anything"
BugIDEA-222256Some problems in the new project/module configuration steps
BugIDEA-219117Gradle tool window: When Explicit Module Groups option is selected and iml files are generated, only the root project is shown
BugIDEA-220969InteliJ IDEA 2019.2 runs out of memory when running tests using gradle runner
BugIDEA-224160Use Gradle from: Specified location doesn't work at all
BugIDEA-210603Errors when synchronizing a project with gradle with custom test sourceSets, if annotationProcessor is used (using lombok as an example)
BugIDEA-225171Gradle sync failed with Java 13
BugIDEA-216524Modules are duplicated after unlinking and linking a Gradle project
BugIDEA-210316Changing Gradle module structure causes IDEA to fail with error
BugIDEA-217933Package prefix issues on import from Gradle
BugIDEA-221699Serious regression with transitive dependencies in Gradle project
BugIDEA-222149Duplicate subprojects in Gradle Tool Window
BugIDEA-217769Separate Gradle tasks for Build and Rebuild
PerformanceIDEA-160489Startup performance problem - 1 minute waiting
PerformanceIDEA-224835Gradle import is **slower** in 2019.3 EAP
PerformanceIDEA-225007Leaking threads: 1500 threads after running Gradle project import
PerformanceIDEA-183944IDE hangs when refreshing Gradle projects
PerformanceIDEA-222904Hotswap: scan only affected output roots for delegated Gradle build
UsabilityIDEA-188763Gradle plugin on MacOS: find Gradle where it brewed
UsabilityIDEA-217932Missing quote error is not reported in the Gradle errors view
UsabilityIDEA-217437GradleDiagrams: do not auto-select excessive nodes when first opening the diagram
UsabilityIDEA-218295Ability to run Gradle run configuration during indexing
UsabilityIDEA-225276Build tw: display Gradle scala compile task errors on the task execution tree
UsabilityIDEA-216938Offer an alternative to the removed "Create directories for empty content roots automatically" Gradle option
UsabilityIDEA-223833Run anything confused by `gradlew`
ExceptionIDEA-222311Exception when run Gradle with JFR
ExceptionIDEA-222958NPE at org.jetbrains.plugins.gradle.config.GradleClassFinder.clearCache
Build. MavenFeatureIDEA-131491Support for pom (bom) type in Dependency management (Maven)
BugIDEA-217314Cannot find relative path of parent pom
BugIDEA-222912Attempt to run Application RC with DelegateToMaven == true causes multiple java processes producing endlessly
BugIDEA-122332Repeated errors for missing Maven repo files
BugIDEA-122783Unit test runner ignores maven surefire classpath configuration
BugIDEA-215315NPE when "Reimport All Maven Projects" with maven 3.6.2-SNAPSHOT
BugIDEA-205211Maven unpack nested archives tries to write files that it shouldn't or can't
BugIDEA-221829"Remove maven project" action from Maven Tool Window does not remove the project from ProjectView
BugIDEA-223724Import Maven pom.xml instead imports Gradle build.gradle
BugIDEA-209548Run anything `mvn` is a no-op unless a maven root project is added
BugIDEA-220010Maven project import fails if old maven version (3.0.3) is used
BugIDEA-174515IntelliJ's Maven plugin can't download sources for snapshot dependencies
BugIDEA-2194262019.2 ~/.m2/repository missing from indexed maven repositories
BugIDEA-202133Maven late property evaluation ignored when running tests
BugIDEA-22366791 maven background processes running simultaneously
BugIDEA-209168Delegate To Maven: confusing results in case of Application run configuration run from RunDashboard / Services
BugIDEA-223275Problem when importing child maven projet when using property in version tag
PerformanceIDEA-209532Intellij Freezes in SQL Editor (MavenTargetUtil.getFindTarget in non-Maven files)
PerformanceIDEA-200003Awfully slow background task: "Resolving external annotations"
PerformanceIDEA-216758MavenProjectImporter freezes
PerformanceIDEA-219933Maven toolwindow update reads zip files in EDT
UsabilityIDEA-219670Maven: confusing representation of cancelled goal
UsabilityIDEA-219066Can not set working directory when running Maven goal from Run Anything popup
UsabilityIDEA-210278Maven: do not show Import dialog when creating/opening projects
UsabilityIDEA-219324Execute Maven goal in 2019.2
UsabilityIDEA-207487Maven: build toolwindow: add Rerun and Stop toolbar buttons
CosmeticsIDEA-135179Import project dialog is not resizable (buttons not visible)
CosmeticsIDEA-223197New Maven module dialogue window is distorted
Configuration ProblemIDEA-204155Support adding to maven-surefire-plugin argLine instead of replacing it
ExceptionIDEA-224662Throwable at com.intellij.openapi.application.impl.ApplicationImpl.assertReadAccessAllowed
ExceptionIDEA-220662SOE at com.intellij.util.xml.EvaluatedXmlNameImpl.equals
CloudsFeatureIDEA-220275Show Heroku, CloudFoundry, Google App Engine in Services tool window
Clouds. OpenShiftTaskIDEA-225047Discontinue Openshift plugin
Code Analysis. DuplicatesBugIDEA-221014Many "JavaScript/TypeScript" entries in duplicate settings.
Code Analysis. InspectionFeatureIDEA-214558Reactor inspection: Warn when returning nulls from Flux/Mono transformation functions
BugIDEA-220740Run Inspection -> Custom Scope value is not persisted
BugIDEA-199182Incorrect warning "Unassigned Flux instance" with Reactor's transform method
BugIDEA-222909Typo that selected in Inspection Results tree is not highlighted in batch editor
BugIDEA-188820Out of memory when exporting code analysis to HTML
BugIDEA-217597Clicking on checkbox in the Inspections tree leads to `profileChanged` event in `ProfileChangeAdapter.TOPIC`
BugIDEA-224533Inspections from command line fail with "TFBlockNameValidness descriptionUrl==TFBlockNameValidness "
PerformanceIDEA-220137Do not run inspection iterations if LocalInspectionTool returned PsiElementVisitor.EMPTY_VISITOR
UsabilityIDEA-221001Quick fixes on an inspection warning should have higher priority than Run/Debug actions
Code Analysis. Language InjectionFeatureIDEA-106449Support template language injection
FeatureIDEA-217838Text blocks: edit injection fragment should trim left spaces
FeatureIDEA-221416AssertJ language injection rules as built-in rules
BugIDEA-223046Strange highlighting in injected HTML text block
BugIDEA-218402Database plugin - SQL syntax highlighting is not working in JavaScript strings if DECLARE is used
ExceptionIDEA-221436NullPointerException when move folders in project tree
Code Analysis. Structural SearchFeatureIDEA-216174SSR: Auto-insert pair $ when editing search/replace template
FeatureIDEA-223337Search for Java methods should find methods with receiver parameter
BugIDEA-224120Replace element with unmatched annotation variable fails
BugIDEA-221361Replace variable number of parameters with fixed type correctly
BugIDEA-221558SSR inline preview does't get updated on editor document change
BugIDEA-204454Structural Replace doesn't have replacement variables anymore
BugIDEA-223146PsiInvalidElementAccessException: Element class : on SSR replacing annotation
BugIDEA-218006SSR: AssertionError at com.intellij.structuralsearch.impl.matcher.JavaMatchingVisitor.visitClass
BugIDEA-219700'Search Structurally' with selection uses scope different from selected in UI
BugIDEA-224871"does not match anything" warning when searching string literal
BugIDEA-65982Structural search and replace doesn't correctly substitute annotation parameters
UsabilityIDEA-81912SSR - Restore the last text in the SSR dialog
UsabilityIDEA-201471SSR: Do not use default input field focus for the Text Area
UsabilityIDEA-210319SSR: Irrelevant completion variants when typing $
UsabilityIDEA-216177SSR: Don't show intention actions in Search Template field
CosmeticsIDEA-216180SSR: Don't show quick doc on hover in Search Template field
CosmeticsIDEA-218151Baseline for filter hint is lower than other text
CosmeticsIDEA-201475SSR: Darcula: Use the same border for the template editor and the variables filters pane
ExceptionIDEA-218193MalformedPatternException occurs when specifying malformed search template
CoreBugIDEA-223803Crash on clean startup in latest snapshot due to MacBook Touch Bar
BugIDEA-222787Keybinding Issue with 2019.3 EAP
BugIDEA-218430Freeze forever if use `runProcessWithProgressSynchronously` during processing window focus events on JDK11 (SequencedEvent)
Core. DebuggerBugIDEA-224914move watch up/down doesn't work
BugIDEA-220181Debugger ignores stepping filters when using new directed step-into
CosmeticsIDEA-222515Doubled single quote: Source file changed or found source file does not correspond to the breakpoint''s file
Core. DiagramsBugIDEA-223512UML Diagram: missing "Save as UML" button on a toolbar
BugIDEA-216951Repaint Maven/Gradle diagram only once per selection change in "Show Paths: Root->Selection" mode
BugIDEA-210021Undo is not afailable for file after some diagram is shown for it
ExceptionIDEA-222053NewJavaDiagram action causes NPE
Core. File SystemFeatureIDEA-224971fsnotifier: support osxfs mounts
BugIDEA-224079Open File or Project only showing one directory in home
PerformanceIDEA-218043Freezes in scheduleInitialVfsRefresh
Core. IDE SettingsFeatureIDEA-215428Add relative file path live template function
BugIDEA-211157File and Code Templates shows incorrect include header for Default scheme
BugIDEA-217321IOException - 'example/path' is not a directory in VFS
BugIDEA-221456Options for Inlay Hints are rendered too slow
BugIDEA-219420"Editor | Inlay Hints" settings are not persisted between restarts
BugIDEA-198276Registry returns default values (not the user ones) at early stages of application loading
BugIDEA-221939Settings for new project are applying only after restart
BugIDEA-124684Customize menu and toolbar not persisting/broken
UsabilityIDEA-217609UI cleanup for Settings | Editor | Smart Keys
UsabilityIDEA-207984Ambiguous description: small labels in editor tabs
UsabilityIDEA-136209"Small labels in editor tabs" should be in "Editor Tabs" configuration section
ExceptionIDEA-223425Shell environment not loaded
Core. IDE Settings. SharingBugIDEA-220697Intellij 2019.2 cannot sync settings on linux
BugIDEA-219853Cannot enable nor trigger IDE Settings Sync
UsabilityIDEA-208370"Invalid credentials. Click to authorize" tooltip should make it clear which credentials exactly are invalid
Core. IndexingBugIDEA-216643wrong TODO counter for database console
PerformanceIDEA-219456Contentless indices load file content due to file type detection
TaskIDEA-216231Research on possible advantages of a common map for SerializedStubTree & IndexedStubs
ExceptionIDEA-224749Possible `IndexNotReadyException` when adding package-info.java
Core. InstallationFeatureIDEA-194011Turn vcs.log.graph module into a healthy maven dependency
BugIDEA-222834Cannot open project by relative path across different IDEA instances
BugIDEA-224100Windows launcher is fragile under externally-imposed SetDllDirectory context
BugIDEA-224371Allow to use custom size for spalsh image in launcher.
TaskIDEA-224889Please add release/eap/nightly flag to product-info.json
TaskIDEA-220738Bundle Kotlin 1.3.50 with IntelliJ IDEA
TaskIDEA-224517Add additional logging to macOS launcher to find out why bundled JBR is not picked up
TaskIDEA-219542Enable Bytecode Verification by default
Core. LicensingPerformanceIDEA-222244IDE start takes several minutes when there is no network connection
Core. Navigation and SearchFeatureIDEA-160274Field Call Hierarchy
BugIDEA-221398Go to Declarations and Usages from popup doesn't jump to class definition
PerformanceIDEA-211967IDEA 2019.1 freezes while searching for Todo items
Core. Platform APIFeatureIDEA-219946API to determine a command-line, which started current IDEA
FeatureIDEA-218478Register ConcatenationInjectorManager service in the platform
FeatureIDEA-215436Method with experimental\internal parameter or return type should be considered experimental\internal on its own
FeatureIDEA-203508Provide an API for mixing goto results from different sources
BugIDEA-223709RubyMine 2013.EAP creating more than 800 threads on opening, freezing the IDE and slowing the computer for several seconds
BugIDEA-219855Unable to build an empty IDEA plugin project with 2019.2 target
BugIDEA-215432Internal\experimental API member usage inspection must check if declaring class or package is marked internal\experimental
BugIDEA-223074IDEA has to report regarding corrupted files / plugins
BugIDEA-225641Large soft-reference cache (1.3GB) on ResolveCache.myPhysicalMaps
BugIDEA-223894PluginException trying to use ServiceManager to get service with multiple constructors
BugIDEA-220169Bug in matching words with the same ending and starting letters in pair words by MinusculeMatcher
BugIDEA-216172Profiler says that ApiUsageUastVisitor#isInsideImportStatement may be slow
UsabilityIDEA-212107Need a way to respond to file edit without creating a FileEditor in a plugin
TaskIDEA-217639Get rid of reflective access in `com.intellij.ide.ClassUtilCore#clearJarURLCache`
Core. Plugin ManagementBugIDEA-219259Queries in plugin list unavailable during indexing
BugIDEA-225451IDEA dies with low memory on updating the applied theme plugin
BugIDEA-224223Theme plugins installed from disk disappear after update
BugIDEA-222061plugin can not be installed just after IDEA downloading and installing
BugIDEA-209769Transitive optional plugin XML dependency does not work
BugIDEA-224881Color scheme is available upon IDEA restart after uninstalling theme plugin
BugIDEA-224401"Updatable" plugin is duplicated in plugins list until restart
BugIDEA-224408No label on enable/disable theme plugin after clicking on Apply
BugIDEA-226071'null' values instead of Settings tabs are displayed on clicking "Cancel" in Settings dialog after installing a keymap
BugIDEA-226608"ReSharper (macOS)" keymap is applied on Windows by default after installing Resharper keymap plugin
BugIDEA-224220Theme is partially changed after uninstalling plugin
BugIDEA-222461Plugins management: incompatible plugins reporting is incorrect
BugIDEA-225295Theme is reset to broken "IntelliJ" theme after uninstalling light theme plugin which was installed over dark theme
BugIDEA-224230Updating theme plugin from incompatible version requires IDE restart to apply changes
BugIDEA-225615Theme plugin is shown as uninstalled after disabling
BugIDEA-222960Plugin conflict between included plugin and Markdown Navigator
BugIDEA-225613Theme plugin installed from welcome screen on first start is not available until restart
UsabilityIDEA-205043Plugin Manager Dialog steals focus when the Settings dialog is opened
UsabilityIDEA-226216On theme plugin updating the theme is applied automatically though the different look'n'feel has been used before
CosmeticsIDEA-218594Plugins: ugly dialogs on downloading failure
TaskIDEA-225980Remove JB modifier from plugin logos
ExceptionIDEA-224649Throwable at com.intellij.ide.plugins.newui.MyPluginModel.applyEnableDisablePlugins
ExceptionIDEA-224191AE at com.intellij.application.options.colors.ColorAndFontOptions.initAll
ExceptionIDEA-224976Exception in dynamic plugin loader on installing a theme plugin after first IDE start
ExceptionIDEA-224650NPE at com.intellij.ide.plugins.newui.MyPluginModel.addProgress
Core. ProfilerFeatureIDEA-218137Profiler: to open zipped collapsed async profiler dumps
FeatureIDEA-217015Need own time in methods list
FeatureIDEA-217451Allow to collapse recursion in specific method's call tree
FeatureIDEA-222914Profiler: support Icicle Graph (inverted Flame Graph)
FeatureIDEA-219359Provide "Callees list" in addition to "Back Traces" and "Merged Callees"
BugIDEA-222168NoSuchElementException: List is empty.
BugIDEA-221005Profiler flamechart: one pixel line on the right of component isn't updated
BugIDEA-221007Profiler call tree: strange horizontal scroll state after jumping from flame graph to call tree
Core. Project SettingsBugIDEA-221596JavaDoc and annotations paths may be reordered in *.iml file on save
BugIDEA-217659On new project creating the file withe name "$PRODUCT_WORKSPACE_FILE$" is created in .idea
BugIDEA-223363IDE deletes newly added library configuration files if external storage is enabled
BugIDEA-221500New module created in Project Structure dialog may get explicit module group assigned breaking grouping by module names
BugIDEA-223248No VCS tab in Settings for New Projects in fresh EAP instance
BugIDEA-222246Inspection settings are not saved
BugIDEA-186751Repository library: disallow manual editing of library with transitiveDeps=true
BugIDEA-223730java.util.ConcurrentModificationException at com.intellij.openapi.projectRoots.impl.UnknownSdkType.getInstance(UnknownSdkType.java:31)
PerformanceIDEA-216510Freezes in ConversionServiceImpl.getProjectFilesMap
UsabilityIDEA-94764Import Project from Existing Sources: source roots and module roots are incorrectly detected
ExceptionIDEA-222934Cyclic service initialization for bookmarks
Core. Quick DocumentationBugIDEA-216893Quick documentation is shown even without moving the mouse
BugIDEA-218115QuickDoc popup changes its user-defined size on navigating by links
BugIDEA-212331Anchor links do not work in QuickDoc
BugIDEA-220127Anchor links within the same document don't work sometimes
BugIDEA-205986QuickDoc popup is not restored in the Editor from the Tool Window
UsabilityIDEA-189703Documentation doesn't appear on hover on the element with warning
CosmeticsIDEA-225391Labels in the documentations popup are not properly aligned
ExceptionIDEA-218404Edit Source in QuickDoc popup toolbar throws NPE
Core. RefactoringsFeatureIDEA-129547Rename module and directory at the same time
BugIDEA-216354com.intellij.codeInsight.hint.ShowParameterInfoHandler#getHandlers doesn't respect "order" attribute
BugIDEA-222073Error:build: Cannot determine build data storage root for project C:/Users/timur.yuldashev/IdeaProjects/Jigsaw/CannotBuild
PerformanceIDEA-214780TouchBar action update freezes UI thread for a long time
ExceptionIDEA-219687"java.lang.Throwable: AWT events are not allowed inside write action" on Undo during Rename operation
Core. Run. ConfigurationsFeatureIDEA-182193Intention to create a new Run configuration for executable class
BugIDEA-216291No paste button in Tomcat Run/Debug configuration Startup/Connection
BugIDEA-157989"Stop" button does not work when the IDE is launched as a background task
BugIDEA-215194Run console toolbar is not separated from console editor when new tabs is enabled
BugIDEA-131597Filtering is not applied to "irrelevant" run configurations
BugIDEA-210252[Environment variables] when pasting smth in addition to the existing value - the whole value is replaced
BugIDEA-222962Run Anything: invocations history is lost after new command entering
BugIDEA-215363Generate JavaDoc passes java11 style --source-path to java8 javadoc binary
BugIDEA-183885Maven goals executed as 'run before/after' tasks are not run in the Services view despite settings for maven run configurations
BugIDEA-222233Copy-paste behavior in the Environment Variables editor
BugIDEA-219327Run/Debug actions on toolbar aren't shown until 'Edit Configurations' dialog is opened
BugIDEA-93940Run/Debug Folders: DnD should support multiple items
BugIDEA-215196Runner content ui has left border when its toolbar is not visible and new tabs is enabled.
PerformanceIDEA-219923Avoid running run configuration producers on EDT
UsabilityIDEA-182361Make the new Run Dashboard Visible by default under View - Tool Windows -
ExceptionIDEA-200833Exception occurs on clicking run configuration after renaming Main class
Core. SSHBugIDEA-224997FileNotFoundException when no permissions for reading ~/.ssh/known_hosts
BugIDEA-220081SSHJ: Hash hosts in known_hosts file setting ignored
Core. Task ManagementFeatureIDEA-155327Improvement to automated Branch Name in the Open Task dialog
FeatureIDEA-64464Tasks plugin should also save bookmarks list in task context
BugIDEA-134603When switch from task to task with branch having new files these previously opened files are not reopened
BugIDEA-222401[Task Management] some controls are hidden after the server settings window resizing
BugIDEA-138917Time Tracking broken
BugIDEA-101254Time tracking: Suspend delay setting has effect only on project reopening
BugIDEA-224295Commit from local changes doesn't show task autocompletion
BugIDEA-207486[Task Management] the task dropdown in the toolbar is disabled for the newly added server in the fresh IDE installation
EditorBugIDEA-221337Joining lines performance is slow
BugIDEA-217903Inlay Hints: doubled hints on changing the file extension
BugIDEA-216745Inlay hints: Select first item in the list when opening a settings page
BugIDEA-220419Copying from text block and pasting into regular string should escape characters
BugIDEA-221335Exception in plugin aborts the whole Copy/Cut operation
BugIDEA-216746Inlay hints: Use editor font for editor
BugIDEA-216360Code vision selection background overrides editor margin
PerformanceIDEA-219760Editor may start faster
UsabilityIDEA-222562Split view is broken/changed - close tabs and open recent works differently
UsabilityIDEA-216743Inlay hints: Add explanation text on root page of the settings
UsabilityIDEA-218340Escape required characters when copy-pasting text between different types of string literals
CosmeticsIDEA-216747Inlay hints: Increase space between checkboxes and "Black list..." label
TaskIDEA-217669Use same delay for popups shown on mouse hover in editor
ExceptionIDEA-221262IAE at org.jetbrains.plugins.github.pullrequest.comment.ui.EditorComponentInlaysManager
Editor. Code CompletionFeatureIDEA-55066Add Live Template macros to insert file path
BugIDEA-223713CNFE: com.intellij.codeInsight.completion.CompletionPhaseListener: Can't run 1.3.60-dev-2580-IJ2019.2-1 with IDEA Nightly IU-193.3938
BugIDEA-223033Different Live Templates differing by case only may shadow each other
BugIDEA-220191How do you customize the CompletionPopup background color?
BugIDEA-223091IntelliJ keeps freezing when editing story files
BugIDEA-219161Empty bottom advertisement text in non-completion lookups
PerformanceIDEA-198887MinusculeMatcher can be very slow on long prefix and name
UsabilityIDEA-221804Reword setting name for ML code completion
ExceptionIDEA-219655NSEE at kotlin.collections.MapsKt__MapWithDefaultKt.getOrImplicitDefaultNullable
Editor. Color SchemesExceptionIDEA-216690Exception occurs on importing a color scheme if a color scheme is incompatible
Editor. Diff and MergeFeatureIDEA-218189Show scope background color in Diff window files popup
FeatureIDEA-1025223 way Merge dialog & multiple files merge dialog should show details about affected commits (at the left and at the right)
FeatureIDEA-216868Diff could tell if binary files are different
BugIDEA-218187Diff/Merge files drop-down has strange files sorting
BugIDEA-223218Default focus on file list in 'Diff Between' window
BugIDEA-215841Directory diff finds binary content differences in some big binary files, while they are the same
BugIDEA-223924Shortcut for Include Lines into Commit do not work in the Unified diff
BugIDEA-220681Wrong Differences ignored label
BugIDEA-220960Compare files doesn't respect Soft wrap option
UsabilityIDEA-220861Merge dialog: Actions buttons should be disabled if file is not selected
ExceptionIDEA-220582NPE at com.intellij.diff.tools.simple.SimpleDiffModel.updateGutterActions
Editor. Editing TextFeatureIDEA-125325Join lines in custom file type should handle end-of-line comments
FeatureIDEA-218836New editor command to sort lines alphabetically
FeatureIDEA-223034Add support for for block caret-friendly braces highlighting and navigation
BugIDEA-216967Folded values of properties from resource bundles are not changed on property value changing in *.properties file
BugIDEA-218068Javadoc comments folding captures code on the same line
BugIDEA-215896Folded property value editing: incorrect cursor after Expand invocation in case of long property value text
BugIDEA-15855Auto-import is too pushy
BugIDEA-217073Burmese language literals irreversibly break the editor
BugIDEA-217353Paste inside text block should escape opening/closing quotes
BugIDEA-220417Expand Selection doesn't select text block contents correctly
BugIDEA-220956Error tooltip shown on F2 stays longer than it should, and obscures editor contents
BugIDEA-221642Incorrect parameter popup highlighting range
BugIDEA-210020Search highlight color does not change when changing theme
BugIDEA-221610Need to click twice to unselect identifier that is being renamed
BugIDEA-221995Undo removing after rename refactor glitch
BugIDEA-223891TODO regex are broken
BugIDEA-221958Quickly pressing Cmd-V and then Cmd-G to jump to next search result doesn't work correctly
BugIDEA-223715Todo pattern matching not working correctly when using ö (o with two dots)
BugIDEA-217406Paste multiline text into text box should keep indents
BugIDEA-215899Folded property value editing: if PasteFromHistory (Ctrl-Shift-V) is invoked in value editor, Esc closes editor instead of ChooseContentToPaste dialog
BugIDEA-218901Limit Description width in inspections popup
UsabilityIDEA-216380When folding Javadoc comments do not show ellipsis if full content is shown when folded
UsabilityIDEA-223760Rendering of whitespace in editor too noticeably
UsabilityIDEA-215414Toggle Case action must preserve selection if changed text expands
UsabilityIDEA-204308Multiline TODO popup interferes with editing the TODO.
CosmeticsIDEA-185041Tabs rendering for show whitespaces are too intrusive, and space rendering look too much like periods.
Editor. Error HighlightingBugIDEA-217862False code inspection on methode reference on protected class for inheritence in different package
Editor. FormatterBugIDEA-223408Java ij_java_imports_layout setting in .editorconfig not working properly
BugIDEA-223416Regression: overriding FileIndentOptionsProvider no longer works when .editorconfig is present
BugIDEA-173076Unable to disable formatter using JSP comments (<%-- --%>)
BugIDEA-219572New | EditorConfig action should not be available when the context directory is undefined
BugIDEA-165776VCS automatic pre-commit reformat option use a wrong default format preferences
BugIDEA-224183IDEA takes into account formatting markers with the disabled "Enable formatter markers in comments" option
BugIDEA-188412Formatter markers don't prevent formatting selection when placed after annotation
PerformanceIDEA-218532Freezes in CodeStyle.getSettings
UsabilityIDEA-216088EditorConfig: consider making "Add properties as comments" off by default
CosmeticsIDEA-218180JavaScript language level is used in the Configure indents action name instead of JavaScript
ExceptionIDEA-222855'Adjust code style' on the value of variable causes an exception
Editor. Intention ActionsBugIDEA-220487Create File Intention: in the target roots drop-down the inconsistent slashes are used (in case of missing directories)
BugIDEA-219577Create File intention popup does not support speed search in the options popup
BugIDEA-218163CreateFileFix creates files in sources instead of resources locations in Gradle / Maven projects
CosmeticsIDEA-221475Incorrect spelling in the "Add on-demand static import..." context action
TaskIDEA-217596Redesign tooltip for warnings/errors on scrollbar
Editor. TextMate BundlesBugIDEA-220388Disabled Insert paired brackets is ignored
FrameworksFeatureIDEA-225925EndpointsView: show/hide available frameworks toggle action
FeatureIDEA-224096Quarkus JAX-RS methods and @Produces/@Consumes
FeatureIDEA-218261Warn throwing exceptions from reactor operators
FeatureIDEA-222733MicroProfile REST Client
FeatureIDEA-221934Smarter Publisher usage diagnostic
FeatureIDEA-219725Support Micronaut
FeatureIDEA-224780Support methods, which call subscribeOn and publishOn internally
FeatureIDEA-225473Microservices: provide URL path reference and completion in Retrofit.Builder baseUrl
FeatureIDEA-225503Microservices: Provide standard URL path references for JAX-RS ClientBuilder
FeatureIDEA-224093Quarkus private field injection
FeatureIDEA-224027Reactor. Rename variables in debugger for modified stack frames
FeatureIDEA-224786Microservices: Show Retrofit and OkHttp Clients in Endpoints View
FeatureIDEA-221723Endpoints View
FeatureIDEA-222409Support getting URL's from Swagger spec file
BugIDEA-226098Cannot jump to source when debugging reactor application
BugIDEA-222371Spring MVC: on Microservices plugin disabling the Spring MVC functionality becomes unavailable silently
BugIDEA-224755Cannot resolve `/localhost:808` in UrlPathRefrerence
BugIDEA-225280EndpointsView: Details filter: don't collapse endpoint items after applying a filter in case of more then 2 panes
BugIDEA-225346EndpointsView: Filter "Module"=true: the content is not module-related
BugIDEA-225880Microservices: show concrete frameworks instead of Microservices group in Default Plugins
BugIDEA-218211Reactor. Consider transformation methods (map, filter, doOnNext, handle and so on) also as non-blocking scope
BugIDEA-225584UrlPathReferences are wrongly placed in case of concatenations in annotations
BugIDEA-226062Helidon: Routing.get() is not shown in Endpoints
BugIDEA-225690EndpointsView: Framework doesn't appear at once
BugIDEA-226532Micronaut: cached value is not equivalent for injected beans search
BugIDEA-226430EndpointsView: Non-blocking items refresh
UsabilityIDEA-226027EndpointsView: tool window should not be shown in IntelliJ project
ExceptionIDEA-225245Endpoints: PsiInvalidElementAccessException at doing some resolve/adding annotations/ navigation
ExceptionIDEA-226156Micronaut: PsiInvalidElementAccessException in Endpoints at changing a class
Frameworks. GWTBugIDEA-226574GWT facet compilation uses CommandLineWrapper which is not suited for Java 9+
Frameworks. HibernateBugIDEA-128307Hibernate-reverse-engineering. Support type conversion document by generating entity java class
UsabilityIDEA-219888Generate Persistence Mapping Showing Information Schema
Frameworks. SpringFeatureIDEA-158876Spring MVC: support the @RequestAttribute annotation
FeatureIDEA-158875Spring MVC: support @SessionAttribute annotation
FeatureIDEA-158709Spring: support SQL highlighting in @Sql annotation
FeatureIDEA-224768Microservices: Show Spring Feign Client interfaces in Communications
FeatureIDEA-151638Spring MVC: provide gutter navigation icons from mappings to beans when beanNameViewResolver is used
FeatureIDEA-223980Spring Boot: on or off can be used as boolean values in application.yml since v. 2.2.0
FeatureIDEA-215237Support Apache CXF XML configuration for Spring (JAX RS)
FeatureIDEA-216078Support Apache CXF XML configuration for Spring (JAX WS)
FeatureIDEA-209148Spring: detect the JPA facet automatically in SpringBoot projects with corresponding dependencies
FeatureIDEA-209456@ConfigurationProperties are scanned by default as of Spring Boot 2.2
FeatureIDEA-218873Navigation and quick fixes for Spring @ImportResource locations and @PropertySource / @TestPropertySource values
FeatureIDEA-208951Inspection when calling a `@Bean` method directly in a `@Configuration` where proxyBeanMethods is disabled
FeatureIDEA-216041False warning `Cannot resolve @PathVariable ...`
FeatureIDEA-215874Warn if a file specified in @Sql annotation does not exist
FeatureIDEA-225797Microservices: Support URL path completion in Spring UriSpec of WebClient and WebTestClient
BugIDEA-225445Spring Boot: false positive Spring Boot Configuration Annotation Processor not found in classpath warning in Gradle-based project
BugIDEA-216162SpringBoot MVC: if view name starts with slash ("/") it can't be resolved by IDEA
BugIDEA-194013Spring Boot: Cannot resolve configuration property quick fix does not create META-INF/additional-spring-configuration-metadata.json file
BugIDEA-220205Spring MVC: ModelVariables from base classes in Spring Boot app can not be resolved
BugIDEA-177644ComponentScan basePackages with constant doesn't resolve beans
BugIDEA-95024Spring MVC: forward prefix should be processed correctly
BugIDEA-225842Endpoints view: if all filters are applied (the single tab with urls is shown) then on mapping editing it disappears from view
BugIDEA-225723Spring Boot 2.2: for classes annotated both with @ConfigurationProperties and @Component multiple beans are registered
BugIDEA-217305Spring Boot: if @ComponentScan annotation with defined filters exists in the @SpringBootApplication-annotated class, filters are applied incorrectly
BugIDEA-223072NoSuchMethodException starting Spring Boot application using Kotlin and main method without parameters
BugIDEA-220746Create File intention: don't suggest web roots in case of existing 'classpath' prefix
BugIDEA-225544Spring Boot 2.2: components from Spring Boot application package are not scanned.
BugIDEA-211520IDEA ignores Spring Boot configuration metadata produced by Gradle build
BugIDEA-220379Thymeleaf plugin does not grab @ModelAttribute-s
BugIDEA-220787Kotlin / Spring messaging / Inspection: Methods marked with @MessageMapping shouldn't be marked as unused
BugIDEA-217145Spring Boot plugin - IndexNotReadyException
BugIDEA-211826Kotlin objects are not considered by IDEA as Spring Bean candidates, when actually they are
BugIDEA-211498Spring support does not support a bean defined in XML and wired via @Value
BugIDEA-189858Spring: incorrect name for beans defined in inner classes
BugIDEA-219573Spring: when 'create file' intention is invoked from the config file in the web root, only web root is suggested (but 2 times) despite the set 'classpath' prefix
BugIDEA-225463SpringBoot 2.2: if @ConfigurationPropertiesScan annotation points to diff package, don't recognize @ConfigurationProperties classes from component scan package as beans
BugIDEA-222402Spring: property auto completion for PropertyResolver.getProperty() does not work in Kotlin
BugIDEA-221542Spring: event listeners defined as beans are not found from gutter icon of publishEvent call
BugIDEA-225983Spring MVC: rename is not available for mapping URLs from code
BugIDEA-223638Code analysis doesn't work because of exception in SpringBootApplicationYamlAccessor.getBinder
BugIDEA-223846Do not show Spring Autowire action in non-Spring bean classes
BugIDEA-224073Spring: field with Value annotation is shown as used even if there are no usages
PerformanceIDEA-217972SelectWordAtCaretAction + +Spring + JPA + KotlinAnnotatedElementsSearcher leads to 100 sec freezes
CosmeticsIDEA-224550Change highlighting level for Spring Autowired fields warning inspection to WEAK WARNING
ExceptionIDEA-222363Throwable at com.intellij.openapi.application.impl.ApplicationImpl.assertReadAccessAllowed
ExceptionIDEA-222170Any Spring MVC view opening causes exception
Frameworks. VaadinTaskIDEA-217303Unbundle Vaadin plugin
GroovyFeatureIDEA-202694Support type annotation syntax
FeatureIDEA-192769An inspection to report method names with dots
BugIDEA-221863SOE in type inlay hint
BugIDEA-224630Extract Method results in invalid code
BugIDEA-221874Type information is not available in "each" closure after "findAll" closure
BugIDEA-147080Groovy Pointless Boolean Inspection should remove double negation
BugIDEA-164747Groovy: Intention "Convert to Dollar-Slashy String" gives wrong result
BugIDEA-220527'Create method' refactoring doesn't handle method params correctly
BugIDEA-162734Groovy "Reformat Code" to error format
BugIDEA-212792Groovy Cucumber completion not working
BugIDEA-221996Type is not know after `tap` on `getAt` operator
BugIDEA-219623Wrong inferred type on local variable
BugIDEA-217978Failure of resolving DGM methods on bounded type parameters
BugIDEA-225977Method names with dots are highlighted in Spock
ExceptionIDEA-223045INRE at com.intellij.openapi.project.IndexNotReadyException.create
Groovy. CompilerBugIDEA-224869FileNotFoundException on compiling Groovy class with umlaut in name
BugIDEA-223826New constructor causing ambiguous resolve doesn't produce errors on incremental compilation
Groovy. InspectionsBugIDEA-221929Groovy: "Change to operator" breaks code (I): Wrong replacement of compareTo
BugIDEA-223032Flip/Negate operator ignores import
BugIDEA-221931Groovy: "Change to operator" breaks code (II): asType() conversion ignores import
Groovy. ResolveBugIDEA-221962Good code red: GString passed into a method followed by `with` call
BugIDEA-135602IDEA does not recognize Groovy @BaseScript if the annotation is on import
InfrastructureBugIDEA-222874IDEA CE project is modified when opened with IDEA Ultimate 2019.2.2
TaskIDEA-220225Convert tcServiceMessages library to a Maven library
TaskIDEA-220226Publish modules of Java plugin as Maven artifacts
Infrastructure. Build ScriptsFeatureIDEA-200523Automatically compute version of repository library for third-party libraries list
JavaFeatureIDEA-217335Highlight text block actual content
FeatureIDEA-210515Replace "Select elements to import" dialog with balloon notification "x imports were added"
BugIDEA-224600Order of Types in Method Hierarchy is not correct.
BugIDEA-223237Reassigned local variable not highlighted
BugIDEA-223133Live template applicable in Java: String does not work in Text Block
BugIDEA-219096interpret escapes in text block value
BugIDEA-220084exception in jshell console
Java. Code CompletionFeatureIDEA-173598no autocomplete for method signature after @param is used
FeatureIDEA-209607When completing equals/hashCode/toString, show elements that show corresponding generate dialogs
FeatureIDEA-196951Delete empty parenthesis when replacing a method call with a (constant) field reference
FeatureIDEA-212024Replace adjacent literal with selected completion option when pressing Tab
FeatureIDEA-209608When completing @Override, show element that shows override/implement dialog
BugIDEA-162456Auto-completion of generic class parameters inside javadoc comment
BugIDEA-221376IntelliJ generates unnecessary cast with raw type
BugIDEA-220464Smart-cast completion doesn't insert <?>
BugIDEA-196864Completion: classes containing no annotations are suggested after @
BugIDEA-221379Unexpected "instanceof" keyword completion in annotation
BugIDEA-217955Repeating completion options for nested class
BugIDEA-224244Bad suggestions for fully qualified class in javadoc link
BugIDEA-223316Name suggestions are not available when variable type is unresolved
BugIDEA-217104Completion popup selects third item instead of first
UsabilityIDEA-220634Completion suggests finalize() first after @Nullable/@Nonnull, final expected
Java. Code FormattingFeatureIDEA-223911Improve quote handling for text blocks
FeatureIDEA-216737Formatting Java text block literals
BugIDEA-184461Formatter markers are ignored in block comment
BugIDEA-223437EditorConfig imports order has lower precedence than IntelliJ settings
BugIDEA-221827Formatter breaks preformatted <pre> block contents
Java. DebuggerFeatureIDEA-211917"Reload Current Class" action in context menu
BugIDEA-169285Breakpoint in a .class file causes IDEA to decompile a class when project is opened, which slows down opening a project
BugIDEA-225073Unable to attach to openjdk 13 process
UsabilityIDEA-221182Rename option "Disable until breakpoint is hit:"
Java. Error HighlightingFeatureIDEA-207059Add quick fix for error highlighting in enhanced 'switch' that code block is required for non-value switch rule
BugIDEA-224306IDEA doesn't detect incompatible types when converting an overridden method reference to Function
BugIDEA-217352Red code is green: Illegal escape character
BugIDEA-185578IntelliJ unable to resolve constructor reference while javac can
BugIDEA-219098incorrect error highlighting when text block contains broken escape
BugIDEA-219330Lambda type inference regression
BugIDEA-222163"incompatible method arguments" tooltip is wrong
BugIDEA-223192Non-initialized variable error is not displayed in nested switch statement
BugIDEA-224305Strange to see both 'String' and 'java.lang.String' in method parameters type mismatch error message
BugIDEA-216009method toString in class java.lang.Object cannot be applied to given types
PerformanceIDEA-205927IDEA hangs after >40 entries added to Map
UsabilityIDEA-224449Confusing error message on self-referencing variable declaration with 'var'
UsabilityIDEA-220107Redesign incompatible types tooltip
UsabilityIDEA-218801Wrong place highlighted on type mismatch: functional argument instead of incompatible return value type
UsabilityIDEA-94965Java: in case of "Incompatible types" error the tooltip shows compatible non equal generic type arguments in red
UsabilityIDEA-217630Incompatible types description is not homogeneous.
UsabilityIDEA-206898"Cannot resolve method" highlighting should not show parameter types if they are irrelevant for understanding the error
CosmeticsIDEA-202664Confusing error message when several statements used for Java 12 rule-based switch case
Java. GUI DesignerBugIDEA-223242GUI Form marked as Plain Text still opens GUI designer
Java. InspectionsFeatureIDEA-224474Add an option to exclude all "maybe"-warnings from Constant conditions & exceptions result
FeatureIDEA-217721Assert has side effects does not provide any details
FeatureIDEA-205279Create missing switch branches based on known value range (e.g. from Range annotation)
FeatureIDEA-223097Provide an inspection which reports overriding package-private methods located in different module
FeatureIDEA-224327Warn if a String method, accepting two numbers (e.g. String::substring) is used with compilation-time literal of different length
FeatureIDEA-223487Inspection should flag unnecessary calls to toString() on arguments to String.format()
FeatureIDEA-221368"Constant conditions & exceptions" should know about Collectors.joining(...) properties
FeatureIDEA-217333Convert string literal to text block
FeatureIDEA-219142Refactoring methods with multiple exit points
FeatureIDEA-214448IDEA does not propose migration of for-each loop with remove() to removeIf()
FeatureIDEA-211409Enable the inspection "Unpredictable BigDecimal constructor call"
FeatureIDEA-195220Track exact type of value (not only instanceof) in Java dataflow
FeatureIDEA-222173Support org.assertj.core.util.CanIgnoreReturnValue in "Result of method call ignored"
FeatureIDEA-224531Support Arrays.asList in dataflow analysis
FeatureIDEA-218253Extract "Not-null field is not initialized" to separate inspection and improve it
FeatureIDEA-221657Prefix/postfix operator ++/-- is incorrectly applied to point/range abstract int value
FeatureIDEA-218562Warn if toLowerCase result is compared with a string which contains uppercase letters
FeatureIDEA-223344More precise widening of integral addition
FeatureIDEA-218061Better support for string concatenation in dataflow
FeatureIDEA-224107Separate "cast may produce CCE" and "cast will produce CCE"
FeatureIDEA-217334Convert text block to the string literal concatenation
FeatureIDEA-223861Infer static field nullability from the bytecode
FeatureIDEA-224530Support nullability check for vararg components
FeatureIDEA-187316Reactor: unfinished StepVerifier quickfix
FeatureIDEA-177238QuickFix for "Casting ... to ... may produce ClassCastException"
FeatureIDEA-219934Inspection: Stream collections within static factories from Guava
FeatureIDEA-217215Add new quick fix for inspection "Empty catch block"
FeatureIDEA-225383x - 1 - x: no warning or intention action
FeatureIDEA-145192Report unnecessary escaping of apostrophe symbol in string literals
FeatureIDEA-207434Comprator.comparing(Map.Entry::getKey) -> Map.Entry.comparingByKey()
BugIDEA-224654False-Negative Contract evaluation
BugIDEA-223511Inspection 'Raw use of parameterized class' shows warning for array creation method reference even with 'Ignore where a type parameter would not compile'
BugIDEA-225392@NotNull annotions on SortedMap incompatible with AbstractMap
BugIDEA-224498Serializable class without 'readObject()' and 'writeObject()' inspection does not store subclasses
BugIDEA-210351Unnecessary 'final' on local variable or parameter produces red code
BugIDEA-218089Find cause may duplicate reason for && operator
BugIDEA-220982Optional.ofNullable() warns to simplify to a code which is logically different from original code
BugIDEA-218856False-positive "Loop can be terminated after condition is met"
BugIDEA-222533Explicit array filling wrong message and fix
BugIDEA-223102Replacement Arrays.full() doesn't work properly with byte/short array
BugIDEA-223549"Constant conditions & exceptions" should handle Objects.requireNonNullElse
BugIDEA-219109Stream.of(...).anyMatch(Objects::isNull) does not affect nullability analysis
BugIDEA-223282Standard Charset Object Can be used in does not take Java language level into consideration
BugIDEA-220059"Folded 'ifPresent' call can be eliminated" produces invalid result for nested Optional.ifPresent
BugIDEA-224476False “May produce NullPointerException“ positive with Contract and method with parameters
BugIDEA-218143Explicit array filling suggests wrong fix
BugIDEA-218385False positive of inspection "Condition is covered by further condition" (quick fix produce NullPointerException-code)
BugIDEA-216386Incorrect warning on Void.TYPE in "MethodHandle/VarHandle type mismatch" inspection
BugIDEA-225659«Deprecated API usage» inspection don't take in account usage of `this(<...>)`
BugIDEA-221611Java Class equality data flow analysis corner case
BugIDEA-224194Inspection "Map<> may not contain keys of type" is missing for ConcurrentMap
BugIDEA-224224`Class.isInstance` incorrectly dismantles `@Nullable` status
BugIDEA-223821`Catch block may ignore exception` inspection does not check for existence of local variable with `ignored` name
BugIDEA-222832Unnecessary initialization is detected as Explicit array fill
BugIDEA-220077"Java | Probable bugs | Constant conditions & exceptions" suggests incorrect code change
BugIDEA-223759Redundant suppression doesn't show warning in Editor
BugIDEA-138881False positive for "Reuse of local variable" involving nested if statements.
BugIDEA-217396Lambdas should have implicit `return` in Java Uast
BugIDEA-223698"Type may be primitive" does not trigger for loop variable if it's concatenated with a String
BugIDEA-223629'Method invocation may produce NullPointerException' false positive for ArrayDeque.pollFirst()
BugIDEA-224090Static method is only used from one class: disable for factory methods
BugIDEA-151819Misordered assertEquals parameters false positive when the expected parameter comes from a function argument
BugIDEA-225601Incorrect null analysis: Condition x != null is always true
BugIDEA-224546"Cannot annotate with both @NotNull and @NotNull" warning
BugIDEA-223166Implicit numeric conversion false negative when "Ignore widening conversions" is enabled
BugIDEA-172876Purity inference algorithm does not match hardcoded contracts for assertion methods
BugIDEA-197256"Non-constant string concatenation ... logging call" QuickFix could include single chars into format string
BugIDEA-223115Collapse catch blocks may produce incompilable code if exception is reassigned
BugIDEA-208839"Inappropriate thread-blocking method call" inspection: refactoring in-project annotations does not update the blocking/non-blocking annotations list
BugIDEA-194990"Arguments to 'assertEquals()' in wrong order" false-positive
BugIDEA-221837Math.min inspection doesn't remove all old code
BugIDEA-218232Create missing branch in switch leads to exception, fix all does nothing
BugIDEA-170081Inspection "Collapse 'if' statement" generates wrong code when quickly fixing the code
BugIDEA-221339junit 5 don't show "inner class may be static" hint on @Nested classes
BugIDEA-159078"Unused assignment" inspection false positive
BugIDEA-209249"Inappropriate thread-blocking method call" inspection does not consider method throwing children of `IOException` or `InterruptedException` as blocking
BugIDEA-196258"Highlight problem line in test" should not highlight failed Assume.assume* calls
BugIDEA-209407"Inappropriate thread-blocking method call" inspection: class chooser for annotations throws NPE at ProjectViewNode.hasProblemFileBeneath() when no project is opened
BugIDEA-223995Replace with conditional inspection not recognises opposite assignments
BugIDEA-217298"Incorrect string capitalization" inspection deson't recognize 'choice' pattern
PerformanceIDEA-224753High CPU during inspections - snapshot
UsabilityIDEA-225036Do not warn about ignoring Void return value
UsabilityIDEA-175539"Raw use of parameterized class" inspection should be on by default
UsabilityIDEA-224582Make "Convert string literal to text block" less noisy
UsabilityIDEA-216381Stream.min and Collections.reverseOrder is not simplified to Stream.max
UsabilityIDEA-225505Suggest replacing 1-x-1 with -x rather than 0-x
UsabilityIDEA-215727'Utility class without 'private' constructor' quick-fix 'Generate empty private constructor' should be first
UsabilityIDEA-218031"Replace with 'if' statement" should be available inside lambda
UsabilityIDEA-219831"'int' literal cast to 'long' could be 'long' literal" doesn't work if the target type is boxed.
UsabilityIDEA-145570Intention text for "Incompatible types" error quck fixes are a bit too verbose
CosmeticsIDEA-221312NPE warning on instance-qualified static method call
CosmeticsIDEA-219924"@NotNull/@Nullable problems" inspection refers "Constant conditions & exceptions" as the place to edit options, but the configuration dialog is already here
ExceptionIDEA-218831'Replace '+' with 'java.text.MessageFormat.format()'' exception on character+string concatenation
Java. Intention ActionsFeatureIDEA-216279Suggest fix for the case "Cannot return a value from a method with void return type"
FeatureIDEA-162253"Create missing switch branches" with variables annotated with @MagicConstant
FeatureIDEA-209924Add Kotlin's "Put arguments/parameters on separate lines/on one line"
FeatureIDEA-216275Provide fix for Invalid method declaration; return type required
FeatureIDEA-223996Make "Extract method" available as intention
BugIDEA-224253"Make conversion explicit" does nothing
BugIDEA-217165Text blocks: join concatenated string literals breaks indentation
BugIDEA-218083Put arguments on separate lines wants to process comment
BugIDEA-219639'Extract condition' intention looses parenthesis around disjunction
BugIDEA-220832Create File intention: don't suggest generated sources root as possible target
BugIDEA-224254"Sort content" leads to spurious error in annotation attribute
BugIDEA-218735"Sort content" loses comment between called method name and argument list
BugIDEA-223643"Replace assertTrue, assertFalse, or assertNull with assertEquals" intention does not work with JUnit 5
BugIDEA-220955Create File popup does not sort target directories for Spring Sql annotations
BugIDEA-216450Eliminate parentheses is available, but does nothing
BugIDEA-223641"Flip assert literal" intention does not work with JUnit 5
BugIDEA-217660Exception when joining text block with string literal ending in escaped double quote
BugIDEA-217253"Replace '+' with 'String.format()'" intention makes regular strings from text blocks
BugIDEA-222593"Create JUnit assertion" intention does not work with JUnit 5
BugIDEA-220747Create File intention: don't suggest the test roots when quickfix is called for a reference in non-test root
BugIDEA-171439Intention/quick fix showing a dialog are not proposed if to cancel the called dialog
UsabilityIDEA-219189"Split into 2 if's" generates redundant 'else if' clause
UsabilityIDEA-224313"Import static constant" is apparently less useful than ... searching jar on the web
ExceptionIDEA-201122"Split local variable" SIOOBE
Java. Properties FilesPerformanceIDEA-224601UI Freezes and thread dumps in logs
ExceptionIDEA-218175com.intellij.diagnostic.PluginException: Inspection #UnusedProperty has no description [Plugin: com.intellij.properties]
Java. RefactoringsFeatureIDEA-155249Replacing "elvis" operator ?: with if-else in return statement could omit the 'else' keyword
FeatureIDEA-219791Inlining a method returning a ternary expression depending on boolean parameter could automatically simplify the expression
BugIDEA-223623Scratches: Rename refactoring changes name only in a place where you've called it
BugIDEA-223086ImportClassFixBase.fixSilently affects performance even if UnambiguousImportsOnTheFly settings is disabled
BugIDEA-218200Invert Boolean doesn't update bitwise assignment operators
BugIDEA-216460Cannot extract expression to variable
BugIDEA-218011"Rename" dialog is invoked for anonymous class in Structure View or Structure popup
UsabilityIDEA-210792Bug : IntelliJ IDEA 2019.1 and Extract variable - Different behavior for expression enclosed within ()
UsabilityIDEA-215812"Convert to functional expression" in "Extract functional parameter" should be enabled by default
UsabilityIDEA-51483Extract Variable: does nothing on a block with invalid parentheses
Java. Tests. CucumberBugIDEA-153338Cucumber for Java plugin > Scenario names are not displayed in test results
BugIDEA-224277Cucumber v5 support
BugIDEA-221320Support step definition declared with method from `io.cucumber.java8` package
Java. Tests. JUnitFeatureIDEA-171419All modules become one unnamed module during test execution
BugIDEA-222920Cannot run standalone test module
BugIDEA-224598JUnit 5: Test framework quit unexpectedly: Unable to parse --add-opens <module>/<package>.
BugIDEA-223109JUnit tests from 192 branch don't start on the master IntelliJ
BugIDEA-223329Running JUnit Tests produces: Module org.junit.platform.launcher not found
BugIDEA-223128Exception during execution of invalid JUnit 5 test
Java. Tests. TestNGUsabilityIDEA-128201No generators for @BeforeClass and @AfterClass
JavaX. AppServersFeatureIDEA-222786Enable application servers in Services tool window by default
JavaX. AppServers. GlassFishBugIDEA-201756NPE at re-running Glassfish with different jdks
JavaX. AppServers. JBossBugIDEA-223807Unable to deploy artifacts to JBoss AS 6
JavaX. AppServers. JettyBugIDEA-221766Jetty: plugin does not recognize succesfull deployment if context root contains "."
JavaX. CDIBugIDEA-215143Wrong tooltip and false-positive for "Unproxyable Bean Types Inconsistency" inspection
BugIDEA-222745False positive Unsatisfied Dependency inspection for parameter with @ConfigProperty
PerformanceIDEA-222019High CPU usage when highlighting CDI files
CosmeticsIDEA-224391CDI: unify injected bean icon location with Spring and Micronaut
JavaX. EJB3BugIDEA-209332Unproxyable bean types inconsistency.
PerformanceIDEA-219366Right click in the editor while editing a stateless session bean causes huge ui freezes (JavaTestFramework.isTestClass -> EjbSuperMethodSearcher)
JavaX. JPAFeatureIDEA-220244Show no warnings if fields in entity-classes are not initialized inside no-args constructor
FeatureIDEA-144763JPA: Import database schema: Make Default "Mapped Type" configurable
BugIDEA-215297JPA/Hibernate: Import Database Schema: Generate Separate XML Per Entity action should (allow to) generate xml in the resources directory
BugIDEA-203129Disable "'Basic' attribute should not be a container" JPA rule if using @Convert annotation
BugIDEA-222734Detect JPA facet for Quarkus Panache
BugIDEA-222887JavaEE. JavaEE Persistence: IndexNotReadyException on facet initialization
UsabilityIDEA-98652JPA: NamedQuery is marked as an error if JPA facet is not configured
JavaX. JSPBugIDEA-220754JSP Javascript block comment highlighting error
JavaX. ServletsCosmeticsIDEA-218953Servlet listener template has a typo in JavaDoc: "attibute"
JavaX. Web ServicesFeatureIDEA-223090JAX-RS support does not know about javax.ws.rs.PATCH
BugIDEA-226185Web-services: Path completion list doesn't include paths without "/" at the beginning
BugIDEA-225131JAX-RS: @Path completion: remove duplicated "/" in case of its presence in both paths
BugIDEA-226217EndpointsView: Display slash between url parts if it is absent at the beginning of these path parts
BugIDEA-225344JAX-WS. java.lang.IllegalArgumentException at setting "Endpoint Source"=false
BugIDEA-225112JAX-RS: Remove the root path from the children paths completion list
BugIDEA-225128JAX-RS: Wrong completion list if we call it after "/"
BugIDEA-225339HTTP url reference language injection. The "localhost:8080" url part is red marked.
BugIDEA-222624Java Enterprise -> RESTful WS -> list of endpoints doesn't show / between paths correctly.
BugIDEA-225342JAX-RS: Wrong find usages list content for @Path
UsabilityIDEA-225378EndpointsView. If "Show details"=false then the view should not contain "nothing selected" pane for "Details"
Lang. FreeMarkerFeatureIDEA-225967Improve Freemarker language support
BugIDEA-226072Optimize Imports (on commit) causing problems with Freemarker Templates with Template Data Language configured as Java
Lang. JSONBugIDEA-221552Unit Test fails for custom plugin when trying to load a JSON file
Lang. MarkdownCosmeticsIDEA-221369Make grayscale antialiasing the default in Markdown preview
Lang. Shell ScriptFeatureIDEA-223844Run shell scripts from context menu
BugIDEA-216493[ShellScript] 'Rename all occurrences' is available on keywords
BugIDEA-215936Shell Plugin :: Tab Size In Editor Doesn't Match Size Configured In Settings
BugIDEA-215997[Shell script Run config] "Main" configuration doesn't run if Shell script config in Before Launch section
BugIDEA-219427Shell Script command appended to current Terminal command line
BugIDEA-220421Java classes are suggested in completion popup
BugIDEA-219544shell script format problems with locale
BugIDEA-221031Shell script removes '/' slash from execution command
BugIDEA-223938[Shell Script] working directory couldn't be changed in run configurations
BugIDEA-224147Inject language shell creates fakes Run Line marker
BugIDEA-222424Execute shell script without ENTER confirmation
BugIDEA-218250Cant define working directory for ShConfigurationType
BugIDEA-222093Shellcheck instances aren't killed
Lang. ThymeleafBugIDEA-218561Thymeleaf anchor links with literal substitution are not recognized
BugIDEA-220340Thymeleaf parameters in fragments can not be resolved
BugIDEA-220326Thymeleaf @{...} links are marked as error
Lang. VelocityBugIDEA-165810Wrong automatic indention for Velocity comments
Lang. XMLBugIDEA-215634com.intellij.util.xml.DomFileDescription#isMyFile: parameter module is always null
BugIDEA-219411Settings | Languages & Frameworks | Schemas and DTDs: all paths to schema files appear in red though are properly resolved from xml
BugIDEA-192427Invalid URI resolution for dependent external resources with absolute path (XML schema files)
PerformanceIDEA-212283DOM: xinclude performance problem
Lang. XPath and XSLTBugIDEA-220836Show Unique XPath is not working well
Lang. YAMLFeatureIDEA-224404Make YAML metatype engine be able to complete inside quoted values
FeatureIDEA-212876Made an option to disable (or change) key sequence paste feature
BugIDEA-222915Invalid errors in injections into Java
BugIDEA-223349Problems validating sequences using Metamodel engine
BugIDEA-225873Yaml completion of numeric properties by JSON schema doesn't jump to the value
Plugin Development (DevKit)FeatureIDEA-219619plugin.xml: highlight EP/EP-attributes annotated with @ApiStatus.Experimental
FeatureIDEA-220700plugin.xml: suppress spellchecking for EP attributes marked with @NonNls
FeatureIDEA-219724Devkit: support <projectListeners> (2019.3+)
FeatureIDEA-206060DevKit: deprecate Project Wizard
FeatureIDEA-211503Devkit: specifying ApiStatus.ScheduledForRemoval without Javadoc
FeatureIDEA-203877Help to write PersistentStateComponent correctly
BugIDEA-217581Devkit plugin.xml I18n: take into account all ConfigurableEP/InspectionEP classes
BugIDEA-221095Devkit: resolve EPs when used via xinclude or <depends>
BugIDEA-219140Devkit: support <applicationListeners> (2019.3+)
BugIDEA-217183DevKit: PluginXmlDomInspection should not request icon from implementation-detail plugins
BugIDEA-217683plugin.xml: highlight duplicate <depends> only if using same config-file
TaskIDEA-216155@ScheduledForRemoval: inspection that warns if API marked with SFR must already be removed
TaskIDEA-221351Devkit: include 'com.intellij.modules.platform' dependency by default in plugin.xml templates
Tools. DockerFeatureIDEA-194510Docker: Allow to specify custom context folder which contains separate unrelated Dockerfile
FeatureIDEA-198286Support docker build target option
FeatureIDEA-218063Progress handling in Docker deploy log console
FeatureIDEA-178495compose YAML: add editor support for typed arrays (v3)
BugIDEA-222447Docker: Impossible to call "Create..." a container for an image in case of existing run configurations
BugIDEA-212488Docker settings do not keep path to docker executable
BugIDEA-226401DockerCompose: Deploy log is absent at running a compose file
BugIDEA-226332Docker: if docker run configuration is launched while docker is not connected, deployment node is missing
BugIDEA-163279Support logging of transport level interaction with docker daemon
BugIDEA-193559DockerCompose. Run Configuration: impossible to choose services to run
BugIDEA-201787Docker: DockerView hangs after running tomee/tomcat
BugIDEA-223502Docker: impossible to create a new exec command for a container: "Create..." doesn't work
BugIDEA-226434Can't parse run CLI options: Unrecognized option: --group-add
BugIDEA-214766Incorrect error highlighting for function arguments used in string interpolation inside a BASH function in a RUN statement in Dockerfile
BugIDEA-223616Docker. Show sensible tooltip for an image
BugIDEA-224069Dockerfile highlighting breaks on multiline RUN with quotes
BugIDEA-224747Compose Run config: java.lang.IllegalArgumentException: Got empty dockerComposeFilePaths at expanding Services in case of absent compose file
UsabilityIDEA-226469DockerCompose. Editor. Completion for keys known as arrays should insert "-"
UsabilityIDEA-215626Services. Docker. Absent easy start possibility to create a docker connection from DockerView .
UsabilityIDEA-156211Docker. Create a container from an image. Don't show the second "Create...".
UsabilityIDEA-178719Docker: Docker run configuration. Process the case of a Dockerfile with a big context folder in a more user-friendly way.
UsabilityIDEA-210917Docker image run configuration. Rename "Image ID" field to "Image ID/Name"
UsabilityIDEA-226409Improve text when Docker is not connected
CosmeticsIDEA-223630Docker: Make names of container tabs in the same low/upper case style
CosmeticsIDEA-226534Docker: Correct "Attached console" and "Container Port" tab/column names to be in the same low/upper case style
CosmeticsIDEA-178001Docker. Run Configuration. Delete "Create new" from "Server" listbox.
CosmeticsIDEA-190344DockerCompose: Avoid green DeployLog tab by "down" of our compose node
ExceptionIDEA-226366IOException: Pipe broken when stop Docker container
ExceptionIDEA-223856Docker. Mark the field red by running an empty exec on a container
ExceptionIDEA-225084java.util.ConcurrentModificationException in Docker plugin
Tools. KubernetesFeatureIDEA-223406KubernetesView. Add Helm into the Services view with the output of the actions int, template, update dependency.
FeatureIDEA-222766Helm3. Provide a quickfix in the requirements.yaml to add the dependencies into Chart.yaml
FeatureIDEA-223058Show "Kubernetes" item by default only if there is k8s on the computer. Connect to it by default.
FeatureIDEA-226870Kubernetes: apiVersion apiextensions.k8s.io/v1 not supported
FeatureIDEA-223054KubernetesView: Provide possibility to change "Namespace" for an object type in the separate tab.
FeatureIDEA-223060KubernetesView: Possibility to view, copy logs
FeatureIDEA-212595Kubernetes. Implement Service view provider for k8s
BugIDEA-226633Kubernetes. Change icon by wrong connection to k8s "not-connected" one
BugIDEA-223333KotlinNullPointerException at adding missing keys for a dependency
BugIDEA-226647Helm. Dependencies: chart and parent are red-marked for `import-values:` and absent foe the completion
BugIDEA-224867Helm3: some pre-defined build-in objects are absent for helm3
BugIDEA-222133Kubernetes. After turning on k8s view: java.lang.LinkageError: loader constraint violation: when resolving method 'org.slf4j.ILoggerFactory org.slf4j.impl.StaticLoggerBinder.getLoggerFactory()
BugIDEA-223937Helm3. Chart.yaml, completion: add "type", remove "engine" if not needed
BugIDEA-223421Helm. Doesn't add a new dependency via Alt+Insert in requirements.yaml if key "dependencies:" is absent
BugIDEA-223153KubernetesView: NPE at attempt to connect to the new minikube
BugIDEA-223207Kubernetes. Refresh should work on sub-nodes if a cluster is not available
BugIDEA-226170Helm, go templates: False positive "duplicated key" error between branches of with-else statement
BugIDEA-222665KubernetesView: Display a more clear root name in the Services
BugIDEA-224373com.intellij.util.IncorrectOperationException at changing namespaces in different tabs
BugIDEA-223313Kubernetes: Different indent by adding a new dependency via Alt+Insert and via keys/values completion
BugIDEA-226529K8s: Exceptions if pods have opened logs : java.io.EOFException, com.intellij.util.IncorrectOperationException
BugIDEA-223413Helm. New sub-charts are not loaded after "Update dependency" action in the ProjectView with java.lang.IllegalArgumentException
BugIDEA-224308KubernetesView: Doubled namespaces in the list after Refresh
BugIDEA-224841Kubernetes view: reload the opened yaml file instead of the opening one more item in the Editor
BugIDEA-223405Helm. "Update dependency" action is absent for helm3 dependencies from Chart.yaml
BugIDEA-224906KubernetesView. Correct actions behaviour at no connection
BugIDEA-225015Helm. The repo pointed via "file//" should not be marked as "Repository not added yet"
BugIDEA-222453Kubernetes view: it doesn't refresh cluster changes
UsabilityIDEA-224927KubernetesView: show logs in one click in case of one container in a Pod
UsabilityIDEA-225010Helm: inspections are updated very slowly
UsabilityIDEA-224004KubernetesView: Remain the same expanded/collapsed state of items after "Show in a new Tab"
UsabilityIDEA-223997Kubernetes. Display progress and errors at wrong connection to k8s cluster
UsabilityIDEA-222764Helm3. Display warnings about tiller options which are not actual in helm3
CosmeticsIDEA-224189Kubernetes. Resize/move the table columns.
CosmeticsIDEA-224188KubernetesView. Make table content in one string
ExceptionIDEA-222438Kubernetes view: ISE at com.intellij.kubernetes.view.ui.KubernetesPodInformationPanel by container selection
Tools. TerminalFeatureIDEA-116253font zooming does not work in terminal tool window
BugIDEA-220774Terminal failed to start on Windows (blocked by antivirus)
BugIDEA-180204Terminal output garbled after specific file has been printed out
BugIDEA-2195992019.2 JBTerminal throws java.lang.Throwable: Directory index may not be queried for default project
BugIDEA-222498Cannot move focus to next window when terminal is active
BugIDEA-219379Terminal sessions are lost on every major update
BugIDEA-223117Cannot move focus to next project using by IDEA hotkey when terminal is active
BugIDEA-141263When changing Theme to Darcula Terminal view remains white
BugIDEA-223264WSL paths are not clickable in terminal
UsabilityIDEA-223286`git log` in terminal switches to Version Control tab
CosmeticsIDEA-217612Terminal rename session minimizes the terminal window
ExceptionIDEA-163345"Could not set clipboard: cannot open system clipboard" (#171.584)
User InterfaceFeatureIDEA-173174Warn user about IDE keymap conflicts with native OS keymap
FeatureIDEA-101757Copy status message to clipboard
FeatureIDEA-203207Touch Bar: Options on the Touch Bar should be filtered when searching in popup
FeatureIDEA-197859"Show in dolphin" does not select the file
FeatureIDEA-223297Snap full-size toolbar on right side of main-window
BugIDEA-208808Services Tool Window is shown in projects without services
BugIDEA-222621Keyboard navigation in debugger watches is broken
BugIDEA-215943Expand button for "No proxy for" field insert spaces instead of commas
BugIDEA-222130Suggestion lookup list disappears if the editor is scrolled after it appears
BugIDEA-221532"Recent Files" list flickers on hovering
BugIDEA-222748Report bug does not work on latest 2019.3 EAP
BugIDEA-224617Find in Path dialog: Path is overlapped by file name
BugIDEA-85792File with unknown extension can't be opened with drag'n'drop from Windows Explorer
BugIDEA-216416Plugins changelog is missing
BugIDEA-223367IDEA file chooser doesn't show sub root directories except users directory
BugIDEA-207914Validation message doesn't fit explanation text
BugIDEA-222403UI in Presentation mode is broken after switching from full screen to presentation mode
BugIDEA-221330Tabs painting artefacts after disabling tabs
BugIDEA-225920Updates dialog: big space between the text and link section
BugIDEA-224228Refactor dialog appears when trying to open Terminal via Switcher
BugIDEA-218593Project window does not restore "maximize" state
BugIDEA-220057NPE in NotificationsManagerImpl.findWindowForBalloon
BugIDEA-223443Popups appear at wrong position in Presentation mode
BugIDEA-225826ActionButtonWithText does not update if overall font is changed in Settings
BugIDEA-219479New License Dialog: Show error message in bottom part
BugIDEA-216341Tabs in color themes: ToolWindow.HeaderTab.hoverBackground is applied incorrectly to an inactive tool window tab
BugIDEA-221112Incorrect text painting in goto class
BugIDEA-226746Selection is not synced between tree and table components of JBTreeTable when scrolling with arrow down pressed
BugIDEA-218080"Open Project" dialog does not appear if opening a project via "Open Recent" main menu
BugIDEA-221755Project opened from fullscreen is windowed
BugIDEA-221491Tab placement none doesn't work with table layout
BugIDEA-2236592019.3 EAP locks up when switching back to it
BugIDEA-204463Touch Bar: Items in "Add to Favourites" list disabled in IDEA UI are not disabled on the Touch Bar
BugIDEA-167805Keyboard navigation in debug tool window
BugIDEA-220837Cannot switch between the Debug Console tab and Debugger tab using keybindings anymore
BugIDEA-218136Can't copy selected text from popup inspection tool tips with Ctrl+C
BugIDEA-218687Select the only plugin on the right on search
BugIDEA-216240Editor Tabs close button unreachable for last visible tab
BugIDEA-226107JBTreeTable does not update viewport height when rows are added dynamically
BugIDEA-222488Window size is changed after exiting Presentation Mode
BugIDEA-222971Projects stop switching using Cmd+` after restoring window from minimised state
BugIDEA-224452Cannot find parent keymap "Default for XWin"
BugIDEA-225540Corrupted status bar border if UI font size >= 18
BugIDEA-214546ctrl+tab window sometimes stucks on screen
BugIDEA-220729"Open" project link doesn't work on Welcome screen
BugIDEA-223312Regression: Mnemonics in dialogs on Windows are not displayed until alt key is pressed
BugIDEA-221860'Exit from Fullscreen' is broken on mac
BugIDEA-222310Unify Dark Appearance
BugIDEA-224783NPE at com.intellij.ui.mac.MacOSApplicationProvider$Worker.getProject when opening IDE
BugIDEA-218342IDEA crash on a dropdown filtering
BugIDEA-218782'null' user account name when trying to sync settings on freshly installed IDEA
BugIDEA-223645Toolbar buttons are not clickable in full screen mode
BugIDEA-224349com.intellij.util.concurrency.SwingWorker calls methods designed to be overridden it its constructor
BugIDEA-216347Tabs in color themes: ToolWindow.HeaderTab.underlinedTabForeground / underlinedTabInactiveForeground don't work
BugIDEA-223767Reopened project is located on a wrong screen
BugIDEA-220625Double border on top of push dialog
BugIDEA-220046Editor tabs: editor tabs icon jumps down on tabs layout changed
BugIDEA-220279IDEA shows dialogs and popups on wrong monitor
BugIDEA-223328New project created from full screen project is not opened in full screen
BugIDEA-220663Empty frame when project is opened in current window
BugIDEA-223868"Copy Path" action in editor tab context menu should be hidden for non-file tabs
BugIDEA-217907Error message in status bar is truncated
BugIDEA-222526Esc doesn't close Evaluate Expression window
BugIDEA-221666"Copy Reference..." -> "Absolute Path" or "Content Root Path" does nothing if called from Project tree context menu.
BugIDEA-221233Smooth mouse wheel scrolling mishandles some burst scroll events on Windows
BugIDEA-222472"Show List of Tabs" action sometimes shows irrelevant tabs from other tool windows in the list
PerformanceIDEA-219875Slow and laggy after updating to 2019.2 (many open tabs)
UsabilityIDEA-119140"Find in path" dialog missing tabstop for "File mask(s)" checkbox
UsabilityIDEA-116865Add the ability to bind "Jump to Editor" to a key other than escape
UsabilityIDEA-217044Better wording for "Autoscroll to source", "Autoscroll from source" and "Scroll to source"
UsabilityIDEA-219185New License dialog: Wrong dialog size
UsabilityIDEA-76396Make MouseWheel scrolling smooth
UsabilityIDEA-223889"Line/Column" status bar panel tooltip should show action shortcut
UsabilityIDEA-18213MacOSX: Use Cmd+Enter instead of Ctrl+Enter
UsabilityIDEA-223867Run Anything context chooser: Mismatch of tooltip and popup title
UsabilityIDEA-55081Allow date format customization
UsabilityIDEA-104317Javadoc with images using the data: scheme are shown as broken images.
UsabilityIDEA-176949"Toggle Bookmark" & "Toggle bookmark with mnemonic" actions should be available on gutter context menu
UsabilityIDEA-222947IDEA should show which project is being opened
UsabilityIDEA-218869New error tooltip with action is hard to use for multi-line error
UsabilityIDEA-211035Tabs Placement: None should affect only tabs visibility
CosmeticsIDEA-221352"Multiple libraries contain the file" text doesn't fit the popup header
CosmeticsIDEA-217053Misaligned "Update" buttons when some plugins are disabled
TaskIDEA-216355Debugger: do not underline tab if there is only one tab in a group
TaskIDEA-216075Convert New File action to the same popup design as New Class
TaskIDEA-221926Always show the newest progress text in the status bar, do not group it with older processes
ExceptionIDEA-198352"java.lang.Throwable: null topic; dialog=class" after invoking "Context help" ("Help" button, F1) in a dialog with no help available
ExceptionIDEA-224205java.lang.Throwable on first start
ExceptionIDEA-216781Exception occurs on opening Spelling tab in Settings
ExceptionIDEA-225710NPE on IDE opening in MacMainFrameDecorator.enterFullScreenNow
ExceptionIDEA-222251Assertion failed: Decorator not found
ExceptionIDEA-217476NPE at com.intellij.openapi.actionSystem.impl.ActionButton.performAction
User Interface. Action SystemBugIDEA-221936Enter Full Screen action is missing
BugIDEA-220573It takes a long time for context menu to appear when right-clicking on 1000 files in a directory
BugIDEA-224276"Commit" action is not searchable by "checkin" pattern
BugIDEA-223815intellij-community latest snapshot build causes exception when displaying Generate action popup
BugIDEA-225712Checkbox actions are no longer disabled. When searching editor `Words` option is enabled even if `Regex` option is checked
UsabilityIDEA-218224Request: always offer "show in explorer" when it's a file in the file system
ExceptionIDEA-204565Throwable at com.intellij.ide.impl.DataManagerImpl$MyDataContext.getData
User Interface. Console ViewBugIDEA-184208Console horizontal scroll position lost on output
BugIDEA-70016error mixing stdout/stderr
BugIDEA-124688Console scroll to the end - jumps on the end of the line sometimes
User Interface. ControlsBugIDEA-222661Drop-down list size is not adjusted to the list size
BugIDEA-215218[Debugger tabs] all tabs are opened after IDE restart with Undocked view mode
BugIDEA-147414Project Area can't resize
BugIDEA-218270Toolwindows in 'Window' mode are hardly accessible
BugIDEA-223501Hover over Tool Window toggle button broken
CosmeticsIDEA-214806"JRE" combobox is cut in Maven Runner Settings
CosmeticsIDEA-215220[Debugger tabs] add a tooltip to the icon under which all tabs options are shown
CosmeticsIDEA-215252Git Login window — the width of Username and Password fields is not equal
User Interface. Find, Replace, UsagesFeatureIDEA-146832Add the "In selection" checkbox on the find tool equals to the replace tool
BugIDEA-166862Find/Replace: Do Refactor button disappears
BugIDEA-202674IntelliJ froze after trying to open result from find in path dialog
BugIDEA-172063find in path preview hides file extension if filter mask is set, even if several extensions are allowed
BugIDEA-191582FindInPath & ReplaceInPath: Regexp: incorrect behavior in case of malformed replacement string
BugIDEA-224319Forget the previous search fragment when a new multiline fragment was selected
BugIDEA-225181Empty tooltip in 'Find in Path' popup for button in the corner
BugIDEA-214836IDE freezes in "Find in path" while scrolling through found files
BugIDEA-173424Find in Path results sorting in random order
BugIDEA-215838Memory leak in FindPopupPanel
UsabilityIDEA-56579Find Usages dialog could preserve option values
User Interface. FocusBugIDEA-214538UI freeze caused by java focus API, Ubuntu 18.04, two monitors
BugIDEA-223740[Debugger tool window] Focus is lost when switching tabs via "Show List of Tabs" on Linux
BugIDEA-221394Focus is lost when switching project using "Recent projects"
BugIDEA-223806After closing the Find view, keyboard focus is nowhere
BugIDEA-223548RecentLocations: focus is lost on navigating to different file
BugIDEA-224810Nothing has focus after closing Version Control tool window
BugIDEA-222801MacOS: Opening a recent project from fullscreen results in switching to Desktop
BugIDEA-222477Unable to open/hide tool window in some cases
BugIDEA-221988Escape key does not return focus to the Editor
UsabilityIDEA-211276Refactoring preview "Do Refactor" cannot be handled from keyboard because it does not gain focus
User Interface. Keyboard InputBugIDEA-223678Deadkeys not working anymore
BugIDEA-220414"Jump Outside Current Bracket/Quote" does not work with Emacs Tabs
BugIDEA-2249082019.3 EAP build 193.4386.10 Linux: macOS keymap missing
BugIDEA-222847Invoking Ctrl-Alt-O ("Optimise Imports") while indexing prints a character
User Interface. Look and FeelBugIDEA-225247Incorrect tooltips for indent and GoTo line widgets
BugIDEA-221356"Cannot set High contrast theme" error on attempt to set High contrast theme
UsabilityIDEA-219108Checkboxes for plugins are right next to scrollbar, leading to frequent operator error
TaskIDEA-201463IntelliJ LaF: change inactive selection background color
User Interface. NavigationBugIDEA-223322Bookmarks with mnemonics is lost after project reopen
BugIDEA-217470Next enabled option will be selected if disabled one was called from keyboard
BugIDEA-220990Configuration 'Use "CamelHumps" words' does not appear in 'Find Action...' window
BugIDEA-217535Focus stays on the the latest active element in the popup action list when cursor is on disabled item
BugIDEA-224660Search Everywhere: start matches should be prioritized
PerformanceIDEA-217855Go to Action: don't init all configurables on EDT
UsabilityIDEA-222570Recent files toggles between 3 files, not 2 as it was previously
UsabilityIDEA-220792"Recent Files" popup no longer remembers it's dimensions
TaskIDEA-217686Not clear what In-place Descriptions menu item means
ExceptionIDEA-225233NPE on 'Show error info' after navigation to next error
User Interface. Project ViewBugIDEA-224258Show in Dolphin doesn't work on Kubuntu
BugIDEA-226539Only one file is opened after drag-and-drop several files to the Editor
BugIDEA-206056In Project Files, adorn symlink to folder with arrow in corner?
BugIDEA-225460Project tool window button context menu should not show icons for checkbox items
PerformanceIDEA-217348UI Freeze when deleting file (StructureTreeModel update in non-interruptible read action)
PerformanceIDEA-192253Hangup on rendering project view containing Unicode file names
UsabilityIDEA-223758Project view popup appears to the few pixels left
UsabilityIDEA-85947Need to rename "synchronize" context menu item
CosmeticsIDEA-171222Module uses wrong icon in project tree
User Interface. Services ViewBugIDEA-222134Kubernetes. Services view is absent after setting "kubernetes.view" registry key to true
BugIDEA-223118Application Servers run configurations appear in the default list of RC to be run in Services after restart only
BugIDEA-226557Services: after hiding running configuration from Services it is still presented in the tree
BugIDEA-220601Services: text in speed search popup is red even if the tree contains matched nodes
BugIDEA-220472Services View: for the Compound Run Configuration Debug is disabled
UsabilityIDEA-219486Services View: make the ability to run configurations in Services discoverable
UsabilityIDEA-220113Bring Status filter back to Services
CosmeticsIDEA-226054[Services view] tabs and toolbar buttons are not aligned
Version ControlFeatureIDEA-212693Support Issue Navigation from annotate/blame commit tooltips
FeatureIDEA-178283Add 'Copy as Patch to Clipboard' to the Shelf view
FeatureIDEA-220779Add recent commit messages into completion list
FeatureIDEA-73223More completions in commit message editor. Not only for file names, but method/field names, etc.
FeatureIDEA-218460Browse Repository At Revision: support Annotate
BugIDEA-222387Non-modal commit: Decrease indent before node
BugIDEA-215930Rewording commit by shortcut (F2) invokes edit changelist dialog instead reword dialog
BugIDEA-218842Diff In Commit-dialog: In Unified View the first chunk is not in focus on dialog opening
BugIDEA-223176Double border between "Local Changes" toolbar and tool window stripes
BugIDEA-210224Synchronous execution on EDT: unshelveChangeList on Update Project
BugIDEA-217856Find action: "Changelists: Enable changelist conflict tracking" cannot be enabled and does not exist in settings
BugIDEA-225053Expand selected change list node in "Local Changes" on "Commit" invocation
BugIDEA-168261Can't commit changes during indexing in case of exceptions from Checkin Handlers
BugIDEA-225316Diff preview still shows checkboxes after successful commit
BugIDEA-224844Intellij 2019.3 EAP - hitting commit (Ctrl-K) on a single file in a changelist selects all files
BugIDEA-216369Local Changes | Related Files: related files are not shown when default changelist contains multiple files
BugIDEA-224559Commit message area has minimal height after restart if it was changed
BugIDEA-221875Wrong layout in VCS tool window after restart
BugIDEA-224798"Commit and Push" action text is not updated when amend mode is on
BugIDEA-221535Non-modal commit: Commit button in not getting enabled when only unversioned files selected
BugIDEA-184345Regression - Git Branch Spacebar Functionality
BugIDEA-216607Undo in the editor removes checkbox in the commit pane
BugIDEA-221637Unversioned files selected in "Local Changes" are not checked by default in commit dialog on "Commit Project" invocation
BugIDEA-222454"Related Files" in VCS ToolWindow blinking
BugIDEA-206127"Compare Before with Local" doesn't show new files
BugIDEA-221627Non-modal commit: Checked unversioned files are unchecked on Ctrl + K
BugIDEA-224162Incorrect action order in "VCS Operations" invoked from "Local Changes" if "toggle commit" mode is on
BugIDEA-218809"Paths Affected in Revision" window is not shown anymore if to close the underlying diff
BugIDEA-222499Hard to distinguish directories with same name and different paths in non-modal commit
BugIDEA-196619Move to another changelist action only offers changelists not assigned to the file chunks
BugIDEA-222654Actions are duplicated in Commit Dialog
BugIDEA-222352Checkout dialog with preselected Git does not show inputs at once
PerformanceIDEA-218483ChangesViewManager may load it's state lazily
PerformanceIDEA-177781VcsVFSListener spends much time in handling VFS events
PerformanceIDEA-223971IDE Hangs on startup
PerformanceIDEA-145778VCS: UI freeze when deleting directory
PerformanceIDEA-160355Shelving changes is slow for many files
UsabilityIDEA-216547Resolve Conflicts: keep focus in the files list after resolving conflicts by Accepting Yours/Theirs
UsabilityIDEA-224396Commit action should not hide commit panel if invoked from not selected file
UsabilityIDEA-218356could you please stop popping annoying "Adding file to VCS" messages
UsabilityIDEA-222144Get from Version Control should default to Git not CVS
UsabilityIDEA-224509Non-modal commit: focusing on a non-active changelist and invocing Ctrl/Cmd-K selects the active changelist
UsabilityIDEA-207787Silent Unshelve silently ignores a file if it doesn't match the base
UsabilityIDEA-216817Non-modal commit: the splitter between the commit message and the changelists tree should stay intact when resizing the toolwindow
UsabilityIDEA-223798Amend & Co buttons are too far away if Preview Diff is off
UsabilityIDEA-216488Do not show "View 0 commits" after unsuccessful update with conflicts on rejected push attempt
UsabilityIDEA-163530Preselect VCS in Enable VCS integration
UsabilityIDEA-216823Non-modal commit: Does not disappear after finishing
UsabilityIDEA-219936Ignore file update should work through document, not PSI
UsabilityIDEA-217226Provide a way to hide checkboxes and commit message panel from "Local Changes" view
CosmeticsIDEA-224603Improve error message when commit message is not loaded
CosmeticsIDEA-223614VCS History tab underline merges with line selection
CosmeticsIDEA-221406Typo in "Project from Version Control"
CosmeticsIDEA-224988Increase gap from borders for commit button and commit message text
TaskIDEA-217302Remove "VCS History Cache Settings" panel from "Version Control" -> "Background" settings
TaskIDEA-217255HierarchicalFilePathComparatorTest is in different package than testee
ExceptionIDEA-217482Synchronous execution on EDT on "Fix and Commit" on commit line separators
ExceptionIDEA-214504"Project opening should be done in a transaction" on checkout project from git
Version Control. GitFeatureIDEA-168476git interactive rebase: Add "drop" option
FeatureIDEA-219087Local .gitignore - An action to ignore via .git/info/exclude
FeatureIDEA-173936Smart checkout could use shelf instead of stash
FeatureIDEA-81532Git: support force add for gitignored files
FeatureIDEA-208517Unified Checkout action for remote branches
FeatureIDEA-124890Feature Request: Add Colour hint to git branch menu when in Merging state
FeatureIDEA-164356Let push a branch which is not current branch
BugIDEA-217242Git hooks don't run unless you open "Commit Options" popup
BugIDEA-176615Endless loop of "git rebase" on update project
BugIDEA-223904After cancelling a commit, "Commit" button stays disabled
BugIDEA-220907Git Update Project Info doesn't share recent filters with the main Log instance
BugIDEA-210229Wrong baseline for branches statusbar widget
BugIDEA-190333(Git) UnStash Changes dialog does not open if there is a stash with message without colon
BugIDEA-221660Git | Branches | Show Diff with Working Tree should be a Frame
BugIDEA-170401Canceled Commit task reports that the file has been committed while it has not
BugIDEA-223970Rewording git commit should not run commit hooks
BugIDEA-217872Changing the Update Info Filter in the Settings doesn't activate the "Apply" button
BugIDEA-224741Conflicts details: Details are shown for the incorrect commit
BugIDEA-217569Rename selected branch from Branch Popup do not affect repos which contain this branch as current
BugIDEA-222091When changing themes VCS Diff empty panel stays unchanged
BugIDEA-222440In multi-repository project with synchronous branch control current branch is listed among Common Local Branches with all branch actions
BugIDEA-224742Conflicts details: commit list is not scrollable
BugIDEA-220998Cherry-pick without dialog doesn't synchronize file system changes to the VFS
BugIDEA-220504Git | Pull is broken because missing some GitBundle properties
BugIDEA-1994983-way merge shows wrong hash of incoming commit during interactive rebase.
BugIDEA-216931Use consistent sort order for Version Control > Shelf and Diff window
PerformanceIDEA-220438Don't use reflection to read git config via ini4j
PerformanceIDEA-221003Git integration should refresh only the files which actually have changed
PerformanceIDEA-222365"Find commit by hash" takes too much time
UsabilityIDEA-132259Multi-repo sync setup: Checkout common remote branch as local fails if one of repositories is already on such branch
UsabilityIDEA-149015Rename "Git | Revert" action to avoid confusion with `git revert` command
UsabilityIDEA-152791File with reverted staged changes is highlighted as changed (blue)
UsabilityIDEA-193354Git | Branches | "Checkout as" always makes new branch track selected branch
UsabilityIDEA-221787"New Branch" and "New Tag" in Git log context menu should be top-level items
UsabilityIDEA-209664Git double-dot: add 'Swap branches' action to the Compare with Current branch action
UsabilityIDEA-192646Option for Commit Date rather than Author Date in File History and Annotations
UsabilityIDEA-171626Ability to create new branch that already exists in some repositories
UsabilityIDEA-199553Offer to update command line tools when getting error: invalid active developer path after MacOS update
UsabilityIDEA-220048Add a setting to select Shelf or Stash as a preferable method to preserve local changes
UsabilityIDEA-224034Rename Reword action to Edit (Commit) Message
UsabilityIDEA-216382"Compare with Current" could produce confusing results
UsabilityIDEA-223827Preselect commits in the details
UsabilityIDEA-224204"Add to .git/info/exclude" should add content root path, not just file name
CosmeticsIDEA-221248Typo in the description of interactive rebase.
CosmeticsIDEA-221703Tag dialog: change tooltip text on Validate button
CosmeticsIDEA-224054Push dialogue elements are improperly placed / aligned
TaskIDEA-163444Remove "Branch Default" update method
ExceptionIDEA-222017Throwable: Assertion failed at org.jetbrains.git4idea.ssh.GitXmlRpcHandlerService.getXmlRcpPort on Rebase action
ExceptionIDEA-221695Throwable at org.jetbrains.git4idea.ssh.GitXmlRpcHandlerService.getXmlRcpPort
ExceptionIDEA-222952Throwable: Assertion failed: Repositories have unexpectedly diverged
Version Control. GitHubBugIDEA-224239GitHub PullRequests: content is not shown if user logged in from toolwindow
BugIDEA-224323GitHub PullRequests: Refresh notification does not appear automatically
CosmeticsIDEA-224329GitHub PullRequests: add space between file name and its path
Version Control. Local HistoryUsabilityIDEA-73911Implement user-friendly method toString in class com.intellij.history.core.revisions.RecentChange
CosmeticsIDEA-195993Recent Changes dialog needs some spacing
CosmeticsIDEA-220623Recent Changes dialog design
Version Control. LogBugIDEA-225553Filter by "me" incorrectly matches email.
BugIDEA-209131If the project name contains an underscore '_', the underscore does not appear in the Log Paths combobox.
BugIDEA-219575memory leak
PerformanceIDEA-217125Git log component update is very slow
PerformanceIDEA-217010VcsLogManager leaks project
UsabilityIDEA-193806Display errors which affect displayed information in the Log
UsabilityIDEA-164276Show progress while executing Git Log indexing
Version Control. MercurialBugIDEA-220350Push commits dialog (mercurial): should enter remote URL on every push
UsabilityIDEA-73341Mercurial: allow adding ignored files
Version Control. PerforceBugIDEA-221889Exception when saving a merge result in perforce
Version Control. SubversionBugIDEA-125032Stuck in endless loop of modal SVN Authentication Required Dialog
BugIDEA-223635GetFilesFromVersionControl: CheckOut from Subversion fails silently
UsabilityIDEA-219245Add Subversion ignore action to Unversioned Files Dialog
Version Control. TFSCosmeticsIDEA-215448Add Items to TFS window - there is no "NO" option. Should be either both (text and button) No or Cancel
No subsystemFeatureWEB-37464vue.js missing autocompletion for v-slot
FeatureWEB-35796Vue.js: support style element src attributes with support vue-loader
FeatureWEB-14385syntax highlighting of mime type text/ractive in scripts for Ractivejs
FeatureWEB-41489Curly braces not autocomplete in JSX tags
FeatureWEB-39636Intention action to convert nested calls to a pipe expression and vice versa
FeatureWEB-32255Vue.js - single file components with external script file not resolving
BugWEB-38017Red code is generated when creating a new variable inside `for` content
BugWEB-42382JavaScript "Local variable 'X' is redundant" is not that redundant
BugWEB-41478"Quote property names" too aggressive when working with selected properties
BugWEB-41531"Run anything" is not working if package.json is not in the root folder
BugWEB-41923Typescript: Auto complete for function parameters not working correctly for keyof readonly properties
BugWEB-40288No 'Download Node.js' action if there is one (or more) invalid node
BugWEB-42167Completion is different if you move cursor before or after a statement
BugWEB-41803Please add "screenshot" to the dictionary
BugWEB-41817Async generators: create a for-await loop in corresponding postfix template
BugWEB-40777Run anything: yarn is not shown in the list of available commands
BugWEB-41925Cordova: exception while creating "platforms" directory
BugWEB-41789Standard code completion insert handler is not invoked for items in optional chains
BugWEB-39386weridly behaving typos hints
BugWEB-42052"expectedly" is marked as a typo
BugWEB-37995Higher-order function generic inference should work for lambdas invoking generic functions
BugWEB-41938Should not allow to inline destructuring rest
BugWEB-41368Inlay hints are always visible in TypeScript
BugWEB-40027Incorrect "variable initializer is redundant" message
BugWEB-41807Warning is wrapped in exclamation point (! symbol)
BugWEB-41957End-of-line LT expression is parsed as generic parameter list in some cases
BugWEB-42045"stringifies" is marked as a typo
BugWEB-41971Import-types are not properly resolved in case of ambient modules
BugWEB-38768React: collapsed fragment shows as 'xml'
BugWEB-41746Sort properties alphabetically goes into an infinite loop on malformed JSON
BugWEB-40746Add "parallelization" to the dictionary
BugWEB-41421Incorrect 'narrowed to' highlighting if type is not fully expanded yet
BugWEB-25969Vue.js $event and $emit should be ignored by inspections inside template tags in vue files.
PerformanceWEB-17638Joining Lines works extremely slow
UsabilityWEB-33143closing tag should be smarter
UsabilityWEB-40899Don't re-evaluate webpack config if there are syntax errors
UsabilityWEB-32948JSX onClick prop autocompletion not correct
UsabilityWEB-40818Create package.json in the project root when using Install dependency quick fix
UsabilityWEB-41215Allow editing textboxes containing list of element names, instead of requiring clunky "Add"/"Remove" diaiog
CosmeticsWEB-41731The name of Handlebars/Mustache folding category is truncated
TaskWEB-41910Change "Replace with the shortened form" to "Replace with a shorter path"
ExceptionWEB-41076PluginException: Cyclic service initialization when open project
ExceptionWEB-41499PluginException: Exception in plugin Java Server Pages (JSP)
Build toolsBugWEB-40782'Run Anything': List scripts from package.json when typing `npm` or `yarn` regardless what tool is set in preferences
BugWEB-42270Can't execute Gulp tasks from IDE - getting an error with com.intellij.execution.ExecutionException
BugWEB-38986Don't debug npm before launch tasks
CSSFeatureWEB-24298Add quote style settings for CSS
FeatureWEB-31724Adding Bootstrap Autocompletion from CDN
FeatureWEB-10023Need ability to download external stylesheets
BugWEB-40898CSS padding property hint auto is invalid
BugWEB-35236Import of css files with webpack aliases is not resolved in case of '@import url()'
BugWEB-37978Webpack aliases not resolved in URLs in CSS properties
BugWEB-8044Move statement on CSS block no working as expected
BugWEB-41795Download CSS library from CDN: disabling in Preferences - Libraries has no effect on completion
BugWEB-8045Move statement on CSS line no working as expected
UsabilityWEB-41796Download CSS library from CDN: show shorter name for the location in completion popup
CoffeeScriptBugWEB-34310CoffeeScript: "Change signature" refactoring doesn't work
DartFeatureWEB-41609Dart formatter: use dartfmt tool when reformatting file parts, not only the whole file
TaskWEB-41628Dart formatter: use dartfmt tool always, remove legacy formatting settings
DebuggerFeatureWEB-21626watch method return value not implemented in webstorm 2016.1.2?
BugWEB-42360Start execution on attaching to process waiting for debugger
BugWEB-41598Breakpoints don't work after app is reloaded by webpack
BugWEB-40496Node Debugger doesn't always start properly on re-running
BugWEB-21719NodeJS Remote Debugging Doesn't Allow Breakpoints
BugWEB-41719TraceableDisposable.ObjectNotDisposedException when close IDE while debugging
BugWEB-38477Debugging with "js.debugger.use.node.options" fails if path to TEMP directory contains non-ASCII characters
BugWEB-42156JS debugger breakpoints not shared between symlinked files.
BugWEB-40694Debugger doesn't stop on a breakpoint in Kotlin/JS project
BugWEB-36015Debugger attaches to "Before Launch" gulp script, application not launched
BugWEB-41716'Hide frames from libraries' does nothing
BugWEB-13411Node.js: can't set value in debugger
BugWEB-42331Breakpoints in excluded node modules don't work
BugWEB-41007Can't debug node.js - get error 'URI is not hierarchial'
BugWEB-36471WebStorm Debugger variable set value error.
BugWEB-41684Protractor stops on the wrong line, tooltips are not shown
PerformanceWEB-36752Large page in Elements View slows down IDE
PerformanceWEB-41324Throwable: LEAK: {}.release()
PerformanceWEB-38989Optimize memory used for source maps
File WatchersFeatureWEB-36668Allow enabling global file watchers for all new projects
BugWEB-41091Incorrect path is used if file watcher's Working Directory field is left empty
BugWEB-40636Strange intention actions: just 'Yes' and 'No'
BugWEB-40982'Failed to run File Watcher' error is displayed several times in the event log
BugWEB-29424Race condition between saving file and file watcher execution
CosmeticsWEB-40053File Watchers: column header in Settings is not fully visible
HTMLFeatureWEB-41487HTML tags including attributes in JSX blocks can't autocomplete the closing tag
BugWEB-40570JavaScript fragments weirdly converts apostrophes and quotes
BugWEB-378PHP code in conditional comments
BugWEB-42029Broken documentation for TS/JS library symbols in HTML files
BugWEB-41994Repetition of the result of intention 'Missing required attribute'
BugWEB-37786JSX Emmet: wrong expand of the comment filter
UsabilityWEB-41780Show class name label when collapsing JSX tags
ExceptionWEB-41600Invalid file name lib/intellij-xml.jar!/resources/html5-schema/html5chars.ent
JSONFeatureWEB-41515Add editor action for "Copy JSON Pointer to clipboard"
FeatureWEB-38070Complete statement could add quotes on JSON
FeatureWEB-35787JSON: Smarter colon/comma handling before the closing quote (disabled by default)
BugWEB-40927Editor is breaking JSON syntax when inserting new line after key-value pair
TaskWEB-42249Add `babel.config.json` to system schema map
JavaScriptFeatureWEB-41373Support optional chaining in TypeScript and in the type system
FeatureWEB-41508Highlight await once the caret is on async.
FeatureWEB-41553Don't show unexported symbols from libraries in the Go to definition popup
FeatureWEB-38663Add parentheses and implement the body when completing `constructor` keyword
FeatureWEB-32472Validate duplicate ES6 exports in JS
FeatureWEB-38784Support Promise.allSettled
FeatureWEB-40240Suggest awaited items in code completion for promises
FeatureWEB-40404Extract single property from object as a shorthand property, not as spreadElements
FeatureWEB-2089Implement AMD declaration linking
FeatureWEB-39273'Make private/make public should be available for ES6 private fields
FeatureWEB-42028Name suggestions: add unresolved names from the current scope to the list of suggestions
FeatureWEB-41908Bundle language injection for paper.js
BugWEB-41991Readonly check that shows a dialog is invoked from the availability check in ES6MoveModuleMembersHandler
BugWEB-39441CommonJS: completion for exported symbols when using const {freeze} = Object; module.exports = freeze({})
BugWEB-40655Duplicate 'Simplify' items in Alt+Enter for conditional
BugWEB-42106Highlight "arguments" as parameter
BugWEB-40662Intention: Incorrect replacing const with let in for-of loop
BugWEB-28204'Create variable' quick-fix shown when not applicable (in variable type annotation)
BugWEB-42125Moving destructured items via keyboard shortcuts doesn't work for function parameters
BugWEB-41403WebStorm 2019.3 EAP - After a while IDE show warning "unused constant"
BugWEB-40194Quick fix: Joining variable declarations with export removes export
BugWEB-41668False positive "Readonly<T> is not assignable to type {}" for the state inside react component constructors
BugWEB-40962"Script is not in strict mode" when using "use strict" pragma with escaped quotes in injection
BugWEB-41270Incorrect JavaScript warning: 'Value assigned to primitve will be lost'
BugWEB-41764Optional chain tail is not evaluated properly
BugWEB-40776Code completion doesn't work for modules imported using require function created with Node.js createRequire
BugWEB-41041Wrong highlighting for braces in template literals
BugWEB-41927PhpStorm didn't show inferred parameter type in JavaScript
BugWEB-28080Extends ES5 classes with ES6 classes is not supported
BugWEB-41610Javascript: Unresolved variable
BugWEB-38679Type mismatch inspection incorrectly matches JSDoc type expression with destructuring parameter
BugWEB-21935Wrong highlighting for 'del' word in gulpfile.js
BugWEB-41249'Replace nested calls with pipe expressions' is incorrectly applied in Jasmine tests
BugWEB-42109Unexpected "not assignable to type T" warning in JavaScript
BugWEB-41956Can't decline name suggestion for the last parameter when using `function` live template
BugWEB-32695The documentation tool window breaks text in wrong places
BugWEB-42074'Flip ,' works incorrectly with rest parameters
BugWEB-39875JS Intentions: JS: Converting arrow function to anonymous function breaks on IIFE
BugWEB-41958Extra # shown in completion items rendering for #-private fields
BugWEB-41728Resolve default import when .d.ts has no default export
BugWEB-40659Intention "Extract increment" in for loop generates invalid code
BugWEB-41954JS support require calls with references
BugWEB-40538Exception when file has several default exports
BugWEB-41252'Replace nested calls with pipe expressions' looses parameters
BugWEB-40713WebStorm don't consider super() return type as this
BugWEB-40492Unicode code points are not supported in JS identifiers
BugWEB-36893Better mapping of file names to class names in code completion based on file name
BugWEB-42182Properly optimize left-types of logical operators (||, ??)
BugWEB-38545Invalid highlighting for JS Classes after including via require
BugWEB-40637Replace with indexer access produces malformed code in HTML context
BugWEB-36802'Safe delete parameter' should check for usages inside function and show conflicts dialog
BugWEB-41995'Make private using #' cannot be invoked for getters in pure JS
BugWEB-30569ES6 classes: Generated code doesn't take comments at the end of the class into account
BugWEB-40520'Split into declaration and initialization' drops type annotations or creates red code in Flow with destructuring
BugWEB-38392False 'unused definition' when re-defining a property initialized in constructor
BugWEB-38414Auto import in Flow adds path to the IDE bundled definitions for React instead of the project ones
BugWEB-40285'Split into declaration and initialization and move to scope start' duplicates variable initialization in for-in loop
BugWEB-41382Show 'forof' postfix template instead of 'forin' for ES6 typed arrays
BugWEB-36461Double `flip if-else` results in double parenthesis
BugWEB-42196Incorrect processing of destructuring arrays in rest elements
BugWEB-41410Javascript autocomplete for JsDoc @typedef {typeof import('./somefile')} not working anymore in PHPStorm 2019.2
BugWEB-40393'Create Directory/File' fixes don't work with relative paths in 2019.3
BugWEB-38677JSDoc: wrong type mismatch errors when using function type with IIFE
BugWEB-32591Autocompletion not working after importing class instance that was instantiated via factory
BugWEB-31714Make field public QF should change all usages of this field (remove # symbol)
BugWEB-40023Quick fix: JS: shouldn't invoke action of converting "for-in" to "forEach" on object
BugWEB-41303JQuery.proxy warning
BugWEB-41399No completion on Express req/res parameters
BugWEB-40100Merge 'simplify' intention and inspection
BugWEB-38794Incorrect import when copy/pasting code in javascript (only aplies to some imports)
BugWEB-24105'Surround with' doesn't work for object properties with attached JSDoc comment
BugWEB-41980Global resolve works differently inside a class and on the top level
BugWEB-41793Remove 'package-lock.json' from import/require completion
BugWEB-40009JSDocs and Promise all not working
PerformanceWEB-11215large concatenated JS file causes hang
PerformanceWEB-41810Freeze in EDT on type evaluation
UsabilityWEB-41044Lack of clear sorting of object properties in output type hints
UsabilityWEB-41094Allow to move switch-cases with 'Move statement'
UsabilityWEB-40096Quick Fix: JS/TS: "Join Concatenated String Literals" duplicates the functionality of "Compute Constant Value "
UsabilityWEB-41727'Method expression is not of Function type' should be 'Method expression is possibly null/undefined' where appropriate
UsabilityWEB-40195Quick fix: Improve availability of 'Quote/Unquote property names' after lbrace and for commas
UsabilityWEB-38439Typing semicolon doesn't move caret after statement
UsabilityWEB-40964Mismatch settings with the editor for examples in dialog 'Inlay hints'
UsabilityWEB-41542Show type hints for Promise.allSettled-like repeating tuples more conveniently
TaskWEB-40421Support having decorators after the 'export' keyword
TaskWEB-40895Implement JSControlFlowProcessor using CF graph
TaskWEB-37382JS/TS suggest variable names: improve UX and enable by default where that's safe
TaskWEB-40821Enable type hints by default for function parameters
ExceptionWEB-34766"Convert to forEach call on array" exception on invalid code
ExceptionWEB-42268Destructuring using the postfix template fails with "cannot be cast to class" exception
ExceptionWEB-41675NullPointerException when call 'Split into multiple declarations'
JavaScript. FormatterBugWEB-38347Formatting unindents comments in braceless ifs
BugWEB-41063Quote style from javascript is not applied to postfix completion
BugWEB-39888Formatter does not respect TypeScript code style settings for VueJS components using typescript in <script> tag.
BugWEB-38291Reformat Code (Ctrl + Alt + L) deletes empty space between curly brace and 'from' keyword
BugWEB-28301Formatter: support Rearrange Code action inside script tag
BugWEB-13538Wrong indent for comments in chained function calls
BugWEB-40497TypeScript - when 'function declaration parameters' wraps the parameters it unneccesarily wraps lambda function passed as a argument
BugWEB-40900EditorConfig doesn't apply to <script></script> in .vue file
JavaScript. FrameworksFeatureWEB-27946WebStorm complains about attributes on <svg:g> elements
FeatureWEB-41476Vue.js: code completion for source components slot names
FeatureWEB-42083Vue.js: support precise documentation on directives
FeatureWEB-40545Implement quick documentation for vue symbols
FeatureWEB-42220Angular: support new representation of metadata in Angular
FeatureWEB-42113Vue: Provide better type inference when using v-for with an object
FeatureWEB-40909Vue.js: support named slots shorthand
FeatureWEB-40973Vue.js : support components defined in several files via @WithRender decorator
FeatureWEB-42242Angular: support Schematics with Angular CLI 9.0.0
FeatureWEB-41320Angular 8 SVG template unsupported
FeatureWEB-40277Vue: support vuex-class decorators
FeatureWEB-41576Slots are not resolved (slot, v-slot)
FeatureWEB-32487Vue.js. Support local and global filters
FeatureWEB-32274Support Vue components defined using separate JavaScript, HTML and CSS files
FeatureWEB-42016Vue.js: support completion for custom modifiers from web-types
FeatureWEB-28442Vue.js: scoped slots support
BugWEB-41782Completion for v-bind - attribute href is missed
BugWEB-40929Vuex store state/getters/etc are not resolved in attribute values in templates
BugWEB-41717Can't type closing tag in Vue file while indexing is in progress
BugWEB-41349No completion and refactoring for slot props
BugWEB-31286Tabbing on live template $VAR$s in JSX is hijacked by autocomplete
BugWEB-41917Vue.js: 'lang' attribute isn't suggested for completion
BugWEB-41827Cannot resolve imported properties in Vue component
BugWEB-41073Vue.js: instance properties/events from plugins not resolved in templates
BugWEB-29103JSX comment out on simple arrow functions (without {...})
BugWEB-42108Enable "copy-paste with imports" support for vue
BugWEB-41477Vue.js: attribute name is not in code completion on slot tag
BugWEB-40489Invalid comment detection and syntax highlighting issue in JS (React JSX) file
BugWEB-31785React: `props.<props_name>` not resolved unless there is explicit `propTypes` declaration
BugWEB-41544Vue Class Components: Mixin properties are not resolved in template when using uppercase Mixins from 'vue-property-decorator'
BugWEB-42458WebStorm complains about abstract class not being in Angular module
BugWEB-41366Vue is missed in 'File | New'
BugWEB-36502Vue.js: warn about empty tag bodies instead of self-closed tags in compiled vue templates
BugWEB-41654Specify variable type explicitly doesn't produce any changes in code
BugWEB-40955Vue.js: vuetify `v-col` component is reported as unknown
BugWEB-41883"Undefined binding" inspection's severity is ignored when inspecting events.
BugWEB-41713Vue: missing syntax coloring within <script type="text/x-template">
BugWEB-37854Typescript - issues with generic inference from index signatures
BugWEB-41647vuejs computed values resolved as functions instead of values
BugWEB-42230Disable 'Introduce variable', 'Introduce constant' and 'Introduce field' for vue expressions
BugWEB-42112Vue: variables created by v-for are marked as unresolved
BugWEB-30600Vue.js: Component binded with v-model should not warn when the prop definition for value is defined as required
BugWEB-41620Angular: attributes from selectors in ng-content marked as not recognized
BugWEB-41020After 2019.2.1 update Vue + TypeScript + Decorators stopped working
BugWEB-41422Angular: inputs without brackets are reported as unknown if the property type is not explicitly specified
BugWEB-23401TODO not recognized in JSX comments
BugWEB-41026Vuejs v-for index is resolved as array type instead of number
BugWEB-41541No Auto Closing Parenthesis in Vue Single File Components
PerformanceWEB-41427XmlTagNameSynchronizer freezes IDEA due to synchronous angular resolve
UsabilityWEB-41765Vue.js: background color for <script> tag causes usability issues
ExceptionWEB-41350PsiInvalidElementAccessException when call completion in vue.js expression
ExceptionWEB-42076IncompatibleClassChangeError when add .hbs file in vue project
ExceptionWEB-41365NoSuchElementException: Sequence is empty. when type in .vue file
ExceptionWEB-41547IllegalArgumentException: PsiElement(XML_ATTRIBUTE_VALUE).isValidHost() when resolve to file
ExceptionWEB-41704'IllegalArgumentException: Argument for @NotNull parameter' when open the certain project
JavaScript. InspectionsFeatureWEB-40156Add inspection when using trailing commas in destructuring/ functions with rest parameters
FeatureWEB-40394Duplicate declaration inspection for export (specifiers/aliases)
FeatureWEB-40586TS. Accessibility modifier already seen inspection
BugWEB-25157"Unnecessary semicolon" inspection quickfix removes trailing line breaks
BugWEB-24660unresolved file name quickfix cannot create file inside not existed folder
BugWEB-32647Duplicate case inspection works incorrectly for side-effect expressions
BugWEB-41362"Pointless statement or boolean expression" inspection offers incorrect suggestion
BugWEB-32373False positive on redundant escape characters inspection in regular expression built from template string
BugWEB-39775"const variable without initializer" from assigning PHP to inline JS
BugWEB-25169'Flip ,' works incorrectly for destructuring arrays
BugWEB-27499'var to let/const' produces invalid result in 'for' loop
BugWEB-39843Quick fix: JS : Converting a function and its member declarations to a class caused exception
BugWEB-41879'Specify variable type explicitly' shouldn't specify raw literal types in Flow
BugWEB-40911False 'missing await' for async generators
BugWEB-41679'Duplicate case label' should work with string literals in different quotes
BugWEB-29134"unused local-variable/constant" inspection shouldn't provide a quick-fix for required loop variable
BugWEB-40150Unresolved variable
TaskWEB-39873Intention actions "Merge Parallel For Loops" and "Merge Parallel For-In Loops" - either rethink, or remove
JavaScript. RefactoringFeatureWEB-41816JS. Replace for..of with indexed intention
FeatureWEB-14450Provide "Extract Constant" refactoring
FeatureWEB-38972Quick-fix: Convert const to let. remove readonly modifier
FeatureWEB-40033Add an intention action to add a template string argument
FeatureWEB-39691Can't inline variable in destructuring (expected: convert to property access)
FeatureWEB-34116Can't create/extract constant to the top level of the file
FeatureWEB-33038"move function 'myFunc' to 'myFunc.ts'" intention action
BugWEB-40042'Introduce variable' deletes the preceding comment
BugWEB-40833Checking/unchecking 'Optional parameter' in the popup fails for 'Introduce parameter'
BugWEB-39748Extract superclass: making 'abstract' for pure JS throws and also doesn't work with TS fields
BugWEB-37033Typescript: in case of return type mismatch, quick fix should update the whole class hierarchy
BugWEB-42065'await new Promise' can be converted to pipe expression
BugWEB-39368'Introduce variable' is available on invalid selection and breaks code
BugWEB-39719Extract variable: opening/closing quote in selection breaks result
BugWEB-40769Don't inline variables with default values in object destructuring
BugWEB-39746'Extract superclass' creates invalid code when extracting from already extending class
BugWEB-41849"Extract Constant" from substring doesn't enforce 'const' and reuses the var type from 'Extract Variable'
BugWEB-37162'Introduce local variable' produces red when invoked in 'export default' with decorators
BugWEB-39798'Change signature' should handle arrow functions in class hierarchy
BugWEB-7439Extract JavaScript variable fails if using multiple declarations chained in a single 'var' statement
BugWEB-31704'Extract method' for generators should extract generators when possible with updating usages to 'yield * newFunc()'
BugWEB-42023Extract field: don't suggest to initialize in constructor when creating directly from a field initializer
BugWEB-41845"Extract Constant" refactoring shouldn't work with ECMAScript 5.1 and earlier
BugWEB-42324Better validation of names for file name <-> class name matching
BugWEB-35616Comment for typescript class last field is broken after applying intention "Create field"
BugWEB-40957Invalid result of 'Introduce variable' when react function returns parenthesized HTML
BugWEB-38409'Introduce parameter' shouldn't suggest anonymous callback scope
BugWEB-38305Implement all members doesn't respect quote style setting
BugWEB-41989Private (#) references are not updated when 'Extract superclass'
BugWEB-25137WebStorm allows to extract variable with breaking the operator precedence
BugWEB-41876'Generate destructuring patterns' fails on a property of already existing pattern
BugWEB-29335'Extract superclass', 'Pull members up' should move comments around members
BugWEB-40959Inappropriate suggestion to replace string with template string inside flow/typescript type declaration
BugWEB-40040TypeScript - Change method signature is wrong when passing "this"
BugWEB-41960Introduce field should not change other classes
BugWEB-40919Extracting a generator method from a field assigned to a generator breaks code due to ASI not allowed
BugWEB-41723Extracting a variable immediately assigns an auto-generated name to the new variable
BugWEB-39717Extract variable, Template literal: expression in selection breaks result
BugWEB-41103Extract Angular animation into a variable fails
BugWEB-41811Tooltip in 'Introduce constant' isn't shown at the location where the declaration is actually inserted
BugWEB-30408Refactoring: Extract Superclass: static method should not be marked as abstract
BugWEB-41916'Introduce constant' shouldn't suggest global scope if having await expressions
BugWEB-40910'Introduce parameter' shouldn't work with the yield expressions
BugWEB-41961Extract Method refactoring shouldn't suggest outer scopes when having private #-references
UsabilityWEB-41258Do not show refactoring preview when renaming a new file using the "Rename file to match class name" fix
UsabilityWEB-39729WebStorm does't detect labels when refactoring
UsabilityWEB-28271Change signature should better handle TypeScript parameter-properties
UsabilityWEB-17564Refactoring: Extract variable: empty line is added on switching between radiobuttons inside popup
UsabilityWEB-39973Refactoring: JS(ES5): 'Superclass' and 'Field' shouldn't be available to choose from "refactor"
CosmeticsWEB-39913Replace word "lvalue" in warning message about the variable usage on the left side
JavaScript. TemplatesBugWEB-12164Collapse/expand html code in script templates
BugWEB-41895Handlebars: Code is disappearing while editing handlebars fragment
LintersBugWEB-39960Mark modified (*) keep showing after save with ESLint
Live EditBugWEB-7093File is saving after every keypress when using Live Edit
CosmeticsWEB-41338LiveEdit plugin description is outdated
Node.jsFeatureWEB-35034Compatibililty with Yarn PnP (Plug and Play) feature
BugWEB-42176Yarn PnP: Can't run Jest tests
BugWEB-42175Yarn PnP: Imports show long path to a package
BugWEB-40947package.json "Latest version" in quick documentation doesn't refresh
BugWEB-42403Node.js: Cannot Debug Docker Compose configuration
BugWEB-21914angular-cli: Cannot find angular-cli package
BugWEB-40907Rider: Scripts from package.json are not shown in 'Run anything' dialog
BugWEB-23329Output of stdout and stderr are not properly coordinated in Run console
BugWEB-41749Globally installed packages not always appear NPM packages list window
BugWEB-42295Grunt with Yarn PnP: Autofilled run configuration is incorrect
BugWEB-38601Windows: Electron does not show console output when run from npm run configuration
BugWEB-42327Linux: package manager yarn not recognized through nodejs snap
BugWEB-42312Yarn PnP: Exception while trying to apply code style from Eslint
BugWEB-41095package.json homepage url issues
BugWEB-42248Can't run yarn scripts: command\script not found
BugWEB-42171Yarn's version is not shown in 'Preferences for New Projects | Languages & Frameworks | Node.js and NPM'
UsabilityWEB-40794Prevent concurrent NPM install
UsabilityWEB-38864No possibility to show notifications about installing dependencies for a package.json if previously dismissed
TaskWEB-42280Support standard with Yarn PnP
TaskWEB-42131Do not suggest adding node_modules folder to Git
ExceptionWEB-40124Node.js Remote Interpreter: Vagrant: Throwable: Synchronous execution under ReadAction
ProfilingBugWEB-41449NullPointerException when attempting to load heap snapshot
Pug (ex-Jade)BugWEB-27894No folding in PUG in VueJS files
BugWEB-21974jade: unbuffered javascript code not correctly indented
BugWEB-41891Pug's path resolver should not use hard-coded and old extension name
SASSFeatureWEB-41729Add support for new @use and @forward at-rules
FeatureWEB-38529Vue.js ::v-deep support
BugWEB-41982SASS: import path completion doesn't work when using webpack aliases
BugWEB-42000SCSS in HTML snippet in Markdown file: false error for @import '~npm-module/some-file'
BugWEB-42252Parameters in Sass functions in scratch files are marked as unresolved variables
BugWEB-42250SASS/SCSS trailing comma incorrectly seen as error
BugWEB-41886SCSS imports with webpack aliases: wrong 'Cannot resolve directory` warnings shown for packages with `@` prefix
BugWEB-36975SCSS: Webstorm incorrectly reports "mismatched property value" error if function is called `l()`
BugWEB-42158Import scss from node_modules - cannot resolve module node_modules (Vue, SCSS)
StylusBugWEB-41389Stylus: hex color code for opacity not correctly treated
TypeScriptFeatureWEB-41436Support TS control flow assertions and type flow with never-returning calls
FeatureWEB-40667Enable duplicate declaration for type parameters
FeatureWEB-41033Update bundled TypeScript to 3.6
FeatureWEB-40352TypeScript: provide quick fix to insert/remove type arguments for extends/implements case
FeatureWEB-40032TypeScript: provide quick fix to insert/remove type arguments
FeatureWEB-36148TypeScript: new quick fix 'Add "jsx":"react" to tsconfig.json'
FeatureWEB-40789Enable duplicate declaration for union/intersection types
FeatureWEB-41526No auto complete suggestions for ts import in jsdoc
FeatureWEB-42054Allow moving Union types via keyboard shortcuts
FeatureWEB-42328Update bundled TypeScript to 3.7
FeatureWEB-40793Default type parameters should be omitted
FeatureWEB-29437Refactor / Extract Field: add readonly field
FeatureWEB-40531Duplicate declaration for default exports.
BugWEB-42340IteratorResult in presence of node.js typings
BugWEB-40300TypeScript - don't collapse single line comment
BugWEB-41602Container type is computed incorrectly for destructuring in a for-of loop
BugWEB-41948Type is inferred as T | any[] when TypeScript infers just T, causing slowness
BugWEB-40485results of type narrowing outside of shorthanded functions are ignored inside said functions
BugWEB-41480Renaming a property doesn't update usages when using const assertions
BugWEB-41035Completion for declare keyword after export in TypeScript
BugWEB-40481Autocompletion bails for rest parameter typed w/ intersected arrays
BugWEB-40436Field refactoring doesn't pick usage
BugWEB-42105Property completion only provides already inserted items
BugWEB-38395False positive 'method will not be accessible' when changing visibility of class member in namespace
BugWEB-40903TypeScript: false positive type-checking error (and wrong navigation)
BugWEB-40914TypeScript: Property optionality is not processed in some cases
BugWEB-41333Missing typescript suggestion of extended "this" object
BugWEB-41543Getting complete IDE freeze randomly, requiring force quit and restart
BugWEB-41738TypeScript: completion for import() in type context
BugWEB-40966Higher-order type inference fails for mapped types
BugWEB-42311TypeScript: Types references are unresolved
BugWEB-41086Wrong type inferring in typescript
BugWEB-41689Typescript unreachable 'case' branch when exporting enum
BugWEB-41667Incorrect resolving in merging ambient class and function
BugWEB-35889Change signature throws exception when parameter is not described in JSDoc
BugWEB-40660TypeScript. Fix failed if one of the parameters has extends/keyof word
BugWEB-34084Suggestions incomplete for React components when there is an Omit (Pick and Exclude) structure in the type hierarchy
BugWEB-42060"Module is not listed in package.json" error when importing assets into a Typescript Vue component
BugWEB-41661Missing for-of array postfix when iterating over a local
BugWEB-41509Incorrect type when destructuring value in arrow function
BugWEB-40864Overloads don't work after re-exporting
BugWEB-32227TypeScript: show error on initializing optional parameters
BugWEB-40908False positive symbol assignment
BugWEB-42114Wrong inferred type, invalid 'type mismatch' highlighting when using spread with Partial
BugWEB-42078Deleting/adding "less-than sign" should automatically delete/add "greater-than sign" for generic calls
BugWEB-40944Angular - "Make public" quick fix does not work if Decorator is present
BugWEB-39617Cypress & Typescript IntelliSense not working properly
BugWEB-41562Default generic value is not substituted in 'extends'
BugWEB-40893Incorrect indentation for switch-cases code completion: should reindent the inserted case-label automatically
BugWEB-41889Complete current statement inserts parens before explicit generic arguments
BugWEB-40228Type duplication in inlay hints for union types
BugWEB-41597Intention to generate destructuring pattern should generate parameter list parenthesis when needed
BugWEB-42013Typescript file with ts-node shebang is treated as js
BugWEB-40615Enum fields with dot in the name are treated incorrectly
BugWEB-41388Incorrect type inference in TypeScript
BugWEB-40922TypeScript: incorrect smart cast to never
BugWEB-40449@internal not suggested as JSDoc comment
BugWEB-42194'Generate destructuring patterns' doesn't work on a property to which is assigned enum
BugWEB-40795Don't provide auto-complete suggestions for keys in object when you have defined them already (it is non-operation)
BugWEB-39652Refactor inferred params
BugWEB-41490Class fields with non-null assertion are parsed incorrectly
BugWEB-35903Inspection 'Fix all 'Import can be shortened' problems in this file' doesn't work
BugWEB-41042Type hints for variable show redundant information in object destructuring with enum
BugWEB-41724'Propagate to destructuring declaration' should not be available on parameter properties
BugWEB-26888TypeScript: Change Signature dialog: error when adding parameters with initializer
BugWEB-40250Props from parent component are not resolved: incorrect overload is chosen
BugWEB-40827Path mappings aren't used on auto-import if a pattern with wildcard is mapped to exact file name
BugWEB-42149Incorrect type hint
BugWEB-42081Type guard. Narrow string to string literal
BugWEB-41569Completion in class, which implements extended interface with Omit, should suggest all properties
BugWEB-40454"Add braces to arrow function" should not prepend return if method is void
BugWEB-42093Static fields are not evaluated properly when referenced as a qualified name (for instance, in typeof types)
BugWEB-41606Infinite re-indexing of node_modules/
BugWEB-42067Type guard. Narrow unknown type to string literal
BugWEB-41802Typescript import generated with warning (Organize Imports then generates error)
BugWEB-41940Type assertions don't work if we reset null / not null state with the statement
BugWEB-40264TypeScript - Observable type is unknown if takeUntil used as last pipable operator
BugWEB-41884False positive warning for TypeScript type guard function
BugWEB-40897Incorrect "prototype" property in the static type of a enum
BugWEB-41892Spurious "Missing await" inspection warning when a nontrivial expression is being returned
BugWEB-41464Rested destructured parameter is typed to any if nothing else is destructured
BugWEB-40970TypeScript 3.6. ambient class and function can merge
BugWEB-42050WebStorm resolves tuple type param in jest.each to any
BugWEB-40657TypeScript. Insert type arguments completion handler
BugWEB-41966Postfix template shouldn't appear in completion in type annotation
BugWEB-40935TypeScript: incorrect type inference when we pass optional parameter to a method
BugWEB-41003TypeScript: incorrect error message for incompatible members
BugWEB-42103TS Classes sometimes moved to Symbols in Search Everywhere
BugWEB-37898Literals from switch-cases typed by an enum should have references to their source values
BugWEB-29309'Inline' refactoring: allow getter inlining
BugWEB-41374Wrong "statement expected" error when using computed property with decorator
BugWEB-40928False positive type checking error with optional properties
BugWEB-39678TypeScript: Problem with type inference in redux(store.dispatch)
BugWEB-41856Type of response of awaiting supertest function is any (should be response)
BugWEB-40580TS. Extract method should set the parameter type
BugWEB-41466Insert type arguments completion handler should work only in TS files
UsabilityWEB-41591Don't show variables in code completion for 'implements' clause
UsabilityWEB-41345First item isn't pre-selected in completion popup
UsabilityWEB-40275Misleading error message: parent tsconfig.json not found
UsabilityWEB-26722TypeScript: merge inspections/intentions if both provide the same result
UsabilityWEB-41082Improve string literal completion: don't suggest dynamics when not needed and add icons for prop keys
UsabilityWEB-41693Merged methods considered as properties in code completion and parameter info
UsabilityWEB-41430Don't show 'delete' keyword in completion in call arguments
CosmeticsWEB-41652There are two same-named inspections 'TypeScript | Redundant type'
CosmeticsWEB-42068intellijIdeaRulezzz in completion in TS enums
TaskWEB-41495More tests for recursive typescript types
TaskWEB-41519TypeScript: better globs support in "includes" / "excludes" options in tsconfig
TaskWEB-41771Support optional chaining narrowing in common CFA equality guards
ExceptionWEB-42049Error in JS code of typescript service: this.projectService.refreshInferredProjects is not a function
Unit TestsFeatureWEB-19963Cucumber.js: all step references are shown as undefined if feature is written using non-US language
FeatureWEB-41079Add the ".unit" extension to test files patterns
BugWEB-41514jest running no longer works properly in IntelliJ (reports tests as skipped)
BugWEB-41875Support Cucumber steps defined using TypeScript annotations
BugWEB-40585`Rerun failed tests` runs successful tests under failed group (describe)
BugWEB-40351Highlight failed line in the test for shorthanded properties
DB ConnectivityBugDBE-9448Driver files entries order is not saved
UsabilityDBE-9323Connection exception is cut off in the main window
CosmeticsDBE-9357test connection to db - window which is not resizable - inconsistency
DB ConsoleFeatureDBE-5373Add EXPLAIN ANALYZE in context menu for PostgreSQL
BugDBE-3546Database Console doesn't reopen when statement is executed
BugDBE-9523NEXT VALUE FOR [sequence] is no longer working after latest update.
BugDBE-9434Explain Analyse (Raw) action is broken
BugDBE-9478AzureSQL regression in 2019.2.6 - "Unable to verify FIPS mode settings" exception
BugDBE-9550DataGrip: Error when trying to use Quick Documentation on tables containing SQL foreign keys (part 3)
DB DiffBugDBE-7250Schema compare yields inequalities for seemingly equal attributes
DB GeneralBugDBE-9401Data source corruption in recent builds
DB IntrospectionBugDBE-9406Introspection error on Greenplum 6. Source code of routines is not available.
BugDBE-5061DDL for Postgresql trigger misses OF columns block
BugDBE-9433database schemas current schemas can't select
BugDBE-9454multiple-column indexes
BugDBE-9329PostgreSQL 12 generated columns feature breaks introspection
BugDBE-9474H2 view columns are not introspected
BugDBE-9457DataGrip 2019.2.2 does not show DISTRIBUTED BY section for Greenplum v 6 table via "SQL Scripts --> Source Editor"
DB Schema ViewsBugDBE-9267Misleading 'drop schema' handling on insufficient rights
Data Import & ExportBugDBE-9548Creating new table from results contains ambiguous column names
Data ViewsBugDBE-9322Error in 'Load Data' view
BugDBE-9445H2 views cannot be sorted by column
BugDBE-9516`Transpose` action is absent
UsabilityDBE-9549Option to disable autocompletion in Data Editor
PL DebuggerBugDBE-9324Oracle PL debugger: Sometimes debuggers doesn't pick the modified code on second start
TaskDBE-9299Oracle PL debugger: support Type Body
TaskDBE-9274Do not allow to start several debug sessions at once for the same DB console
ExceptionDBE-9297Oracle PL debugger: when a sessions is disconnect, DG throws an unexpected exception "Connection refused to host: 127.0.0.1"
SQL CompletionBugDBE-9504Suggest only "BY" for "ORDER " or "GROUP "
BugDBE-9354select always qualifies the column with table name
UsabilityDBE-9534Better completion for LIKE
UsabilityDBE-9535Better completion for LIKE in the filter field
SQL Format and StyleBugDBE-9458SQL Server query formatting issue: the TOP N clause causes formatter to insert a lot of unnecessary line breaks
SQL GeneralFeatureDBE-9393Support DDL for TASKs
FeatureDBE-9450Snowflake SQL Dialect Should recognize // style comments
BugDBE-9464PostgreSQL 12 COMMIT/ROLLBACK AND CHAIN syntax not recognized
BugDBE-8682Snowflake syntax doesn't recognize USING keyword
BugDBE-9463PostgreSQL 12 REINDEX CONCURRENTLY feature not supported
SQL GenerationFeatureDBE-7976Modify table from data editor
BugDBE-9352Command "Generate DDL to Clipboard" shows incorrect info about fulltext index.
BugDBE-7247Postgres Trigger Definition Does Not Show WHEN condition
BugDBE-5030Foreign Key Creation Doesn't Like Schemas
SQL HighlightingFeatureDBE-3779SQL: inspection for null values
FeatureDBE-8402Inspection and intention for unicode columns in MSSQL
FeatureDBE-9024Ability to suppress sql resolve inspection for the function
FeatureDBE-8688Unreachable code inspection for COALESCE
FeatureDBE-9573Inspection: Insert NULL into NOT NULL column
BugDBE-9542Always true inspection does not work on constants
BugDBE-3815No inspection suppression option for specific unresolved SQL reference?
BugDBE-9336Intentions is not working in existing routines
BugDBE-9468Oracle SQL syntax false error: TRUNCATE TABLE ... CASCADE
BugDBE-9446Add syntax highlighting for command EXPLAIN ANALYZE in Mysql Database
BugDBE-9345Max identifier length inspection
BugDBE-9569Intellij shows false error for 'COMPRESS ADVANCED'
BugDBE-9512Missing syntax highlighting/autocomplete for clickhouse
BugDBE-9281Aggregate-related problems inspection false positive when grouped by primary key
BugDBE-9492Replace DISTINCT with GROUP BY
BugDBE-9564DB console for oracle dialect does falsely reports issue with empty grouping set as : '(' or <expression> expected, got ')'
BugDBE-9467Datagrip syntax checker/linter do not understand the expression "ANALYZE SELECT"
BugDBE-9410T-SQL: Unknown database function 'concat_ws'
BugDBE-9473MariaDB. Unknown database function error for window functions.
BugDBE-9531ORDER BY in subqueries should be highlighted
UsabilityDBE-9543Quick fix should delete COALESCE statement in the first argument cannot be null
SQL RefactoringFeatureDBE-9428Intention to convert JOIN ON to JOIN USING
BugDBE-9568Intention works not correct
SQL ResolveBugDBE-9470PostgreSQL: ORDER BY fields not resolved in a TABLE statement
  • No labels