Child pages
  • IntelliJ IDEA 2018.2 Release Notes
Skip to end of metadata
Go to start of metadata
No subsystemFeatureIDEA-188431Better completion variants in Stream::toArray() method
FeatureIDEA-143537Allow line breaks in scope patterns
FeatureIDEA-186244Analyse Stack Trace does not understand jstack -F traces
FeatureIDEA-187979IJ Internal Statistics: FUSUsagesTrigger for application usages collectors
FeatureIDEA-188135Don't report always true asserts: support expression parts; support assertion methods
FeatureIDEA-97673Feature request: add "fit image to window width" button in image viewer
FeatureIDEA-194897MacBook touch bar: add "Add configuration" button in Run/Debug configuration dialog
FeatureIDEA-190682Support multi ip hosts in client-api RpcUtils
BugIDEA-188452Define context in Live templates. Context can be selected only after second click on it
BugIDEA-184383Large icons since 2017.3
BugIDEA-189153Find usages history keeps reference to PSI via computable icon
BugIDEA-191258Out of memory on opening/reading SVG file.
BugIDEA-191067[win] navigating git log up/down leaves artifacts
BugIDEA-191068After restarted, manually arranged layout jump back to default
BugIDEA-187611Support custom icons for NamedScope to use it in the Project toolwindow
BugIDEA-187182Project encoding wrong after first opening of a solution
BugIDEA-186750Indent guides often disappear
BugIDEA-185495Custom plugin repository URL is lost on IDE restart
BugIDEA-124160search everywhere doesn't get focus
BugIDEA-177327AltGr special characters don't work under Windows 10, instead hotkeys for Ctrl+Alt are initiated
BugIDEA-193180Selecting 'Always show FN-keys at Touch Bar' blows IntelliJ into a billion pieces
BugIDEA-188724Some keyboard shortcuts are not working after pressing ctrl+shift+F/R in terminal
BugIDEA-192359Project Files view in CLion shows two folders as one folder named “A/B” when A doesn't have other content
BugIDEA-190868Go plugin: renaming function does not update function name in project tree
BugIDEA-189737UML diagram titles are broken
BugIDEA-188895Provide API for custom activity providers
BugIDEA-190432NGramEnumeratingService causes Deadlock
BugIDEA-193863exceptions when deleted some .xmls
BugIDEA-184856Rethink the colors of active/inactive toolwindow captions and taking 'No gradient' option as default
BugIDEA-187505Locally-referenced images are not displayed in quick doc
BugIDEA-191450Idea hangs trying to investigate data flow from a `project` parameter of PsiBuilderImpl
BugIDEA-156074"Cannot redo. Unexpected document state" when undoing then redoing in IntelliJ IDEA 2016.2
BugIDEA-185805Reset Default Scheme removes duplicated Scheme
BugIDEA-182889Shortcut conflict: Rerun & Refresh
BugIDEA-188661upgrade batik to 1.9
BugIDEA-188666[batik] missing of width/height rect attribute breaks transcoding
BugIDEA-190535Cannot revert trailed space from diff window
BugIDEA-76438Directory diff: can't resize the columns
BugIDEA-185249modal dialog and <Enter> triggers search
BugIDEA-172173Completion Stats -> factor with null values are ignored during dump
BugIDEA-193747Clicking Help | Register does nothing in a Toolbox-installed PhpStorm
BugIDEA-194169New SE: Keyboard shortcut settings
BugIDEA-185093Second popup sometimes dissapers
BugIDEA-192243Diff Window: Browsing through files by keyboard stopps working when an image cannot be loaded.
BugIDEA-192799Winp exception in the log
BugIDEA-185285Navigate Class/File/Symbol, Find in Path popup windows don't pick characters from input method
BugIDEA-191897Broken SystemInfo.isGNOME on Ubuntu 18.04
BugIDEA-121111Maven and SBT projects are opened as plain directories
BugIDEA-190112Cannot update to new EAP
BugIDEA-187609NPE in sheets when project does not exist
BugIDEA-185930Documentation tab embedded to toolwindows has the 'show tolbar' option that affects quick doc popups only
BugIDEA-186977NullPointerException appears on Welcome screen after typing
BugIDEA-148298File name match regression in version 10
BugIDEA-185305Structure Tool Window Steals Focus After Loading Members of File
BugIDEA-194670Memory leak in DocumentationManager
BugIDEA-194901MacBook touch bar: welcome screen bugs
BugIDEA-192410Find usages doesn't stop searching on tool windows tab closed
BugIDEA-189873Run Dashboard: Del pressing in the Find box in console deletes the current run configuration
BugIDEA-18608438 parrots/build manager auto-make threads
BugIDEA-186858Scrollbars not visible in Run and Debug output - can't scroll
BugIDEA-194890MacBook touch bar: More items button does not work in Run/Debug configurations dialog
BugIDEA-192991WS doesn't keep tab positions on newlines in yml files when switching windows
BugIDEA-191955Focus is lost during typing
BugIDEA-192102Remove close icon from Analyze Stack Trace tab toolbar
BugIDEA-193340Batik 1.10 breaks Xerces 2.11.0 dependencies
BugIDEA-186270TypeAhead NPE if popup is shown without an InputEvent
BugIDEA-193835IDEA starts with error Could not initialize class com.intellij.internal.statistic.eventLog.FeatureUsageLogger
BugIDEA-176405JShell: PsiReferenceExpressionImpl cannot be cast to com.intellij.psi.PsiCodeBlock
BugIDEA-186238Object.getClass() is twice as pure than anything
BugIDEA-185581Can't add new Startup Tasks configuration
BugIDEA-188519Actions that do not show popup because of dumb mode fail typeahead
BugIDEA-188308Custom console font line spacing is not remembered
BugIDEA-193544100% CPU When Memory View (Debugger tool window) is visible
BugIDEA-189011Go to class popup does not fit the screen
BugIDEA-186544NullPointerException in AbstractToolsUsagesCollector
BugIDEA-189461Stop all StackOverflowError
BugIDEA-185770Unable to move quick doc popup
BugIDEA-192579Breakpoints may lose urls
BugIDEA-187695Idea logging from the "Periodic tasks thread" leads to a deadlock
PerformanceIDEA-190829UI freeze during Gradle build
PerformanceIDEA-190794Significant (≥30 sec) UI freeze after directory copy/move
PerformanceIDEA-172762ProjectRootManagerComponent$1.fileTypesChanged on AWT causes 30-60s freeze
UsabilityIDEA-194132Hide JSON widget for Spring Boot YAML configuration files
UsabilityIDEA-186631Confirmation dialog text is trimmed and does not expand when the window is resized
UsabilityIDEA-84622Default "Open directory/project" path and better navigation
UsabilityIDEA-187112UML diagrams: use editor background color for UML tab background on darcula
UsabilityIDEA-160977Not all similar threads are merged
UsabilityIDEA-188401Parameters info tooltip disappears on switching method overloads
UsabilityIDEA-185349Popup disappears before it's possible to hover it
UsabilityIDEA-191596Only one gutter intention is visible
UsabilityIDEA-186172The "Find in Path" dialog box is always on top
UsabilityIDEA-188960pseudo-tooltip very annoying issue
CosmeticsIDEA-188297$FILE$ placeholder is 'unknown' when printing console output
CosmeticsIDEA-190325"Indexing paused due to &Revert"
CosmeticsIDEA-194905MacBook touch bar: use buttons with labels instead of icons in Diff dialog
CosmeticsIDEA-194902MacBook touch bar: debugger improvments
CosmeticsIDEA-194896MacBook touch bar: use close icon instead of close button
CosmeticsIDEA-194893MacBook touch bar: improve Configurations popover
TaskIDEA-189365Get rid of Snappy library
TaskIDEA-194110Turn on Run Anything action in IDEA
TaskIDEA-187791Make JButtons colorable
TaskIDEA-186077provide API for Line/Rectangle pixel-perfect painting in JRE-HiDPI
TaskIDEA-185056Remove pin icon from quick navigate tooltip
ExceptionIDEA-186468NPE at com.intellij.codeInsight.documentation.DocumentationComponent.needsToolbar
ExceptionIDEA-186173NPE at com.intellij.codeInsight.documentation.DocumentationComponent.needsToolbar
ExceptionIDEA-186322NPE at com.intellij.util.ui.UIUtil$JBHtmlEditorKit$1.setUnderlined
ExceptionIDEA-187858NPE on search in settings if nothing was found
ExceptionIDEA-188163BUG | latest EAP Idea ultimate | HttpVirtualFileImpl cannot be cast
ExceptionIDEA-192088Exception when starting IntelliJ
ExceptionIDEA-185991Code analysis in "Commit Changes" dialog fails for php formatter
AndroidBugIDEA-189170Broken JPS inhibits all non-gradle Android builds
BugIDEA-163705JarLoader, make optional logging a fatal error when a jar file is removed
BugIDEA-190632Test sources are not compiled in Android project
BugIDEA-184760UI rendering issues in Android designer
BugIDEA-189515Unable to run Android app
BugIDEA-193964Gradle test runner outputs to console and instead creating test result toolwindow
BugIDEA-192698NPE at com.android.tools.idea.sdk.wizard.InstallSelectedPackagesStep.onEntering(InstallSelectedPackagesStep .java:143)
BugIDEA-185764NPE at com.android.tools.idea.sdk.wizard.InstallSelectedPackagesStep.onEntering(InstallSelectedPackagesStep .java:143)
BugIDEA-186704The IDE doesn't create a new module for Android App
ExceptionIDEA-189524Throwable at com.intellij.xml.util.XmlUtil.findNamespace(XmlUtil.java:222)
AntBugIDEA-173612Ant coloured output configurable
BugIDEA-38486Multiple Ant build file removal removes only the first
BugIDEA-185703Run configuration of Ant Meta Target fails
Code Analysis. DependenciesBugIDEA-187189Analyze Dependency Matrix does not found a class if there is a package with same name
BugIDEA-193128Type hierarchy empty element while it is loading
BugIDEA-188045Call hierarchy doesn't respect overrides and provably distinct "sibling" types
Code Analysis. InspectionFeatureIDEA-93038Inspection: Replace Collections.sort() with Arrays.sort()
FeatureIDEA-175774Reactor inspection: don't implement Publisher or Subscriber yourself
FeatureIDEA-121571Feature request: A Contract Annotation that indicates that a method returns its argument
FeatureIDEA-175780Reactor inspection: unassigned Flux/Mono instance
FeatureIDEA-175784Reactor inspection: do not call blocking operators within a non-blocking scope
FeatureIDEA-49092Inspection profiles: provide possibility to create a scope from inspections dialog
FeatureIDEA-121405Report nullable values assigned to non-annotated fields
BugIDEA-185513Packaging issues > Empty Directory inspection doesn't respect selected scope
BugIDEA-126310Unnecessary toString() call fix breaks code
BugIDEA-187749JSP default package inspection incorrectly displays an error for array types.
BugIDEA-190445Inspection result toolwindow - after excluding some issue cursor disappears
BugIDEA-141239"Manual array to collection copy" produces non-compilable code
BugIDEA-189769Analyze data flow from here should be available on interface members
BugIDEA-194855False positive "Blocking operator in non-blocking scope" for a Flux
BugIDEA-192189"Settings" button disabled in inspections result if focus is in editor
UsabilityIDEA-189380Inspections restore defaults menu option
UsabilityIDEA-192387Not possible to kill inspection quick fix
CosmeticsIDEA-188219"Suppress" button is small
ExceptionIDEA-194975Offline Inspection fails with HeadlessException presumably because EAP version is expired
ExceptionIDEA-188838Keyboard navigation in Inspection Results throws IndexOutOfBoundsException
ExceptionIDEA-190303NPE during JSP code analysis/inspection
Code CoverageFeatureIDEA-102075Update code coverage results to include branch coverage column
FeatureIDEA-191726Update JaCoCo to support Java 10
BugIDEA-190499Run with Coverage: Error occurred during initialization of VM
BugIDEA-185356Code coverage does not refresh correctly
BugIDEA-190928Annotation NotNull changes behaviour of code coverage
BugIDEA-186492IntelliJ Coverage runner does not work with Java 9: Illegal reflective access by TestDiscoveryInstrumenter
BugIDEA-185485Bad class name for files with JSR-45 usage in coverage plugin
BugIDEA-154416Shortcuts for "next uncovered" or "next fully covered" work only once.
BugIDEA-191734Generated report doesn't contain branch coverage
BugIDEA-184699Code coverage Report includes excluded packages
BugIDEA-179136Code Coverage: "Edit Coverage Colors" action could expand the tree of colors to the corresponding line coverage color
UsabilityIDEA-192287Show full package name at coverage view
UsabilityIDEA-179798Coverage view column size is not helpful and user setting is not remembered
ExceptionIDEA-193071Throwable at com.intellij.openapi.application.impl.ApplicationImpl.assertReadAccessAllowed
Code Formatting and Code StyleFeatureIDEA-57898add an option to force a blank line before the end of the class
FeatureIDEA-152088Java Code Style. Add option to not line wrap on import statements
FeatureIDEA-181940Allow ArrangementMatchRule to sort entries with a custom comparator
FeatureIDEA-98499Allow staticly imported class members to have a different style than other constants
FeatureIDEA-151870feature request: code style option to put a semicolon on a line after the last comma of an enum
BugIDEA-191843"Adjust code style settings" adds additional chars
BugIDEA-180049New line after javadoc block in enum.
BugIDEA-153628`Enter` after operator in binary expression should place caret on correctly indented place
BugIDEA-98552for() statement: Place ')' on new line → "incorrect" alignment
BugIDEA-67968Formatter Ignores Empty Space
BugIDEA-186983NullPointerException at saving changed code folding settings
BugIDEA-175560Right parenthesis (rparen) on new line is not indented properly
BugIDEA-175161Javadoc formatter joins lines incorrectly
BugIDEA-166202<pre> tags in Javadoc should not be wrapped
BugIDEA-174605Blank Lines for enum doesn't work properly
BugIDEA-115696Incorrect continuation indentation after string concatenation
BugIDEA-130575Java code style enum wrapping "wrap always" warps also end-of-line comments
BugIDEA-145538Code reformatting forces a space before the colon symbol in a Java foreach statement
BugIDEA-110902File reformatting breaks javadoc @link
BugIDEA-153768JavaDoc formatting for <p> on empty lines creates invalid HTML
BugIDEA-21623Formatter does not respect <pre> tags with attributes
BugIDEA-190462Code format changes ignored (Velocity)
BugIDEA-158493Code formatter adds empty strings when breaking up too long string literal.
BugIDEA-187535Incorrect indent after Enter after a nested code block
BugIDEA-189746Backwards compatibility issue for import/export Code Style?
BugIDEA-189059Line indent provider put caret to wrong position
UsabilityIDEA-145803Code formatter works incorrectly first time after delete try-with-resource
UsabilityIDEA-179426Javadoc @param/@return tag after @param tag with description should not be indented
Code NavigationFeatureIDEA-188351Allow to Navigate to a class within a specified package.
FeatureIDEA-189093Implement Go To Declaration and Go To Implementation for Java 10 var
FeatureIDEA-44323Go to Symbol could handle the results of "copy reference" (eg: com.apptio.biit.server.GraphicsProxyHttpServlet#doGet)
BugIDEA-188178Exception when "//" is typed in the "Navigate to file" popup
BugIDEA-190108IDEA is unable to find interface implementation
BugIDEA-176155Navigate to viewed method after sources download
BugIDEA-190713Navigate Back action works incorrectly after navigate to class
BugIDEA-193708Navigate from enum constant to enum class if no enum constructor is available
BugIDEA-177179Navigate | Class... - navigation by a method reference navigates to the class declaration
BugIDEA-185541Cannot disable search for overriding methods in interface
BugIDEA-194408Exception in 3rd party plugin breaks core functionality
PerformanceIDEA-188959Calculate line marker tooltip in background thread
PerformanceIDEA-187744High CPU usage when idle, never stops
PerformanceIDEA-186086UastReferenceRegistrar should avoid converting elements if no pattern is registered for the respective element type
UsabilityIDEA-187037Provide ability to change name and presentation of 'Navigate | Class' aciton in IntelliJ-based IDEs
UsabilityIDEA-188686'File Path' action should work in dumb mode
ExceptionIDEA-190672IDEA lost all bookmarks
ExceptionIDEA-188549Show Bytecode is enabled for class/file item and causes NPE at ShowByteCodeAction$1.onSuccess()
Code. GenerateBugIDEA-192006Clicking Enter in the "Choose fields to initialize by constructor" dialog was interpreted as OK + new line in the editor
UsabilityIDEA-192185'Insert @Override' by default should be enabled in 'Generate toString()' dialog
ColdFusionBugIDEA-189663CFML: SQL inspection generates an "<expression> expected, got ','" error when pound signs are used in query
BugIDEA-179998CFML: Closing Tag Auto-Completion Not Recognized. Manually Typing Closing Tag Changes Parent Tag and Breaks Indentation.
ExceptionIDEA-188010Unsatisfiable dependency on disabled IntelliLang plugin
Compiling ProjectFeatureIDEA-188958Update "Error Prone" compiler to 2.2.0
FeatureIDEA-110964Introduce module sources artifact
FeatureIDEA-1860672017.3.4 When using Eclipse Compiler it fails with error of unresolved sun.security.pkcs11 package
BugIDEA-141128Compiler 'Make project automatically' breaks auto-save settings
BugIDEA-187753Duplicate annotation in compiled class when Nullable / NotNull Problems inspection is enabled with custom NonNull annotation
BugIDEA-189323Module specific compiler settings doesn't recognize $PROJECT_DIR$
BugIDEA-185574IDEA doesn't delete old output directories after modules have been renamed
BugIDEA-192651Project compilation fails with NPE
BugIDEA-184859Remove dependency from JPS on IntelliJ IDEA installation
BugIDEA-192717ClientCodeException when compiling project with Java 6
BugIDEA-189006After update to version 2018.1, when make code occur the following error
BugIDEA-190284Some errors from the ecj compiler are reported in a bad way
PerformanceIDEA-186710"Messages" view retains a lot of memory
UsabilityIDEA-190622IntelliJ incremental compilation fails to trigger Dagger 2 annotation processor
Configuration ProblemIDEA-184333IDEA compiler cannot resolve Java 9 API when language level is set to smaller than 9
ExceptionIDEA-186848error-prone-plugin does not work with Java 9
ConsoleBugIDEA-188939Toggling soft wrap in the console folds previously unfolded text
BugIDEA-130302First line in console is folded when it is too big (and not command line)
UsabilityIDEA-189608Handle possible misconfiguration of loopback interface in case of connection problems (connection timeouts)
Cucumber JVMBugIDEA-147597Cucumber default run configuration is ignored
BugIDEA-186701Cucumber java run config loses "Glue" and "Feature or folder path"
BugIDEA-184133Cucumber JVM doesn't have shorten classpath option
BugIDEA-192819Cucumber for Java 8 should understand string concatenation in step definition
BugIDEA-185206Cucumber plugin seems not to include asserts of @After Hooks
BugIDEA-185929Cucumber: exception thrown when typing any text after commented test
DatabaseBugIDEA-183999Ignore Unsubmitted Changes grammar error
BugIDEA-169402CSV files not associated with any file type
UsabilityIDEA-177912Database. "Data Sources Detected". It should be possible to click on "Configure" link if the configuration was cancelled before.
UsabilityIDEA-186400No access to (global) data sources properties without "Database" tool window
ExceptionIDEA-194420Throwable at com.intellij.ide.actions.WeighingActionGroup.getAllChildren
ExceptionIDEA-190214Throwable at com.intellij.openapi.application.impl.ApplicationImpl.assertIsDispatchThread
DebuggerFeatureIDEA-191508Breakpoint intentions
FeatureIDEA-172018"Print stacktrace" breakpoint option
FeatureIDEA-153569Copy current thread stack trace
FeatureIDEA-181675Cross-project HotSwap
FeatureIDEA-190644Delete breakpoint with a middle mouse button click
FeatureIDEA-186951Caller method filter
BugIDEA-192070Deadlock while debugging
BugIDEA-187632Remove extra colon in breakpoint configuration
BugIDEA-172425debugger under jdk9 throws NoClassDefFound
BugIDEA-181303java.lang.IllegalArgumentException by org.jetbrains.org.objectweb.asm.ClassVisitor while running JUnit tests with latest EAP
BugIDEA-189504Breakpoints View is bugging in debug view
BugIDEA-193400Duplicated async stacktrace
BugIDEA-190451Variable tree loses focus after "more items" is clicked.
BugIDEA-192962[Mute breakpoints] option is switched off on the debug session start
BugIDEA-191114Incorrect variables mapping inside foreach loops without debug info
BugIDEA-150988Debugger displays incorrect value tooltip for member variables if local variable with same name exists
BugIDEA-186803Debugger frame view doesn't show recursion depth if "show package names" option is off
BugIDEA-187528Quick evaluate with lambdas broken
BugIDEA-94049Debugger: Return ability to set field watch point via alt+gutter click
BugIDEA-159144Can't set breakpoint in lambda that is a field
BugIDEA-128518Map help buttons of the debugger settings
BugIDEA-184352java.io.FileNotFoundException
BugIDEA-190076Incorrect frame state after thread death
BugIDEA-189239Kotlin breakpoint prints 'evaluate and log' message twice
BugIDEA-183804Update default remote debugger config for jdk9
BugIDEA-187709Huge number of captureXXXX.props files created under C:\Users\Миша\AppData\Local\Temp.
BugIDEA-192798[Breakpoint intentions] [Stop/don't stop in the class] correct filter was added using intention, but it doesn't filter anything
BugIDEA-191797Evaluate expression failed in lambda body
BugIDEA-188405Async stacktraces: java.lang.VerifyError: Bad local variable type
BugIDEA-192430Breakpoint intentions [Stop/don't stop in the class] parent class is displayed instead of caller class
BugIDEA-185970Non-java evaluation tooltips do not work
BugIDEA-191140Incorrect variables mapping inside catch block without debug info
BugIDEA-188904Incorrect primitive conversion
BugIDEA-189725'Smart step into' doesn't work immediately sometimes
BugIDEA-189894minor problem with horizontal scrollbar when debugging
BugIDEA-188941char to double/float conversion is not supported
BugIDEA-191337Select All from debug tooltip variable select code editor instead of Tooltip variable value
BugIDEA-188759Attach To Java Process does not show all available Java Process that are started by Intellij.
BugIDEA-187968Expressions in window watches are not editable
BugIDEA-193733history-paste doesn't work in debug-watches, even though it's offered
BugIDEA-187338Async stacktraces may not work with several debug sessions
BugIDEA-127045Unexpected 'step over' behaviour in debugger
BugIDEA-189423Unexpected tokens error in multiline condition
PerformanceIDEA-187063During debugging IntelliJ IDEA gets extremely slow
PerformanceIDEA-184521Please re-enable killing processes via WinP
UsabilityIDEA-147697Debug : can't set the value of long variable
UsabilityIDEA-187893View Breakpoints window should not scroll the breakpoint list when I deselect/select a breakpoint
UsabilityIDEA-186171Turn breakpoint condition field background to pink when there is a syntax error
UsabilityIDEA-130826Prompt user before removing breakpoints with conditions
UsabilityIDEA-194431Async Stracktraces for Platform.runLater
UsabilityIDEA-190833Do not highlight disabled breakpoints
UsabilityIDEA-184710No undo (Ctrl+Z) possible in the "Evaluate Expression" edit field after pressing "Evaluate"
CosmeticsIDEA-192172Text in "Evaluate and log:" field is too small in Presentation mode
CosmeticsIDEA-188878Replace "Stacktraces" with "Stack Traces"
CosmeticsIDEA-191219Font doesn't scale well in presentation mode in debugger view Frames section
TaskIDEA-122113Get rid of NashornJsBreakpointListener
Debugger. Memory ViewBugIDEA-171027memory view decrease performance of the debugger
BugIDEA-185851Populate classes on filter enter
BugIDEA-175146Memory view significantly slows debugger in Android Studio
DecompilerBugIDEA-187608java.lang.ThreadDeath on initial opening of decompiled class
Diff_MergeFeatureIDEA-182364Add action "Compare something"
BugIDEA-189154Partial Commit: "Local Changes" preview does not work if all changes in a file are reverted and applied again
BugIDEA-185924Diff Preview in the LocalChanges is not shown for the image files after they are unshelved
BugIDEA-194913Zoom is broken in Diff for images
BugIDEA-188244Invoking JAR Files Diff does not affect productivity guide statistics
BugIDEA-188245Invoking Directory Diff does not affect productivity guide statistics
BugIDEA-193373Diff in Commit Changes: cannot resize TTF preview below some limit
BugIDEA-170382Unable to use Idea diff command for directories with special symbols
BugIDEA-188761Alt+up/down navigation over method's of the class does not work in diff window
BugIDEA-190698Command line diff : allow diffing single (new) files
BugIDEA-185787Fit image to window: just after opening commit dialog images are not zoomed and are aligned to top
BugIDEA-187715Local history ignore encoding settings and show wrong diff.
UsabilityIDEA-182230VCS "visual merge" window: don't ask "Are you sure" if there was no changes
UsabilityIDEA-90565Diff View:git: do not show LF|CRLF when I have option "automatically convert line separators" on
UsabilityIDEA-191716"Cancel Visual Merge" dialog is shown even with no modifications when pressing Esc
UsabilityIDEA-190466Diff viewer in Local Changes view works incorrect with grouping by repo
DockerFeatureIDEA-184656Support --shm-size, --security-opt, --name options
FeatureIDEA-175476Add option to wrap words in docker logs
FeatureIDEA-175825Add networks option autocompletion
FeatureIDEA-159935Support Multiple Compose files
FeatureIDEA-153443Base directory for Docker deployment
FeatureIDEA-186877Docker. Support --runtime command line option
FeatureIDEA-171362Docker: Provide possibility to choose services to run for Docker Compose
FeatureIDEA-185384Docker. Support --cpus command line option
FeatureIDEA-150690Docker - add --rm option
BugIDEA-175410Docker: Display volumes on "Volume Bindings" without duplicating
BugIDEA-190331DockerCompose. Display volumes on "Volume Bindings" without duplicating if container folder contains "/" at the end
BugIDEA-186907DockerCompose. RunConfig: IDE fatal errors at attempt to choose services for some compose files
BugIDEA-187895Docker: Don't add the tabs from the previous run to the new container
BugIDEA-192393Dockerfile "cannot resolve stage" with valid --from syntax
BugIDEA-187014DockerCompose: Two nodes instead of one when folder name contains punctuation
BugIDEA-164756Docker log tabs added with each new run
BugIDEA-187035DockerCompose: RunConfig: "Environment variables" field. Cut spaces at the beginning/end when saving
BugIDEA-180157Docker Run configuration : replace JSON file with explicitly listed options in CLI format
BugIDEA-194041Number of Attached Console tabs keeps increasing with every container launch
BugIDEA-158702Use default path for docker-compose executable
BugIDEA-187158DockerCompose: RunConfig. Different path separators: "/" and "\" in the "Compose Configuration Files" dialog
BugIDEA-181802DockerCompose syntax highlighting / command shows wrong "Single value is expected"
BugIDEA-158217Docker: stop and delete old container after redeploy, even if container name is not set
BugIDEA-187326Invalid target key inspection in docker-compose.yml
BugIDEA-187496DockerCompose: False inspection error for the value: ulimits
BugIDEA-178756compose YAML: support types with different scalar / sequence / dictionary representation
BugIDEA-186939DockerCompose: No values are taken from .env file
BugIDEA-186934DockerCompose: Deployed ok, but the content of the docker-compose node is empty
BugIDEA-188231DockerCompose: Avoid two-nodes appearance and green tabs by "down" of our compose node
BugIDEA-186952DockerCompose. RunConfig. Choose Configuration File dialog: disable "Ok" until we choose or auto-detect any file
BugIDEA-176049Docker Tab: Freezes happen when there are a lot of containers/images
BugIDEA-194659DockerCompose: impossible to run docker-compose run configuration
BugIDEA-187009Docker, DockerCompose. DockerView: "Show stopped containers" filter doesn't work
BugIDEA-154034Focus on new tab after exec action
BugIDEA-188923Docker pulling progress dialog has negative value for the download size
BugIDEA-187161DockerCompose: Navigation from override files services doesn't work
BugIDEA-194072Dead `--rm` container shown as not removed from the IDE view
BugIDEA-194227Docker: DockerView, Log tab: multiple toolbars at resizing
BugIDEA-186890DockerCompose: correct the path to the chosen compose file: display all the "/" in the same way
UsabilityIDEA-187016DockerCompose: Provide navigation by F4 and double-click from any compose node to the corresponding configuration file
UsabilityIDEA-194040Typing in Attached Console is very slow
UsabilityIDEA-155561Docker. Provide possibility to go to the corresponding Dockerfile from Docker view.
UsabilityIDEA-163754Docker. Container, Exec menu item. Set focus on the command line after Exec-> bash
UsabilityIDEA-187040DockerCompose: RunConfig. "Choose configuration file or folder" dialog: provide multi-selection.
UsabilityIDEA-155346Docker. Container tabs. The focus is not on the new tab if we perform any command two times.
UsabilityIDEA-155340Docker. Add possibility to "inspect" for images.
UsabilityIDEA-188595Docker-Compose: provide navigation from containers to the services in the corresponding configuration file
UsabilityIDEA-187279DockerCompose: Rename "Force build" option
UsabilityIDEA-187025DockerCompose: Change the icon for the root docker-compose nodes
UsabilityIDEA-174112Docker: Docker Machine/Compose Executable: open File Explorer with the selected executable file if it was auto-detected
TaskIDEA-179297Remove dependency on java-impl from Docker plugin.
TaskIDEA-193122Docker: migrate to docker-java to v3.1.0
ExceptionIDEA-193603Docker: IllegalOptionException at saving run configuration with a folder instead of the Dockerfile
DocumentationBugIDEA-191421{@literal foo} in Javadocs doesn't display correctly in CTRL-Q popup - braces display
BugIDEA-188232Invoking Browse external documentation does not affect productivity guide statistics
Editor. Code CompletionFeatureIDEA-192382Override unused imports when adding class with same name
FeatureIDEA-76223Showing Both Autocomplete and Javadoc
BugIDEA-180584Parameter name hints in completion: don't show empty tooltip for extra (invalid) parameter
BugIDEA-138153Determine whether to show autopopup completion in a non-blocking way
BugIDEA-193689IDEA logs of EAP version have eaten all free space of a /home - threaddumps
BugIDEA-185364In the context of a specific inheritance tree, code completion fails to cast expression before a method call in a post-cast scope
BugIDEA-193509Unintended code completion list pops up when typing non-ASCII strings
PerformanceIDEA-186114Code completion is extremely slow
UsabilityIDEA-176647Do not show auto-popup with the exact same name when entering text in the middle of a symbol
UsabilityIDEA-144321LookupElementProximityWeigher should work for all lookup items that have PSI
UsabilityIDEA-189603Multi-parameter completion overwrites code if there is no closing parenthesis
CosmeticsIDEA-187518Support italic in completion lookup element item text
ExceptionIDEA-188584AE at com.intellij.codeInsight.completion.CompletionAssertions.assertHostInfo
ExceptionIDEA-193362java.lang.IllegalStateException: Not in a typed action at this time
Editor. Color SchemesFeatureIDEA-193070"Syntax highlight > Language defaults > Parameter" should have option to inherit from "Identifiers > Default" since it's Identifier
Editor. Editing TextFeatureIDEA-123328When positioned on break/continue, highlight for/while/do it breaks out of
FeatureIDEA-128613collapsed code sections not highlighted for search terms
FeatureIDEA-170770Use different color for scratch files and external classes editor tabs
FeatureIDEA-177411Show external annotations in the code
FeatureIDEA-151939In scroll panel highlight lines with breakpoins
FeatureIDEA-130703Join Lines (Ctrl-Shift-J) could join nested if's
FeatureIDEA-178801Multi-line pasting in line comments
FeatureIDEA-172368'Join lines' could handle increment with 0 nicer
BugIDEA-182771Editor: Split Vertically resets scroll and caret position
BugIDEA-194978Mouse navigation & tooltips handler: take inlay hints into the account
BugIDEA-191159[windows] text in editor can float when parameter hint is on
BugIDEA-185310mouse triple click is not selection whole row.
BugIDEA-189671Editor loses caret (thus focus) after closing one of the two splits using Close (Ctrl+F4)
BugIDEA-108914I can't show the Korean, only □□□□□
BugIDEA-186636Keystrokes lost during freezing
BugIDEA-190665Caret is not repainted correctly
BugIDEA-185869minimized file folded comment issue
BugIDEA-188561Truncated parameter info popup on empty argument list
BugIDEA-190905Blacklisted hint can appears sometimes.
BugIDEA-178503Parameter hint blocks cursor
BugIDEA-192777Builder methods return hints duplication in the editor.
BugIDEA-164133"Optimize imports" adds import which is immediately marked as "Unused import statement"
BugIDEA-186884Can't create a new scratch using New... popup in the Project view
BugIDEA-192288Strange annoying behavior on mouse click in long file in ES6
BugIDEA-188667arg postfix template removes the line part after the invocation point
BugIDEA-188877'<unknown> file changed' error message on undo
BugIDEA-187666Multi-caret does not move uniformly over >= and <=
BugIDEA-187135Pasting multiple lines of Javadoc is broken
BugIDEA-185286PopupFactoryImpl.guessBestPopupLocation(Editor) returns a wrong coordinate.
BugIDEA-192438Underline is always bold underline
BugIDEA-191750Expand selection (ctrl+w) doesn't work correctly for case statements
BugIDEA-188682Moving a Statement through comments mixes up the comment lines
BugIDEA-193436editor component draws a typed char in editor component even if a typed handler does nothing and returns STOP
BugIDEA-187042arg postfix template incorrectly replaces whole line
BugIDEA-189508Parameter names hinting doesn't work correctly with non-ASCII symbols
BugIDEA-192970Jump outside closing bracket/quote: doesn't work if if/while/switch statements were completed
BugIDEA-190660ClassCastException after code reformatting using 'Join Lines'
BugIDEA-108112Ident after enter in Java binary expressions
BugIDEA-192919Custom file type: incorrect Expand selection if word is between backslashes (tested with in C files)
BugIDEA-190254Class name is erased after choosing Add Javadoc action and starting to type
BugIDEA-193224Tabbing out of brackets broken when having to import a class.
BugIDEA-192328Entering a newline between a regular multiline comment and doc comment introduces stray asterisk.
BugIDEA-189701Navigation doesn't work in documentation on hover
BugIDEA-189708Wrong position of completion parameter hint popup
BugIDEA-188770HTML block header sometimes doesn't disappear
BugIDEA-194054Gutter icons of the underlying code displayed on folded region quick view
BugIDEA-192519yml and other files: Editor does not show unquoted devanAgarI unicode characters.
BugIDEA-192700Left gutter is not resized when breakpoint is removed
BugIDEA-186444Pasting a whole line doesn't work properly in Javadoc comments
BugIDEA-189650IDE closes empty files when restarting
BugIDEA-190298Clipboard content pasted twice when assigning mouse shortcut to `Paste`
PerformanceIDEA-189038Slow undo in large file
UsabilityIDEA-157369Order of actions for escape key in editor should be LIFO
UsabilityIDEA-191765soft wrap for active editor switches off
UsabilityIDEA-126440Collapsed comments preview with timeout or button for preview
UsabilityIDEA-189772Weird presentation of collapsed import block, when something deprecated is inside
UsabilityIDEA-186011Smart Backspace isn't smart enough
UsabilityIDEA-191018Selection under diff popup does not work
UsabilityIDEA-186311Kubernetes: Json. Display long messages on scroll-bar as short description with "more" link or as text.
UsabilityIDEA-188800PostfixTemplates: no description for the user-defined and edited built-in templates
UsabilityIDEA-188086Split Editor Tab scrolls back to cursor
UsabilityIDEA-126243Reformatting on typing curly brace should be performed in a separate command
UsabilityIDEA-186314Inconsistent behavior of Home button
CosmeticsIDEA-186054Text cursor is reset to position (1,1) when code editor tab is dragged from primary window to new 2nd window
CosmeticsIDEA-138747Joining line with EOL comment
TaskIDEA-190840Refactor "Line separator" and "Encoding" status bar widgets to share code
ExceptionIDEA-190959Wrong line separators: '\r' at offset 0
ExceptionIDEA-185738NPE at com.intellij.codeInsight.documentation.DocumentationComponent.registerSizeTracker
Editor. Error HighlightingUsabilityIDEA-114803Provide the ability to disable tooltips in editor without disabling inspections
TaskIDEA-188957Add possibility to implement DumbAware highlighting passes
Editor. Intention ActionsBugIDEA-191095Raw string literal RegExp should be recongnized
UsabilityIDEA-193480Unable to add annotations to parameters from the gutter icon
File SystemBugIDEA-193418Deadlock on project open
BugIDEA-188926`VirtualFileManager.refreshWithoutFileWatcher` can take an extremely long time on a Windows FileSystem with a large number of mapped network drives
PerformanceIDEA-191007Too large buffer passed to ReadDirectoryChangesW seriously impacts Windows file system performance
UsabilityIDEA-192665Annoying "External file changes sync may be slow" notification
Find, Replace, Find UsagesFeatureIDEA-59638Actions to navigate to prev/next occurrence of identifier under caret
BugIDEA-188153Next occurrence doesn't work when focus is in folded code
BugIDEA-189518Search in path never completes when using named capturing groups in regexp
BugIDEA-189385Line with both read and write access to a field is shown with read-access icon in 'Show usages' results
BugIDEA-185627Regression: 'Search/Replace in Path' popup doesn't find usages under .idea directory even if explicitly invoked on that directory
BugIDEA-179801Replace in File doesn't find all occurrences
BugIDEA-188789Find in Path: cannot switch between Find and Replace in Path dialogs
BugIDEA-187131Find popup shows incomplete usages and doesn't indicate they're incomplete
BugIDEA-188646Livelock in Git commit dialog during code analysis
BugIDEA-186556Find symbol should show [jdk9] module at beginning of the list when exact name entered
BugIDEA-130620Incorrect find usage on fields if exist methods named like a setter and used in inner class
BugIDEA-185706Search and replace in files is broken.
BugIDEA-191479"Find in Path" partial results can flicker/selection is reset while the search is in progress
BugIDEA-193321SearchEverywhere: on scope switching the 'include non-project items' checkbox loses its state
BugIDEA-170585Disable tooltip for regex find
BugIDEA-190721Accessorr search works incorrect when child field hides parent
BugIDEA-189447"Find in Path" shortcut (Ctrl+Shift+F) not working in "Find in Path" preview window
BugIDEA-189227'File mask' is not saved when switching from 'Find in Path' to 'Replace in Path'
BugIDEA-140859'undo' (ctrl+z) in the 'find' (ctrl+f) box has unexpected behaviour
UsabilityIDEA-186671Find in path: automatically include project files into search scope if *.iml is set as a file mask
UsabilityIDEA-175973Enter file name search popup is not closing itself after losing focus when no value available in textbox.
UsabilityIDEA-184989Navigating from the code preview area (in the find in path window) should keep the cursor position
ExceptionIDEA-193330AIOOBE at com.intellij.ide.actions.searcheverywhere.SearchEverywhereUI$SearchListModel.getContributorForIndex
ExceptionIDEA-189500Search does not work
Flash_FlexBugIDEA-191387Flex intentions produce PSI-text inconsistencies
BugIDEA-189640Actionscript: "Find usages" yields too many results
BugIDEA-172044ActionScript "Missed superclass's constructor invocation"
BugIDEA-189467"Create Field" intention generates property with broken syntax
UsabilityIDEA-119084Quick documentation popup should show method signature even if docs are not available
GradleFeatureIDEA-164636Gradle default task support
FeatureIDEA-189106Add run line marker contributor for tasks defined in gradle groovy scripts
FeatureIDEA-189037Gradle: auto discovery of included builds buildSrc projects
BugIDEA-181144Cannot start main method from compositeBuild
BugIDEA-190103JUnit5 test are not clickable in the Run/Debug view
BugIDEA-190106Gradle sourceset incorrectly considered as submodule
BugIDEA-180830Gradle Kotlin project with Kapt not working
BugIDEA-193631Gradle re-import false positive
BugIDEA-192947Creating gradle configuration for running tests is not recognized by test-runner
BugIDEA-191580Gradle: find usages of 'buildSrc' project sources doesn't work for non-static non-final methods
BugIDEA-188057Kotlin Gradle script created by New Project/Module wizard fails with Gradle 4.1+
BugIDEA-188265Gradle options menu broken
BugIDEA-192927Gradle sync does not stop
BugIDEA-180158Gradle wrapper task configuration download the distribution for every project loaded instead of caching.
BugIDEA-193331Refreshing a composite Gradle 4.8 project fails with "Unable to load class 'org.gradle.composite.internal.IncludedBuildInternal'"
BugIDEA-191341Kotlin project: Intellij custom dependencies imported only after second import
BugIDEA-146140Can not debug tests when maxParallelForks is set in build.gradle
BugIDEA-190592Gradle debug doesn't work on JDK9 and JDK10
BugIDEA-189024Use gradle run configuration to run tasks from gradle groovy DSL context menu
BugIDEA-187971Gradle import fails with NPE for Use JAVA_HOME in gradle jdk combobox
BugIDEA-188526Gradle import doesn't work with java 10
BugIDEA-187683Wrong 'Cannot be applied' warnings are shown in build.gradle file in newly created Gradle project
BugIDEA-191014Cannot Build Project and run tests when having Gradle composite project of multiprojects
BugIDEA-185740Log Gradle project sync reason
BugIDEA-193649Javadoc / sources of dependency not attached when importing Gradle 4.8 project
BugIDEA-189333Gradle: buildscript classpath resolve doesn't work for included build project dependency
BugIDEA-119494Gradle debug doesn't work
BugIDEA-184236Unlinked Gradle Project Dialog does not appear when using build.gradle.kts file.
BugIDEA-194900Project synchronization after upgrading to Gradle 4.8.1 is broken
BugIDEA-189874could not find extension implementation class org.jetbrains.plugins.gradle.config.GradleClassFinder
BugIDEA-182367Gradle auto import option doesn't work with build.gradle.kts
BugIDEA-188096Cannot run TestNG tests using Gradle runner
BugIDEA-188944Gradle: do not use private api to get JavaVersion string representation
BugIDEA-191332Newly created Gradle project is not imported
BugIDEA-190749Application run configuration 'Before launch' doesn't work when the build/run is delegated to Gradle
BugIDEA-188307Non-existent source folders when importing Gradle project
BugIDEA-185436Unable to pass environment variables to Gradle for delegated Application running
BugIDEA-173999IntelliJ does not link Gradle's buildSrc sources and their usage in build scripts
BugIDEA-187904"Rebuild Project" fails for a Gradle project when multi-module buildSrc
BugIDEA-190088Wrong gradle tasks used to run tests of the included build
CosmeticsIDEA-184903Orphan Modules dialogue box has incorrect grammar and should provide more information.
TaskIDEA-193409Upgrade built-in Gradle to 4.8
TaskIDEA-191009Gradle performance automated test
TaskIDEA-190920Collect Gradle sync metrics.
ExceptionIDEA-187230Save all: NCDFE Objenesis at FSTSerializer.<init>(), NCDFE FSTSerializer at DataNode.getSerializer()
GrailsBugIDEA-190240Grails 3 Gson-debug does not work
BugIDEA-186457Idea doesn't detect closure type hints for methods provided by TraitInjector
GroovyFeatureIDEA-191784Support default methods in interfaces
FeatureIDEA-154469Option to generate comments at first column and add a space at comment start
FeatureIDEA-193189Support method references '::'
FeatureIDEA-193165Groovy 2.5 @NamedParam annotation reports incorrect inspection error and warning when used with @NamedVariant annotation
FeatureIDEA-188428Support safe index access ?[]
FeatureIDEA-188429Support try with resources
FeatureIDEA-188424Support ! in 'in' and 'instanceof'
FeatureIDEA-188426Support elvis assignment ?=
FeatureIDEA-188427Support === and !==
FeatureIDEA-188423Support do...while loop
FeatureIDEA-187846Add cast fix for not applicable calls
BugIDEA-190505Down gutter icon says method overrides itself
BugIDEA-194309Groovy 3 syntax: unresolved constructor reference using double colon
BugIDEA-194587Method call is parsed as type cast
BugIDEA-176850@DelegatesTo with DELEGATE_ONLY fails to resolve Class references
BugIDEA-194761Bad code green: slashy string after (triple-) double quoted string
BugIDEA-186243Groovy Console: confusing behavior on re-run of the same code
BugIDEA-190205Code inspection hangs on Groovy Grails code, stackoverflow error
BugIDEA-190433Good code red (groovy): reference to private static class in anonymous class cannot resolve symbol
BugIDEA-194061Formatter: "New line after '('" in "Method call arguments" setting is ignored
BugIDEA-194298Groovy 3 syntax: problems with try-with-resources statement parsing
BugIDEA-186786groovy: view quick documentation is rendered incorrectly for @link
BugIDEA-185208GroovyUnusedDeclaration doesn't recognize "unused"
BugIDEA-187681Good code red in groovy: reference to private inner class in new anonymous class expression is shown as unresolved
BugIDEA-194375Wrong unassigned variable highlighting
BugIDEA-185445Groovy: Good code red: Cannot return null from method returning BigDecimal
BugIDEA-194317Wrong inspection reporting assignments with incompatible types
BugIDEA-192450Can't use Groovy-Eclipse compiler on JDK9
BugIDEA-187605Groovy Copy pasting String with double backslash drops one of them
BugIDEA-192435Inserted FQN is not shortened in class body
BugIDEA-190625String Continuation marked as error
BugIDEA-193040In groovy class in bracket construction don't work static fields and constants from interface in 2018.2 EAP
BugIDEA-191552GROOVY_ALL_JAR_PATTERN and GROOVY_JAR_PATTERN are too strict
BugIDEA-188069Closures cause misplaced tooltips
BugIDEA-192360Unnecessary semicolon inspection: necessary semicolon is highlighted
BugIDEA-191102Refactor groovy type inference
BugIDEA-188366Good code red: references to static inner classes are shown as unresolved in groovy
BugIDEA-186646Cannot compute annotation value if it is a reference
BugIDEA-189966Groovy, Editor confuses List with method of same name
BugIDEA-194446inconsistent goto
BugIDEA-191353unexpected bytecode setting leading to VerifyError
BugIDEA-193285Groovy Slashy String beginning with equals character '='
BugIDEA-187312Javadoc render wrongly in Groovy when methods with multiple parameters are linked
BugIDEA-173503Formatter: "New line after '('" in "Method declaration parameters" setting is ignored
BugIDEA-189193Parentheses in groovy file
BugIDEA-134928Groovy: correct space formatting for : in assert
BugIDEA-187712Incorrect "cannot reference non-static symbol from static context" when getting class name
BugIDEA-193778ExternalProjectServiceTest.groovy has red code but it runs without problems
BugIDEA-186292Parameter name hints doesn't work for negative numbers in Groovy
PerformanceIDEA-193193Typing Groovy code lags/sluggish as compare to Kotlin.
UsabilityIDEA-188500Can't remove parentheses from call in right hand side of assignment
UsabilityIDEA-183317"Run" tool window disappears
UsabilityIDEA-188525Can't remove parentheses from call with empty argument list
UsabilityIDEA-187324"No Groovy library found" when compiling a module with JDK 1.5 with groovy-all-2.4.11.jar
UsabilityIDEA-187576Run Grails Command Window -- CommmandHistory button disabled
UsabilityIDEA-188498Extract variable wraps call into parentheses unnecessarily
TaskIDEA-186327Support for Create Xxx from usage
ExceptionIDEA-194301AE at org.jetbrains.plugins.groovy.lang.resolve.processors.GroovyResolverProcessorBuilder.computeKinds(Gro ovyResolverProcessorBuilder.java:54)
ExceptionIDEA-192905Groovy stubs serialization exception
ExceptionIDEA-186879.IndexNotReadyException at com.intellij.openapi.project.IndexNotReadyException.create
HTML.PreviewBugIDEA-184915IntelliJ doesn't rescale an SVG properly after editing its viewbox property
HibernateBugIDEA-191223problem running hql in hibernate console
IDE ConfigurationFeatureIDEA-183873Do not save frequently changed and not important settings on each save
FeatureIDEA-141077Allow easy live template sharing between different IDEA instances
FeatureIDEA-136387Add a template variable that displays file path from project root.
BugIDEA-187735Comment live template macros show long description text in completion
BugIDEA-188434Can't export Data Source settings
BugIDEA-170111password storage throws exception if config directory is symlink
BugIDEA-172658Reassigned file wildcard for predefined file type is reverted on restart
BugIDEA-189135java.nio.channels.OverlappingFileLockException when idea.config.path and idea.system.path point to the same location
BugIDEA-189920Attribute inheritance flag in Editor color scheme is reverted on Apply
BugIDEA-182780Use system properties to detect boot jdk version in SystemHealthMonitor
BugIDEA-187365Floating license activation over HTTPS on a private network: add 'Test connection' button to Register dialog
BugIDEA-185422Exception when edit custom VM options from Welcome screen
BugIDEA-189452IDEA overwrites write-protected files on saving settings (even with "safe write" option turned off)
BugIDEA-193029Restarting is not supported on GNU/Linux with Python 3 as the only Python interpreter
BugIDEA-192127Launcher Script Should Use Python3 When Available
BugIDEA-188964Error loading kotlin-language facet
BugIDEA-187515Parameter hints enable/disable isn't applied when toggled from action popup
BugIDEA-194876When removing "Other" from "B" live template context, it's reset to "None"
BugIDEA-186546Copyright plugin can't read copyright profile created in IDEA 2017.3
BugIDEA-189445In 2018.1, "Settings | Appearance & Behavior | System Settings | Updates | Automatically check updates" is disabled by default
UsabilityIDEA-193234Sort Live Template Scopes alphabetically
UsabilityIDEA-190017Allow to duplicate postfix templates
UsabilityIDEA-189436IDEA fails to launch with JDK 10 set as IDEA_JDK_64.
UsabilityIDEA-169473Work parameter "ide.no.platform.update" is visible only in the "* .vmoptions" file
UsabilityIDEA-169751Notification in the IDE about low heap memory which clearly tells user to increase an Xmx and provides a convenient way to do it.
ExceptionIDEA-193753MissingResourceException: Can't find resource for bundle java.util.PropertyResourceBundle, key show.new.plugin.page
ExceptionIDEA-188196"Unknown macro $APP_CONFIG$" exception on start
IndicesBugIDEA-190677OOME while indexing images in TeamCity project
BugIDEA-185661Encoding detection requires read action
BugIDEA-188041Uncommitted saved document still leading to "Outdated stub in index" sometimes
BugIDEA-189189Repeated scanning files for index
BugIDEA-194315Spring Boot: application.yaml file opened in Editor while indexing is not recognized as SpringBoot configuration file
BugIDEA-185857Idea hangs after copy/paste files with "Updating indexes" dialog
BugIDEA-181227Throwable: unable to get stub builder
BugIDEA-193172Deadlock while typing after auto completion
PerformanceIDEA-186709freezes on older project open/branch checkout
ExceptionIDEA-188028A test failing with "Outdated stub in index"
Internal build scriptsFeatureIDEA-188583Support generation of Maven artifacts for modules of IntelliJ-based IDEs
BugIDEA-189408Incorrect artifactId is generated for module names which include digits
BugIDEA-189683Building intellij-community from sources fails because of missing jgoodies-common JAR
BugIDEA-188812IDEA with Python plugin run configuration is broken
JPABugIDEA-164504JPA console: it doesn't work if a data source has empty username and password
UsabilityIDEA-180323Resolve should work also by "Assign Data Sources" action by creating projects from github
JSONBugIDEA-193494IndexNotReadyException
ExceptionIDEA-193553Error while indexing .stylelintrc
JSPBugIDEA-121509JSPX: "Reference to classes from the default package": false positive for classes defined in same page
BugIDEA-191271Find usages doesn't find usages in JSPs
BugIDEA-190402Reformat file removes used import
BugIDEA-191394XML qiuck fixes result in PSI-text inconsistency in JSP
JavaFeatureIDEA-177760Add toString() template with 'StringJoiner' for java 8 classes
FeatureIDEA-190558Join lines: smart concatenation of assignment and the subsequent reassignment with the method call
FeatureIDEA-188483launching jshell tool fails with "Cannot determine version for JDK"
FeatureIDEA-54209Join Lines should be able to merge multiple method calls into a chained call
FeatureIDEA-188211Display known dataflow information to the user
FeatureIDEA-188739LVTI: support goto declaration on `var` keyword
FeatureIDEA-190406Raw string literals: insert whitespace + selection to avoid literal till the end of file
FeatureIDEA-189052Support for unreleased java versions
BugIDEA-190370Duplication of records in acceptedLanguageLevels.xm when accept conditions in several project.
BugIDEA-188892Odd behaviour in suggesting return type
BugIDEA-184991Parameter info popup doesn't highlight current item
BugIDEA-185462`JavaCodeBlockModificationListener` can cause out of block in Kotlin code when lazy parsable elements are used (Idea 173 regression)
BugIDEA-191988Template languages: outer elements shouldn't be inserted as the very first children of template data Java elements
BugIDEA-189740Setting JDK-11 doesn't show 'Experimental Feature Alert' right away
BugIDEA-190393When external annotations are enabled, the action works on local variable, but does nothing
BugIDEA-189018Exception type is not detected for "caused by" in Analyze Stacktrace
BugIDEA-192293PsiUtil.isAccessible doesn't change module dependencies
UsabilityIDEA-185968Annoying "Undo?" dialog
ExceptionIDEA-189834UAST exception on invalid java code
Java. Code CompletionFeatureIDEA-190839Code completion for method references
FeatureIDEA-122440Postfix completion: new
FeatureIDEA-188425Add getInstance option in completion popup
FeatureIDEA-187747Suggest Collectors.joining() collector for String stream
FeatureIDEA-188085Smarter order of suggestions when field matches parameter name for "Smart completion"
FeatureIDEA-122461Postfix completion: template to wrap an expression
FeatureIDEA-190023Autogenerate before/after preview for custom postfix completions
FeatureIDEA-86242Code completion do not suggest members of known common supertype
FeatureIDEA-191025New castvar postfix template
FeatureIDEA-186293Smart completion fails when invoked in context of call of inaccessible method
BugIDEA-189285Autocomplete does not work for `var v`
BugIDEA-191500Inappropriate 'Enum.valueOf()' Smart Type suggestion
BugIDEA-189340Does not show Number methods during auto completion
BugIDEA-186367Parameter info popup is confused about overloaded method signature
BugIDEA-185554Redundant cast on autocompletion
BugIDEA-193399JavaClassReference does not provide variants from imported packages on completion
BugIDEA-189536Lambda completion suggestion infers Object `(o) -> {}`, once completion is inserted, IntelliJ infers correct type for `o`
BugIDEA-186652Completion inserts redundant cast
BugIDEA-187504Signature suggestion preferred over primitive type
BugIDEA-186789Completion in empty java file doesn't suggest access modifiers
BugIDEA-45672Type inference for smart completion wrongly suggests collection type
BugIDEA-192209'final' modifier appeared almost in the end of autocompletion list in case of a beginning line with already defined variable
BugIDEA-193049Don't work full java class completion in parametrized method
BugIDEA-186609Redundant cast on autocompletion. Take 2.
BugIDEA-192936A final field initialized in the initialization block is not autocompleted in the constructor as a method invocation parameter
BugIDEA-187354Autocomplete for lambda expressions does not work when multiple constructors are available.
BugIDEA-194462Duplicate unresolved return type suggested
BugIDEA-190041Smart completion doesn't work for generic array satisfying "complex" type constraint
BugIDEA-194812Bad smart completion:
BugIDEA-187483Current completion hint is not highlighted when method call spans multiple lines
BugIDEA-187481finalize() in method proposals for variable declared with var
PerformanceIDEA-185290Too long time takes filling of Ctrl+Space list. (fast code insertion)
PerformanceIDEA-190133Slow completion of lambda parameter
UsabilityIDEA-191883"Tab" completion doesn't work as expected for inner classes
UsabilityIDEA-186020Rework UI texts in Settings | Editor | General | Code Completion
UsabilityIDEA-191954Auto-entering of dot after completed package name is unexpected
UsabilityIDEA-186761Names for suggested variable in 'enhanced for' is not good enough
UsabilityIDEA-190480Annoying import suggestion while writing a new generic method
UsabilityIDEA-186334Show class javadoc-level for .class completion
UsabilityIDEA-189544Inconvenient suggestion for SmartType completion of SortedMap<Integer, SortedSet<String>>
UsabilityIDEA-186522Javadoc completion always generates {@link}
ExceptionIDEA-192477Clicking on "Sort lexicographically" in autopopup completion with documentation leads to an exception
Java. Error HighlightingFeatureIDEA-179708Add support for Checker Framework nullable/non-nullable annotations
FeatureIDEA-188912Suggest to increase language level for unresolved `var` reference
FeatureIDEA-184708In language level 10, highlight modifiers on `requires java.base` as errors
FeatureIDEA-192041Do not show intentions that require a higher language level
FeatureIDEA-192084Suggest elevating visibility level as one of the QuickFixes for "Cannot resolve symbol" error
FeatureIDEA-187474Ternary condition is not boolean: add a quick-fix for method call
FeatureIDEA-187805Support for Java 'Preview (former incubating)' features
FeatureIDEA-187804JEP 323: Local-Variable Syntax for Lambda Parameters
FeatureIDEA-190765Add intention to break Raw String Literal
FeatureIDEA-185819Operator ! cannot be applied to void: add a quick-fix
BugIDEA-187289Javadoc Enum valueOf
BugIDEA-185316Intellij marks non-compile error as compile error in method reference
BugIDEA-187890module-info.java is highlighted red when requiring module with transitive dep
BugIDEA-186306good code red: variable might be assigned in loop
BugIDEA-186305good code red: variable might already have been assigned to
BugIDEA-186304good code red: field might not have been initialized in unreachable branch
BugIDEA-186321Bad code green: non-iterating for-loop update
BugIDEA-186844Editor says compiling code does not compile due to differences in Java types
BugIDEA-189883Bad return type in method reference: cannot convert java.lang.Object to T
BugIDEA-191686Bad code is green (cannot assign a value to final variable)
BugIDEA-191467Bad code is green: incompatible types: cannot infer type-variable(s)
BugIDEA-185447`PsiResolveHelperImpl` should use the **package** of an inner class member to determine module access
BugIDEA-188976Good code underlined red
BugIDEA-156926Formerly green code should be red for JDK 9
BugIDEA-191197Invalid casting is redundant message in editor
BugIDEA-190380Unexpected "no instance(s) of type variable(s) exists" error message issued and broken quickfix suggested
BugIDEA-187930Good code red: unhandled exception in lambda
BugIDEA-188487Editor shows type error but compilation is fine
BugIDEA-189184Functional interface returns checked Exception needs try-catch block or throws section in signature where applied
BugIDEA-193514Bad code green: 'var' is not allowed as an element type of an array
BugIDEA-188623No error for var and void method
BugIDEA-188164Inspection is not work after "Surround with..."
BugIDEA-185309Ambiguous method call false positive?
BugIDEA-185540"Wrong parameter" error is shown for the next parameter instead
BugIDEA-193386Good code is red: Variable may not have been initialized
BugIDEA-186381bad code green: variable might already have been assigned
BugIDEA-186271Error incorrectly reported when inheriting raw types w/ conflicting generic supertypes
BugIDEA-186043Wrong getClass() result type in anonymous class
BugIDEA-188716IntelliJ does not accept reference to private member class
BugIDEA-188880Make interface method 'default' fix: suppress for methods overriding Object methods
BugIDEA-189766Bad code is green: cannot create array with type arguments
BugIDEA-190766Final field reassignment problems in always true/always false polyadic chains
BugIDEA-187378IDEA reports error while the file compiles OK: Cannot access java.lang.AutoCloseable
BugIDEA-187943False positive "Bad return type in lambda expression"
BugIDEA-187330Red code green: method reference for static interface method on subclass
BugIDEA-192037Cannot show compile errors on some specific inner class generics cases
PerformanceIDEA-186416com.intellij.frameworks.akka.codeInspection.PropsParametersInspection slow on long call chains
UsabilityIDEA-180509Wrong compiler error order: 'cannot reference before supertype constructor' comes before 'has private access'
UsabilityIDEA-186432Quick-fixes for unresolved variable is counter-productive
UsabilityIDEA-192204Wrong error with ambiguous method reference
UsabilityIDEA-190912Too much underline for a simple problem like "Unhandled exception"
ExceptionIDEA-193828com.intellij.util.IncorrectOperationException: Incorrect expression '(java.util.concurrent.Callable<null>)() -> x'
ExceptionIDEA-191360PsiInvalidElementAccessException after adding explicit type arguments in red code
Java. InspectionsFeatureIDEA-191905Optional.get without Optional.isPresent can suggest quick fix when Optional.get returns Optional
FeatureIDEA-177466Detect list.remove(int index) called in a loop
FeatureIDEA-182125Mutability tracking support
FeatureIDEA-190440Convert usage of java.util.Map.forEach() to for (... entrySet()) loop
FeatureIDEA-175455"Mismatched query and update of collection" false negative when copy constructor is used
FeatureIDEA-182699Numeric overflow: add an option to ignore if left bitwise shift result makes number negative
FeatureIDEA-179273Nullability check can be simplified when return type is Optional
FeatureIDEA-192155Contract checker: highlight the relevant part of contract
FeatureIDEA-189130Inspection not compatible with Java 10
FeatureIDEA-192236Support opposite expression pairs like `x == null` and `x != null` in boolean expression simplifiers
FeatureIDEA-191767Suggest to simplify Stream.of(...).collect(joining()) with String.join(...)
FeatureIDEA-191762"Call to a native method while locked" should have exception list
FeatureIDEA-184769Support compatqual annotations from Checker Framework
FeatureIDEA-192392Assertions which imply non-nullness should be treated as asserting non-nullness
FeatureIDEA-184914Object allocation in loop doesn't detect LocalDate.now()
FeatureIDEA-176015Allow annotating void methods as pure
FeatureIDEA-191302Introduce new contract return values: this, new, paramX
FeatureIDEA-191305Stream::sorted can be simplified in some cases
FeatureIDEA-190651Suggest to change local variable type if this can remove the cast
FeatureIDEA-176358Improve Unnecessary call to 'String.valueOf()'
FeatureIDEA-186380Restore "Optional.get() without Optional.isPresent()" as a separate inspection
FeatureIDEA-190984Warn if getClass() is called on Class instance
FeatureIDEA-187349Inspection Unnecessary call 'toString' should be smarter
FeatureIDEA-182784Inspection to detect missing .close() for Streams.
FeatureIDEA-187130Inspection: Comparison of primitives with compareTo()
FeatureIDEA-188303Track value escaping
FeatureIDEA-187548Show generic parameters as redundant for non-generic method
FeatureIDEA-188480if-else can be simplified
FeatureIDEA-189237False positive "'Optional.get()' without 'isPresent()' check" in combination with Hamcrest
FeatureIDEA-175914Reactor inspection: Unfinished StepVerifier
FeatureIDEA-191937Contract checker: more checks
FeatureIDEA-192004Suggest adding StandardCharsets constant as a QuickFix for "Implicit usage of platform's default charset"
FeatureIDEA-185729Improve 'Mismatched query and update of collection' by supporting `Map.getOrDefault`
FeatureIDEA-187623Arrays.stream.anyMatch can be simplified
FeatureIDEA-189143Support unrolling of Stream.of(a, b, c)
FeatureIDEA-191536More redundant string operations with indexOf lastIndexOf startsWith
FeatureIDEA-189336New inspection 'Wrapper type may be primitive'
FeatureIDEA-179499New inspection: Should break out common conjunct from "if / else if"
FeatureIDEA-190341Raw string literals: detect redundant leading/trailing "`"
FeatureIDEA-185304"Suspicious collections method calls" does not check second argument of Map.remove(Object, Object)
FeatureIDEA-185548Inspection to remove excessive Comparator.comparing call
FeatureIDEA-189125Store new collection size in DFA
FeatureIDEA-186148Show warning if Set and List are compared using 'equals' method
FeatureIDEA-192161Support "a && b || a" case in "Simplifiable boolean expression" inspection
FeatureIDEA-189855Convert multi-line string literals to raw string and reverse
FeatureIDEA-186859Treat "this" as a variable
FeatureIDEA-191569Warn if stream of 0-1 elements is sorted or distincted
FeatureIDEA-187212Suggest to use Java 10 List/Set/Map.copyOf where possible
FeatureIDEA-187213Stream API migration: support Java 10 toUnmodifiableList/Set/Map collections
FeatureIDEA-187211Suggest using StandardCharsets.XYZ instead of "XYZ" where possible
FeatureIDEA-187214Stream to loop inspection: support Java 10 toUnmodifiableList/Set/Map
FeatureIDEA-187215Support Java10 toUnmodifiableXYZ collectors in dataflow
FeatureIDEA-160435Warn about parallelization of single-element stream
FeatureIDEA-188731Add Cast to expected return type quick fix
FeatureIDEA-176630Inspection: Redundant explicit close() of AutoCloseable
FeatureIDEA-171940Add "ignored if annotated by" to the "Interface which has no concrete subclass" inspection
FeatureIDEA-193573IDEA doesn't recornize static import on replacing by StandardCharsets
FeatureIDEA-187022LinkedList should be included into scope of inspection 'Redundant Collection.addAll'
FeatureIDEA-193227Inspections for checking instanceof: Also detect getClass(), isInstance()
FeatureIDEA-188554Infer method return value immutability from source
FeatureIDEA-188555Warn on List.remove(i) inside a counted loop with `i` index
FeatureIDEA-180165Inspection to simplify chained StringJoiner.add calls
FeatureIDEA-187578Inspection to detect when Optional is compared with null
FeatureIDEA-182268Allow "Access can be private" inspection for fields with specific annotations
FeatureIDEA-193288Inspection to detect Xyz.class.isInstance(foo) and Xyz.class.cast(foo)
FeatureIDEA-188301Map index range to array value in DFA
FeatureIDEA-188306More math operations on DFA
FeatureIDEA-186797'Result of method call ignored' should check methods from java.lang.Thread
FeatureIDEA-185812Allow to force explicit toCollection(ArrayList::new) instead of toList() in "Subsequent steps can be fused into Stream API"
FeatureIDEA-159541Inspection which warns if unstable api is used
FeatureIDEA-191809'finally block which can not complete normally' shouldn't show warning when finally inside main
FeatureIDEA-187123Refactoring suggestion of boolean expression to stream
FeatureIDEA-190548"equals() and hashCode() inspection" should not check abstract methods
FeatureIDEA-189079Warn if nullability constraint annotation are put over primitive fields
FeatureIDEA-184148Inspection to warn if module-info.java contains less dependencies than project model/used by code
FeatureIDEA-186422Red code green DFA: reference on non-initialized field
FeatureIDEA-186507Stream.distinct() can be simplified in certain cases
BugIDEA-193692Dumb change proposed to misc.xml
BugIDEA-186461Mismatched read and write of array should recognize read left of =
BugIDEA-191042"Assignment or return of field with mutable type" to ignore types like guava's ImmutableSet
BugIDEA-191043"Explicit type can be replaced with <>" false positive inside `enum`
BugIDEA-185470false positive "Method 'buildVisitor()' is identical to its super method"
BugIDEA-188158'Inline value for parameter' quick-fix produces incorrect code
BugIDEA-186224Remove redundant cast(s) breaks compilation of Java class with lambda
BugIDEA-191254Quick-fix under "no highlighting, only fix" severity has different activation area in some cases
BugIDEA-186484IntelliJ inspection 'startsWith with single character' generates code with warning
BugIDEA-187756Variable initializer is redundant false-positive when the value is read before write
BugIDEA-187758Variable initializer is redundant false-negative with chained constructors
BugIDEA-189349AtomicFieldUpdaterIssues false-positive on anonymous class constructor
BugIDEA-182842False positive is always null condition when using Spring annotations
BugIDEA-190836Integer division in floating point context misses polyadic expressions with dbl/float dividers
BugIDEA-190804Add import on inner class should work inside extends/implements list of the outer class
BugIDEA-189790Incorrect code analysis for peek() in Deque<E>
BugIDEA-193618Invalid code generated after "Can be replaced with 'collect' call"
BugIDEA-193614IntelliJ replaces the code "var x = new Integer[]{2, 4, 8};" with invalid code "var x = {2, 4, 8};"
BugIDEA-189848Overly strong type cast from (Object[]) to (Object...) false positive
BugIDEA-187205Redundant cast false positive
BugIDEA-192372'Annotate override method parameters as @Nonnull' quick-fix does nothing
BugIDEA-187974Good code red: don't warn on method references if static method is called on a class inheritor
BugIDEA-186267"Field may be final" false positive/fix is not clever enough to fix resulted code
BugIDEA-192339Simplification of statement leads to wrong results
BugIDEA-193827Redundant initializer warning produces incompilable code when `var` is used (java-10)
BugIDEA-186075Honor field initializers works badly when field is used in constructor
BugIDEA-185868RedundantSuppression and UnnecessaryLocalVariable inspection conflict on TeamCity
BugIDEA-191097"Abstract method with missing implementations" inspection ignores abstract classes
BugIDEA-194439Regression: Enum.toString() should not be externally annotated as @NotNull
BugIDEA-192696Javadoc Inspection doesn't catch missing @param for generic method
BugIDEA-192735Field can be local issue.
BugIDEA-187506Deprecation inspection actions should insert SuppressWarnings instead of noinspection
BugIDEA-190591Erroneous inspection of Stream.reduce
BugIDEA-190774'Annotate overriden methods as @NotNull' on method return value removes warning from method parameter
BugIDEA-186034Lambda can be method call inspection should not generate code with inference failures
BugIDEA-194454Replacing stream chain with loop breaks line comment
BugIDEA-151378Numeric overflow in expression does not go away
BugIDEA-193102x > Double.NaN comparison should be highlighted as always false
BugIDEA-193290"Mismatched collection query and update": no warning when update in lambda
BugIDEA-194863Non-sensical warning and quick fix: Condition is always true
BugIDEA-194009False "Redundant step in Stream" inspection
BugIDEA-187094Assume.assumeNotNull() from JUnit is not taken into account by the NullPointerException-related inspection
BugIDEA-188833var type with explicit type cast for non inferable initializer type
BugIDEA-192521Expect warning "Always true" when double compared to NaN and negated
BugIDEA-192527warning persists on field when overriding @Nonnull custom annotation with a @Nonnull(When.Maybe) annotation
BugIDEA-194278"Too weak variable type leads to unnecessary cast" does not detect some cases
BugIDEA-193726Nullable/NotNull inspection false positive ("Parameter annotated @Nullable should not receive null as an argument")
BugIDEA-187543"Value is always ..." inspection's quick fix encourages to worsen code readibility
BugIDEA-189606'try can use automatic resource management' false positive when the resource is used in the exception handling block
BugIDEA-187321Static method referenced via subclass should warn on method reference
BugIDEA-193167False positive "Condition is always true" with two boolean comparisons in one expression
BugIDEA-188872Java analyzer does not handle static initialization blocks correctly
BugIDEA-186732Incorrect nullability analysis when using method reference
BugIDEA-189459"Test class with no tests" inspection doesn't check for double-nested JUnit 5 tests
BugIDEA-191856"Replace Optional.isPresent() condition with functional style expression" creates bad code when used with Type Promotion
BugIDEA-187493False "Field may be final" inspection
BugIDEA-187645NPE warning is not issued when "null -> null" method is called with Nullable argument
BugIDEA-191876Bug in 'Condition is always true' inspection when comparing with NaNs
BugIDEA-193530"Replace with 'try' with resources" generates incorrect (and invalid) code
BugIDEA-187625Overriden methods are not annotated should not complain about generated implementation
BugIDEA-185448IDEA wrongly reports that casting is redundant
BugIDEA-193915Quick-fix to add generic parameter to javadoc works incorrectly
BugIDEA-187764'RedundantCast' inspection gives false positive on conditional expression
BugIDEA-185956RedundantSuppression and WhileLoopSpinsOnField inspection problem
BugIDEA-192226Don`t inlined a value if the character is '\n'
BugIDEA-187410Unnecessary call to 'String.valueOf()' problems
BugIDEA-191576@NotNull/@Nullable problems inspections warns where it shall not
BugIDEA-191570Mutates contracts should be changed from "argN" to "paramN"
BugIDEA-188026Inspection "'if' statement replaceable with 'switch' statement" can introduce NPE
BugIDEA-192148"Actual method parameter is the same constant" inspection suggestion changes code behavior
BugIDEA-187041Cannot stop inspection from reporting certain ignored return values.
BugIDEA-183753False positive redundant throws clause
BugIDEA-191776Contract checker checks inferred contract and does it incorrectly
BugIDEA-161979Inner class field access makes "updated, but never queried" inspection inconsistent
BugIDEA-185994False positive on "Type may be weakened"
BugIDEA-184105"too broad scope" false positive
BugIDEA-193196Wrong 'always false' warning when comparing floating point value with constant
BugIDEA-188598Inspection "Simplify stream API call chains" is missing some warnings when using method references
BugIDEA-185066method should not be highlighted redundant
BugIDEA-192123Don't follow code after System.exit() in the nullability system
BugIDEA-188897Replacing 'List<?>' with 'var' creates red code
BugIDEA-187020"Weaken" inspection resolution breaks code
BugIDEA-188088Suspicious parameter/name combination does not work for camelCaseWords
BugIDEA-190938Spell check should work inside raw string literals
BugIDEA-192300Redundant If statement inspection does not work with else if
BugIDEA-192301"Extract common part" loses comment
BugIDEA-193876Replace explicit type with var misses annotations
BugIDEA-188969Tool 'ReplaceNullCheck' registers INFORMATION level problem in batch mode on PsiJavaFile:AssertArrayEquals.java.
BugIDEA-194440Can't see expected inferred Unmodifiable annotation for List.of
BugIDEA-191982"Replace with 'try' with resources" QuickFix breaks the code
BugIDEA-190764Inspection "Type may be weakened": false positive: lambda method return type constraint is not checked
BugIDEA-186024'Abstract class may be interface; Inspection Incorrect if Class Overrides Object Class Method(s)
BugIDEA-189865Support class.isAssignableFrom and class.isInstance in DFA
BugIDEA-185830Inspection "Actual method paramonstant" works not always parameter is the same constant.
BugIDEA-191374DFA: "condition `x instanceof X` can be replaced with a null check" is not reported
BugIDEA-193548Redundant cast not reported on Java class fields
BugIDEA-189010Return value of the method is never used: does not work in method reference/expression lambdas with void SAM
BugIDEA-187941Field naming convention: "Constant with mutable field type" does not recognize UnmodifiableCollection
BugIDEA-193097Redundant cast is reported for cast on functional expression inside synchronized()
BugIDEA-193096Unnecessary boxing is reported for synchronized statement
BugIDEA-193896"Can be final" is not true
BugIDEA-171866False positive I/O, JDBC resource opened but not safely closed
BugIDEA-188117"Remove redundant call to String.format()" loses comment
BugIDEA-189448SimplifyOptionalCallChains recommends incorrect simplification
BugIDEA-189199'equals()' should check the class of its parameter: false-positive on method reference
BugIDEA-185753false positive: contract violated
BugIDEA-188283"Rationalize static field access" is broken in master
BugIDEA-188134Set inspection option fix does not work when options differ by scope
BugIDEA-189427'Overly strong type cast' false positive
PerformanceIDEA-193987IDE freeze when turn on code inspection data flow for Java
UsabilityIDEA-185683'Constant conditions & exceptions' inspection mockito false positive
UsabilityIDEA-187442Annotation used in package-info.java is reported as unused by Analyze | Inspect Code...
UsabilityIDEA-189214private methods called from entry points are flagged with Unused Declaration warning
UsabilityIDEA-188447Unnecessary static import of inner enum
UsabilityIDEA-193645'Collections.sort() can be replaced with List.sort()' shouldn't show warning for java 7 modules
UsabilityIDEA-185303"Suspicious collections method calls" message for Maps should distinguish between keys and values
UsabilityIDEA-185345"Catch block may ignore exception" settings considerations
UsabilityIDEA-187319Rationalize static field reference on subclass can be cleanup inspection
UsabilityIDEA-190727Replace instanceof with null-check could automatically eliminate double negation
UsabilityIDEA-192829Do not show warning about missing NotNull annotation for Enum methods.
CosmeticsIDEA-192842Change text in the Infer Nullity Annotations warning
CosmeticsIDEA-186767Magic constant: false positive for JFrame.EXIT_ON_CLOSE
CosmeticsIDEA-188730Omit default 'java.lang' package name in FQNs for brevity
CosmeticsIDEA-193810Inspection 'Standard Charset object can be used' doesn't show warning for ASCII
ExceptionIDEA-186946TooBroadScopeInspectionBase: ClassCastException: com.intellij.psi.impl.source.PsiJavaCodeReferenceElementImpl cannot be cast to com.intellij.psi.PsiReferenceExpression
ExceptionIDEA-186242SOE in EqualsBetweenInconvertibleTypesInspection
ExceptionIDEA-186126TryFinallyCanBeTryWithResourcesInspection quick fix inspection
Java. Intention ActionsFeatureIDEA-186488Merge "Annotate as Nullable/NotNull/Deprecated" actions under submenu
FeatureIDEA-192090IDE doesn't suggest imports if field has the same name as a type
FeatureIDEA-187224Add inspection for substring with String#length as second param
FeatureIDEA-189928Create fix for Java 10 when non final value changes in lambda or anonymous class
FeatureIDEA-190570Replace strings concatenation with Java 8 String.join
FeatureIDEA-190559Intention to introduce a local variable could be made available for the 'return' statement
FeatureIDEA-189833Create quick fix to create type parameter for unresolved reference
FeatureIDEA-185652Improve StringBulder.append(s.substring(1,2)) intention
FeatureIDEA-190412Unroll loop action: support decreasing loops
FeatureIDEA-185852'Sort content' may also sort generic varargs
FeatureIDEA-188826Add an option to cast to String in Intention Menu
FeatureIDEA-190067Add "Change type" intention for field when passing a field to a method
BugIDEA-185274"Replace 'String.format' with concatenation" intention discards character after %s
BugIDEA-192252"Remove unnecessary parentheses" produces PSI-text inconcistency on commutative operators
BugIDEA-186712I think that PsiType is not interesting for user
BugIDEA-189828Add exception to existing catch clause should be suggested for fields of anonymous classes
BugIDEA-192056"Annotate" action isn't available in decompiled classes
BugIDEA-189633Quickfix intention confused by type parameters and doesn't resolve problem
BugIDEA-185491'Create Service Interface of Class' dialog should allow to create Annotation as well
BugIDEA-187595Quick Fix for method throwing a local Exception subclass.
BugIDEA-189654Add to existing catch clause should not be available inside finally block
BugIDEA-194648Simpler expression auto-fix results in different code
BugIDEA-185967Intention 'Cast parameter to' doesn't resolve problem for generic method parameter
BugIDEA-185965Do not suggest to extract condition to internal 'if' for 'while(true)' loop
BugIDEA-188072"Merge sequential if" exception when there's intervening comment
BugIDEA-188068Variable might not have been initialized if a method is missing the return type
BugIDEA-190473Type cast fix should not be suggested with non denotable types from Java 10
BugIDEA-193829"Expand boolean" produces incorrect code when boolean is declared using java 10 'var'
BugIDEA-193338Incorrect "Replace with `throws Object`" suggestion
BugIDEA-193339"Replace with Exception" loses comment
BugIDEA-193337"Remove explicit array creation" loses comment
BugIDEA-187524"Move assignment to field declaration" loses comment on class initializer
BugIDEA-190203Intention 'Extract common part with variables from if' creates invalid code for array assignments.
BugIDEA-189596"Add exception to method signature" does not fix code in local class
BugIDEA-189904Quick-fix for replacing deprecated code doesn't work for library methods
BugIDEA-186037"Add braces to 'if' statement" puts the body onto the same line without any spaces
BugIDEA-185629When «Private field is never assigned» «Suppress for fields annotated by ...» is sometimes absent in popup.
BugIDEA-193106Intention 'Replace with if statement' extracts wrong conditional expression
BugIDEA-192528Inadequate "Create Type Parameter suggestion"
BugIDEA-192896"Create field for constructor parameter" not available
BugIDEA-185786'Sort content' may produce too long lines when data contains comments
BugIDEA-192775Wrong create type parameter suggestion
BugIDEA-192541DeMorgan intentions break PSI-text consistency within polyadic expressions
BugIDEA-192543"Unwrap else branch" breaks PSI-text consistency
BugIDEA-189822"Sort content" breaks code in presence of comments
BugIDEA-186479Cannot cast variable to method's return type
BugIDEA-186499Create abstract method in abstract class has private access modifier (and syntax error)
BugIDEA-192268ConvertToLocal intention for field incorrectly treats its javadoc comment
BugIDEA-193174'Ambiguous method call' quick fix proposes int instead of Integer
BugIDEA-193066boolean used for new symbol instead of known Object-type for intention "Create local variable", parameter etc
BugIDEA-193060"Create type parameter" intention non-sensical when assigning to unknown target
BugIDEA-191778"Add Single-Member Static Import" intention produces red code
BugIDEA-191774Add on demand static import incorrectly available
BugIDEA-192958"Split into declaration and assignment" is incomplete for non-terminated statement
BugIDEA-188061'Replace qualified name with import' on inaccessible class reference in Javadoc results in red code
BugIDEA-188063"Replace method reference with lambda" loses comment
BugIDEA-188908IDEA shows popup for add import for file from library source
BugIDEA-192129Logic is changed when an 'if' statement is simplified
BugIDEA-187531"Add on demand static import" with intervening comment and an empty line breaks code
BugIDEA-188556Convert inferred annotation to explicit: properly react on Unmodifiable/UnmodifiableView inference
BugIDEA-192688Inline constant param doesn't work properly when string contains escaped character
BugIDEA-188021"Move assignment to field declaration" leaves comment in class initializer
BugIDEA-193499"Replace with 'if' statement" on code "var key = first != null ? first : second;" generates invalid code (for Java 10)
BugIDEA-185790"Declaration access can be weaker" inspection could be even weaker
BugIDEA-189268HashCode template "java.util.Objects.equals and hashCode (java 7+)" inserts a superfluous empty line.
BugIDEA-182071"Generate > Implement methods" uses wrong wrapping margin
BugIDEA-52481"Manual array copy" quick fix produces exception-causing code
BugIDEA-187940Annotation parameters are not copied when implementing methods
BugIDEA-188115"Inline call to getter" loses comment
BugIDEA-186826"Add on-demand static import" removes method reference qualified
PerformanceIDEA-193479Java editor hangs when navigating around code that doesn't compile
UsabilityIDEA-185785Inconsistency in availability of 'Sort content' intention depending on parameters
UsabilityIDEA-192837Suppress for methods annotated by 'xyz' action is confusing
CosmeticsIDEA-185492'Create service implementation' UI - align labels vertically
ExceptionIDEA-187526"Add static import" with an intervening comment leads to exception
ExceptionIDEA-185843Can not save new template for equals and hashCode
ExceptionIDEA-185784IndexOutOfBoundsException applying 'Sort content' intention
ExceptionIDEA-177291Control flow fails with an exception during "Invert if condition" on incorrect code
ExceptionIDEA-192532PIEAE when inverting if condition on red code
ExceptionIDEA-188113"Create property appOutputPath" leads to exception
ExceptionIDEA-190299Exception during "Split into declaration and assignment" on invalid code
Java. RefactoringFeatureIDEA-190923Push members down don't "merge" interface method with implementations
FeatureIDEA-185245Show a preview panel for the Extract Method refactoring in the case where duplicates are found
FeatureIDEA-186125Module was renamed but its name within module-info.java remains the same
FeatureIDEA-192602Convert @Contract annotation on Java method signature change
FeatureIDEA-191690Inline method: less restrictions on tail call
BugIDEA-186928Inlining method with recursive method reference should be impossible
BugIDEA-187777Change signature refactoring applied to SAM updates lambda badly
BugIDEA-192159Inlining a variable adds cast to var
BugIDEA-186773Refactoring preview does not exclude removed entries
BugIDEA-194709"Extract Parameters to Replace Duplicates" dialog ignores existing duplicates if original signature is kept
BugIDEA-186323Inlining base class with constants will alter subclasses to reference constants in inline target subclass
BugIDEA-186590Pull static method up to interface breaks code
BugIDEA-192378Additional configurations are lost during extracting methods with preview
BugIDEA-188243A duplicate is not recognized when extracting a method
BugIDEA-189557Extract method preview marks modified code fragments as invalid after the changes are undone
BugIDEA-189949Encapsulate Field Refactoring results in compilation error
BugIDEA-188894Red code after extracting method from duplicate fragments
BugIDEA-189384Add context to diff view of extract method preview
BugIDEA-187991Wrong warning when converting to default interface method
BugIDEA-189023Suggested signature change produces red code for the extracted method with an array argument
BugIDEA-192246'Access static via class reference' quick-fix do nothing
BugIDEA-135785Extract parameter, constant and field produces wrong code for array initializers
BugIDEA-191899After changing the method signature the method's body becomes trivial
BugIDEA-186122"Introduce functional parameter" should create a lambda
BugIDEA-192542If user extracts part of the duplicated statement then differences are not shown in preview
BugIDEA-192850Mixed up constructor parameters order in extracted super class
BugIDEA-191147Misleading "Variable is never used before modification" error message when trying to do an inline-refactoring while there are compile-errors
BugIDEA-186605Do not suggest renaming variable when it already has the same name as the class
BugIDEA-190409'Push Member Down' creating broken code when pushing down implementation of one interface to another
BugIDEA-190911Moving public static field from one class to another should remove redundant modifier
BugIDEA-191185Moving a class to a new package doesn't work if I need to add the folder to SVN first
BugIDEA-191187'Inline super class' should be aware of inner classes
BugIDEA-191186Package is not remembered after "moving inner class to upper level",
BugIDEA-191189'Inline super class' creates duplicate method
BugIDEA-185872Refactoring - move enum to inner class without static modifier
BugIDEA-194463Comments lost in extract method preview
BugIDEA-187089Simplify Java "redundant if" removes comments
BugIDEA-189238Cannot extract Comparator to constant
BugIDEA-193287Refactor | Extract Method fails with ArrayIndexOutOfBoundsException
BugIDEA-185798Import placed at the same row as javadoc for class after 'Create constructor'
BugIDEA-193132Refactoring "Extract superclass" with varargs creates uncompileable code.
BugIDEA-189465Strange 'No found' message during method extraction
BugIDEA-189200Pull Up Method Refactoring results in compilation error
PerformanceIDEA-185248OutOfMemory when running large migration
UsabilityIDEA-188992'Extract Variable' should show earlier warning about impossibility of extraction from field initializer
UsabilityIDEA-191425Refactor / make static raises "Method reference will be corrupted" warning instead of converting method reference to lambda
UsabilityIDEA-186331Introduce variable doesn't expect double value with '.' at the end
UsabilityIDEA-186606Variable renaming code preview should expand folded regions
CosmeticsIDEA-189278Strange colors and cutting in preview duplicates during method extract
CosmeticsIDEA-191188Duplicate constructor name in message when try to inline super class
TaskIDEA-191399Refactor DuplicatesFinder
ExceptionIDEA-188127Extract Java method fails with exception
ExceptionIDEA-186521Exception on extract method inside anonymous class
JavaEEBugIDEA-180265JavaEE8: support 4.0 deployment descriptor version
PerformanceIDEA-192420Memory leak: LibraryModel.myLibraries
JavaEE. Deployment and RunPerformanceIDEA-189009Run Config Dialog for Payara increadibly slow
JavaEE.JBossBugIDEA-187787Unable to deploy on WildFly 12 Final with Java 9
JavaEE.StrutsBugIDEA-194195OGNL Sanity Test: failed completion with OgnlNewArrayExpression
BugIDEA-194802OGNL Sanity Test Fail - OgnlVariableExpression ref
BugIDEA-194799OGNL: Sanity Test Fail OgnlReferenceExpressionBase
JavaFXBugIDEA-187363New FXML File in the Web tool window does nothing
JavaScriptBugIDEA-190826@NotNull method com/intellij/lang/javascript/nashorn/library/NashornJSLibraryProvider$1.compute must not return null
BugIDEA-190598Nashorn JS with Java 9: IDE does not support class declaration
KubernetesFeatureIDEA-185224Kubernetes: Yaml. Validate Integer values
BugIDEA-187853Kubernetes. Yml. Labels: false inspection by empty label values
BugIDEA-187343Kubernetes: improve "Change Notes" for plugin
BugIDEA-184998Kubernetes: Yml. QuickHelp. Show it for the completion list items
BugIDEA-187357Kubernetes. Yml. Labels: false inspection by empty labelValue and absent error at key/value ending with "_"
BugIDEA-185004Kubernetes: Yml. QuickHelp. It's impossible to restore it as popup from keyboard
UsabilityIDEA-183805Kubernetes: update the view of the quickhelp
CosmeticsIDEA-187399DockerCompose. Kubernetes. Inspections. Start the parent node name from the upper-case letter.
ExceptionIDEA-192537java.lang.Throwable: Do not call synchronous refresh under read lock (except from EDT)
Language InjectionBugIDEA-188783Intellij IDEA 2018.1RC#IU-181.4203.519 freezes frequently on start and during project build
BugIDEA-185223Highlighting in injected code updating inconsistently
BugIDEA-188988<statement> or DELIMITER expected in Java constants
BugIDEA-87358CDATA is required in order to have FreeMarker IntelliLang support
BugIDEA-191232Injected language fold regions aren't cleaned up if the injected document becomes invalid
MavenFeatureIDEA-154970Support searching Maven artifacts in Jcenter (jcenter.bintray.com)
FeatureIDEA-150621Maven integration: add support for maven-compiler-plugin 3.5 option annotationProcessorPaths
FeatureIDEA-188940Maven integration: add support for maven-compiler-plugin option annotationProcessorPaths with project dependencies
BugIDEA-96358Maven: cannot resolve environment variables
BugIDEA-190332Provide search by library name for custom bintray repositories
BugIDEA-192401Run configurations disappear from Maven Projects tool window when working directory path differs in case on Windows
BugIDEA-191328Compilation does not recognize test-jar dependency
BugIDEA-125737maven compiler settings -> IDEA compiler settings
BugIDEA-190400Runtime dependencies from Maven Library pom.xml are not resolved
BugIDEA-120881Maven: war: support 'nonFilteredFileExtensions' configuration option
BugIDEA-184868Maven projects with non-default pom file names: adding some goals as before-run task to run configuration from Maven Projects View fails
BugIDEA-189073IntelliJ 2018.1 - Maven warSourceExcludes / Build Artifact Not Working Correctly? (Edited)
BugIDEA-67322Maven: IDEA cannot parse POM correctly if parent POM reference contains property placeholder
UsabilityIDEA-158549Maven plugin configuration reports "Invalid Maven home directory"
OSGiTaskIDEA-184034Upgrade Bndlib
Packaging and InstallationFeatureIDEA-194011Turn vcs.log.graph module into a healthy maven dependency
FeatureIDEA-187290New balloon notification: IDE update has been applied
FeatureIDEA-187763Register our IDE for compatible file type on macOS
BugIDEA-122925IntelliJ Fails to apply IDE update patch due to faulty "IOException: No Space Left on Device /tmp"
BugIDEA-189387Pycharm 2018.1 won't start after patch update
BugIDEA-194822Incorrect sed command in non OS_TYPE Linix libyjpagent check breaks non Linux startup
BugIDEA-190448Missing 'config' dir in Install-Linux-tar.txt instructions
BugIDEA-193348The IDE has been updated by Snap shouldn't be shown on macOS
BugIDEA-167297After broken update can't run pycharm
BugIDEA-162267Update requires excessive disk space
BugIDEA-188130Launcher should be able to recover when config/port contains invalid value
UsabilityIDEA-46819Updater should automatically download patch in background
UsabilityIDEA-185044Show list of used third-party libraries directly in the IDE
UsabilityIDEA-191432Force "Download and install JRE x86 by JetBrains" and "32-bit launcher" options when installing on 32-bit system
CosmeticsIDEA-185688Groovy association item is not displayed correctly
CosmeticsIDEA-191997com.intellij.updater.Runner usage message for Runner install <folder>
CosmeticsIDEA-161414"Profiling agent is not enabled" should not be a WARN log entry and / or chatter to the terminal
CosmeticsIDEA-181200Install-Windows-zip.txt instructions are out of date
TaskIDEA-185591Get rid of -Xbootclasspath/a: argument when running IntelliJ-based IDEs
TaskIDEA-192733Update bundled JDOM to 2.0
TaskIDEA-189413Bundle Kotlin 1.2.50 with IntelliJ IDEA
TaskIDEA-189411Bundle Kotlin 1.2.41 with IntelliJ IDEA
TaskIDEA-195115Bundle Kotlin 1.2.51 with IntelliJ IDEA
TaskIDEA-166447Provide separate application icon for EAP distributions
TaskIDEA-192182Extract sources of java annotations to separate GitHub repository
TaskIDEA-185083Unblock basic proxy authorization scheme for https protocol
Password SafeBugIDEA-190514"Magic number did not match" exception on opening Deployment Settings
UsabilityIDEA-191264Uncheck remember on push credentials dialog by default
Platform APIFeatureIDEA-188386Support debug-level logging in IntelliJ product build scripts
FeatureIDEA-192059Improve `JavaBuilderUtil.registerFilterToSkipMarkingAffectedFileDirty` for using in other builder categories
FeatureIDEA-192484Allow IntelliJ-based products to define custom icons for EAP builds under Windows and Linux
FeatureIDEA-187115JPS: provide API to report exception to IDEA
FeatureIDEA-185693Provide an API to programmatically pause/resume indexing during heavy activities
FeatureIDEA-169107Create an API to add custom text in place of OuterLanguageElement-s to aid template data language lexer
FeatureIDEA-192305EditorTabTitleProvider: pass FileEditor, not just VirtualFile
FeatureIDEA-184848UAST Pattern: constructor param
FeatureIDEA-193136Synchronous notification on file opening
BugIDEA-185355VMOptions.writeOption doesn't support digits in values
BugIDEA-193989IDE does not start - broken icon loading by relative path and IconPathPatcher in multiple plugins
BugIDEA-185644ProjectJdkTable#findMostRecentSdk does not select most recent
BugIDEA-181783AbstractUastVisitor in AbstractBaseUastLocalInspectionTool violates contract of `buildVisitor` method
BugIDEA-188348Change com.intellij.openapi.actionSystem.ex.DefaultCustomComponentAction API
PerformanceIDEA-189948AST is loaded when computing file icon because of smart pointers
PerformanceIDEA-187382Documents for LightVirtualFile's are leaked via SmartPointerManager
PerformanceIDEA-185281Livelock while reopening a project
UsabilityIDEA-192560ReplaceConstructorWithFactoryDialog has non public constructor
TaskIDEA-192805Clean up values set by Look-n-Feel
TaskIDEA-193114Make property-based and code insight sanity testing frameworks available outside IntelliJ IDEA repository
Meta IssueIDEA-175637Check in tests that PSI text can be parsed back to a similar PSI structure
Plugin DevelopmentFeatureIDEA-182835Add an inspection that warns when UElements are used as PsiElements
FeatureIDEA-142062DevKit: make TestDataReferenceContributor work for Kotlin
FeatureIDEA-140461DevKit: make TestDataReferenceContributor work for Groovy
BugIDEA-194306Devkit: fix quick/full doc for extension point w/ "qualifiedName"
BugIDEA-186696TestDataNavigation: don't compound two side editor from files in different directories
BugIDEA-188247JavaSdkImpl#getVMExecutablePath returns wrong path on Windows
BugIDEA-183006Automatically load plugins on which the main plugin optionally depends in tests
BugIDEA-166677XIncludes in plugin descriptions should resolve paths in classpath (or even in entire project's classpath)
BugIDEA-188374CommitChangeListDialog.commitAlienChanges shows empty changes browser (when it is not)
BugIDEA-185624False inspection description not found error
BugIDEA-163694Devkit: fix IdeaPlugin DOM
BugIDEA-190994Usage of ITNReporter in PlatformExtensions.xml is reported as an error
BugIDEA-194424DevKit: fix usage scope for Action/Group
BugIDEA-191217Devkit: "Element should be registered in ..." false positives
UsabilityIDEA-187502Add module for IntelliJ IDEA Community as well as joint module for both Community and Ultimate
UsabilityIDEA-193156DevKit: keep "plugin.xml" in editor tab title
CosmeticsIDEA-192134Remove 'MaxPermSize' from default VM options when start IDEA plugin run configuration
TaskIDEA-188302plugin.xml: highlight <idea-plugin@use-idea-classloader> as deprecated
TaskIDEA-188065Warnings when using httpclient-4.5.2 provided with IntelliJ
Plugin ManagementBugIDEA-193311"Install plugin" button is undistinguished
BugIDEA-182869Plugin update fail if requested with major version IDE patch update
BugIDEA-189271IDEA plugin manager cannot download Xtext
BugIDEA-191790NoClassDefFoundError in case of disabling Coverage plugin
UsabilityIDEA-176508Unable to install plugins when their download URL returns 307 redirect
ExceptionIDEA-186256CCE “java.awt.FileDialog cannot be cast to javax.swing.JDialog” at opening File dialog window when attempting to connect to wrong plugin repository
Project ConfigurationFeatureIDEA-50658Artifact editor: copy artifact action could be provided
FeatureIDEA-193045Repository libraries: add option to exclude only some of transitive dependencies
FeatureIDEA-193050Add option to specify minimum version of the IDE which is required for a project
FeatureIDEA-186246Provide a convenient way to change qualified names for multiple modules at once
BugIDEA-189112Externally stored settings of facets aren't loaded by build process
BugIDEA-186115Module unloading using ModuleManager.setUnloadedModules has bogus guard check
BugIDEA-188581Project Structure: SDK: two JDKs in Add new SDK list
BugIDEA-185531Order of lines in ModuleRenamingHistory component in .idea/modules.xml randomly changes on save
BugIDEA-186248Unexpected error on compiling standard Java project after launching IDEA with no configurations
BugIDEA-188647Renaming a module breaks stored renaming scheme
BugIDEA-185428IAE during loading of artifacts
BugIDEA-185763Scopes editor: 'Include Recursively' button works incorrectly for module group nodes if qualified module names are used
BugIDEA-192913Stop updating misc.xml with test statistics
BugIDEA-191059Can't find bundle for base name messages.JavaCoreBundle
BugIDEA-192248Default PHP Interpreter settings are reset after PhpStorm restart
BugIDEA-185133Changing version works incorrectly for Maven libraries if MAVEN_REPOSITORY path variable has non-canonical case of letters
BugIDEA-187885Modules may disappear from 'Load/Unload Modules' dialog
BugIDEA-194717Excluded roots are lost after refreshing a repository library
BugIDEA-180295Project settings: don't show unnecessary modules grouping items for modules with version numbers in names
BugIDEA-189444Default run/debug configurations are not saved
BugIDEA-186834Creating a project in the drive root adds the second backslash leading to the wrong project working directory for Run Configurations
BugIDEA-182850Module with a dot in the name is displayed as if it were a module group
BugIDEA-187313New Project Wizard unexpectedly replaces path by '~'
BugIDEA-186197OutOfMemoryError on Clean up old output directories
UsabilityIDEA-192234Quickfixes offer to add annotation and junit jars from IDEA installation directory to project configuration
UsabilityIDEA-189675Remove misleading 'channel' option from 'Required plugin' settings
UsabilityIDEA-189733Properly check version range for bundled plugins in 'Required Plugins'
UsabilityIDEA-190951Reload all repository libraries when list of repositories changes
CosmeticsIDEA-188607Fix warning icon for "Module managed by Gradle" notification
ExceptionIDEA-188194Removing module from a big project may fail with NPE
ExceptionIDEA-190988Cancelling creation of a library in Project Structure dialog fails with exception
ExceptionIDEA-187726Constant exceptions after opening Idea/ultimate#master with IJ 2017.3.5
ExceptionIDEA-190250Assertion failed: Write access is allowed inside write-action only - at IdeaProjectModelModifier.changeLanguageLevel
RefactoringBugIDEA-187647Rename module does not rename directory
BugIDEA-185936Rename File action shouldn't be available while indexing is in progress
BugIDEA-176840View / Expression Type just after closing pair character changes user selection
BugIDEA-191733Copy file dialog: selection with mouse does not select words
BugIDEA-189391Wrap return value doesn't work with Optional
UsabilityIDEA-190300Duplicate menu hot keys for Refactor|Make Static and Refactor|Wrap Method return value
RegExpBugIDEA-191355SingleCharAlternationInspection quick fix produces inconsistent PSI
BugIDEA-186023Regexp: "Single character alternation" quickfix yields invalid code
ExceptionIDEA-190180RegExpSetOptionsImpl ClassCastException blocking editor inspections
Run | Debug configurationBugIDEA-187390Allow using classpath instead of module path when running applications on JDK9
BugIDEA-187519Run button not disabled for for debug only run/debug configurations
BugIDEA-184007Run dashboard debugger window very narrow
UsabilityIDEA-181847RunDashboard: auto-scroll to the running item in case of many items in the view
UsabilityIDEA-182763Run configuration drop down menu does not show the full name of the test being selected
UsabilityIDEA-169476Run configurations are too easily deleted
Settings RepositoryBugIDEA-193023completion.factors.user.xml should not be synchronized by Settings Repository
UsabilityIDEA-149733Settings are not synced when using only read-only sources
SpringFeatureIDEA-174264Spring: SpEL injection for Kotlin could be supported for `@Cacheable`, `@CacheEvict`, `@EventListener`
FeatureIDEA-159298Integrate class hot swapping with Spring Boot Devtools
FeatureIDEA-185906Spring Boot: Endpoints: Show gutter icon on bean declarations
FeatureIDEA-191509Spring Boot Run Configuration: support module-info.java classpath
FeatureIDEA-194917Spring Boot 2: support microseconds in Duration value
FeatureIDEA-180870"Create @PathVariable parameter" intention should use implicit name
FeatureIDEA-170882SpringBoot Dashboard. Provide a new filter: my beans, all beans.
FeatureIDEA-184281Spring Boot: Endpoints: Show gutter icon on request mapping handler method
FeatureIDEA-184703Spring Boot 2: new binding rules for configuration keys
FeatureIDEA-191403Spring Boot: intention to replace deprecated key should remove value if types are incompatible
FeatureIDEA-188272Spring Boot: evaluate Embedded/PooledDatabaseCondition
FeatureIDEA-185626Spring Boot: Endpoints: provide extension point
FeatureIDEA-187368Spring Boot: support @ConditionalOnEnabledHealthIndicator
FeatureIDEA-187933Spring Boot: code insight for config key "spring.autoconfigure.exclude"
FeatureIDEA-141499Spring Boot: highlight SpringBootApplication located in default package
FeatureIDEA-188184Spring Boot: evaluate org.springframework.boot.autoconfigure.web.servlet.error.ErrorMvcAutoConfiguration.ErrorTemplateMiss ingCondition
FeatureIDEA-188408Spring Boot: Endpoints: On mappings tab open request mapping in http scratch
FeatureIDEA-186265Spring MVC: async navigation popup for "views" @RequestMapping gutter
FeatureIDEA-187784Spring Boot: support @ConditionalOnEnabledInfoContributor
FeatureIDEA-154969Add support for Spring Live Beans Graph
FeatureIDEA-187801Spring Boot: support @ConditionalOnManagementPort
FeatureIDEA-185897Spring Boot: Endpoints: support new SB 2.0.0 mappings endpoint's output format
FeatureIDEA-186253Spring Boot: async navigation popup for @ConfigurationProperties gutter
FeatureIDEA-129129Spring Integration: support built-in SPEL functions of PublisherAnnotationAdvisor
FeatureIDEA-177633Inspection to remove useless `@ComponentScan` annotation
FeatureIDEA-177632Inspection to remove @EnableAutoConfiguration if @SpringBootApplication is present
FeatureIDEA-187942Spring Boot autoconfig: handle config property "spring.autoconfigure.exclude"
FeatureIDEA-188674Spring Boot: Run Configuration: add Shorten command line option
FeatureIDEA-188676Spring Boot config files: resolve placeholder properties to other project .properties keys
FeatureIDEA-95426Spring Integration: smart #this/#root support for Spring EL expressions
BugIDEA-186465Spring MVC: gutter navigation icons for request mappings must not show multiple targets
BugIDEA-182559Class annotated with @MessagingGateway not recognized as bean when using SpringBoot autoconfiguration for Spring Integration
BugIDEA-183441Cannot display Spring Webflow popup
BugIDEA-177932Override parameters unaccessible for Spring Boot configuration
BugIDEA-155456SpEL: code completion suggests nothing inside keywords in specific cases
BugIDEA-184465SpringBoot incorrectly shows ApplicationArguments as an error in Bean creation.
BugIDEA-186346Spring Boot: configuration properties gutter navigation: only single usage per file is found
BugIDEA-186326Spring: SpringModelDependencies action doesn't work when invoked via 'composed' gutter icon
BugIDEA-195208NoSuchMethodException starting Spring Boot application using Kotlin when there is another package level function
BugIDEA-186320Spring MVC toolwindow: embedded documentation pane is too small when it is just shown; it should be possible to change its size manually
BugIDEA-190843Spring Initializr: "Version" parameter is ignored
BugIDEA-161883Spring Boot: Configuration Annotation Processor editor notification should be easier to dismiss
BugIDEA-145061Spring. Help. View "model dependencies Diagram". Help navigates to the wrong topic.
BugIDEA-188580Spring Boot: @ConditionalOnProperty: completion for 'prefix' + 'name' only allows single-part names
BugIDEA-189086Access HTTP request mappings from the editor via the new REST client doesn't work
BugIDEA-193352Spring Live Beans graph: SaveDiagram toolbar button doesn't work
BugIDEA-193355Spring MVC: if the path variable name is not valid identifier, the CreatePathVariableParameter intention causes error
BugIDEA-189718Spring Boot: @ConditionalOnManagementPort support: correctly treat situation when management.server.port == null
BugIDEA-195167Spring Boot: find spring-autoconfigure-metadata.properties in all scopes
BugIDEA-131587Spring Integration: support @BridgeFrom and @BridgeTo annotations
BugIDEA-188645Spring Boot: find @ConfigurationProperties bean properties usages in dependent modules
BugIDEA-190707Spring Dependency Diagram Open action should not depend on caret position
BugIDEA-193510Spring Boot: Endpoints: use 'spring.mvc.servlet.path' property for SB 2.1 application URL
BugIDEA-186899Spring Boot: no completion for the user-defined configuration properties
BugIDEA-193534Spring Boot: placeholders are resolved only for properties files from resource roots
BugIDEA-184398Spring Boot: use canonical format of configuration keys also for harvested POJO properties
BugIDEA-194149Hide JSON widget for Spring Boot additional-spring-configuration-metadata.json files
BugIDEA-194941Spring Boot Run Configuration: on completing values for property of 'profile' type the profile names in list should have icons
BugIDEA-154863Spring: provide possibility to refactor/rename caches
BugIDEA-144490Spring Boot: support hints for config keys in SB Run Configuration
BugIDEA-175194Spring Boot. Run Dashboard: F1 doesn't work, should lead to the corresponding help page
BugIDEA-144494Spring Boot: provide smart completion for properties with configured hints of class-reference type in the Run Configurations
BugIDEA-138067Spring Integration - wrong expected type for amqp:outbound-channel-adapter@header-mapper
BugIDEA-128564Spring Integration: "handler-retry-advice" element is not parsed
BugIDEA-185376Spring: Field Injection Warning inspection doesn't report violations in stereotype components
BugIDEA-192956Component scan does not pick up classes annotated with @Component even though they are in the component scan classpath
BugIDEA-194731False positive inspection 'Spring Boot Application Setup': when @ComponentScan with parameters is provided
BugIDEA-163124UnsupportedOperationException at com.intellij.psi.impl.java.stubs.JavaStubElementType.createStub(JavaStubElementType.java:74)
BugIDEA-191715Spring Boot: application.yml: intention that replaces the deprecated property removes all properties in the same group (same-prefix ones)
BugIDEA-174517Spring Boot run configuration: Override Parameters table: Ctrl-Q for the property name or value shows confusing results
BugIDEA-154902Spring: "cachenames definition error" inspection should work for @Caching annotation also)
BugIDEA-192365Spring Boot: Endpoints: provide correct request mapping URL in case of custom dispatcher servlet
BugIDEA-188277Spring Boot: support Kotlin/kapt - generated configuration metadata in Gradle projects
BugIDEA-192109Main Spring Boot class does not have to be "public"
BugIDEA-194616SpEL: completion does not work in existing qualified type
BugIDEA-175723Spring Integration Diagram: selector element appears as small empty rectangle
BugIDEA-182605Support replacement for map-based key in Spring Boot metadata
BugIDEA-187394Spring initializr wizard: strip trailing "/" for custom Initializr URL
BugIDEA-187026Spring Boot Autoconfiguration: related models from autoconfig must be fully evaluated
BugIDEA-128918Spring Integration: support <expression> subelement
BugIDEA-194891Spring Boot: handle config key with type 'org.springframework.http.MediaType'
BugIDEA-186259Spring Boot: links are not navigable in the quick doc popups for the application properties keys
BugIDEA-190237Spring Boot configuration wirings by string key not resolved when using Kotlin strings
BugIDEA-188365Spring Boot: @ConditionalOnProperty support only "plain" config keys
BugIDEA-186393Spring Initializr: the new created projects are not imported from Maven automatically
BugIDEA-166857Spring Boot Testing: support @TestConfiguration
BugIDEA-181322Spring MVC - Shorthand if on controller method 'return' causes controller-view linking to not work
BugIDEA-194859Spring Boot Application not recognized in Kotlin
BugIDEA-128520Spring Integration: check that 'resource-inbound-channel-adapter' has 'pattern' attribute
BugIDEA-129123Spring Integration: support @EnablePublisher annotation
BugIDEA-155241Spring: Caches: custom annotation that uses @Caching doesn't cause warning in interfaces
BugIDEA-187126spring.factories: inner classes can be referenced using '$' (class$innerClass)
BugIDEA-187127spring.factories: class not resolved in case of trailing spaces
BugIDEA-187693Spring Boot 2: use 'spring.banner.location' to determine banner file
BugIDEA-181435Spring Integration: provide implicit IntegrationFlowContext
BugIDEA-194837Redundant Spring Gutter on Kotlin data class
BugIDEA-194834Spring Boot: "redundant @ComponentScan " warning should not be shown when some non-default attributes are specified in this annotation
BugIDEA-187711Spring Boot config files: allow to suppress value checking for user-configurable "placeholder replacement" markers
PerformanceIDEA-191396Spring Diagrams: poor performance on diagram opening/updating
UsabilityIDEA-194098Spring gutter icon for 3rd party libraries only shown when declared by XML and not when instantiated via a Configuration class
UsabilityIDEA-191729Spring model dependencies diagram: navigate to configuration file on double click
UsabilityIDEA-179168SpringBoot Dashboard: show some message if the list of health indicators is empty
UsabilityIDEA-190799Spring Boot Run Configuration: on new parameter adding the parameters tab should be autoscrolled
UsabilityIDEA-185771Spring Beans toolwindow: the bean documentation pane cannot be vertically scrolled
CosmeticsIDEA-185822Spring documentation providers: new design
TaskIDEA-188587Spring Boot: optimize collection auto-config classes for ManagementContextConfigurationModel
TaskIDEA-187047Spring Boot: optimize collecting/evaluating auto-config classes
Meta IssueIDEA-189532Spring performance/cache/mod.trackers investigations
ExceptionIDEA-190456Spring Boot: problem with quoted values for certain value types (StringIndexOutOfBoundsException)
ExceptionIDEA-187785Throwable at com.intellij.codeInsight.actions.ReformatCodeProcessor.assertFileIsValid
ExceptionIDEA-192100Getting sporadic exceptions from the bundled Spring plugin when using IJ EAP
Structural Search and ReplaceFeatureIDEA-191915finding switch statements: allow counted branches
BugIDEA-190128SSR Structural Replace to achieve Java 7 diamond syntax produces illegal Java
BugIDEA-189344Structural search doesn't match statement variable in lambda
BugIDEA-146380Structural replace fails
BugIDEA-187792Structural Search Inspection problem: Groovy Script execution error: java.lang.Throwable
BugIDEA-191669can't find anonymous class within hierarchy
BugIDEA-188376SSR: 1 dimensional array is found when using 2 dimensional array expression syntax
BugIDEA-129336Structural search pattern not found because of comment
BugIDEA-192548Structural replace replaces arrays with plain values in method signature and class fields
BugIDEA-190055Can't find XML/HTML tags without a specific attribute value
BugIDEA-189473improve java 9 var matching
BugIDEA-191831Wildcard pattern with a variable finds nothing
BugIDEA-187663JavaScript replace replaces only first statement of multiple statement result
BugIDEA-191858Problems with finding try-catch statements
BugIDEA-190519replace structurally creates wrong code, when using static import
BugIDEA-188144javascript method with optional qualifier pattern returns less results than expected
BugIDEA-187725Bad Groovy script can cause exception
BugIDEA-187291Replacing an XML tag set as target does not work correctly
BugIDEA-187436Malformed pattern warning expected on incorrect use of variables
BugIDEA-187437ActionScript annotation matching incorrectly matches attributes
BugIDEA-189852html pattern finds nothing
BugIDEA-189195Not possible to find labeled statements
BugIDEA-176024Adding an annotation with structural replace breaks a nested class reference in annotation parameters
BugIDEA-191673Find within hierarchy does not handle negation correctly
BugIDEA-187532Reference target constraints panel visible for replacement variable
BugIDEA-186640SSR: extremely hard to edit patterns
BugIDEA-185614Structural replace removes parentheses unexpectedly
BugIDEA-189196Labeled break and continue statements can't be found with a variable
BugIDEA-189220Can't find annotations with counted number of parameters
BugIDEA-185417SSR crash
UsabilityIDEA-189236Open variable settings directly from search/replacement template in Structural search
UsabilityIDEA-189234Misleading "available variable" if var is optional in structural search groovy code snippets
UsabilityIDEA-187826Find Structurally: remove Unlimited checkbox
TaskIDEA-193238File type combo-box for the new design of the Structural Search dialog
ExceptionIDEA-191889SSR: java.lang.ClassCastException when open 'Search template' dialog in 'Edit variables'
ExceptionIDEA-141767NPE at at com.intellij.structuralsearch.plugin.replace.ui.ReplaceUsageViewContext.replaceOne(ReplaceUsageViewC ontext.java:130)
ExceptionIDEA-193171Existing pattern "all methods of the class (within hierarchy)" fails
Task ManagementBugIDEA-162223Task Server is not removed.
BugIDEA-189113Unable to save settings: Failed to save settings. Please restart... Error with Mantis Task server enabled
BugIDEA-190752Adding YouTrack server should configure https URL by default
BugIDEA-187507Cannot save Trello integration settings in 2018.1
BugIDEA-193736Task intgaration with GitLab does not work - 410: Gone error
BugIDEA-187128Generic task server configuration cannot be saved in settings
BugIDEA-188611[remove context] option not present / not possible while CLion is still indexing
UsabilityIDEA-185567Server types not searchable in Settings
Template Languages. FreeMarkerBugIDEA-187664FreeMarker continue directive not supported in plugin
BugIDEA-191594Freemarker: 'continue' directive is falsely reported as error (no matching loop directive found)
BugIDEA-188119FreeMarker: change macro call to positional style can break code if single "=" is used inside
TaskIDEA-187956Support new Freemarker 2.3.26-28 features
TerminalBugIDEA-118871Integrated terminal doesn't scroll to bottom on "movement-keys"
BugIDEA-184513Terminal prompt displaying incorrectly
BugIDEA-191852Show typed user input in terminal console
BugIDEA-194928Terminal console: a few first long lines are not properly carried over to next line
BugIDEA-186950Exception on trying to evaluate java program that throws exception in terminal
BugIDEA-184778Terminal - Console - wrong format - wrap new line after 2017.3.1 update
BugIDEA-140061Should be possilbe to pause terminal output
BugIDEA-185523Fish Terminal displays ⏎ (U+23CE) after every input
BugIDEA-173259fish plugin functions do not work on macOS in built-in terminal
UsabilityIDEA-186170Enter key in terminal doesn't scroll down
CosmeticsIDEA-126617Resizing terminal moves caret
CosmeticsIDEA-185689Open in Terminal should be in the same group as Reveal in Finder/Show in Explorer
ExceptionIDEA-187084StringIndexOutOfBoundsException while executing some action with long output in the Terminal
ThymeleafBugIDEA-172792message key usage do not works with keys built using dash symbol
BugIDEA-187050Thymeleaf property syntax
UMLBugIDEA-187287SVG UML Diagram Export results on zero length file
Unit Testing. JUnitFeatureIDEA-186922Spock library not found : no FIX
FeatureIDEA-187387Notify of test method/class/suite boundaries when cycling through JUnit comparison failure diffs
FeatureIDEA-188606JUnit 5.1: extend supported @Values check for malformed parameterized tests
FeatureIDEA-191608JUnit 5: support fully qualified method names for external classes in @MethodSource
FeatureIDEA-185341IDEA should verify @Tag value in Run configuration
FeatureIDEA-188590JUnit5 - False positive 'Access can be private' on '@RegisterExtension' field in test
FeatureIDEA-187029Enhance @Tag support for JUnit 5.1's Tag Expression
FeatureIDEA-187572Junit5: Warn for static nested classes annotated with @Nested
BugIDEA-191772'View assertEquals difference' action shows result for neighboring test
BugIDEA-189761Missing stdout for failed tests when loading in-memory test history
BugIDEA-193010Message parsing bug in JUnit plugin around actual value
BugIDEA-190100Error running individual unit test spec in Gradle project - module directory does not exist
BugIDEA-193925Inspection "JUnit 5 malformed parameterized test" is triggered on legal source: @ArgumentsSources
BugIDEA-193920JUnit: preserve slashes in suites names
BugIDEA-192085@RunWith annotated nested class should be runnable
BugIDEA-189846JUnit 5: Primitive array signatures
BugIDEA-189535IntelliJ 2018.1/JUnit 5.1: Selection of single test case in @ParameterizedTests executed all test cases, but selection two test cases only executes the selected cases
BugIDEA-185988"<Click to see difference>" only available in command line when junit4 is available
BugIDEA-188435JUnit assertion failed "Click to see difference" dialog doesn't show a difference
BugIDEA-155008"Jump to source" is not available for tests that have dot in name
BugIDEA-185621Regression: JUnit4 test classes detection picks non test classes
BugIDEA-162259IntelliJ shouldn't run JUNit inner static classes
BugIDEA-189276IntelliJ IDEA 2018.1 suddenly hangs and doesn't respond until I restart it
BugIDEA-187308Automatic Migration from JUni4 to JUnit5 has problems with Assert.fail() and method references
BugIDEA-185229False positive "JUnit 5 malformed parameterized test" when @ValueSource used as param of test object constructor
BugIDEA-185244'Test kinds' should depend on actual project and run configuration
BugIDEA-194570Wrong total/passed tests count calculation in TestStatusLine.java
BugIDEA-188684IDEA warns about Java keyword used as Tags value
BugIDEA-191141Rerun JUnit 5 DynamicTest with custom TestSource is not supported
BugIDEA-75209Path variables should not be used in non-path attributes
BugIDEA-185990Test runner tries to run inner classes
BugIDEA-189526Zohhack Tests are not detected
BugIDEA-187470JUnit 5 - No run/debug options when a custom @Nested annotation is used
BugIDEA-187396idea_classpath not found when restarting the process
BugIDEA-188806CreateProcess error=206, The filename or extension is too long (JUnit)
PerformanceIDEA-189829AST is loaded by JUnit integration when computing class icon
PerformanceIDEA-189956AST is loaded by JUnit 4 integration when computing class icon
UsabilityIDEA-179774"Create Test" dialog does not fill test superclass with last used value
ExceptionIDEA-188648IllegalStateException: @NotNull method com/intellij/openapi/vcs/changes/ChangeListManager.getInstance must not return null
ExceptionIDEA-191597IndexNotReadyInspection on save test history
ExceptionIDEA-186528Exception at com.intellij.testIntegration.createTest.CreateTestAction.createTestDialog
Unit Testing. TestNGBugIDEA-193485"Jump to source" action broken for failed tests
BugIDEA-190388Upgraded to 2018 now TestNG tests not working
BugIDEA-193024Execution hangs when Testng testsuiterunner throws runtime exception in onStart/onExecutionStart
User InterfaceFeatureIDEA-163208Add support for MacBook Touch Bar (Magic Toolbar)
FeatureIDEA-61533Color folded block according to validation status.
FeatureIDEA-189689Move HelpTooltip settings to resources
FeatureIDEA-188603Allow to align grid label with the upper edge of multiline components
BugIDEA-194131Missing 'Expand All/Collapse All' icons in TODO tool window
BugIDEA-192055Focus goes nowhere after breakpoint popup
BugIDEA-189327Exception on startup when consent dialog is shown
BugIDEA-192157When configuring touch bar, I would like to be able to see changes instantly.
BugIDEA-191170[windows] tip of the day picture is large on 125% scale
BugIDEA-190806notification balloon shadow gaps
BugIDEA-180876[fps] VCS branch markers and log track paint artefacts
BugIDEA-191708VersionControl: visual garbage on the very first opening of VersionControl toolwindow
BugIDEA-193398New SE: multi selection is not supported
BugIDEA-192119Some SVG icons are rendered incorrectly in IDE
BugIDEA-186989Invoking "find action" in Evaluate dialog moves focus to the main window
BugIDEA-192353Table (list) selected items are shifted to the right
BugIDEA-186615Tool windows: resizing cursor appears on top of 'Hidden tabs' arrow
BugIDEA-187873UI glitch in editable combobox with wide popup
BugIDEA-191300Hyperlink stays underlined when mouse leaves its area
BugIDEA-178351"Restore Default Layout" do not work with 2017.2.3 having "Run Dashboard" open
BugIDEA-185911Incorrect popup height causing scrollbar to appear
BugIDEA-192713focus is lost on opening Find Usages tool window
BugIDEA-192318Progress bar in "Getting Started" dialog do not scale correctly in HiDPI
BugIDEA-187834Replace translucent text rendering in tab pane with opaque one using premultiplied alpha and srcOver rules
BugIDEA-188740LightweightHint.pack() doesn't have any effect when hint uses AWT tooltip internally
BugIDEA-192691Wrong title of JetBrains Privacy Policy window
BugIDEA-193316Font setting for IDE appearance is ignored
BugIDEA-116955Text in the "Evaluation Feedback" window is editable
BugIDEA-186229'Search everywhere' loses focus after some item selecting by mouse in the drop-down
BugIDEA-193867Clicking bottom-most 'more' link in new Search Everywhere popup throws IndexOutOfBoundsException
BugIDEA-179312Project View Popup - Does Not Match Settings
BugIDEA-191812Buttons in license agreement popup overlap each other
BugIDEA-190948Dropdown button for elements content in Artifacts panel is not very good looking
BugIDEA-187932Invoking some features does not affect productivity guide statistics
BugIDEA-192029Touch bar blinks when scrolling the file
BugIDEA-193169badly rendered SVG icons in Customize dialog
BugIDEA-185405Nested Idea does not scale on kubuntu 17.10 / KDE Plasma 5
BugIDEA-185745Quick Doc hides under Win task bar
BugIDEA-133900Can't type @ in Find/Replace dialog
BugIDEA-183148Cannot export colour scheme as plugin from PhpStorm
BugIDEA-193536scaling a composite icon modifies the base icons
BugIDEA-188161Quickly typing one letter and pressing Enter in "Goto File" leads to endless progress indicator without any results
BugIDEA-188167Remove light line between vertical tool windows
BugIDEA-193028"Refactor this..." is not displayed in Touch Bar
BugIDEA-154988No default icon suggested on adding buttons to main toolbar
BugIDEA-185137Can't load comboDropTriangle icon when switching theme to Darcula
BugIDEA-194924TouchBar support: touch bar is not appeared after first IDE launch
BugIDEA-191164[windows] text floats in preview diffs
BugIDEA-164920Wrap toolbar
BugIDEA-185306Powered by open-source software link in about box is outdated
BugIDEA-188687switch on SVG icons by default
BugIDEA-194712Messages tool window header is missing "Collapse/expand all" icons
BugIDEA-194716Fatal error reporting with optional files not working correctly
BugIDEA-182408Provide ability to cache icons in platform-api
BugIDEA-184963"Diff Viewer" switch via popup breaks focus
BugIDEA-190607It is not possible enter another character in plugin window.
BugIDEA-191318Icons are not scaled correctly in presentation mode
BugIDEA-193383New SE: please remember last action I typed
BugIDEA-191122"Captured Snapshot" notification's "Show in Explorer" link does not work when IDEA is installed on alternate drive letter
BugIDEA-192976MacBook Touch Bar: show debugger actions when run configuration is shown in Run Dashboard
BugIDEA-189520[fps] gaps in git-log graph edges
BugIDEA-190646Tool Window tabs revision
BugIDEA-180725Background Image is not set for the RemoteHosts toolwindow if there are no selected hosts
BugIDEA-190257Layout changes for no reason when typing in the Description field for a newly created LiveTemplate
BugIDEA-190258Context selection popup is unusable in LiveTemplate editor
BugIDEA-194795Exception appears when try to open file chooser from Welcome screen
BugIDEA-166871IDEA doesn't show 'Scratch File' button in navigation bar toolbar
BugIDEA-190937Changing language in Scratch files not always properly updates file extension
BugIDEA-192303"Darcula" colors are not replaced with "Light" ones on switching LaF back and forth on Windows
BugIDEA-193875Synchronise '' context menu item
BugIDEA-193493"Tip of the day" pixelated but correct size with 125% DPI scaling
BugIDEA-118171Show the same background color for files in Favorite as in Project.
BugIDEA-186587'Replace all' confirmation popup is out of focus
BugIDEA-185008Show usages is closed on escape in usages settings dialog
BugIDEA-185007No find in bytecode view
BugIDEA-97714Add "Associate With File Type" to the editor tab context menu and menu
BugIDEA-192720Selection in Local changes resets when context menu invoked via keyboard
BugIDEA-193115TouchBar: dropdown values are not selectable
BugIDEA-185834Scope tabs of the Project toolwindow: focus is lost on item deleting
BugIDEA-185833Quick Doc tool bar overlapped by Quick Doc body
BugIDEA-186562Javadoc not shown for jigsaw modules in another module
BugIDEA-186564Default size of Edit configuration -> tasks before launch is just for 1 step
BugIDEA-191613Structure tool window steals focus (regression)
BugIDEA-194010New SE: some toggles do not change their state while action performed
BugIDEA-189464Poor presentation of incompatible plugins when using the search bar
BugIDEA-191807Cannot paste file into Scratches
BugIDEA-151301Navigation over highlighted search matches in "Override/impl method" dialog only works for method names
BugIDEA-186529New tool window header close buttons close on mouse down instead of mouse up
BugIDEA-187482ToolWindow header becomes active when context menu is invoked on editor
PerformanceIDEA-191867Disposed project leaked via Changes View content tab label
PerformanceIDEA-192424Editors are leaked forever after opening, via EditorTabbedContainer.CloseTab shortcut
PerformanceIDEA-192184Goto Class/File/Symbol popups leak via native window and focus traversal policy
UsabilityIDEA-165231Input fields should be inactive when exception comes from 3rd-party plugin
UsabilityIDEA-192075IDE Fatal Errors dialog - cannot copy/analyze stacktrace
UsabilityIDEA-192403Touchbar support for Select in > Project view
UsabilityIDEA-186774Change UI texts for Editor Tabs Settings
UsabilityIDEA-191361Exception dialog is too tall
UsabilityIDEA-193841New "Search classes" does not show outer class for inner classes
UsabilityIDEA-187091'Mark Directory as | Unmark root' option name is confusing
UsabilityIDEA-187133Redesign remote configuration
UsabilityIDEA-125158Do not show versions of bundled plugins
UsabilityIDEA-190363Improve UI of 'Third Party Software' list
UsabilityIDEA-185564Match Refactor | Extract | Method ... with "refactor method" in Find action
UsabilityIDEA-170891Show meaningful error when IDE fails to create new project in the read only directory
UsabilityIDEA-66258Apply when editing artifact moves focus in to different artifact
UsabilityIDEA-190251Unhelpful and misleading wording in update checker under Toolbox
UsabilityIDEA-189726Tree nodes expand unexpectedly when navigating using Up/Down keys
UsabilityIDEA-190216Hard to resize quick doc popup
UsabilityIDEA-173072Change wording in "IDE updates are managed externally and weren't checked": message is unclear
UsabilityIDEA-185585'Speed search' in modules in project structure should match pattern against full module name
UsabilityIDEA-192180No speed search: Edit Severities
UsabilityIDEA-110169New Action dialog loses all information when there is an error after pressing "OK"
CosmeticsIDEA-174261"Unused declaration" inspection settings has ugly buttons
CosmeticsIDEA-186151New quick-doc: opening it many times causing gradual size growth
CosmeticsIDEA-188095Button width should accommodate the length of the label plus standard indents
CosmeticsIDEA-193276Strange gray rectangle instead of disabled value when moving Class
CosmeticsIDEA-190090Double arrow cursor on Project tree header on hover
CosmeticsIDEA-188396Quick Doc: caret is not hidden when switching from Doc tool window back to Doc pop-up window
CosmeticsIDEA-191579table view folded/unfolded toolbar inconsistency
CosmeticsIDEA-190919Increase height for popup headers with buttons
CosmeticsIDEA-191985Speed search is truncated
CosmeticsIDEA-169819"New Window" button in open project dialog has extra space
TaskIDEA-189867Switch Search Everywhere toolbar icon to ActionButton
TaskIDEA-192178Enable IntelliJ laf on Mac
TaskIDEA-190225Replace Run Configuration combobox with button if no configuration created
TaskIDEA-192417Provide an API for adding status bar widgets
TaskIDEA-191080Refactor components to clarify insets meaning
TaskIDEA-190218Rename "Default settings" and "Default project structure"
ExceptionIDEA-193393TouchBar: exception is thrown after cancelling Project Structure window
ExceptionIDEA-193575New SE: ClassCastException on selecting filter criteria
ExceptionIDEA-186452StackOverflowError on setting Floating mode for console
User Interface. AccessibilityBugIDEA-193617Accessibility issue with ComboBox and the Win10 LAF
BugIDEA-189859provide JVM property for the screen reader option
User Interface. ControlsBugIDEA-193777Cannot switch on 'Show function keys on touchbar' feature
User Interface. Look and FeelBugIDEA-191398NullPointerException when switching theme to GTK+
CosmeticsIDEA-186708Standard panel height difference between Darcula and IntelliJ themes causes buttons misalignment in DialogWrapper
CosmeticsIDEA-191671Mac menu icons don't handle Darcula well
User Interface. Project ViewFeatureIDEA-145898Scratches timestamps and preview
BugIDEA-195578New files do not show on package view
BugIDEA-164950Project Tool Window - Ctrl+Left shortcut doesn't work
BugIDEA-188727"Select in Project View" should select file in active scope (and not switch to "Project" tab)
BugIDEA-190556Scratches and Consoles - when adding a new scratch file, the project view wasn't updated and the file is not seen
BugIDEA-191952Scopes view: flatten packages doesn't work
BugIDEA-192028Directories with dots in the name show up incorrectly in Project pane
BugIDEA-185935Modules with namespaced name show wrong in some scenarios
BugIDEA-192364Problems with opening multiple files when Scoped view is selected
BugIDEA-189742Items in Project View remain highlighted as incorrect after deleting the class with uncompilable code
PerformanceIDEA-185472Idea is unresponsive while updating Gradle projects
UsabilityIDEA-182143Edit Scopes option only appears in Project tool window's menu when a custom scope is selected
UsabilityIDEA-25714Empty folders are invisible in scope tree view
CosmeticsIDEA-185546Project files new arrow (2018 EAP) location is inconsistent
CosmeticsIDEA-168362Inconsistent labels in Project Tree View
Version ControlFeatureIDEA-193058Update commit legend UI
FeatureIDEA-66051Local Changes: need a special subtree/group only for unmerged conflicts.
FeatureIDEA-193537Update "Commit Message History" action UI
FeatureIDEA-120755Local changelists: apply background scope colors for files as in other views
BugIDEA-190311Commit directory action is not searchable
BugIDEA-191782No tooltip for new button containing "ignore" actions in Changes view
BugIDEA-186483Amend does not populate previous commit message if enabled with unversioned files only.
BugIDEA-148366File history: file history is not shown on two simultaneous requests
BugIDEA-192400"Move to Another Changelist..." creates new changelist instead of using existing one
BugIDEA-186772Git compare two branches: sort is wrong
BugIDEA-186651Move to another changelist shortcut in Diff moves the entire file
BugIDEA-185598Favorite branch mark is lost on restart
BugIDEA-188502Commit Window Automatically Scrolls Back and Forth While Clicking
BugIDEA-188501Partial Commit: "Git | Revert" action reverts changes, that are excluded by checkboxes
BugIDEA-188319Partial Commit: Pre-commit changes by "Update Copyright" hook will not be committed when committing non-active changelist
BugIDEA-168338Apply patch choses wrong module for new files if there is similar path in other module
BugIDEA-115100Maven project import sets Subversion VCS for submodules, if there is a folder or file called .svn in parent folders
BugIDEA-192793SelectChangesGroupingActionGroup doesn't work via Quick Actions Popup
BugIDEA-192474Annotate fail in error
BugIDEA-186725Changes grouping by repository: confusing results for external VCS root if group by module is used
BugIDEA-189350Undo sometimes doesn't work if 'partial Git commits' feature is enabled
BugIDEA-192877Git: CheckOut Tag Or Revision: on the first invocation some tags are not available in completion
BugIDEA-192203keymap "Xcode" not found warnings on startup from Git4Idea & hg4idea
BugIDEA-186758LocalChanges view: when focus in in the Diff Preview, click in the changes tree doesn't change selection
BugIDEA-189523Cannot delete changelist created by Remote Run in TeamCity
BugIDEA-193195Compare Before with Local should support file move
BugIDEA-153272Files are lost during the movement of unversioned files to overwrite existing files with same names
BugIDEA-192552CloneDvcsDialog#prependToHistory: Cannot use this method with a non-Mutable data model
BugIDEA-189699Wrong unshelving: XML file is restored to not original state (duplicating lines)
BugIDEA-187108Commit action does not respect file selection in Local changes
BugIDEA-187101EAP #IC-181.3870.7:Create partial patch does not work as expected
PerformanceIDEA-192017Unshelving creates a thread for each shelved file
PerformanceIDEA-174636Unregistered VCS root scanning, which happens in the Settings | Version Control, should be moved out of the EDT
PerformanceIDEA-188192File History view periodic refresh causes synchronous VCS queries under modal dialogs
PerformanceIDEA-131357Idea stucks after "accept mine" for 100 files in merge dialog
UsabilityIDEA-192073Missing 'Expand All/Collapse All' icons in VCS Local changes
UsabilityIDEA-187405Copy to clipboard can copy the currently visible in-place diff instead of the just selected text in editor
UsabilityIDEA-193296Assign default shortcut for the "Set Active Changelist" action
UsabilityIDEA-187114Regression: there is no shortcut to group changed files by directory in 'Local Changes' view anymore
UsabilityIDEA-141136Extremely wide not-resizable "Commit Changes" dialog in case of a long error message
UsabilityIDEA-189421Undoing typing sometimes works in two steps if 'partial Git commits' are enabled
TaskIDEA-191668Replace "Move to another changelist" icon with combobox in Commit > Diff dialog
TaskIDEA-191693Update patch icon
ExceptionIDEA-131135AE at com.intellij.openapi.vcs.changes.ui.ChangesBrowserFileNode.render
ExceptionIDEA-188593ISE at com.intellij.openapi.vcs.changes.ui.CommitChangeListDialog.$$$reportNull$$$0
Version Control. GitFeatureIDEA-75835Init Git projects submodules automatically or by asking user at least?
FeatureIDEA-147018Delete git tag
FeatureIDEA-192678Multiple Github accounts: show login dialog if attempt to perform the remote operation fails
FeatureIDEA-74492Git: Checkout tag or revision: provide a list of available tags in combobox
FeatureIDEA-145325Show Continue/Abort/Skip Rebase menu items at the top of the Git | Branches popup, if there is an ongoing rebase process
FeatureIDEA-192369Allow configuring Local changes toolbar in "Appearance & Behavior | Menus and Toolbars"
BugIDEA-186463After the valid git executable is configured for a project reopening is necessary to make Log or History displayed
BugIDEA-192800Allow force push is available in Find action but does nothing
BugIDEA-189369Cannot deselect files with line-ending changes only in the commit-dialog tree
BugIDEA-186342Cherry-pick with auto-commit uses full hash in the suffix, while cherry-pick showing the dialog uses short hash
BugIDEA-187425Partial Commits: Exclude Lines From Commit action does not work with deleted blocks
BugIDEA-187426Partial Commits: Exclude Lines From Commit action does not work with selection in left editor
BugIDEA-123397Git: History for file doesn't show anything before the move if there were too many changes in the commit that moved the file
BugIDEA-185964Git: Partial Commits: after turning the HighlightFilesFromNonActiveChangelists ON the behavior becomes unpredictably wrong
BugIDEA-185963Git: Partial Commits: after one of partial changelists reverting the LocalChanges displays updating.... until refresh
BugIDEA-108316Unregistered Git roots are not auto-detected if they are more than 2 folder levels deep than any project module
BugIDEA-180112IDEA stores passwords in memory even when "Remember" is unchecked
BugIDEA-191309Commit failed with error
BugIDEA-192906Git Push with Rebase puts all changes into the Default changelist
BugIDEA-193788Git: Submodules: attempt to merge conflicts fails
BugIDEA-193259Git: Browse Repository At Revision: on new revision tab opening move focus there
BugIDEA-181823moving a class to another package leaves it unversioned in git
BugIDEA-191992Files Merged with conflicts shows only one branch name
BugIDEA-195270Missing notification about invalid Git roots
BugIDEA-193141Git: on saving file after Reword Commit performing i often get the File Caches Conflict dialog
BugIDEA-193140Can't undo rewording of a commit made before a merge commit and get an exception
BugIDEA-185221Git 2.16 considers Builtin SSH as simple client => `ssh variant 'simple' does not support setting port` error on remote operations
BugIDEA-187498On partial shelve the changes excluded from shelve are moved to default changelist
BugIDEA-187702Git: Resolve conflict during rebase - "Accept Theirs" does not work
BugIDEA-187706Partial Commits: First included file is not selected in commit dialog by default
BugIDEA-193688Squash message editor starts with an extra line break
BugIDEA-190132GitCheckinEnvironment#reset needs to split request into multiple commands.
BugIDEA-187748Partial Commit: can't move file with changed line separators to another changelist
BugIDEA-193934Git clone --recurse-submodules checkouts submodules in detached state which breaks Update project
BugIDEA-188681Partial commit does not work for old git (1.x)
BugIDEA-185959IOOBE at com.intellij.diff.util.DiffUtil.getLines
BugIDEA-189562Deadlock during VCS changes revert
BugIDEA-191656Git commit history with control characters causes intellij to spin, consuming CPU and repeating the same stack in the idea.log
BugIDEA-194449New Git root is not detected until restart, if added externally as a submodule or under a new subdirectory
BugIDEA-193260Git: Browse Repository At Revision: JumpToSource action for folders is enabled but doesn't work
BugIDEA-187375Partial commit checkboxes are not always shown
BugIDEA-192531Clone from github: incorrect behavior in case of github accounts configured but w/o saved credentials
BugIDEA-140196Built-in SSH: does not support strong security ciphers - Cannot negotiate, proposals do not match
BugIDEA-188650Git: Partial Commits: for some changes the diff preview is wrong
BugIDEA-194991Annotation tooltip is huge and empty
BugIDEA-193134Multiple Github accounts: clone doesn't suggest github repositories if you are not logged in to all accounts
BugIDEA-187335On Partial Shelve reverts only selected changes are shelved, but the whole file is reverted
PerformanceIDEA-193442Git Cherry-Pick became slower because of long process of searching for containing branches
UsabilityIDEA-144948Branch list in Git Rebase dialog should include remote branches
UsabilityIDEA-124453Update Project should not fail completely when some module can't be updated (have no remotes, doesn't have a tracked branch, is in detached state, etc)
UsabilityIDEA-192982Multiple Github Accounts: if default account is selected and you are logged in, use this account for sharing and skip not authenticated ones
UsabilityIDEA-136155Git Resolve conflicts: use more specific text for 'theirs' and 'yours' labels
UsabilityIDEA-180118Interactive Rebase: Clicking Cancel in the dialog to enter a message for Squashed commits should cancel rebase.
UsabilityIDEA-161921Remotes: allow configuring a single remote as a default one.
UsabilityIDEA-192333Automatically register Git submodules as VCS roots
UsabilityIDEA-56183Optionally Do not show "Push" dialog after pressing "Commit and Push"
UsabilityIDEA-118140Don't add renamed or moved files to git index unless configured to do so
UsabilityIDEA-163630"Cherry-picked from" suffix should be optional
UsabilityIDEA-153448Shortсut to change action in "Rebasing Commits" window
UsabilityIDEA-144072Sort order of branch names in git branches drop-down lists is not alpha-numerical (Rebase, Branch Widget etc)
CosmeticsIDEA-192092Rephrase a notification that appears when users switch branches
CosmeticsIDEA-192384History for Selection shouldn't be visible in the context menu of Project Files
CosmeticsIDEA-168642Git remote editor doesn't resize properly
TaskIDEA-185954Git: Partial Commits: on MoveToAnotherChangelist performing all changes in file are moved to selected changelist
ExceptionIDEA-193107IllegalArgumentException trying to open Branches menu in the detached HEAD state
ExceptionIDEA-194024AssertionError at git4idea.rebase.GitRebaseLineListener.onLineAvailable
ExceptionIDEA-186769CME at com.intellij.openapi.vcs.changes.conflicts.ChangelistConflictTracker.optionsChanged
ExceptionIDEA-192978kotlin.UninitializedPropertyAccessException at org.jetbrains.plugins.github.GithubShareAction$Companion$shareProjectOnGithub$1.onSuccess
Version Control. LogFeatureIDEA-190615Explore the source code based on specific revision
FeatureIDEA-116053Ability to open filtered results in Changes/Log view a new tab
BugIDEA-180371Open Repository Version uses Jump-to-Sources Hotkey
BugIDEA-190544Clicking on a hash in file history does not open main log tab
PerformanceIDEA-178016High memory consumption of git indexing for shallow clones.
UsabilityIDEA-190169Shortcut assigned to "Open Repository Version" action should have priority over Jump to sources
UsabilityIDEA-152559Allow to copy branch/tag names from the commit info
UsabilityIDEA-162889Tag names in commits details pane in Git log aren't selecteable
UsabilityIDEA-160834Log: do not display 2 progresses when filtering
TaskIDEA-191611Update toolbar in VCS Log
ExceptionIDEA-191967Throwable at com.intellij.vcs.log.impl.VcsLogTabsWatcher.closeLogTabs
Version Control. PerforceBugIDEA-187738Changelist is duplicated in IDEA after partial commit (Perforce)
BugIDEA-191521Duplicate changelist is created when submitting a part of files in a Perforce changelist
BugIDEA-186736Perforce integration is unusable with 2018.1 EAP
BugIDEA-183743Use file revision encoding when comparing file contents
BugIDEA-193396Perforce: 2 default changelists are displayed by default, and the one not marked as default can't contain any changes
PerformanceIDEA-192097Too many threads spawned by reading Perforce command outputs from refreshing File History
ExceptionIDEA-188162NoSwingUnderWriteAction assertion in Perforce actions
Version Control. SubversionBugIDEA-140811IDE Hangs when importing large maven project.
BugIDEA-192371NPE on importing project with directory mappings set to "Subversion", but without real svn working copy
BugIDEA-190960"Error updating changes: can not parse output" error in local changes for certain tree conflicts
BugIDEA-189300ISE at com/intellij/openapi/vcs/changes/VcsDirtyScopeManager.getInstance
BugIDEA-172626Can not parse output - SVN integration is basically useless after that
BugIDEA-190790Subversion: tree conflicts can't be viewed if path contains spaces
BugIDEA-188180"Merge from" fails if branch location of the current branch is under some other branch location
BugIDEA-186917Path to ssh executable for svn+ssh tunnel is not valid
BugIDEA-191800Urls of switched files are shown encoded in "Local Changes"
BugIDEA-191518Subversion "Update Project" dialog - error on selecting revision if url contains special symbols
BugIDEA-185360Subversion File History not working for links with spaces
BugIDEA-189542SVN+SSH shows "Process exited with code 1" instead of the actual error
BugIDEA-191927"Repository" tab - Aggregating commits from several working copies is slow
UsabilityIDEA-158791Unexpected output of svn commands for a single file/revision should not prevent further svn operations
CosmeticsIDEA-188814Subversion: correct the title of "BranchOrTag" tab in Messages tolwindow
ExceptionIDEA-190935ISE at org.jetbrains.idea.svn.branchConfig.SvnBranchConfigurationManager.resolveConfiguration
Version Control. TFSBugIDEA-184463Selected work item is not updated on checkin - can not resolve or associate changeset
BugIDEA-185601Commit to TFS - Code Reviewer issues
XMLBugIDEA-194328Bundled XMLSchema-instance.xsd refers to nill- instead of nil-attribute
BugIDEA-185180RubyMine takes 400% of CPU during work with html file with inline styles
PerformanceIDEA-189915Checking DOM applicability loads AST for files under .idea
i18nBugIDEA-189804IDEA hangs after NullPointerException
BugIDEA-183409There is no name of Resource Bundle in Resource Bundle Editor
BugIDEA-190909Autopopup code completion is not working for message bundles
No subsystemFeatureWEB-11431Smarty: CSS autocomplete from included css file
FeatureWEB-33641Angular2: allow injecting languages other than CSS in `styles:[]`
FeatureWEB-33712ES6: autoimports for ts declarations inside node_modules
FeatureWEB-31177Color picker doesn't work for template string literals
FeatureWEB-31099Update documentation for Live Templates
FeatureWEB-28371Make links in package.json clickable
FeatureWEB-33236Add ng add integration
BugWEB-33570Do not log issues with bad schematics in New|Angular Schematics... dialog
BugWEB-32040Missing support for JSON in Prettier
BugWEB-31963Emmet BEM filter doesn't work in JSX
BugWEB-9333Copyright Formatting Not Working For HTML5 DOCTYPE
BugWEB-31412React Native Run configuration does not start
BugWEB-33007Folder is automatically being excluded, cannot be undone
BugWEB-33002'Change signature to match and update call' removes 'new'
BugWEB-33217DartAnalysisServerService trying to read files on disposed project
BugWEB-31307'Reformat with prettier' action is disabled on first opening of project
BugWEB-31708EAP - Prettier tries to run on HTML files
BugWEB-32412template stringx jsx closing bracket expected
BugWEB-32120Copy and Paste and Syntax Highlight stops working
BugWEB-31108"closing tag matches nothing" shows on the correct tag of vue file
BugWEB-31719Prettier autosave on format
BugWEB-31736Flow: provide a detailed error message if flow service fails to start because of incorrect flowconfig
BugWEB-31206Renaming exported const does not rename import statement
BugWEB-19054Jsdoc repeatable variable type not shown in quick documentation
BugWEB-33569Suggest newer version for 'ng-add' dependencies if older one doesn't support 'ng-add'
BugWEB-32053editorconfig plugin is not working properly
BugWEB-32496Prettier plugin resets package path in 2018.1.2
BugWEB-31461prettier: should use builtin config cache
BugWEB-31520TypeScript parse/syntax error: "formal parameter expected"
BugWEB-31858Use NPM package configured in project preferences when downloading TypeScript stubs
BugWEB-31444When debugging Node.js, computer logs out after a while
BugWEB-33364Angular template reference wrong typing
BugWEB-29946Vue+pug: selector usages in Pug template not found
BugWEB-32300Incorrect warning: ") expected" on React components
BugWEB-16795Git conflicts suggest switching to the JSX Harmony project type
BugWEB-33287Nested indices access in JsTestSourcesFilter may cause deadlock
BugWEB-31399Surround with Emmet doesn't work with linewise selection of JSX
BugWEB-32748NodeModulesDirectoryManager is on UI thread with a lot of threadDump-freeze reports
BugWEB-32769Webpack config rejects automaticNameDelimiter optimization setting
PerformanceWEB-31233Freezing when editing JSX during typing
UsabilityWEB-21129Better UX for documentation for JS/TS projects
CosmeticsWEB-32211Rename 'twitter bootstrap' project template
CosmeticsWEB-32801Webpack option schema has a wrong link in the inspection description
CosmeticsWEB-32036Save As.. should be Save As...
TaskWEB-30134The built-in server should server .mjs module files with JavaScript content type
TaskWEB-32175JS live template: rename "JavaScript" context to "JavaScript and TypeScript"
Build toolsFeatureWEB-30117Allow to remove/disable gulp tool window
BugWEB-28715Gulp tasks tree cannot build due to missing --silent option
CSSFeatureWEB-32000Support repeating-conic-gradient CSS function
FeatureWEB-25011Colors and Fonts/CSS should have it's own field for class and attribute identifiers
FeatureWEB-17009Add not listed CSS &JS files for suggesting for go to declaration in HTML files
FeatureWEB-32228Support of CSS property "font-display"
FeatureWEB-32672WebStorm doesn't recognize backdrop-filter
FeatureWEB-24774Support inline comments in PostCSS
FeatureWEB-7317Provide option to complete styles from all CSS files even if current file has a style tag
BugWEB-31295CSS code completion is shown in JSX after className=<space>
BugWEB-24628CSS: string literal with backslash as property value is not parsed correctly
BugWEB-32646Css: "Insert semicolon" produces incorrect PSI
BugWEB-22893PostCSS: Colors & Fonts: unknown-at-rule cannot be colored
BugWEB-23986PHP: completion/navigation for selectors defined in external stylesheets don't work if there is a <link>/<style> tag in main template
BugWEB-24619BUG: PostCSS code completion doesn't work right before an &-sign (Ampersand).
BugWEB-18258Update css-text spec
BugWEB-32100CSS autocomplete works unpredictably
BugWEB-31104Invalid CSS property value: fill: currentColor;
BugWEB-26828reformating CSS with :host >>> subselect ends up with :host > > > subselect
BugWEB-26368CSS '/deep/' combinator causes 'unexpected token' error if it's the first item in selector list
BugWEB-31567'<?php' symbols in CSS class completion
BugWEB-22895PostCSS: Colors & Fonts: arithmetic symbols are not colored
BugWEB-22894PostCSS: Colors & Fonts: Tag name is not colored
BugWEB-20810Css Custom Properties will be in error if you are in both the transform and calc
BugWEB-33182Intellij complains about valid css
BugWEB-28165Wrong CSS syntax check for @apply rule
PerformanceWEB-30965Slow CSS completion
UsabilityWEB-31592CSS font-family: initial warning generic font
ExceptionWEB-22810"PSI and index do not match" exception while editing CSS
CoffeeScriptBugWEB-31455CoffeeScript the "from" operator is not highlighted in orange
BugWEB-32594Spread Operator in CoffeeScript gives error
BugWEB-32778CoffeeScript "code reformat" change semantics of the string tag
BugWEB-32793Class as prop value error: unexpected indentation
BugWEB-24288Coffeescript - regex with whitespace considered bad code
BugWEB-32452Do not add keywords completion in import statement
BugWEB-32195CoffeeScript string tag error
BugWEB-32194CoffeeScript parse error
BugWEB-33782CoffeeScript: prohibit use of JavaScript Postfix Templates
DartFeatureWEB-32254Nest Dart compiled output under *.dart file
FeatureWEB-32909Provide code completion when editing Dart breakpoint condition and in Evaluate Expression dialog
FeatureWEB-31129Define an Extension Point for Contributing Dart Completions
FeatureWEB-33112Be able to run test of dart 2 code in intellij
FeatureWEB-31130Support Dart Override Completions
BugWEB-32434Dart Analyzer Diagnostics action should be disabled in non-Dart projects
BugWEB-31924Dart: method override list contains duplicate entries
BugWEB-33251Unable to run unit tests from folder with space in path
BugWEB-27128When no selection for Extract Method, IDE sets it to the full line
BugWEB-32559Bad Dart formatting (token per line) if syntax error in argument list
BugWEB-32205.dart_tool folder can't be excluded from indexing if Dart SDK 1.x is configured
BugWEB-33051Dart formatter swallows white space on line merge
BugWEB-33011Unfortunate Dart formatting of syntactically valid code
BugWEB-32974Incorrect 'Pin Tab' icon in Dart 'Get Dependencies' console.
BugWEB-32955Dart tab-autocompletion deletes code
BugWEB-31482Intention action list is sometimes wrong in Dart
BugWEB-31486Dart code completion list is incorrectly sorted
BugWEB-31403Dart Structure View missing sort button
BugWEB-31074Formatting a dart file with syntax errors reformats the file with one token per line
UsabilityWEB-27015need a custom icon for the pub serve tool window icon
UsabilityWEB-31845the Dart plugin doesn't have content in its changelog
TaskWEB-31788In Dart 2 world 'pub global run webdev serve' should be used instead of 'pub serve'.
TaskWEB-32296'enable asserts' flag for Dart Command Line App configuration in case of Dart 2
TaskWEB-31498Auto-exclude .dart_tool folder
TaskWEB-32571Remove 'Dartium path' field from the Dart Settings page and from the New Dart Project wizard
TaskWEB-32172In Dart 2 world 'webdev build' should be used instead of 'pub build'
DebuggerFeatureWEB-14403Drop to frame / Restart frame not available in JavaScript debugger
FeatureWEB-23258Configurable remote mappings for "Attach to Node.js/Chrome" run configuration
FeatureWEB-25793It's not possible to get value of async function in "Evaluate Expression" dialog
FeatureWEB-31991Implement "Run with coverage" for JS Debug configuration
FeatureWEB-32096Show coverage on source files when source maps are used
FeatureWEB-33127JS Coverage: Show correct coverage for css
FeatureWEB-15261Unable to put breakpoints inside JavaScript scratch files
FeatureWEB-25672Allow Node.js/Chromium remote debugger to reconnect automatically
BugWEB-32841Node.js/Chrome remote: 'Another debugger is attached...' warning is wrongly shown
BugWEB-30501karma debugging: breakpoints not hit when re-running the debugger
BugWEB-32003No log in console for npm in debug mode
BugWEB-33044Debugger stops on muted breakpoints in React native app
BugWEB-33398CSS Coverage is shown for the generated .css, not for the apprepriate .sass file
BugWEB-33397No CSS coverage for 'Web Starter Kit' project
BugWEB-30119Jest debugging support not allowing break point inspection of variables
BugWEB-30779Debugger: Remote Node Interpreter: SSH: wrong flag is used
BugWEB-30584Source mapped breakpoints have unexpected behavior in async code
BugWEB-31842Node.js Debugger Console allows to type commands after process termination
BugWEB-33020IndexOutOfBoundsException when stop JS 'Run with coverage'
BugWEB-31161Object not totally copied on Copy Value
BugWEB-32921Turn off breakpoints when run js with coverage
BugWEB-32714Debugger steps into node_modules even if "Do not step into library scripts" is enabled
BugWEB-32908Can't resolve breakpoints in webpack 3.X project
BugWEB-33604Infinite 'Loading value' when calculating a variable
BugWEB-33132JS Coverage: create-react-app, App.js is not added in coverage result
BugWEB-33119Wrong file path in Console when debugging a Vue app
BugWEB-33170Breakpoints not matched properly
BugWEB-32550Wrong line is hit when debugging Jest tests
BugWEB-33095Breakpoint is not hit in multi-module node projects bundled with webpack
BugWEB-33328Node.js remote debugger ignores breakpoints in .ts file inside Docker container
BugWEB-30514Can't debug Node.js in cluster mode with Docker
BugWEB-33151NPE when hovering over field declaration during debug session
BugWEB-32132Rerun not works with JS coverage.
BugWEB-31589Warning about breakpoints in JSX tags with event handlers
BugWEB-32851Debugging Karma tests with karma-browserify not working sometimes
BugWEB-33528Out of memory when debugging React Native application
BugWEB-32389Assertion failed: Debug tool window not initialized yet!
BugWEB-22818Debugging with sourcemaps doesn't work when using `null` as `"file":` value
BugWEB-32636Debugger: the number of properties that can be inspected is limited to ~ 100
BugWEB-33033IntelliJ 2018.1.3 does not show frames when debugging webpack
BugWEB-32155Debug different chromium browsers
BugWEB-33419Debugger tooltip shows value for the variable one line above
BugWEB-31314Client-side debugging pauses in same-named files loaded before the file breakpont is set in
BugWEB-33288Incorrect coverage report for @angular/cli 1.7.4
BugWEB-31709Node.js Remote Interpreter: Docker: cannot start debug due to the "port is already allocated" error
BugWEB-33128JS Coverage: Rename in Coverage toolwindow
PerformanceWEB-31775Debugger: false stops in same-named files cause delays when debugging
UsabilityWEB-32843Node.js global.console has duplicate logs in Console tab when Debugger Console tab is hidden, when debugging
UsabilityWEB-32842Improve notification in case of wrong settings in 'Node.js/Chrome remote' RC
UsabilityWEB-32810Add to watch is not always possible in JavaScript
UsabilityWEB-30689Blank page opened when debugging Chrome with custom profile if Chrome instance from same user data directory is running
CosmeticsWEB-33294Attach to Node.js configuration: add separator
TaskWEB-33027JS Coverage: hide the Debugger and Elements tabs in tool window, add notification
TaskWEB-7998If breakpoints muted, don't stop on debugger keyword
ExceptionWEB-31501[[FunctionLocation]] not found when call 'Jump to source'
ExceptionWEB-33102Exception in IntelliJ IDEA on closing Internet Explorer
File WatchersFeatureWEB-33319Add Insert Macro button for the Program path field in File Watchers
FeatureWEB-33175Add File Watcher template for Prettier
FeatureWEB-33321Add File Watchers to Settings for Default Project
FeatureWEB-12478Global File Watchers
BugWEB-31413File watcher (prettier) marks files as generated files
BugWEB-32127File Watcher dialog: 'File not found' error if macro is used in Program field
BugWEB-31808Not all watchers are run
BugWEB-33191File Watcher with custom scope is triggered on all files if this custom scope is deleted
BugWEB-33661Export File Watchers action: preserve Path Variables
UsabilityWEB-27952File Watchers which modify the current file cause prompts to Reload From Disk on Undo
CosmeticsWEB-33683File watchers: column title doesn't fit on Linux
HTMLBugWEB-31803Typo in HTML Code Style settings
BugWEB-33582Inspections - Unknown HTML Tag not working
BugWEB-32073Surround with Emmet trims
BugWEB-26242HTML: Code styles: Project scheme doesn't use quote marks value
BugWEB-30755Browsers popup not showing
BugWEB-30752HTML code style: an option to add space in self-closing tags only
BugWEB-32388XML/HTML attribute completion items disappear if you press Ctrl+Space once again
BugWEB-2223CSS selector completion in HTML document does not work if there is an inline style block
BugWEB-31136SVG attributes marked as not allowed in injected HTML fragment
JSONFeatureWEB-32238JSON Schema: dropdown to choose JSON schemas
FeatureWEB-31909Allow to suppress warning for NaN in json
FeatureWEB-32826JSON schema: Provide quick fixes for schema incompatibility errors
FeatureWEB-29953Support JSON schema v6
FeatureWEB-29954Support JSON schema v7
FeatureWEB-32433Smarter 'Enter' handling for JSON
FeatureWEB-33426Support path patterns for JSON mappings
FeatureWEB-31912Add support for extension JSON schema property for pure HTML description
FeatureWEB-32538JSON Schema switcher: show locally stored schemas
FeatureWEB-12776Support the JSON5 file type
FeatureWEB-31882Action to copy JSON editor breadcrumbs as JSONPath / JSON Pointer
FeatureWEB-32698JSON Schema selection menu should work for JSON fragment editor
FeatureWEB-32131Support remote JSON schemas and auto-mapping via schemastore.org catalog
FeatureWEB-31897Make JSON schema compliance inspection configurable
BugWEB-32237Kubernetes: Json. QuickHelp. Display: key name, type, kubernetes version
BugWEB-33235JSON schema: Don't suggest non-string variants inside string literals
BugWEB-33724Incorrect 'missing property' in case of 'anyOf' with required
BugWEB-33215JSON Schema Mappings: Empty file pattern and path should match nothing
BugWEB-32960JSON Schema switcher: applying schema for the file for several times multiplies this file in Schema Mappings
BugWEB-33494Incorrect handling of allOf+oneOf combination
BugWEB-33444JSON Schema mappings are stored with platform-dependent slashes
BugWEB-32533JSON Schema switcher doesn't recognize .angular-cli.json
BugWEB-32539JSON Schema dialog: correctly write path to the local file from the dialog and the switcher
BugWEB-31883"Copy Reference" for JSON items does not include arrays indices
BugWEB-33705Unintended autocomplete list pop-ups when typing B or P inside quotes in JSON strings
BugWEB-33306JSON Schema Mappings: required fields are not suggested inside 'oneOf' definition
BugWEB-33179Exception while trying to add missing property to JSON file
BugWEB-32556JSON widget: mapping to the built-in schema shown as a schema error
BugWEB-33099JSON Schema Mappings: conflicting mappings for newly added item
BugWEB-32852JSON schema switcher: correctly map built-in and local schemas when remote sources are not allowed
BugWEB-32853JSON schema: do not remove manually added schema on schemas reassign
BugWEB-32243JSON schema: JSON pointer refs with array items are ignored
BugWEB-32242JSON schema: support pointers to array elements
BugWEB-32514JSON: escape tilde and slash symbols on "Copy JSON Pointer to clipboard" action invocation
BugWEB-32038JSON schema for multiple projects
BugWEB-31653JSON Schema completion: incorrect handling of a string with only one quote
BugWEB-31989Show array index in JSON breadcrumbs
BugWEB-33014"File is not a schema" error in json widget when file was manually added with a mapping to schema
BugWEB-32244JSON schema: allOf merge is not recursive
BugWEB-31196JSON schema: False negative "select file under project root"
BugWEB-32972JSON switcher: schema causes conflict instead of switching for a file in nested folder
BugWEB-33845File type detection on EDT via JsonSchemaVfsListener
BugWEB-31896JSON Schema validation not handling nested "oneOf" properly
BugWEB-32290JSON Schema autocompletion doesn't work
BugWEB-31870Provide an option to allow trailing comma in JSON files
BugWEB-32504Inspections: remove JSON-related options from the JSON5 inspection
BugWEB-32506JSON5: support negative hexadecimal numbers and character escapes
BugWEB-20366JSON Schema should not validate itself
PerformanceWEB-33189Add file-based index for "$schema" and "$id"/"id" properties in JSON
UsabilityWEB-32680JSON Schemas: add "x-intellij-html-description" property into v6 and v7 schema completion
UsabilityWEB-31908Json. Completion. Provide icons depending on key types for the completion list
UsabilityWEB-33404Add an API to suppress JSON widget for particular files
UsabilityWEB-31904Kubernetes. Json. Add "type" tip into the inspection error description.
UsabilityWEB-20353JSON Schema: provide Edit action for created mapping
UsabilityWEB-33178'Missing property' inspection in JSON should provide all missing property names at once
UsabilityWEB-32878Not clear behavior when trying to use json schema outside of the project
UsabilityWEB-33265JSON Schema widget is always visible when index is being updated
UsabilityWEB-31903Kubernetes: Json. QuickHelp. Avoid symbol codes in docs.
UsabilityWEB-20445JSON Schema: errors from schema in Event log should not be red-colored
UsabilityWEB-33103JSON Schema Mappings: no validation for empty path to file/pattern
CosmeticsWEB-31911Kubernetes: Json. QuickHelp. Display " instead of \" .
CosmeticsWEB-32555JSON Schema switcher: correctly show "Add/Edit Schema Mapping..." actions depending on the context
CosmeticsWEB-33544Clean up empty items on saving JSON schema mappings
CosmeticsWEB-32404Improve configuration of JSON Schemas
CosmeticsWEB-32407JSON Schema Catalog Settings UI
TaskWEB-32716Add a checkbox to completely disable remote activity for JSON Schemas
TaskWEB-33207Limit JSON schema services only to supported files
ExceptionWEB-32532JSON Schema: exception is thrown while typing the value for the "$schema" property
ExceptionWEB-32551JSON: "java.lang.Throwable: HTTP response 301" exception while updating schema URL
ExceptionWEB-32199Exception in JSON file
JavaScriptFeatureWEB-31578'Introduce variable' intention action
FeatureWEB-31579Intention action to add/remove numeric separators
FeatureWEB-3804make a javadoc popup more usable if there is several different items to show doc for exists
FeatureWEB-27638Support Named capture groups for JavaScript RegExps
FeatureWEB-29350New Quick Fix: Generate 'cases' for enum and unions of literals
FeatureWEB-3564JSDoc: special symbols auto pairing
FeatureWEB-30478Better keyword completion tails/insert handlers for common language constructs
FeatureWEB-31369Support revised standard for template strings lexing
FeatureWEB-32924Better default values for object literals, tuples, arrays and functions
FeatureWEB-31759JavaScript control flow: completion for properties after the explicit check
FeatureWEB-33195'Iterate' intention action for JS/TS
FeatureWEB-30654Better "Rename" action for es6 javascript file when it contains only single class with export default
FeatureWEB-31502Support for webpack 4 built-in plugin's schemas
FeatureWEB-33343Copy path breadcrumbs to clipboard for JS/TS
FeatureWEB-22059@providesModule
FeatureWEB-13397Filename<->Class detection on Rename
FeatureWEB-27640Support RegExp lookbehind assertions
FeatureWEB-11052Add support for markdown in jsdoc
FeatureWEB-31581Code style for JS file names
FeatureWEB-30230Feature: Numeric separators
FeatureWEB-33050Support 'Jump outside closing bracket/quote with Tab' feature for Javascript/Typescript files
FeatureWEB-18381Flow/TSX/React: provide possibility to navigate via namespaced React tags
FeatureWEB-27687Add support for private class fields (ES Next)
FeatureWEB-30594jsDoc | Add support for optional properties in @typedef with @property
FeatureWEB-22487Make ECMAScript 6 default JavaScript version
FeatureWEB-31761JavaScript: use "d.ts" when there is import with explicit "js" extension
FeatureWEB-24395Flow: Type annotations need a different color
FeatureWEB-29250Support yarn workspaces (better indexing of node_modules parent directories)
FeatureWEB-31174Show all symbols on second completion when "Only type-based completion" is enabled
FeatureWEB-32919Support 'import.meta' metaproperty
FeatureWEB-2694IDEA should not report unresolved js reference if code checks for it explicitly
FeatureWEB-30918webpack 4: exclude dist folder by default
FeatureWEB-30445Show inferred type in Flow in Brief Info
FeatureWEB-31275Intentions: 1) move type into separate file with matching name, 2) rename file to match type name
FeatureWEB-22256Show readme file from npm package in documentation popup in import statements
FeatureWEB-28578Support BigInt
FeatureWEB-31213Live templates should be language-version-dependent
FeatureWEB-18032JSDoc: support name path including "unusual" characters (@event, @fires, @listens, module: etc.)
BugWEB-25009Javascript instanceof suggestions, upcast
BugWEB-33574JS: Changing language level doesn't trigger reindexing node modules
BugWEB-32042Incorrect type inference for destructuring assignments with require()
BugWEB-31787Unresolved variables while using @types/react
BugWEB-32545WebStorm 2018.1.2 broke Vue JSX syntax highlight
BugWEB-31571'Implement missing members' should work for object literals with expected types in pure JS
BugWEB-24161CommonJS: properties of function object returned by exported module not resolved
BugWEB-29083WebStorm can not infer any type in javascript files
BugWEB-22342CommonJS: properties of object instance returned by exported module not resolved
BugWEB-32006assignment to es6 class properties are considered redefinement and marked as unused (possible 2018.1 regression)
BugWEB-31299Quick Doc: Markdown: open angular bracket is changed into the &lt; symbol
BugWEB-32491Can't type named default exported class
BugWEB-29681Expression type action sees 2 expressions
BugWEB-33700JavaScript: 'Method expression is not of Function type' after exporting
BugWEB-31629Flow: cannot parse signature with multiple parameters represented by union types
BugWEB-33061WebStorm doesn't type 'this' properly when used in JSDoc
BugWEB-30877Wrong suggestions/missing documentation for interface members declared in typings
BugWEB-30878Declaration merging in typings breaks documentation lookup
BugWEB-30879Problems using interfaces declared in typings in plain JavaScript files
BugWEB-31400Type mismatch errors when mapping `{}` type to object instance
BugWEB-30113Incorrect suggestion for empty return statement inside generator function
BugWEB-16665Syntax highlighting is wrong when sharing same file between projects with different JavaScript Language versions
BugWEB-31980Wrong "collection '<collection>' updated, but never queried" violation when using "in" operator
BugWEB-28158Method is missed in completion/not resolved if class is exported like module.exports=class
BugWEB-32966No completion for `async` keyword after `=` in function expression
BugWEB-26635Regression: Javascript/node references no longer resolved across `require`
BugWEB-31824Namespaced Classes Constructor Parameter Hinting
BugWEB-31665"Implement methods" cannot generate paired accessors and async/generator methods in pure JS
BugWEB-24383"Copy reference" from context menu on JS object broken in PhPStorm 2016.3
BugWEB-31336Problems with private fields
BugWEB-32125Code analysis for JavaScript is broken after upgrade to 2018.1
BugWEB-21478Quick Fix: Implement missing members based on JSDoc interface definition
BugWEB-31346Only first @example from JSDoc is properly shown in the documentation
BugWEB-31753Flow JS: Some line markers are not reported
BugWEB-18469Methods can not be resolved to node_modules
BugWEB-33290Iterate intention: template should skip the last variable
BugWEB-26860Quick Documentation - JSDoc @property annotation not handled over multiple lines
BugWEB-30658Promise chains skip return values of long-hand arrow functions when type checking
BugWEB-30386TypeScript import added when pasting from clipboard into comment
BugWEB-6164Documentation is not shown for function with no textual comment
BugWEB-14279Use domination assignment instead of initializer for type evaluation
BugWEB-31504Autocomplete of class methods stopped work
BugWEB-33349Spread expression types in calls are always evaluated as 'any', that is incorrect
BugWEB-26824Flow: syntax errors when using destructuring in function type
BugWEB-32770Folded regions are unfolded on file reopening
BugWEB-30926ctrl+click functions with JSDoc notation between two objects doesn't properly track. Changes from 2017.2-2017.3
BugWEB-32140Better availability for 'Introduce variable' action
BugWEB-31695'Implement methods' quick fix generates prototype-based members for a class expression
BugWEB-31523Ordered lists <ol> are not supported in JSDoc comments
BugWEB-31061.vue file not support flow
BugWEB-31200Object with computed property names shows duplicate keys warning
BugWEB-32790WebStorm decides to stop accessing .d.ts files for es features for a project
BugWEB-31223'Create class' fix produces invalid code
BugWEB-30579ES6 'implement' action for jsdoc entities is separate from 'Generate' mechanism
BugWEB-31613Flow: weird 'declare expected'
BugWEB-31615Flow: cannot parse call signature in ambient class
BugWEB-11714Object key should be resolved after checking for key
BugWEB-24263Scratch files don't support ES6
BugWEB-32208React Stateless Functional Component autocomplete doesn't work with Flow prop types
BugWEB-32935Install and add to dependencies should respect project package manager
BugWEB-32130Flow: async generic lambdas syntax is not recognized correctly
BugWEB-32691'Implement missing members' for object generates redundant comma
BugWEB-32692Exception on opening quick documentation for addEventListener
BugWEB-32072Using babel 7+ breaks webpack integration
BugWEB-32075Parse error on 'async get(){}' function property (regression)
BugWEB-31610Cannot parse valid Flow syntax for generic lambdas in type annotations
BugWEB-31612Cannot parse generic lambda as type argument in Flow
BugWEB-31614Flow: incorrect lexing of generic lambda with lambda as a parameter
BugWEB-31616Flow: 'declare export default' is supported incompletely
BugWEB-31361No 'abstract class / interface cannot be instantiated' warning when implementing JSDoc interface with imports
BugWEB-28079WebStorm fires “Unused default export” wraning when export is actually used and IDE knows it.
BugWEB-30881Problems extending an abstract class declared in a typings file
BugWEB-30880Constructor documentation declared in typings not shown
BugWEB-31938Bad error message for getter/method mismatch in plain JS
BugWEB-31289Create interface doesn't work via inspection
BugWEB-30082Wrong type mismatch errors when using overloaded functions in typings
BugWEB-31637Flow and TypeScript: trailing commas are okay in generic parameter lists, but we don't parse that
BugWEB-31633Flow: 'declare function' should be allowed to have unnamed parameters
BugWEB-33077Instance fields have inconsistent styling
BugWEB-25333'Replace switch with if' removes block's body
BugWEB-30291Flow Project errors does not show warnings if there are no errors
BugWEB-31464Simple Flow function return type syntax is not recognized
BugWEB-19719ES6: The `yield` and `new.target` keywords may not be used in an arrow function's body
BugWEB-32174Quick Documentation overlaps @example formatting
BugWEB-32616Complete current statement (if block) places cursor out of the block if 'simple blocks/methods one line' options is enabled
BugWEB-30829False positive? "Field ... is declared after ... and is possibly not assigned yet" with class property initializers
BugWEB-32971Do not show 'with' keyword on top of completion
BugWEB-32977Undefined property assignment incorrectly triggering
BugWEB-32979@memberOf for instance members support only 1 way of declaration of 3
BugWEB-24606Intellisense taking the wrong JS file and not the one imported in require('./...) using NodeJS
BugWEB-31312Default word in object is bold
BugWEB-32953No support for Node.js Async Hooks module
BugWEB-29193JSDoc formatting of @example blocks could be better
BugWEB-32427Renaming function parameter changes usages of same-named variable in inner scope
BugWEB-32421next/prev method ignores es6 object methods when {key: function} is present within a method
BugWEB-32139Invalid 'Returned expression not assignable' when using Object.create
BugWEB-33435Imported class member not resolved when using singleton pattern
BugWEB-26937CommonJS: properties of class instance returned by exported module not resolved
BugWEB-32119Proper support for `@instance`
BugWEB-33611Javascript. Array type is not properly defined
BugWEB-32706Complete current statement should add semicolon in switch statement after 'default'
BugWEB-31059get & set keywords are ignored when implementing methods marked with @abstract (ES6 classes)
BugWEB-30647Interfaces declared in .d.ts modules not found
BugWEB-24352JSDoc: Inline documentation window mangles the JSDoc comment text
BugWEB-33280Can't finish template for switch/while by pressing Enter once
BugWEB-33498Navigate/Declaration works wrong when using computed properties
BugWEB-31135.mjs extension will no longer find usages of file.
BugWEB-30446Expression type action in Flow shows the expression twice
BugWEB-31274Quick Doc: Markdown: IOOBE is thrown when documentation contains angular bracket before code block
BugWEB-33129Add keyword completion for 'new.target' and 'import.meta'
BugWEB-30931Cmd+Shift+Enter completing expression incorrectly
BugWEB-327682018.1.2 broke JSX when using quotes
BugWEB-33591Reduce availability range of some intentions for class members
BugWEB-31236Pure JS generate -> constructor doesn't insert required 'super' call
BugWEB-26870Complete members of exported class instance
PerformanceWEB-32483IDE Freezes and general slow performance
PerformanceWEB-31630Very high CPU usage when indexing node_modules
PerformanceWEB-28126PyCharm slows down when editing JavaScript files
PerformanceWEB-32469Slow initial indexing and completion in projects with Cypress
PerformanceWEB-31271IDE Hangs
UsabilityWEB-33552Autocomplete for properties doesn't show string-named items when typing a capital letter
UsabilityWEB-31473Flow's output changed in version 0.66, now the IDE's Flow error messages need to be adapted
UsabilityWEB-30365Create an React-App - and Project-Name
UsabilityWEB-32488Code-Completion disturbing entry
UsabilityWEB-31855if method name is capitalised, intellij injects it without parentheses
UsabilityWEB-31398javascript (es6+) module imports do not have .js extension
CosmeticsWEB-32663Remove "Implement methods" for objects without contextual type
CosmeticsWEB-31826Method separators aren't shown for arrow functions
CosmeticsWEB-31098Update descriptions for import/export Live templates
CosmeticsWEB-31831Settings: JS/TS: Code generation: align fields on the page
CosmeticsWEB-33635Issues with brace highlighting
CosmeticsWEB-33186Wrong before preview for "switch" postfix action
TaskWEB-31296Remaining things about private JS class members
TaskWEB-32285JavaScript editable postfix templates
TaskWEB-31469webpack 4: update config schema
ExceptionWEB-30943NPE at com.intellij.lang.javascript.modules.ModuleFixCreator.isGlobalPredefinedElement
ExceptionWEB-32656IllegalArgumentException when insert text in .js file
ExceptionWEB-32917Mac. exception in JSUnusedGlobalSymbolsInspection
ExceptionWEB-31078Exception when create @angular/cli 1.6.6 project
ExceptionWEB-32718StringIndexOutOfBoundsException is thrown on indexing
JavaScript. FormatterFeatureWEB-10038Bad JS code format after using completion
FeatureWEB-29071JS/TS: Should keep line breaks around parameter lists if 'keep line breaks' is enabled
FeatureWEB-16696Wrong indent size in multi-line string definition in WebStorm
BugWEB-31019ES6 Bind operator (::) improperly indents.
BugWEB-31928Formatting of "await" in TypeScript broken
BugWEB-29105JSX in vue uses HTML indentation settings
BugWEB-11763Incorrect line break on auto formatting with long statement conjunction
BugWEB-29763Javascript formatter causes multi-line object indent in if statement violates ESLint standard rule for indent
BugWEB-31326Code Style: No space at right side of arrow if Arrow function is checked and Function left brace is unchecked
BugWEB-30818'Chop down if long' does not work in binary expression in if condition
BugWEB-12193JSDoc comments with code samples not indented properly
BugWEB-32659JS formatting: 'Method call arguments -> Align when multiline' does not work if argument is binary expression
BugWEB-32154Autoformat breaks code
BugWEB-31167'Wrap imports -> Always' shouldn't affect namespace or default imports
TaskWEB-33431Formatting for conditional types, named and default generics, variadic tuples
JavaScript. FrameworksFeatureWEB-32648Angular6. Add support for angular-cli setting "stylePreprocessorOptions" > "includePaths"
FeatureWEB-29682Angular CLI 1.5 generators don't have command line arguments info
FeatureWEB-30502Add React Live Templates
FeatureWEB-20913Intention: Switch between React class and pure function syntax
FeatureWEB-30416tsx is not recognised in vue single file component
FeatureWEB-30656HTML tag tree highlighting does not work inside JSX render return statements
FeatureWEB-33304Remove "introduce local variable" intention for angular methods/data
FeatureWEB-33381Show type of React props in completion popup
FeatureWEB-31654Can't autoimport React HOCs
FeatureWEB-28160Vue.js Add opportunity to create a new vuejs project
FeatureWEB-31488[Vue.js] V-for items autocomplete
FeatureWEB-33244React: Complex prop-types (oneOf, shape, arrayOfType) should be supported
FeatureWEB-28376Add support for angular-cli setting "stylePreprocessorOptions" > "includePaths"
FeatureWEB-30481Code completion for Vue events and event modifiers
BugWEB-33573Do not show ng add/install things if @angular/cli is not installed
BugWEB-33575Can't create react-native project
BugWEB-29520Ignore React JS Lifecycle components/properties using ES6 syntax
BugWEB-32069React 16.3: support new lifecycles
BugWEB-30287Code completion for TypeScript Vue components
BugWEB-31439Create a method from angular template with params generates red code
BugWEB-32643Angular 6. Unnecessary folder is created when generating new project
BugWEB-32642Angular 6. Make output colored again
BugWEB-33064Regression. imported 3rd party vue components are not resolved (vuetify)
BugWEB-31475Vue CLI: do not show progress as a separate dialog window
BugWEB-31474Vue CLI: reset project creation on pressing cancel
BugWEB-31479Project template dropdown should be disabled for @vue/cli
BugWEB-31646Vue: generate imports when completing not global vue-class-components
BugWEB-30850React Native: no completion for native components properties
BugWEB-31322Angular 5 -> Attribute i18n is not allowed here
BugWEB-32986Support pointer events (react 16.4)
BugWEB-32162Copy React import when moving or copying JSX code
BugWEB-31829[React Native Configuration] - Runs simulator when `Build and launch` disabled
BugWEB-33605Load karma and protractor config paths from angular.json
BugWEB-27143Code completion for React lifecycle methods
BugWEB-31506Vue create project: empty combo box for linter selection
BugWEB-30928Components in template while using mixins
BugWEB-33114Completion of function inserts parens when completing in JSX with expected function type
BugWEB-28018Angular: support navigation/completion for template reference variables in `@ViewChild()` decorator
BugWEB-32557Angular 6 CLI blueprints not supported
BugWEB-26739Disable 'Refactor | Extract included file' for Vue files
BugWEB-31580Auto import of Vue components doesn't respect Auto Import preferences
BugWEB-33526React Class Component template should be 'Component' instead of 'PureComponent'
BugWEB-30759Vue Plugin got warning while props with .sync
BugWEB-32268Simultaneous editing of JSX tags is broken on auto-importing component
BugWEB-32264No properties in the completion for material-ui
BugWEB-32949Exception when renaming methods/data in .vue files
BugWEB-32617Regexp in JSX attribute value breaks syntax highlighting
BugWEB-31992auto-imports for scoped packages resolves to wrong file
BugWEB-32507wrong type mismatch error when using template reference variable for <textarea> (due to uppercase-misspelling)
BugWEB-26939WebStorm doesn't understand bound variables in Angular structural directives
BugWEB-31480Win. Wrong symbol when creating vue project
BugWEB-31484Renaming an angular component should suggest to rename file according to Angular style guide
BugWEB-30682Angular. ngIf then/else block shows the error (statement expected)
BugWEB-32323IDE doesn't recognize local variables prior to *ngFor
BugWEB-32583Vue project generation fails with @vue/cli 3.0.0-beta.9 and later
BugWEB-33599Do not list already installed packages in New|Angular Dependency... dialog
BugWEB-33451Insufficient new project name validation for latest Angular CLI versions
BugWEB-33121Do not suggest running npm install when creating a new Vue project
BugWEB-31512Generating Angular Components doesn't work
BugWEB-21774{'{'} in jsx breaks syntax highlighting
BugWEB-33378Angular Schematics dialog: show completion when typing `--`
BugWEB-31557Angular Component host not parsed correctly
BugWEB-33722React: add autoimport for Component based on react.d.ts
UsabilityWEB-31675Vue extract component: add action, corresponding to intention, into Refactor and Refactor This groups
CosmeticsWEB-31476Vue CLI: capitalise yes-no answers
CosmeticsWEB-31499Vue CLI: update texts
CosmeticsWEB-30808Some of the vue components may have an empty body
TaskWEB-31545Update Angular Live Templates
TaskWEB-30882Align Vue templates, completion and actions with Vue Style Guide
ExceptionWEB-30790Exception when extracting vue component
JavaScript. InspectionsFeatureWEB-31568"Create derived class / implement interface" intention action
BugWEB-27281False "Possible iteration over unexpected (custom/inherited) members" inspection errors when using 'hasOwnProperty.call()'
BugWEB-30991IDE Fatal Error: CoffeeScriptUnusedLocalSymbols
BugWEB-33556Inspections: "Missing require() statement" inspection has no description
BugWEB-30740Unresolved read property when incrementing getters/setters with JSDoc
BugWEB-26902Inspections: "Convert to arrow function": correctly convert function with destructuring parameter
BugWEB-31754'Missing await' false positive in 'for async' with ESNext 'for await'
BugWEB-31124TypeScript: "Unsound 'typeof' type guard check" inspection should understand generic constraints
BugWEB-31694Unused local Symbol - False match
BugWEB-33365JSDoc error with default + rest arguments
BugWEB-28206Allow to skip files from webpack code analysis
BugWEB-31008Tool 'ES6ModulesDependencies' registers INFORMATION level problem in batch mode on JSFile:validations-spec.js. INFORMATION level fixes could change semantics and should not be used in batch transformations
BugWEB-32839Wrong warning var' variables cannot share name with block sc...
BugWEB-30597TS/JS Code Templates: predefine variables are not applied
BugWEB-24435Pointless boolean expression false positive for double negative
BugWEB-33588inspection "TypeScript | Unsound 'typeof' type guard check" is not fully correct
BugWEB-32956False positive for inspection "Primitive type object wrapper used"
BugWEB-32303Strict mode inspection behavior is not applied in modules and classes
BugWEB-20119TSLint: improve completion for the complex rules
BugWEB-33610Wrong "Iterate with for..of" intention inside strings
BugWEB-28334Import code style from tslint ignores whitespace "check-modules"
CosmeticsWEB-33289Rename Iterate intention
ExceptionWEB-33555Throwable: Tool 'JSUnresolvedFunction' registers INFORMATION level problem in batch mode
JavaScript. RefactoringFeatureWEB-31644Rename all the related files (html views, stylesheets, etc.) for a component when renaming Angular component
FeatureWEB-32354JS: Inline refactoring should work across modules
FeatureWEB-13098Replace if/else chain with switch statement when using identity operator
FeatureWEB-11191JS: allow to inline function declaration
FeatureWEB-23894Refactor: Extract React (JSX) component
FeatureWEB-28355Perform Extract method refactoring in-place
BugWEB-31039JS/TS: Refactor: Rename: buggy rename from named import, rename not available on named exports
BugWEB-32849Move module member: dependent member highlighting in dialog has wrong color
BugWEB-18354Refactor - Rename of exported object doesn't rename import
BugWEB-31116Don't suggest converting function expression to arrow function if it uses 'arguments'
BugWEB-33049'Move into matching file' intention should escalate visibility of non-exported items in modules
BugWEB-32829Introduce var: wrong caret position after introduce variable /var postfix template
BugWEB-33062`Refactor -> Move` is very slow as it checks node_modules too
BugWEB-31477Exception when moving Angular component class
BugWEB-32415'Rename with containing file' should work for global entities too
BugWEB-30695Extract function: 'Declare static' checkbox can generate invalid code
BugWEB-6960TypeScript: Refactor/Inline works incorrectly for function that takes a callback as parameter
BugWEB-23504"variable value is changed when accessed from closure" when inlining variable set to this is used in arrow function
BugWEB-30905"Extract method" extracts without dialog, setting function scope to public
BugWEB-33417Move ES6 module member: usages of react components should be updated
BugWEB-33091UI issues with the Move Symbol dialog on resize
BugWEB-31588'Rename class in file' dialog shown when not necessary
BugWEB-31937'Introduce variable' dialog doesn't have 'const' option in ES6
BugWEB-32493When renaming Angular component, .spec.ts files should be renamed as well
BugWEB-32651Exception when inlining function call without parenthesis
BugWEB-32838Rename should not change default re-export
BugWEB-31440Wrong replacing `if` with ternary operator
BugWEB-32403JS: 'inline' refactoring should substitute parameters for function expression assigned to variable
BugWEB-32405Typescript: inline class member should check accessibility
BugWEB-2388'Cannot inline nonlocal variable' for top-level variable in Node module
BugWEB-33418Move ES6 module member: update imports to non-js files
BugWEB-33416Disable Inline refactoring for React functional components
BugWEB-31816Rename JS element should validate if member with same name is already present in scope
BugWEB-24100ES6 "Replace with template string" reports incorrectly on ternary operator
BugWEB-12557"Replace switch with if" does not work as expected when function in switch
BugWEB-33309'Move module member' should move assignments to properties
BugWEB-33107Move module member fails with resolve to implicit overload element
BugWEB-20006Intention replace ternary with if else puts variable declaration in scope
CosmeticsWEB-30764Invalid preview when extracted function has arguments
CosmeticsWEB-30798Preview in in-place extract function doesn't highlight keywords in ES6+
JavaScript. TemplatesBugWEB-18941Handlebars: avoid errors when expression is used as attribute value
LESSFeatureWEB-24450Copyright plugin: support Less, Stylus and PostCSS file types
BugWEB-20921Add support for valid HTML syntax for including LESS/SCSS in <style> tags
BugWEB-33442less file '{' expected with guard clause
UsabilityWEB-31609Default Less File Watcher options are not optimal
LintersFeatureWEB-26119Support severity levels in TSLint 5.0
FeatureWEB-29554It is not possible to create tslint fix file/error keyboard shortcut
FeatureWEB-23695Stylelint: lint <style> tags within .html files
FeatureWEB-31158Support reformatting non-JS files with 'prettier' (CSS, vue, markdown, etc)
FeatureWEB-31338Prettier: recognize "prettier" option inside the package.json file (completion, schema)
FeatureWEB-26391.vue files stylelint support
FeatureWEB-30350Don't enable linters when there's no package anywhere
FeatureWEB-32441TSLint - Add YAML Support
FeatureWEB-30482Apply code style from ESLint JavaScript configs automatically or show notification
BugWEB-31022ESLint: Cannot get result from language service
BugWEB-29991Options values check for TSLint need update
BugWEB-27540ESLint: update config schema with overrides
BugWEB-31363Prettier: Settings: correctly layout labels and do not mark page as changed when no action was performed
BugWEB-31342Prettier: do not mark file as changed when formatter does nothing
BugWEB-31341Prettier: hide notification panel in other files immediately when action from it was performed
BugWEB-33680Throwable: Read access is allowed from event dispatch thread or inside read-action only
BugWEB-32202Typescript code style global options not honored
BugWEB-28870Support for "extends" in TSLint
BugWEB-33055Guessing linters shouldn’t happen while indexing on initial project generation
BugWEB-31465vue project created by <vue cli 3.0> has no eslint error inspection in ".vue" file
BugWEB-32991Code styles from ESLint config inside package.json are not applied
BugWEB-32613JSCS: doubled completion inside the .jscsrc config file
BugWEB-31199Auto-import code style to project settings for 'standard' on opening project
BugWEB-31339Prettier: hide "Reformat with Prettier" action for not supported files
BugWEB-32110Allow comments in specific JSON configuration files
BugWEB-32328Crash (from idea.log)
BugWEB-31706On opening project, ESLint is not enabled if eslintConfig package.json section is enabled AND present in dependencies
BugWEB-28391TSLint schema: Support 'options' syntax for semicolon rule
CosmeticsWEB-31841Customise npm/yarn install notification reported by linters
TaskWEB-23376Stylelint: correct schema used for the completion and highlighting
Live EditBugWEB-33214Support Live Edit without Chrome extension
BugWEB-29792Live Edit: 'restart if hotswap fails' doesn't work with Node.js 8+
Node.jsFeatureWEB-32689Understand esnext field in package.json
FeatureWEB-27974Use yarn instead of npm if yarn is installed
FeatureWEB-32067node express-generator: Support new '--no-view' option for node express-generator
FeatureWEB-31207Support npx in project generators
FeatureWEB-28587Understand module field in package.json
FeatureWEB-31796package.json template should start version from `0.0.0` as `npm init` does
FeatureWEB-29184Add tab with stdout/stderr in Node.js run/debug tool window
FeatureWEB-26855No Editor > File and Code Templates option for package.json
FeatureWEB-8794package.json: provide path resolving
FeatureWEB-32500Navigate to installed package from corresponding dependency declaration in package.json
BugWEB-30993Windows, yarn (choco, .msi, scoop): yarn alias is empty
BugWEB-31010'Project' alias for package manager isn't shown when drop-down is opened
BugWEB-33042Find usages of file doesn't work if it's specified with "main" field in package.json
BugWEB-33708WSL: webpack config can not be analyzed
BugWEB-31985does not detect updated npm
BugWEB-31185Highlight mismatched dependencies in package.json
BugWEB-33687WSL: flow doesn't start (Throwable: Can't find node interpreter)
BugWEB-31496Webstorm can't locate npm packages when using asdf
BugWEB-31166Yarn isn't set when creating projects with yarn.lock via generator
BugWEB-32719Add v8 to Node.js core modules
BugWEB-31733Node.js project does not identify multiple Buffer.from definitions
BugWEB-31123NPM configuration: no scripts in drop-down
BugWEB-33688WSL: covered lines are not marked in the editor
BugWEB-33368Incorrect encoding in console.table() output
BugWEB-30940Auto detect yarn installed via brew & mac ports
BugWEB-31222Show "Node.js and npm" settings when searching for "yarn"
BugWEB-33154Support ANSI coloring in log files
BugWEB-32859Incorrect view of ANSI symbols in run tool window when create create-react-app project
BugWEB-32697Node.js: Run console width is limited to 80 symbols
BugWEB-32482Node.js remote interpreter is not added to the list when using Add - Remote
BugWEB-33263WSL: interpreter from linux is incorrect for some RC
BugWEB-33246WSL: can't configure node coding assistance
BugWEB-33248'WSL Ubuntu is not available' when try to run or debug
BugWEB-32364Node.js: asdf manager: search ~/.asdf/ folder to correctly detect npm version
BugWEB-30950Missing 'yarn' alias
BugWEB-24477Unresolved function or method with require() and node-js
BugWEB-33707WSL: can't install nyc or istanbull via link from error
BugWEB-33256WSL: can't create project via Ubuntu legacy
BugWEB-31113Do not change package manager when deleting yarn.lock
BugWEB-31352Readme for npm package is not detected if module has a slash in the path
BugWEB-30935Fix font for 'npm package' filed
BugWEB-30958Change spelling for package manager alias: 'project' -> 'Project'
BugWEB-30976Node.js interpreter dialog: remove extra separator
UsabilityWEB-32669Error: startup page is empty -- error displayed on Node.js debug configuration dialog but is not documented anywhere
UsabilityWEB-31323Check installed dependencies should not work inside node_modules
UsabilityWEB-31707run tab name for npm install dependencies
CosmeticsWEB-30961Alias is not visible when 'Edit configuration' dialog is too narrow
ExceptionWEB-33725WSL: IllegalStateException when indexing project
ProfilingFeatureWEB-29269Support Node.js heap profiling with Inspector APIs
Pug (ex-Jade)BugWEB-30741PUG - classes are not suggested when using '.class' in pug in Vue files
BugWEB-28010Vue + Pug: attributes with leading special characters
SASSFeatureWEB-30041Sass imports using path prefixed with Tilde ('~') are not resolved when using Angular CLI
BugWEB-31193Go to symbol for Sass/SCSS mixins and variables doesn't work when typing dash
StylusBugWEB-31356Vue stylus deep selector error CSS_PERIOD
TypeScriptFeatureWEB-27095TypeScript: Refactor: Inline Variable should work with type.
FeatureWEB-31577Intention action to implement interface or abstract class member in derived types
FeatureWEB-32847TS. Suggest inline implementations for abstract classes in the completion after the "new" keyword
FeatureWEB-32490Better support for unique symbols and non-string computed-constant properties in code completion
FeatureWEB-33326Add references to TS 3.0 named generic arguments (so that they can be renamed/navigated)
FeatureWEB-31453'Create from usage' should be available on import/export statements
FeatureWEB-32988'Is not accessible' inspection and quickfix "Make constructor public" for private/protected constructors
FeatureWEB-28964Add option to omit JsDoc types for TypeScript code
FeatureWEB-26909ES6/TypeScript: comments should be moved together with the symbol Move Refactoring
FeatureWEB-32945TS: completion after 'new' should assign higher priority if contextual type is a supertype
FeatureWEB-29248Add a different token type for "types" in TypeScript.
FeatureWEB-33447Replace if with switch intention in should work with enums and constant variables/fields
FeatureWEB-33448Intention actions to convert TypeScript parameter-property to field and back
FeatureWEB-33291Support TS 3.0 tuples in function calls
FeatureWEB-31739Support TypeScript 2.9 imported types
FeatureWEB-31364Support mapped type modifiers overriding (TS 2.8)
FeatureWEB-31041Bundle TypeScript 2.7
FeatureWEB-33546TypeScript service: provide show quick fixes for "suggestion" annotations
FeatureWEB-31978Support generics in TypeScript JSX (TypeScript 2.9)
FeatureWEB-26481For side-effects-only imports, show all available files in path completion
FeatureWEB-32997Suggest static factory methods based on expected types
FeatureWEB-30592TypeScript: provide quick fix to propagate parameters from the base constructor/method into it's delegate
FeatureWEB-33222Support TypeScript 3.0 named type arguments
FeatureWEB-33221Support TS 3.0 'unknown' type
FeatureWEB-31676Semantic support for async generators should be improved
FeatureWEB-27744Provide a way to change the color of typescript type information
FeatureWEB-31994TypeScript: Make method protected (on call from derived class)
FeatureWEB-30820Add type guard statements to postfix templates
FeatureWEB-31064Feature: Type inference in conditional types (TS 2.8)
FeatureWEB-33430Support TypeScript 3.0 variadic tuple types and tuples with optional items
FeatureWEB-31744Context action 'convert type alias to literal const enum'
FeatureWEB-33454Support TS 3.0 tuple type inference
FeatureWEB-32461TypeScript 2.9: support generics in tagged templates
FeatureWEB-29277Show documentation summary from MDN in TypeScript
FeatureWEB-31092Support TS 2.7 'in' type guards
FeatureWEB-22273TypeScript 2.0: Allow wildcard ("*") patterns in ambient module declarations
FeatureWEB-32501Show computed property names like [a] instead of their actual values in code completion
BugWEB-32041TypeScript: readonly abstract parsing is broken
BugWEB-32047Disable Compile TypeScript to JavaScript notification in Angular CLI projects
BugWEB-31966Parameter info shortcut does not work with TypeScript in Vue files.
BugWEB-30567Type guards are not applied to implicit members introduced via indexers
BugWEB-32688"Generate cases" action generates invalid code if no braces
BugWEB-31013Typechecking: incorrect handling of optional properties
BugWEB-32064Can't use typescript config files with non-default names in 'before launch` tasks
BugWEB-32661Incorrect ASI for TypeScript conditional type
BugWEB-32492Resolve string args of typescript indexer access type
BugWEB-32494Cannot parse function type with destructuring arg
BugWEB-32495Incorrect handling of const-defined properties in this-indexers
BugWEB-31606Don't suggest to add getter/setter and to 'make private' on abstract class members
BugWEB-29339TypeScript+React: Non-optional methods in Props interface not auto-stubbed when typing component name as JSX.
BugWEB-33519Remove redundant empty line when replacing if with switch
BugWEB-33701[TypeScript] Wrong "Non-ASCII characters in an identifier" inspection on TypeScript decorator with property access
BugWEB-26232WebStorm's typescript parsing is confused by NTFS directory junctions
BugWEB-33647Broken 'Create from usage' and 'Introduce type alias' in TSX tag generics
BugWEB-31470Getter/Setter should be generated with the same access type
BugWEB-33230typeof dynamic import error: expression expected
BugWEB-32051Pulling generics from type to its base type alias is broken with mapped types
BugWEB-32055Typescript readonly type inference from const
BugWEB-33001Bad "Must be lvalue" inspections in typescript
BugWEB-32352Generate -> Constructor doesn't properly handle overloads
BugWEB-31457TypeScript: incorrect resolve for overrides when we have several merged interfaces
BugWEB-32989Classes with private/protected constructors are suggested after "new" word outside their visibility zone
BugWEB-30589The '&' symbol is marked with the error (xml element expected) in .tsx file
BugWEB-31664Renaming a property and property accessors also renames the setter which is an error
BugWEB-31849TypeScript: improve visibility handling
BugWEB-29705Uniun types are created instead of pure types when pure types are available
BugWEB-31388'Make private'/ 'Make static' fixes generate incorrect code with generators
BugWEB-32081Auto-import doesn't correctly import from node_modules if a project is opened from symlink
BugWEB-30837Rename parameter finds occurences in comments, strings, ...
BugWEB-31306False positive in Unsound instanceof type guard check
BugWEB-32965Incorrect unresolved 'super' in case of object literals
BugWEB-33765Completion for generic TSX components doesn't work properly for the first attribute if TS service is enabled
BugWEB-32148'Create derived type' action should properly handle generic types (e.g., by inserting template sections for generic arguments)
BugWEB-30153Corrupt import pathes after refactor/move
BugWEB-32313Node subprocesses are started for TypeScript language service
BugWEB-31144TypeScript: errors are not detected for the readonly field with Union type
BugWEB-30816Inserting matching brace doesn't work as expected in case of EOF
BugWEB-31493TS valid syntax marked as invalid: readonly async
BugWEB-32943Error about non-implemented members is not shown for unnamed class expressions
BugWEB-31012Typechecking: incorrect handling of 'undefined' and 'null'
BugWEB-32123Exception when generating constructor in the interface
BugWEB-31774TypeScript: function template works incorrectly in ".d.ts" files
BugWEB-32593TypeScript: Renaming an interface member doesn't rename usages in curried functions
BugWEB-31168Remove overloads from auto-import popup
BugWEB-32101Incorrect parsing of parenthesized async lambda (regression)
BugWEB-33194TypeScript User Defined Type Guards: Renaming parameter does not rename type gurad definition "x is Y"
BugWEB-31102"Change signature" quick fix incorrectly replaces primitives with their interfaces and removes one argument ( :) )
BugWEB-32712Code completion for 'this'-items uses incorrect type when there exists a 'this'-parameter
BugWEB-28091Support different names for tsconfig.json
BugWEB-33293Expected type for tuple element shouldn't include types from other elements
BugWEB-33467Incorrect type text for tuples with repeating same types
BugWEB-31385Type of '+' expression is evaluated as dynamic in TypeScript
BugWEB-31715Find in path sets the path to a folder in node_modules when searching a package name
BugWEB-31713TypeScript incorrectly infers types of re-exported members from "import * as someName from 'path'"
BugWEB-30042JS unused local symbols inspection reports many false positives for unused parameters in .ts files
BugWEB-28565Support extending type alises
BugWEB-30925RXJS 5.5.3 importing aliased pipeable operators (e.g. flatMap)
BugWEB-31699Implementing TypeScript methods omits 'async' and '*'
BugWEB-33584TypeScript Auto-complete for new Promise is worse now
BugWEB-32185Enum and type alias have redundant items in "Generate" list
BugWEB-32180Typescript: Element is not exported if importing a namespace
BugWEB-32182Type Inference Broken when using enum instead of string
BugWEB-32189Abstract fields should not be in suggestion list to generate getters/setters/constructors
BugWEB-30550'Create variable/function' is not suggested if reference is via namespace
BugWEB-32570TypeScript enum value variants: should import enum at target location or don't show if it is impossible to import it there
BugWEB-32792Typescript: quick documentation doesn't show properties of type aliases
BugWEB-33457Spread expressions in arrays are always treated as 'any'
BugWEB-30637'Create Method' not working on instance of a generic class in TypeScript
BugWEB-31540StackOverflowError occurs when parsing TypeScript with certain generics
BugWEB-31548Type guard is not applied to enum, but it should narrow to enum literal values
BugWEB-29057TypeScript: auto-import should respect path mappings for node_modules in tsconfig.json
BugWEB-32489TypeScript 2.2: broken "Project errors" API produces memory leaks
BugWEB-30573Rename should work for literal types referenced in variable and parameter declarations
BugWEB-30963No completion for literal type for aliased tuples and for tuple-like types
BugWEB-33545Should properly infer tuples from spreads
BugWEB-32699Angular 6: do import from compiler/src/core
BugWEB-31918Typescript. expected type is not evaluated for shorthand arrow function return
BugWEB-33644Add 'extends' to the suggestion list for conditional types
BugWEB-320142018.1. TypeScript. Good code red: IIFE with explicit return type
BugWEB-31934invalid delete operator target, reference to field expected
BugWEB-32241Generic TSX component tag without any attributes is parsed incorrectly
BugWEB-31402Create method when missing should create it under imports
BugWEB-31405Invalid priority of 'as' expression in TypeScript
BugWEB-33716Incorrect rest parameter's type in "parameter info" / "quick doc" for aliases and tuples
BugWEB-32634False positive Type mismatch error inside Angular Injectable
BugWEB-33225TypeScript: better error messages
BugWEB-33036Typescript TSX conditional syntax error
BugWEB-32615Inspector suggests readonly when it can't actually be readonly
BugWEB-31194TS: Rename fails with multi-resolved overloads from usage
BugWEB-30824Can we avoid showing 'insert type assertion' fix for incompatible primitive types?
BugWEB-30827Incorrectly applied type guard in ternary operator
BugWEB-30822Don't show 'Implement all members' fix for primitive type
BugWEB-30945Invalid 'find references', 'unused import' for exported function with overloads
BugWEB-32361Incorrect Typescript "Unsound `instanceof`" with union of classes
BugWEB-32098Completion and suggestions not working for React.ComponentType
BugWEB-32952Incorrect errors with class expressions
BugWEB-21141[TypeScript] false error with generic extends non-named types
BugWEB-21143[TypeScript] false error when passing a generic comparator function to Array.sort
BugWEB-31209Wrong insertion scope when creating field in TS class in .vue file
BugWEB-31374Typescript:can't infer type from non-existing optional property
BugWEB-21614invalid error: rest parameter must be an array type
BugWEB-32118TypeScript: "Import can be shortened" suggests wrong import for the renamed export
BugWEB-32113TypeScript typed literals "implemented" and "implementing" gutter icons missing
BugWEB-32115TypeScript: re-exported symbol is incorrectly imported with quick-fix
BugWEB-32114TypeScript 'implement': generics are not applied when implementing for object literal
BugWEB-30164Support auto import for ambiguous imports
BugWEB-30165Documentation lookup for re-exported symbols.
BugWEB-31743Literal enum values should be target to rename when used via mapped types
BugWEB-31742Typescript. Incorrect type inference for array after ternary operator
BugWEB-31740Enums with literal values are not resolved as valid key sets in mapped types
BugWEB-33632TypeScript: Types are included in pre-populated JSDoc for properties/vars
BugWEB-32582Incorrect parsing of typescript non-null assertion in division operator
BugWEB-31170Re-exported module not resolved when importing from current dir ('.')
BugWEB-31620inlining variable produces incorrect code
BugWEB-31725Code completion and resolve for explicitly specified 'this' is broken (when service is off)
BugWEB-31720Support --noImplicitThis and ThisType semantically
BugWEB-33612Incorrect lexing of tuples in TSX tag generic arguments
BugWEB-31118Properly treat 'readonly' in mapped type when doing readonly checks
BugWEB-31115TypeScript: Conditional types: incorrect substitution because of incorrect 'object' implementation
BugWEB-31110TypeScript: change signature inserts incorrect import
BugWEB-32700Freeze on typing '=' in JSX with styled-components
BugWEB-33491Array destructuring should support TS 3.0 variadic tuples
BugWEB-31397'Specify type explicitly' produces 'void' for generators
BugWEB-31549Blinking overload resolution
BugWEB-33651Typescript. Autocomplete for properties doesn't show string-named items when service is on
BugWEB-32524Traversing base types for non-implemented members doesn't take into account type members from aliases
BugWEB-32299rxjs 6 imports point to "internal" path
BugWEB-30932Angular Animations Argument Type Error
BugWEB-33355Generic type arguments in JSX elements should allow whitespaces between tag name and generic list
BugWEB-31076Typescript Complete current statement for interface not adding semicolon
BugWEB-29622Better documentation features for union/intersection/mapped type members
BugWEB-30627Resolve typings for scoped packages
BugWEB-33590TypeScript objects with getters/setters fail type validation
BugWEB-33373TyperScript non-null assertion operator("!") syntax error case
BugWEB-31940Argument type not assignable to parameter error with intersection type
BugWEB-31235Typescript Enum Autocomplete
BugWEB-32788TypeScript return value checker erroring when using indexable types
BugWEB-31333Cannot parse 'async async' or 'async public' in object literals
PerformanceWEB-31597Typescript terrible performance and freezing
PerformanceWEB-31987StackOverflowError on a typescript project
PerformanceWEB-31458OutOfMemory when having `node_modules/*` in path mappings in tsconfig.json
PerformanceWEB-31148Terrible performance with Typescript Intellisense (ngrx selectors, composed functions)
UsabilityWEB-33609Inaccurate typescript autocomplete for text "ret"
UsabilityWEB-31126TypeScript completion: not intuitive automatic adding of `this` before the parameter name
TaskWEB-30813Support TS 2.8 conditional types
TaskWEB-33010TypeScript: remove "rxjs" from default blacklist
TaskWEB-33013TypeScript: enable excluding js sources for node modules packages with typings
ExceptionWEB-32678Exception when replacing switch with if
Unit TestsFeatureWEB-31101Karma: Can't have multiple configurations in single project with multiple node_module
FeatureWEB-31590Debugging Karma tests in Chrome Headless
FeatureWEB-26053Rerun failed Mocha tests
FeatureWEB-33200Rerun failed Karma tests
FeatureWEB-16577Can't set karma working directory
FeatureWEB-33164Rerun failed Jest tests
BugWEB-9523An issue of running Node.js task & karma server at same time
BugWEB-32546ReferenceError: jasmine is not defined when try to run protractor's tests from IDEA
BugWEB-32840Karma package is set to @angular/cli
BugWEB-33259WSL: interpreter from linux is invalid for Karma RC
BugWEB-33218ClassCastException when rerun Jest and Mocha test in 'Run with coverage' mode
BugWEB-33216Error when rerun failed Karma test in 'Run with coverage'
BugWEB-33682Karma: 'Re-run failed tests' button disappears when debugger starts
BugWEB-32144Ignored mocha tests reduce amount of passing tests incorrectly
BugWEB-30368Add JavaScript test files to the predefined test scope
BugWEB-33855Jest: custom setupTestFrameworkScriptFile is not executed sometimes
BugWEB-33622WSL: Jest Coverage tool window not showing any stats
BugWEB-31383Degraded mocha support if dev dependencies only include electron-mocha but not mocha itself
BugWEB-33816Jest: initialization error is shown as passed test
BugWEB-33810'Click to update snapshot' link is missing
BugWEB-33664Karma: cannot run single jasmine suite or test
BugWEB-33662Improve description for suits with ignored test when 'Hide ignored' is chosen
BugWEB-31951Jest default working directory is not set correctly
BugWEB-33260WSL: interpreter from linux is invalid for mocha RC
BugWEB-33261WSL: interpreter from linux is invalid for jest RC
BugWEB-33076org.jetbrains.concurrency.InternalPromiseUtil$MessageError: No tabs to inspect when debug KarmaHeadless test
BugWEB-32422mocha --recursive fails to run
BugWEB-32883Cannot run karma tests in @angular/cli 6 project with multiple targets
BugWEB-33631Jest + Vue: coverage marks not shown in gutter of .vue file
BugWEB-33353Jest, re-run failed tests: all test files are shown in the result tree
BugWEB-33356Jest: re-run failed tests can be faster
BugWEB-33354Jest, re-run failed tests: all same-named tests are run (even not failed)
BugWEB-33594'Show ignored' option doesn't work for Jest
BugWEB-32653Can't run Karma in @angular/cli 6 project
BugWEB-31558Karma coverage on Vue Project does not work
UsabilityWEB-30439Jest: show console.log output in test results console when clicking on test
UsabilityWEB-31201Running a jest test from within the test file sets wrong cwd
No subsystemBugDBE-6559New Data Source dialog does not save the status of driver downloads if dialog is closed with Cancel
BugDBE-6451DataGrip: Execution of SQL command does not ask for colon-parameter values if not whole SQL command is selected
PerformanceDBE-6206PyCharm freezes or shows Xmx out of memory error when typing .SEPARATOR , \n in an SQL file
DB ConnectivityBugDBE-1673Data Sources and Drivers Settings are applied to connection only after reconnect to DB
BugDBE-6435Datasource postgres configuration problem : ClassNotFoundException: org.postgresql.Driver
BugDBE-1423Wrong encoding when connection to database failed
UsabilityDBE-3260Add default values in SSH configuration for Data Sources
UsabilityDBE-6655Custom JDBC driver configuration workflow
UsabilityDBE-6321Postgres: if database in connection parameters differs from the database selected in Schemas tab IDE may fail to connect
UsabilityDBE-5628Password dialog box issues
DB ConsoleBugDBE-3116Impossible to disable prompt for query parameters
BugDBE-6384Disconnect database keyboard shortcut (Ctrl+F2) is stopping running application
BugDBE-2297Changes to Tools > Database > User Parameters are only in effect until PhpStorm is restarted
BugDBE-397DESC/DESCRIBE in read-only mode
BugDBE-6358Cannot execute multiple queries as batch in 181.4892.10 (unless highlighted)
UsabilityDBE-6112closing database console tab also closes the tab
UsabilityDBE-6115database console > scroll from editor doesn't work well
ExceptionDBE-5953DBE-5953 AE: SqlPsiElementFactory#createROFile
DB IntrospectionFeatureDBE-2102Default constraints in MS SQL
FeatureDBE-6234Allow filetype association to sqlite/sqlite3
BugDBE-4962Cascade rules of foreign keys not correctly displayed for Microsoft SQL Server
BugDBE-6553NPE when sync DB structure on already droped tables
BugDBE-5968Sybase: incorrect length for types nchar, nvarchar, unichar, univarchar
BugDBE-6409MariaDB schema discovery fails with: Unknown column 'purchase_date' in 'field list'
DB RefactoringBugDBE-634MS SQL Incorrect statements for modifying a table column default value
UsabilityDBE-6235Can't create a table during indexing
Data Import & ExportBugDBE-6081Can't import from .csv ISO timestamp with "Z" timezone
BugDBE-5987Cannot use \N as null text in data import
UsabilityDBE-6130Add IMPORT DATA FROM SQL DUMP menu option
Data ViewsFeatureDBE-4150Show # of selected rows in IDE
FeatureDBE-4100Feature Request: Show column comments in tooltips
BugDBE-5204Database Table DDL does not open in active window group
BugDBE-6306Copying Column List
BugDBE-6436Filter correction does not bring back matching column list
BugDBE-6200Quick documentation popup: too wide columns of the referencing data
BugDBE-1858Fiter in database table view does not apply to query result after cleared
BugDBE-6292Manual Transaction re-executes command after transaction rollback
BugDBE-4868sorting does not work if the filter contains a comment
ExceptionDBE-5884Throwable at com.intellij.openapi.application.impl.ApplicationImpl.assertReadAccessAllowed
IDE GeneralFeatureDBE-6502YAML plugin in DataGrip
FeatureDBE-3178dbForge-like projects
FeatureDBE-5081REST client in DataGrip
FeatureDBE-2614Add support for opening SQLite files from command line
FeatureDBE-6278Project handling more like IntelliJ, PyCharm, WebStorm
FeatureDBE-5999Ability to sort items in structure pane
BugDBE-6544Fail to generate pojos.groovy on view in database
BugDBE-6004Run and Synchronize Options in Scratches and Console Window show GUIDS and not logical names
BugDBE-6005Clicking issue does not work in update GUI
BugDBE-5576DataGrip .desktop entry description is not descriptive
UsabilityDBE-557It is impossible to Undo directory detaching
UsabilityDBE-6405Query plan fails for sub-queries in sqlite
Navigation & SearchBugDBE-6289Database View hasn't got focus after Go to Definition action
PL & DDL EditingFeatureDBE-5340Compiling PL/SQL code with atual errors
BugDBE-6301Postgresql - Create Foreign key between tables in schema different than public
BugDBE-3195Oracle PL/SQL Auto complete object types
BugDBE-6254Database toolwindow: ModifyTable action should not be available for read-only datasources
SQL Code StyleFeatureDBE-4923First word right-aligned code style
BugDBE-2799SQL formatting: case - when - then else alignment
BugDBE-6681Formatter unwraps MySQL-style line comments
SQL CompletionBugDBE-5451Oracle 12c ALTER TABLE identity clause
SQL EditingFeatureDBE-2647Custom Parameter %VAR% not working when wrapped in single quotes.
FeatureDBE-4560Shift-shift search looks for functions in database, not in codebase
FeatureDBE-3834Find usages on SQL file could find SQL data sources where this file is added to
BugDBE-5896MySQL dialect does not recognize CTEs
BugDBE-5928Oracle: Don't report OVERLAPS function as error
BugDBE-1509Teradata diagnostics command is treated as a parameter by mistake
BugDBE-5930Oracle: ELSEIF should not be valid keyword
BugDBE-5958DB2: Syntax Error at temporal Table Select Statement with BUSINESS_TIME alias
BugDBE-6354UNION ALL FROM TWO TABLES
BugDBE-4532Structure tool window view changed in recent IDE versions
UsabilityDBE-2248SQL: File Structure: table item is preselected if the caret is right after the last character of a column definition
UsabilityDBE-2249SQL: File Structure: if current statement is not shown selection could be preset to the nearest shown element
SQL GenerationBugDBE-3548Postgres: sequence start value is wrong
BugDBE-6176Suggested DB2 procedure drop statement is wrong
BugDBE-6473"Request and copy original DDL" action fails
BugDBE-5479explain plan for redshift outputs: Invalid operation: syntax error at or near "FORMAT"
BugDBE-5825MySQL code generator: invalid CHARSET clause for column definition
SQL HighlightingFeatureDBE-6367H2. Support select with 'with'
FeatureDBE-6368H2. Support drop scheme cascade
FeatureDBE-521Psi aware brace highlighter
FeatureDBE-3127MS SQL: Introspect and highlight columns of cursors that are returned by functions
BugDBE-5791oracle dialect -> support for TYPE records
BugDBE-5891Can't change SQL dialect for the injected string
BugDBE-6196Oracle: INSERT ALL incorrectly parsed without column list
BugDBE-6027Set statement with multiple clauses is reported as error
BugDBE-5960Window functions support for MySQL
BugDBE-5859MySQL Create Table Syntax parse error
BugDBE-6325MSSQL: Unable to resolve column
BugDBE-5919DataGrip: Color coding when calling a user defined procedure with SQL Server global variables does not work
BugDBE-6028CTE ("with" statement) and code folding are not working together (2018.1 EAP, MySQL 8/MariaDB 10.2)
BugDBE-5935PostgreSQL dialect Valid SQL marked as red
BugDBE-2581Support of conditional compilation flags in pl/sql code
BugDBE-6336Support for MAXFILESIZE in Redshift UNLOAD
BugDBE-6104H2 SQL dialect does not recognize "drop column" statement with multiple columns
BugDBE-5995PostgreSQL. Good code red. Custom sampling_method
BugDBE-6167H2 Custom type is not parsed correctly
BugDBE-5952False positive: Condition X is always true
BugDBE-6391PyCharm unable to determine record fields when looping through query surrounded by parentheses (PostgreSQL)
UsabilityDBE-5855PostgreSQL CITEXT type and extensions not supported
SQL ResolveBugDBE-6676Quoted Identifiers are case insensitive SQL Server
BugDBE-6182Same aliases for different tables in adjacent UPDATE queries lose column name resolution for SQL Server
BugDBE-6378Oracle JSON syntax is not recognized
User InterfaceFeatureDBE-4928Add of Database Color Settings check box for Table Bookmarks
Feature