Child pages
  • IntelliJ IDEA 2016.1.2b Release Notes
Skip to end of metadata
Go to start of metadata
No subsystemBugIDEA-153364Warning 'Cannot modify read-only scheme' when no one setting is changed
BugIDEA-153761Code analysis stucks in j2me project
BugIDEA-154341Subscription message has grammatical error
BugIDEA-155360Open In Browser : files from library jars cannot be opened
BugIDEA-152596Save settings failed. kotlin.TypeCastException: null cannot be cast to non-null type kotlin.ByteArray
BugIDEA-149939CCE in com.intellij.execution.stacktrace.StackTraceLine.getMethodLocation causes frozen UI
ExceptionIDEA-153534AE at com.intellij.openapi.editor.impl.view.EditorSizeManager.reset(EditorSizeManager.java:293)
AntExceptionIDEA-152435SOE during offline inspections
CSSExceptionIDEA-154246Throwable at com.intellij.psi.css.impl.stubs.index.CssIndexUtil.processKeysInScope
Code Analysis. DependenciesBugIDEA-141154Backward dependency analysis broken for external libraries
Code Analysis. InspectionBugIDEA-153063Invalid inspection warning: Condition 'in == null' is always 'false'
BugIDEA-153571"Run inspection by name" ignores file name filter
Code Formatting and Code StyleBugIDEA-153620Indexing took too long starting from IU-145.596.7
ColdFusionBugIDEA-153938ColdFusion. Syntax highlighting problem.
Compiling ProjectBugIDEA-154110Eclipse compiler won't compile sub Java8 SDK project
TaskIDEA-143976Update Eclipse Compiler version
Cucumber JVMBugIDEA-152821Allow Cucumber tests run configuration under JDK 7
DatabaseBugIDEA-151538NPE at JdbcConsole.java:405 Build #IU-144.3600.7
UsabilityIDEA-69733Database console is always closed when invoking 'Close unmodified' action
BugIDEA-149736ERD fails to respect the object filter
BugIDEA-153625'Go To Referenced Data' not working properly when target table is already open in editor
DebuggerBugIDEA-153426Debugging streams and lamdas: debugger enters unexpectedly java.util.stream
DockerBugIDEA-152569Docker: High memory usage
BugIDEA-153214Docker plug-in depends on SSH Remote Run which is not available in Community Edition
BugIDEA-153513Docker: terminals for `attach` and `exec` are broken
BugIDEA-150970Docker: edit container settings in the Docker view
ExceptionIDEA-153110PhpStorm fails to open PHP Interpreter dialog after PhpStorm detected a Dockerfile with the Docker integration plugin
Eclipse IntegrationBugIDEA-151755combineaccessrules is unnecessarily added to .classpath
Editor. Code CompletionBugIDEA-153520Lost type after autocompletion
Editor. Editing TextBugIDEA-152736IntelliJ IDEA refuses to print with no space between cast (unchecked cast)
BugIDEA-153586Backspace setting gets overwritten with every release
BugIDEA-152985Import popup for static import is not always shown
BugIDEA-152601Copy/paste of reference to class not properly working.
BugIDEA-154189cannot create new live template
BugIDEA-152991Field to Import pop-up auto-expands when not expected
UsabilityIDEA-126952Scratches should have an extension
Editor. Error HighlightingBugIDEA-154245Library source does not match the bytecode for class JSONArray when add new android sdk
Editor. Intention ActionsBugIDEA-153614Flip ',' (comma) generates invalid code
Find, Replace, Find UsagesFeatureIDEA-152756Add Quick Search ("Search for:") in "Find in path" > "Preview"
BugIDEA-154525"Find in path"-Action // Previous searches popdown conflicts with live preview
BugIDEA-154342Find Usages: Editor preview should not animate scrolling to the selected line for newly opened file
BugIDEA-151531Amount of matches reported in search bar doesn't correspond to reality
BugIDEA-120337after upgraded to 7.1.2, searching in previous Favorites doesn't work
Flash_FlexBugIDEA-153275Not recognizing properly class parameters if there is "if" statement when calling class
BugIDEA-132621Vector.<SomeClass> as Vector.<*> marked as error
BugIDEA-146613Extract Method in ActionScript creates internal variable
GradleBugIDEA-153664Gradle project - JAR file dependencies are not included in generated war artifact WEB-INF/lib directory
BugIDEA-152867Gradle window takes more than a minute to open
BugIDEA-140313Gradle auto-import refreshes wrong project
BugIDEA-150077Idea became unresponzible during debug
BugIDEA-153485Test Module dependencies defined in Gradle is not correctly configured in IntelliJ 2016.1
BugIDEA-153736IDEA16.1 war artifact(explored) with gradle compile project(":dir/module") can not regular work
BugIDEA-153231Optional creating a separate IDE module per gradle source set
BugIDEA-153235Package named 'main' is not correctly recognized in Gradle project with custom source set
BugIDEA-150058Multi-projects dependencies are incorrect in Gradle v2.5 or higher.
BugIDEA-153252IDEA 2016.1 Can't Reference Third-Party Project Gradle Configuration Unless It Uses the 'java' Plugin
BugIDEA-137118Intellij debug through Gradle with a JavaExec dependent task fails
BugIDEA-153003Dependent project appears twice in the gradle project view
BugIDEA-152581Generated sources are not picked up anymore in a Gradle build
BugIDEA-150685Gradle multi module project's dependency hierarchy is destroyed
BugIDEA-154371New Project / Module wizard: Gradle: switching Off all "Additional Libraries and Frameworks" creates module content root in unrelated location
BugIDEA-154369New Module: Gradle: by default "Add as module" shows "none", but works like parent module is selected
GrailsBugIDEA-152910Grails command results in Exception: java.lang.StackOverflowError thrown from the UncaughtExceptionHandler in thread "main"
BugIDEA-149568IntelliJ 15 no longer supports GORMs methods
BugIDEA-153676Cannot run grails command with dynamic classpath
GroovyBugIDEA-153785Correct groovy closure parameter usage marked as error
BugIDEA-153208Groovy static compiled code shown red with generics
BugIDEA-150940StackOverFlowException while reindexing
ExceptionIDEA-152776INRE through GroovyCodeFragmentFactory.isContextAccepted() on opening Breakpoints dialog with running indexes
IDE ConfigurationBugIDEA-152606IDEA fails on startup if one of plugins required for ruby or python plugin cannot be loaded
 BugIDEA-155871Page 'http://localhost:63342/m?jar/resources/inherit.gif' requested without authorization popups
JPABugIDEA-147717Database Schema Mapping does not show default relationships
Java. Error HighlightingBugIDEA-151302Good code is red: cannot pass wildcard generic to method with generic parameter which type variable is bounded by generic parameter
BugIDEA-151761Good code is red
BugIDEA-151409Good code red. Overload resolution fail
BugIDEA-153999Type inference trouble: unifying multiple lambdas with type wildcards
BugIDEA-154187Bad code green. Reference to testMethod is ambiguous
BugIDEA-151823IntelliJ IDEA doesn't show any compilation error (JDK7) when I try to overload a method var(int... x), var(Object... x), var(Integer... x)
BugIDEA-154009Good code red: Incompatible types when returning object with generic parameter
BugIDEA-152685Extending SimpleMongoRepository class shows error in Editor
BugIDEA-152659Incorrect incompatible types error
BugIDEA-152179Generics - good code red: can't pass list of <? extends Comparable> to Collections.sort
BugIDEA-150030No error reported for static inner class referencing non-static variable in outer class
BugIDEA-153632Wrong warning (red)
BugIDEA-150167Irrelevant error message for lambda
BugIDEA-153156unclear error message on red code: modifier 'interface' not allowed here
BugIDEA-154209Good code is red: "Operator '+' cannot be applied to 'java.lang.Object', 'java.lang.String'"
BugIDEA-153642Good code red. Assign method reference to Function
BugIDEA-152690False error: Incompatible types. Found: '<lambda expression>', required: 'p.X'
BugIDEA-152694Parsing error in Eclipse Collections
BugIDEA-153122Good code yellow: unchecked warning for varargs when passing array
BugIDEA-153222Incorrect lambda type inferring
BugIDEA-152577Unhandled exception using generic exception along with checked exception
BugIDEA-153411IDEA 15 and 16: varargs not accepting array input
BugIDEA-152090Misleading "Not a statement" error
BugIDEA-151202IDEA highlights wrong method parameter as error
BugIDEA-152384Good code red. Array construction method reference
BugIDEA-150718[inspection] [java] No instance of type variable(A) exists when using stream API toArray()
BugIDEA-152758Bad code green. Generic inference from argument
BugIDEA-154108False positive: bad return type in method reference.
BugIDEA-150688Good code red. Pass wildcard enum class
BugIDEA-151901Inner interfaces are not resolved in java scratch files
CosmeticsIDEA-151948Java editor: error message extends type parameter names with arbitrary numbers
Java. Intention ActionsBugIDEA-153166Conversion from method reference with type wildcard to lambda creates uncompilable code
BugIDEA-152934Copy to temp final variable adds unnecessary final modifier
BugIDEA-153325Incorrect "Can be replaced with collect call"
UsabilityIDEA-151996Multiple "Add Import" for pasted inner class references
Java. RefactoringBugIDEA-152822"Replace Constructor with Factory Method" refactoring should warn when method is already present
BugIDEA-151634Invert Boolean incorrectly modifies boolean variable of enhanced FOR cycle
BugIDEA-152956Option to moved to inner class is disabled
BugIDEA-151917Refactoring 'Replace Duplicate Code' doesn't work correctly with static methods when runs just after 'Pull Up method'
BugIDEA-152514'Invert boolean' works incorrectly with final fields
BugIDEA-152883Non required cast when inline 'this' reference inside local class
BugIDEA-151440No Move Members refactoring warning when move will hide existing member
BugIDEA-152126Safe delete of method parameter should warn about usages in method references
BugIDEA-151809No warning when Pull Up method to the interface dependent on the instance variable
BugIDEA-152334Refactor/Extract/Method leads to "Variable [...] is already defined in the scope"
BugIDEA-120320Constructor field generation should be aware of checkNotNull type assignments
BugIDEA-153254Conversion from anonymous class to lambda could lead to forward reference issue
BugIDEA-152320"Package does not exist" prompt is not shown when moving a class to some library package
CosmeticsIDEA-151912'Find and Replace Code duplicates' refactoring leaves code highlighted on Cancel
Java.InspectionsFeatureIDEA-152170Option to restrict "Anonymous type can be replaced with lambda" to @FunctionalInterface
BugIDEA-152331FieldCanBeLocal: not reported when calling super constructor
BugIDEA-153782Inspection Conditional expression (?:) fails for returns in lambdas
BugIDEA-152307Option "Ignore outer fields not visible from inner class" of inspection "Inner class field hides outer class field" does not work with nested classes
BugIDEA-152040Inconsistencies concerning analyzations of code using Optional<T> and Optional#isPresent
BugIDEA-152446"Confusing argument to vararg method" false positive
BugIDEA-153332Wrong "Field can be converted to a local variable" hint
BugIDEA-153532False positive for "Condition is always false"
BugIDEA-153897False positive "Bad return type in lambda expression"
BugIDEA-153097SuspiciousMethodCalls misses the baddies
BugIDEA-151954"Anonymous type can be replaced with lambda" inspection does not report a case in presence of not involved constructor
BugIDEA-153054Inspection 'Lambda can be converted to method reference' creates uncompilable code when wildcard used.
BugIDEA-153284Intermitted red highlighting of lambdas
BugIDEA-152303'Optional.get() without isPresent() check' inspection should support assertions
BugIDEA-153164Inspection 'Replace Anonymous with lambda' creates uncompilable code in complex case with generics
BugIDEA-153261Conversion anonymous class to method reference may leave unnecessary wildcard parameter type
BugIDEA-151540"Remove explicit type arguments" intention breaks compilation
BugIDEA-151898Optional.get without isPresent
BugIDEA-150754False positive "Redundant type cast"
BugIDEA-152332"Explicit type arguments can be inferred" can be wrong with String.valueOf
BugIDEA-152373Optional.get without Optional.isPresent warning when check is present
BugIDEA-151971Declaration redundancy inspection flags serialVersionUID and Serializable-related methods
BugIDEA-152076Inversed condition in if() caused to false alarm for Optional.get() inspertion
BugIDEA-153324Erroneous error message about multiple non-overriding abstract methods on @FunctionalInterface
BugIDEA-151559"Explicit type can be replaced with <>" breaks code
JavaEE.WebBugIDEA-153402optimize imports does nothing in new classes
MavenBugIDEA-133331Dependency Diagram does not show conflicts
Packaging and InstallationBugIDEA-149996IDEA 16 144.2608.2 cannot be compiled via ant: jdk.linux does not exist
BugIDEA-153200"You can evaluate for 30 days or buy a license key or upgrade online" message is displayed even with an active subscription
BugIDEA-153847EAP 2016.1 doesn't start on Mac
BugIDEA-152542Windows uninstaller: cancelling the warning shown on attempt to uninstall a running IDE shows uninstallation progress and "Uninstall was completed successfully" message
BugIDEA-150462JVMVersion < 1.8 should be ignored on MacOSX
BugIDEA-153217IDE suggests to install Java 1.6 on Mac
CosmeticsIDEA-152947MacOSX: IDEA 145.257 application should have name 'IntelliJ IDEA 2016.1', not 'IntelliJ IDEA 2016'
BugIDEA-155856After update from 2016.1.1 to 2016.1.2 IntelliJ IDEA won't start anymore on mac os x
Plugin Support. DevKitBugIDEA-147611Live Preview: Editing stops working after editing BNF
RefactoringBugIDEA-154459Moving files is broken
SQLFeatureIDEA-79339SQL: SQLServer: login identifier is resolved, while user name is not
BugIDEA-152617Good code red. PostgreSQL update with jdbc parameter
BugIDEA-133650db2 syntax: add support for keywords for string units in built-in functions CODEUNITS16 CODEUNITS32 OCTETS
BugIDEA-129278Correct H2 database sql has red underline
BugIDEA-148347MySQL # value pattern in SQL does not work
ExceptionIDEA-151821SQL: IAE at SqlFileImpl$8.getCasing() for specific code with Oracle type declaration
Template Languages. VelocityBugIDEA-152434Velocity. Trailing backslash causes wrong highlighting.
TerminalBugIDEA-152291ALT , CTRL characters in terminal window can not type on MAC
UsabilityIDEA-135527Start SSH Session Dialog with weird sorting
Unit Testing. JUnitFeatureIDEA-153424Make the testmethod list searchable
BugIDEA-152829Test class generator generates test methods in reverse order
BugIDEA-152905with ErrorCollector: misleading count of failed tests
BugIDEA-153304Run Configuration is marked as invalid (test doesn't exist) then a test method is declared in a parent class
Unit Testing. TestNGBugIDEA-152733TestNG tests: right click on method shows run as pre-configured pattern instead of run only one method (pattern is equal to the whole class)
BugIDEA-152857the testng xml config file created by IDEA for a class does not include groups info which leads to BeforeGroups method being ignored by TestNG runtime
User InterfaceBugIDEA-153630gdb console is blinking and adding and deleting scroll bar.
BugIDEA-70943Tooltip animations and buggy visibility are exceedingly frustrating
BugIDEA-153651Choose sources dialog cannot be cancelled properly
BugIDEA-152295StringUtil.pluralize() is incorrect
BugIDEA-153084IntelliJ IDEA 2016.1 requires acceptance of privacy policy each time I run IDEA
BugIDEA-152939deadlock on 16 EAP 144.2925.2 startup
BugIDEA-142781Scroll preview
BugIDEA-153753Find by mouse shortcut does not work with mouse button 4/5
BugIDEA-146638Customize IDEA dialog for Community Edition suggests Java Frameworks like J2EE, Spring, JBoss Seam & jBPM, Struts
CosmeticsIDEA-148970Unprintable symbols in Customize Idea wizard
Version ControlBugIDEA-153272Files are lost during the movement of unversioned files to overwrite existing files with same names
BugIDEA-153453Copying file inside project doesn't refresh the status of the new file
UsabilityIDEA-114505Changes tool window forgets preview toggle and has no file selected by default
UsabilityIDEA-153759Commit dialog doesn't remember "Disable editing" toggle state
Version Control. GitBugIDEA-153021Git : Update Project doesn't refresh the cached repository information if there were no incoming commits to the current branch
BugIDEA-152678Regression: Committing externally does not Update File State Correctly
BugIDEA-152902Git4Idea doesn't work on windows if home directory contains whitespaces
BugIDEA-152460Open on Github breaks when repo is on drive root
BugIDEA-151547Git commit error dialog locks the IDE if the text is too big
BugIDEA-153464Weird character ([) in commit warning box
BugIDEA-152430Removing remote branch no longer offers to remove its tracking local branch
BugIDEA-152101Error while "Accepting Theirs" in merge dialog when theirs version was deleted.
BugIDEA-151317Square brackets in file name cause problems with git
BugIDEA-101222Non-Ascii name of Git branch is displayed incorrectly
Version Control. LogBugIDEA-148029"go to branch" goes to wrong branch with the same prefix
Version Control. MercurialBugIDEA-153603Show Diff (Compare) doesn't work for renamed uncommitted files
BugIDEA-1535232016.1 does not detect external changes in the VCS repository
Version Control. TFSBugIDEA-152761"TF400367: The request could not be performed due to a host type mismatch." while connecting to VSTS
No subsystemBugWEB-21145EditorConfig doesn't respect code formating when path is added
BugWEB-20882Preserve setting `toggle auto-test` between IDEA restarts
BugWEB-21007JSON Schema: absolute URLs in $ref cause java.lang.RuntimeException: Non-relative reference
BugWEB-19815WebStorm 12 EAP initially tries to load settings from .WebIde100 rather than .WebStorm11)
BugWEB-19970WebStorm unexpectedly inserts lots of whitespace into string literals
BugWEB-20528Incorrect "Generated source files should not be edited..." warning randomly appears for source files with are NOT generated
BugWEB-20597comment generation does not work with es6 default parameter value as regex
BugWEB-20986JSON Schema Files that are updated require a close and relauch to be used
BugWEB-21083Mocha: create default configuration with a correct user interface
Build toolsBugWEB-20110gulp tasks should be listed in the order they are defined by default
BugWEB-20879pressing enter on a gulp file in the gulp run popup should run the default task for that file.
BugWEB-20914Console does not detect windows-style paths in TypeScript errors
BugWEB-20914Console does not detect windows-style paths in TypeScript errors
BugWEB-21105gulp/grunt task runner does not wrap around with arrow keys
CSSBugWEB-20885CSS/SCSS: "Unit of measure 's' is redundant" on time property for transition-duration
BugWEB-21116Unknown CSS pseudo selector ::-moz-range-progress
BugWEB-21024CSS: show *.svg images in file completion inside 'url' property
CosmeticsWEB-21078CSS: correct typo ('rigth') in info tooltip
CoffeeScriptBugWEB-19807Reformat code fails for coffeescript function bodies
DartBugWEB-21071Project view crashing/ being redrawn, instead of red squiggles appearing.
BugWEB-15936Hovering over a dynamic variable does not tell me what type it is
BugWEB-20759WebStorm unresponsive when html_dartium.dart is opened
BugWEB-20844Dart script can't be run from outside of a Dart package folder
BugWEB-21189Live template autocompletion moves inserted text after previous line
BugWEB-21123Using setUpAll in Dart Test omits test cases from Test Results panel
CosmeticsWEB-20801Dart: do not show "Imports optimized" on each Reformat Code action
DebuggerBugWEB-20997No-breakpoints hit in typescript sources when running jest via node debug configuration
BugWEB-20807With WebStorm latest, I am sometimes getting an error of Connection failed 404
BugWEB-21050No additional tabs are opened when debugging child processes when using Node 0.10
BugWEB-19583Node.js debugging: properties with numeric names are not displayed in the debugger variables
BugWEB-21447Attached files (.css, .js) are not served by built-in webserver
BugWEB-20340JavaScript debugger doesn't show "this" reference with ES6 fat arrows
File WatchersBugWEB-20970check for related changes from File Watchers took too much time and was cancelled
BugWEB-20021SCSS file watcher not working
BugWEB-9946WebStorm hangs when a less file-watcher tries to compile malformed less code
BugWEB-13459File Watchers, SCSS: no separate .css files produced for partials if 'track only root files' is off
BugWEB-20644Open Files and Current File scope not always available
HTMLBugWEB-17406HTML-style comment syntax within a javascript comment breaks comment end detection
BugWEB-17644HTML: Incorrrect width/height values are not marked in img tags
BugWEB-18909HTML Code Style "Keep white spaces inside:" should apply to granddaughters when reformatting
JavaScriptFeatureWEB-20555JSON Schema: recognize comments
FeatureWEB-18276Inject 'JSX Harmony' in script tag with type="text/babel"
BugWEB-20727Destructurization within catch
BugWEB-19187JSDoc mixin and mixes don't allow variables/functions to be followable
BugWEB-20426export default function gives "Unused function" and "Unresolved variables"
BugWEB-20557JSON Schema: provide warning about required type Object for the schema to be read
BugWEB-20633JSDoc: auto generation of comment is broken if "*/" is present as string
BugWEB-20933Do not add .jsx file extension when completing the paths in the import statements
BugWEB-20686strange property name autocomplete behaviour
BugWEB-20680ES6 unicode code points escape sequences are not supported in strings
BugWEB-20362refactor move file & import from 'package/file'
BugWEB-20751Javascript 'Optimize imports' changes order
BugWEB-20494JSDoc @see symbol autocompletion not working inside constructor function
BugWEB-20651Infinite indexing loop
BugWEB-20788Tagged template literals is not support in PHP Storm.
BugWEB-20797Wrong message "overrides method in Object" (again)
CosmeticsWEB-20602Extra items in quick-fix list: suppress suppression
JavaScript. FormatterFeatureWEB-19601Opt-out new indentation rules in JavaScript
BugWEB-20874Reformat code with async and single parameter arrow function without parenthesis
BugWEB-20491Spaces around 'in' operator are trimmed if Spaces/Around operators/Relation operators is disabled
JavaScript. FrameworksBugWEB-20600Angular 2: red code, 'Unexpected token' inspection
BugWEB-20736NgFor initialisers red code
BugWEB-20707Weird behavior with Angular 1.x custom attribute directives and autocompletion.
BugWEB-21183Meteor: Imports are not resolved
BugWEB-20713Angular 2 Good Code Red
BugWEB-20918Angular2: local variables are not resolved in inline templates
BugWEB-21068Angular2: don't show 'XML tag has empty body' warning for Angular directives in inline templates
JavaScript. InspectionsBugWEB-20745Regression: ES 2015 "const" and destructuring assignment cause an inspection error in the latest EAP for 2016.1
BugWEB-20117Redundant local variable inspection for JavaScript incorrectly identifies variable that is required.
BugWEB-20664Adding a JSDoc inline type triggers a completely unrelated and wrong inspection warning (possible misinterpretation of ES 2015 spread operator)
BugWEB-20534Duplicate declaration when using computed property names with function values
BugWEB-21164ESLint: custom severity chosen for ESLint inspection is ignored
BugWEB-20138ES6: reassign const variable
JavaScript. PredefsBugWEB-20708JSON.stringify has wrong parameter type def for replacer
BugWEB-20208Ecmascript 2016: Array.prototype.includes is unknown
LESSBugWEB-20842Code coloring for .less files phpStorm 2016.1
Node.jsBugWEB-20748WebStorm doesn't like the "sql" npm module
BugWEB-20808should not follow symlinked packages that are not in the project library root node_modules folder
BugWEB-20311Remote interpreter: keyboard Escape/Enter keys should work for dialog with Error message.
CosmeticsWEB-21002Typo in npm command list
ExceptionWEB-20643Remote interpreter: NullPointerException on applying empty Vagrant configuration
SASSFeatureWEB-21073Copyright comment format starting with /*!
BugWEB-20545Compass: headings() selector helper is highlighted as unknown function
TypeScriptFeatureWEB-16676Show "File -> New -> Typescript File" not only in Static Web Projects
FeatureWEB-20439Support upcoming TS 1.9 pathMapping semantics
FeatureWEB-20984include typescript 1.8.9
BugWEB-20887Typescript incorrect resolve amd imports with project modules
BugWEB-16951TypeScript: "Unused parameter"
BugWEB-21079'Add import statement' quick fix for Typescript ignores 'use single quotes' setting
BugWEB-21172Initializer type any[]<Foo> is not assignable to variable type Foo[]
BugWEB-20625Convert to template string intention should work in TypeScript
BugWEB-21090Incorrect autoformat tsx code
BugWEB-13906forEach with <any> array marks inner object methods as unresolved
BugWEB-18352Typescript: module resolution logic wrong. Analyzer ignores `typings` entry in sud-modules `package.json` when targeting commonjs
BugWEB-20743TypeScript type "import" is not added although it not present
BugWEB-20934Properties with "readonly" name breaks code validity
BugWEB-20684redudant semicolon in extract method refactoring
BugWEB-20849TypeScript: constructor parameters with decorators are always wrapped on formatting
BugWEB-20942No completion for paths for angular2 modules
BugWEB-21087[TypeScript] False error when initializing an array of objects with string literal types
BugWEB-20838String literal type doesn't work with array
BugWEB-20908File header comment block breaks indentation when using modules in TypeScript and WS2016.1
BugWEB-18835TypeScript: Autoformatting does not put spaces after colon before type in interfaces
BugWEB-20895TypeScript: Incorrect merging for types with generics
BugWEB-20894Good Code Red: TypeScript definition files
BugWEB-21107erroneous "private member is not accessible" warning in ng2 app
BugWEB-20961TypeScript: Path mappings: rootDirs should resolve relative path
BugWEB-20962TypeScript: Path mappings: recognize any baseUrl
BugWEB-20865Good Code Red RxJS in TypeScript
PerformanceWEB-19847WebStorm crashes caused by large TypeScript project when unresolved types introduced
ExceptionWEB-17532TypeScript: subsequent visibility changes with "Make public/private/protected" intentions breaks themselves
BugWEB-21612Chrome not loading ts files after security update
Unit TestsFeatureWEB-20979Debugging coffeescript with mocha should set mocha compilers up
FeatureWEB-21153Mocha+Typescript: Set extra mocha options automatically
BugWEB-20889Better mocha + typescript support
BugWEB-20772Karma: allow coverage preprocessors other than `coverage`
BugWEB-20846Mocha: multiline strings are shown as single line when comparing
BugWEB-10636Mocha: order output in the console correctly
BugWEB-20774Japanese characters are corrupted in the karma test runner.
No subsystemFeatureDBE-2161Structure view does not recognize SQL WITH syntax
DB ConnectivityUsabilityDBE-2327Please make missing SSH/SSL tab more discoverable for custom database connection
DB ConsoleBugDBE-2008[0xDBE][Build DB-143.1040.1] "Pin result tab" doesn't work correctly
BugDBE-2463Can't view multiline errors
DB IntrospectionBugDBE-2492Connecting to SQl Azure database fails
BugDBE-2501Index out of bounds exception: BaseFamily.move(BaseFamily.java:281)
BugDBE-2367Length of Char and decimal fields not shown when extracting DDL
BugDBE-2517Introspection is broken by user table
BugDBE-2485Database-Window: OR-ing object filters does not work in datasource properties
DB RefactoringBugDBE-1674Rename table from DB2 causes disconnect
Data ViewerBugDBE-2331"Clone row" - do not copy primary key value
BugDBE-2460change row
BugDBE-2569MSSQL: unable to delete or update duplicate rows in table editor
IDE GeneralFeatureDBE-874Ability to group files by their purposes
BugDBE-2377Export to CSV does not replace existing files
TaskDBE-2473Please make 'Remote Hosts Access' plugin available for installation
FeatureDBE-2552Perforce support?
SQL CodeStyleBugDBE-2494SQL formatting rules mess with local variables
SQL EditingBugDBE-2408SQL Editor recognizes "default on null some_sequence.nextval" expressions as incorrect
SQL HighlightingBugDBE-2396DataGrip sends the SELECT immediately following a WITH (CTE) separately causing syntax errors in PostgreSQL
BugDBE-2478PostgreSQL: GRANT multiple permissions on a sequence highlighted as error
BugDBE-1186MySQL function {{MID()}} is a synonym for {{SUBSTRING()}} but doesn't accept two variable variant
BugDBE-855MS SQL: create index using WITH without parentheses is green
BugDBE-2447SET row_security highlighted as error
BugDBE-2424EXPLAIN on postgres CREATE TABLE AS
BugDBE-1225Allow qualified column names in MySQL INSERT statements
BugDBE-2321Code highlighting for sybase sql displays an error on ^ operator
User InterfaceBugDBE-2003Structure ToolWindow sorts shortens entry names wrong
BugDBE-1242Having focus in "Database Console" and pressing "close tab" with CMD-w always closes SQL console instead
BugDBE-2368No "Print..." opption in File menu
EditorUsabilityEDU-591Find in Path - Preview: Keeps refreshing - unuseable
No subsystemBugIDEA-153364Warning 'Cannot modify read-only scheme' when no one setting is changed
BugIDEA-153761Code analysis stucks in j2me project
BugIDEA-154341Subscription message has grammatical error
BugIDEA-155360Open In Browser : files from library jars cannot be opened
BugIDEA-152596Save settings failed. kotlin.TypeCastException: null cannot be cast to non-null type kotlin.ByteArray
BugIDEA-149939CCE in com.intellij.execution.stacktrace.StackTraceLine.getMethodLocation causes frozen UI
ExceptionIDEA-153534AE at com.intellij.openapi.editor.impl.view.EditorSizeManager.reset(EditorSizeManager.java:293)
AntExceptionIDEA-152435SOE during offline inspections
CSSExceptionIDEA-154246Throwable at com.intellij.psi.css.impl.stubs.index.CssIndexUtil.processKeysInScope
Code Analysis. DependenciesBugIDEA-141154Backward dependency analysis broken for external libraries
Code Analysis. InspectionBugIDEA-153063Invalid inspection warning: Condition 'in == null' is always 'false'
BugIDEA-153571"Run inspection by name" ignores file name filter
Code Formatting and Code StyleBugIDEA-153620Indexing took too long starting from IU-145.596.7
ColdFusionBugIDEA-153938ColdFusion. Syntax highlighting problem.
Compiling ProjectBugIDEA-154110Eclipse compiler won't compile sub Java8 SDK project
TaskIDEA-143976Update Eclipse Compiler version
Cucumber JVMBugIDEA-152821Allow Cucumber tests run configuration under JDK 7
DatabaseBugIDEA-151538NPE at JdbcConsole.java:405 Build #IU-144.3600.7
UsabilityIDEA-69733Database console is always closed when invoking 'Close unmodified' action
DebuggerBugIDEA-153426Debugging streams and lamdas: debugger enters unexpectedly java.util.stream
DockerBugIDEA-152569Docker: High memory usage
BugIDEA-153214Docker plug-in depends on SSH Remote Run which is not available in Community Edition
BugIDEA-153513Docker: terminals for `attach` and `exec` are broken
BugIDEA-150970Docker: edit container settings in the Docker view
ExceptionIDEA-153110PhpStorm fails to open PHP Interpreter dialog after PhpStorm detected a Dockerfile with the Docker integration plugin
Eclipse IntegrationBugIDEA-151755combineaccessrules is unnecessarily added to .classpath
Editor. Code CompletionBugIDEA-153520Lost type after autocompletion
Editor. Editing TextBugIDEA-152736IntelliJ IDEA refuses to print with no space between cast (unchecked cast)
BugIDEA-153586Backspace setting gets overwritten with every release
BugIDEA-152985Import popup for static import is not always shown
BugIDEA-152601Copy/paste of reference to class not properly working.
BugIDEA-154189cannot create new live template
BugIDEA-152991Field to Import pop-up auto-expands when not expected
UsabilityIDEA-126952Scratches should have an extension
Editor. Error HighlightingBugIDEA-154245Library source does not match the bytecode for class JSONArray when add new android sdk
Editor. Intention ActionsBugIDEA-153614Flip ',' (comma) generates invalid code
Find, Replace, Find UsagesFeatureIDEA-152756Add Quick Search ("Search for:") in "Find in path" > "Preview"
BugIDEA-154525"Find in path"-Action // Previous searches popdown conflicts with live preview
BugIDEA-154342Find Usages: Editor preview should not animate scrolling to the selected line for newly opened file
BugIDEA-151531Amount of matches reported in search bar doesn't correspond to reality
BugIDEA-120337after upgraded to 7.1.2, searching in previous Favorites doesn't work
Flash_FlexBugIDEA-153275Not recognizing properly class parameters if there is "if" statement when calling class
BugIDEA-132621Vector.<SomeClass> as Vector.<*> marked as error
BugIDEA-146613Extract Method in ActionScript creates internal variable
GradleBugIDEA-153664Gradle project - JAR file dependencies are not included in generated war artifact WEB-INF/lib directory
BugIDEA-152867Gradle window takes more than a minute to open
BugIDEA-140313Gradle auto-import refreshes wrong project
BugIDEA-150077Idea became unresponzible during debug
BugIDEA-153485Test Module dependencies defined in Gradle is not correctly configured in IntelliJ 2016.1
BugIDEA-153736IDEA16.1 war artifact(explored) with gradle compile project(":dir/module") can not regular work
BugIDEA-153231Optional creating a separate IDE module per gradle source set
BugIDEA-153235Package named 'main' is not correctly recognized in Gradle project with custom source set
BugIDEA-150058Multi-projects dependencies are incorrect in Gradle v2.5 or higher.
BugIDEA-153252IDEA 2016.1 Can't Reference Third-Party Project Gradle Configuration Unless It Uses the 'java' Plugin
BugIDEA-137118Intellij debug through Gradle with a JavaExec dependent task fails
BugIDEA-153003Dependent project appears twice in the gradle project view
BugIDEA-152581Generated sources are not picked up anymore in a Gradle build
BugIDEA-150685Gradle multi module project's dependency hierarchy is destroyed
BugIDEA-154371New Project / Module wizard: Gradle: switching Off all "Additional Libraries and Frameworks" creates module content root in unrelated location
BugIDEA-154369New Module: Gradle: by default "Add as module" shows "none", but works like parent module is selected
GrailsBugIDEA-152910Grails command results in Exception: java.lang.StackOverflowError thrown from the UncaughtExceptionHandler in thread "main"
BugIDEA-149568IntelliJ 15 no longer supports GORMs methods
BugIDEA-153676Cannot run grails command with dynamic classpath
GroovyBugIDEA-153785Correct groovy closure parameter usage marked as error
BugIDEA-153208Groovy static compiled code shown red with generics
BugIDEA-150940StackOverFlowException while reindexing
ExceptionIDEA-152776INRE through GroovyCodeFragmentFactory.isContextAccepted() on opening Breakpoints dialog with running indexes
IDE ConfigurationBugIDEA-152606IDEA fails on startup if one of plugins required for ruby or python plugin cannot be loaded
JPABugIDEA-147717Database Schema Mapping does not show default relationships
Java. Error HighlightingBugIDEA-151302Good code is red: cannot pass wildcard generic to method with generic parameter which type variable is bounded by generic parameter
BugIDEA-151761Good code is red
BugIDEA-151409Good code red. Overload resolution fail
BugIDEA-153999Type inference trouble: unifying multiple lambdas with type wildcards
BugIDEA-154187Bad code green. Reference to testMethod is ambiguous
BugIDEA-151823IntelliJ IDEA doesn't show any compilation error (JDK7) when I try to overload a method var(int... x), var(Object... x), var(Integer... x)
BugIDEA-154009Good code red: Incompatible types when returning object with generic parameter
BugIDEA-152685Extending SimpleMongoRepository class shows error in Editor
BugIDEA-152659Incorrect incompatible types error
BugIDEA-152179Generics - good code red: can't pass list of <? extends Comparable> to Collections.sort
BugIDEA-150030No error reported for static inner class referencing non-static variable in outer class
BugIDEA-153632Wrong warning (red)
BugIDEA-150167Irrelevant error message for lambda
BugIDEA-153156unclear error message on red code: modifier 'interface' not allowed here
BugIDEA-154209Good code is red: "Operator '+' cannot be applied to 'java.lang.Object', 'java.lang.String'"
BugIDEA-153642Good code red. Assign method reference to Function
BugIDEA-152690False error: Incompatible types. Found: '<lambda expression>', required: 'p.X'
BugIDEA-152694Parsing error in Eclipse Collections
BugIDEA-153122Good code yellow: unchecked warning for varargs when passing array
BugIDEA-153222Incorrect lambda type inferring
BugIDEA-152577Unhandled exception using generic exception along with checked exception
BugIDEA-153411IDEA 15 and 16: varargs not accepting array input
BugIDEA-152090Misleading "Not a statement" error
BugIDEA-151202IDEA highlights wrong method parameter as error
BugIDEA-152384Good code red. Array construction method reference
BugIDEA-150718[inspection] [java] No instance of type variable(A) exists when using stream API toArray()
BugIDEA-152758Bad code green. Generic inference from argument
BugIDEA-154108False positive: bad return type in method reference.
BugIDEA-150688Good code red. Pass wildcard enum class
BugIDEA-151901Inner interfaces are not resolved in java scratch files
CosmeticsIDEA-151948Java editor: error message extends type parameter names with arbitrary numbers
Java. Intention ActionsBugIDEA-153166Conversion from method reference with type wildcard to lambda creates uncompilable code
BugIDEA-152934Copy to temp final variable adds unnecessary final modifier
BugIDEA-153325Incorrect "Can be replaced with collect call"
UsabilityIDEA-151996Multiple "Add Import" for pasted inner class references
Java. RefactoringBugIDEA-152822"Replace Constructor with Factory Method" refactoring should warn when method is already present
BugIDEA-151634Invert Boolean incorrectly modifies boolean variable of enhanced FOR cycle
BugIDEA-152956Option to moved to inner class is disabled
BugIDEA-151917Refactoring 'Replace Duplicate Code' doesn't work correctly with static methods when runs just after 'Pull Up method'
BugIDEA-152514'Invert boolean' works incorrectly with final fields
BugIDEA-152883Non required cast when inline 'this' reference inside local class
BugIDEA-151440No Move Members refactoring warning when move will hide existing member
BugIDEA-152126Safe delete of method parameter should warn about usages in method references
BugIDEA-151809No warning when Pull Up method to the interface dependent on the instance variable
BugIDEA-152334Refactor/Extract/Method leads to "Variable [...] is already defined in the scope"
BugIDEA-120320Constructor field generation should be aware of checkNotNull type assignments
BugIDEA-153254Conversion from anonymous class to lambda could lead to forward reference issue
BugIDEA-152320"Package does not exist" prompt is not shown when moving a class to some library package
CosmeticsIDEA-151912'Find and Replace Code duplicates' refactoring leaves code highlighted on Cancel
Java.InspectionsFeatureIDEA-152170Option to restrict "Anonymous type can be replaced with lambda" to @FunctionalInterface
BugIDEA-152331FieldCanBeLocal: not reported when calling super constructor
BugIDEA-153782Inspection Conditional expression (?:) fails for returns in lambdas
BugIDEA-152307Option "Ignore outer fields not visible from inner class" of inspection "Inner class field hides outer class field" does not work with nested classes
BugIDEA-152040Inconsistencies concerning analyzations of code using Optional<T> and Optional#isPresent
BugIDEA-152446"Confusing argument to vararg method" false positive
BugIDEA-153332Wrong "Field can be converted to a local variable" hint
BugIDEA-153532False positive for "Condition is always false"
BugIDEA-153897False positive "Bad return type in lambda expression"
BugIDEA-153097SuspiciousMethodCalls misses the baddies
BugIDEA-151954"Anonymous type can be replaced with lambda" inspection does not report a case in presence of not involved constructor
BugIDEA-153054Inspection 'Lambda can be converted to method reference' creates uncompilable code when wildcard used.
BugIDEA-153284Intermitted red highlighting of lambdas
BugIDEA-152303'Optional.get() without isPresent() check' inspection should support assertions
BugIDEA-153164Inspection 'Replace Anonymous with lambda' creates uncompilable code in complex case with generics
BugIDEA-153261Conversion anonymous class to method reference may leave unnecessary wildcard parameter type
BugIDEA-151540"Remove explicit type arguments" intention breaks compilation
BugIDEA-151898Optional.get without isPresent
BugIDEA-150754False positive "Redundant type cast"
BugIDEA-152332"Explicit type arguments can be inferred" can be wrong with String.valueOf
BugIDEA-152373Optional.get without Optional.isPresent warning when check is present
BugIDEA-151971Declaration redundancy inspection flags serialVersionUID and Serializable-related methods
BugIDEA-152076Inversed condition in if() caused to false alarm for Optional.get() inspertion
BugIDEA-153324Erroneous error message about multiple non-overriding abstract methods on @FunctionalInterface
BugIDEA-151559"Explicit type can be replaced with <>" breaks code
JavaEE.WebBugIDEA-153402optimize imports does nothing in new classes
MavenBugIDEA-133331Dependency Diagram does not show conflicts
Packaging and InstallationBugIDEA-149996IDEA 16 144.2608.2 cannot be compiled via ant: jdk.linux does not exist
BugIDEA-153200"You can evaluate for 30 days or buy a license key or upgrade online" message is displayed even with an active subscription
BugIDEA-153847EAP 2016.1 doesn't start on Mac
BugIDEA-152542Windows uninstaller: cancelling the warning shown on attempt to uninstall a running IDE shows uninstallation progress and "Uninstall was completed successfully" message
BugIDEA-150462JVMVersion < 1.8 should be ignored on MacOSX
BugIDEA-153217IDE suggests to install Java 1.6 on Mac
CosmeticsIDEA-152947MacOSX: IDEA 145.257 application should have name 'IntelliJ IDEA 2016.1', not 'IntelliJ IDEA 2016'
Plugin Support. DevKitBugIDEA-147611Live Preview: Editing stops working after editing BNF
RefactoringBugIDEA-154459Moving files is broken
SQLFeatureIDEA-79339SQL: SQLServer: login identifier is resolved, while user name is not
BugIDEA-152617Good code red. PostgreSQL update with jdbc parameter
BugIDEA-133650db2 syntax: add support for keywords for string units in built-in functions CODEUNITS16 CODEUNITS32 OCTETS
BugIDEA-129278Correct H2 database sql has red underline
BugIDEA-148347MySQL # value pattern in SQL does not work
ExceptionIDEA-151821SQL: IAE at SqlFileImpl$8.getCasing() for specific code with Oracle type declaration
Template Languages. VelocityBugIDEA-152434Velocity. Trailing backslash causes wrong highlighting.
TerminalBugIDEA-152291ALT , CTRL characters in terminal window can not type on MAC
UsabilityIDEA-135527Start SSH Session Dialog with weird sorting
Unit Testing. JUnitFeatureIDEA-153424Make the testmethod list searchable
BugIDEA-152829Test class generator generates test methods in reverse order
BugIDEA-152905with ErrorCollector: misleading count of failed tests
BugIDEA-153304Run Configuration is marked as invalid (test doesn't exist) then a test method is declared in a parent class
Unit Testing. TestNGBugIDEA-152733TestNG tests: right click on method shows run as pre-configured pattern instead of run only one method (pattern is equal to the whole class)
BugIDEA-152857the testng xml config file created by IDEA for a class does not include groups info which leads to BeforeGroups method being ignored by TestNG runtime
User InterfaceBugIDEA-153630gdb console is blinking and adding and deleting scroll bar.
BugIDEA-70943Tooltip animations and buggy visibility are exceedingly frustrating
BugIDEA-153651Choose sources dialog cannot be cancelled properly
BugIDEA-152295StringUtil.pluralize() is incorrect
BugIDEA-153084IntelliJ IDEA 2016.1 requires acceptance of privacy policy each time I run IDEA
BugIDEA-152939deadlock on 16 EAP 144.2925.2 startup
BugIDEA-142781Scroll preview
BugIDEA-153753Find by mouse shortcut does not work with mouse button 4/5
BugIDEA-146638Customize IDEA dialog for Community Edition suggests Java Frameworks like J2EE, Spring, JBoss Seam & jBPM, Struts
CosmeticsIDEA-148970Unprintable symbols in Customize Idea wizard
Version ControlBugIDEA-153272Files are lost during the movement of unversioned files to overwrite existing files with same names
BugIDEA-153453Copying file inside project doesn't refresh the status of the new file
UsabilityIDEA-114505Changes tool window forgets preview toggle and has no file selected by default
UsabilityIDEA-153759Commit dialog doesn't remember "Disable editing" toggle state
Version Control. GitBugIDEA-153021Git : Update Project doesn't refresh the cached repository information if there were no incoming commits to the current branch
BugIDEA-152678Regression: Committing externally does not Update File State Correctly
BugIDEA-152902Git4Idea doesn't work on windows if home directory contains whitespaces
BugIDEA-152460Open on Github breaks when repo is on drive root
BugIDEA-151547Git commit error dialog locks the IDE if the text is too big
BugIDEA-153464Weird character ([) in commit warning box
BugIDEA-152430Removing remote branch no longer offers to remove its tracking local branch
BugIDEA-152101Error while "Accepting Theirs" in merge dialog when theirs version was deleted.
BugIDEA-151317Square brackets in file name cause problems with git
Version Control. LogBugIDEA-148029"go to branch" goes to wrong branch with the same prefix
Version Control. MercurialBugIDEA-153603Show Diff (Compare) doesn't work for renamed uncommitted files
BugIDEA-1535232016.1 does not detect external changes in the VCS repository
Version Control. TFSBugIDEA-152761"TF400367: The request could not be performed due to a host type mismatch." while connecting to VSTS
No subsystemBugWEB-21145EditorConfig doesn't respect code formating when path is added
BugWEB-20882Preserve setting `toggle auto-test` between IDEA restarts
BugWEB-21007JSON Schema: absolute URLs in $ref cause java.lang.RuntimeException: Non-relative reference
BugWEB-19815WebStorm 12 EAP initially tries to load settings from .WebIde100 rather than .WebStorm11)
BugWEB-19970WebStorm unexpectedly inserts lots of whitespace into string literals
BugWEB-20528Incorrect "Generated source files should not be edited..." warning randomly appears for source files with are NOT generated
BugWEB-20597comment generation does not work with es6 default parameter value as regex
BugWEB-20986JSON Schema Files that are updated require a close and relauch to be used
BugWEB-21083Mocha: create default configuration with a correct user interface
Build toolsBugWEB-20110gulp tasks should be listed in the order they are defined by default
BugWEB-20879pressing enter on a gulp file in the gulp run popup should run the default task for that file.
BugWEB-20914Console does not detect windows-style paths in TypeScript errors
BugWEB-20914Console does not detect windows-style paths in TypeScript errors
BugWEB-21105gulp/grunt task runner does not wrap around with arrow keys
CSSBugWEB-20885CSS/SCSS: "Unit of measure 's' is redundant" on time property for transition-duration
BugWEB-21116Unknown CSS pseudo selector ::-moz-range-progress
BugWEB-21024CSS: show *.svg images in file completion inside 'url' property
CosmeticsWEB-21078CSS: correct typo ('rigth') in info tooltip
CoffeeScriptBugWEB-19807Reformat code fails for coffeescript function bodies
DartBugWEB-21071Project view crashing/ being redrawn, instead of red squiggles appearing.
BugWEB-15936Hovering over a dynamic variable does not tell me what type it is
BugWEB-20759WebStorm unresponsive when html_dartium.dart is opened
BugWEB-20844Dart script can't be run from outside of a Dart package folder
BugWEB-21189Live template autocompletion moves inserted text after previous line
BugWEB-21123Using setUpAll in Dart Test omits test cases from Test Results panel
CosmeticsWEB-20801Dart: do not show "Imports optimized" on each Reformat Code action
DebuggerBugWEB-20997No-breakpoints hit in typescript sources when running jest via node debug configuration
BugWEB-20807With WebStorm latest, I am sometimes getting an error of Connection failed 404
BugWEB-21050No additional tabs are opened when debugging child processes when using Node 0.10
BugWEB-19583Node.js debugging: properties with numeric names are not displayed in the debugger variables
BugWEB-21447Attached files (.css, .js) are not served by built-in webserver
BugWEB-20340JavaScript debugger doesn't show "this" reference with ES6 fat arrows
File WatchersBugWEB-20970check for related changes from File Watchers took too much time and was cancelled
BugWEB-20021SCSS file watcher not working
BugWEB-9946WebStorm hangs when a less file-watcher tries to compile malformed less code
BugWEB-13459File Watchers, SCSS: no separate .css files produced for partials if 'track only root files' is off
BugWEB-20644Open Files and Current File scope not always available
HTMLBugWEB-17406HTML-style comment syntax within a javascript comment breaks comment end detection
BugWEB-17644HTML: Incorrrect width/height values are not marked in img tags
BugWEB-18909HTML Code Style "Keep white spaces inside:" should apply to granddaughters when reformatting
JavaScriptFeatureWEB-20555JSON Schema: recognize comments
FeatureWEB-18276Inject 'JSX Harmony' in script tag with type="text/babel"
BugWEB-20727Destructurization within catch
BugWEB-19187JSDoc mixin and mixes don't allow variables/functions to be followable
BugWEB-20426export default function gives "Unused function" and "Unresolved variables"
BugWEB-20557JSON Schema: provide warning about required type Object for the schema to be read
BugWEB-20633JSDoc: auto generation of comment is broken if "*/" is present as string
BugWEB-20933Do not add .jsx file extension when completing the paths in the import statements
BugWEB-20686strange property name autocomplete behaviour
BugWEB-20680ES6 unicode code points escape sequences are not supported in strings
BugWEB-20362refactor move file & import from 'package/file'
BugWEB-20751Javascript 'Optimize imports' changes order
BugWEB-20494JSDoc @see symbol autocompletion not working inside constructor function
BugWEB-20651Infinite indexing loop
BugWEB-20788Tagged template literals is not support in PHP Storm.
BugWEB-20797Wrong message "overrides method in Object" (again)
CosmeticsWEB-20602Extra items in quick-fix list: suppress suppression
JavaScript. FormatterFeatureWEB-19601Opt-out new indentation rules in JavaScript
BugWEB-20874Reformat code with async and single parameter arrow function without parenthesis
BugWEB-20491Spaces around 'in' operator are trimmed if Spaces/Around operators/Relation operators is disabled
JavaScript. FrameworksBugWEB-20600Angular 2: red code, 'Unexpected token' inspection
BugWEB-20736NgFor initialisers red code
BugWEB-20707Weird behavior with Angular 1.x custom attribute directives and autocompletion.
BugWEB-21183Meteor: Imports are not resolved
BugWEB-20713Angular 2 Good Code Red
BugWEB-20918Angular2: local variables are not resolved in inline templates
BugWEB-21068Angular2: don't show 'XML tag has empty body' warning for Angular directives in inline templates
JavaScript. InspectionsBugWEB-20745Regression: ES 2015 "const" and destructuring assignment cause an inspection error in the latest EAP for 2016.1
BugWEB-20117Redundant local variable inspection for JavaScript incorrectly identifies variable that is required.
BugWEB-20664Adding a JSDoc inline type triggers a completely unrelated and wrong inspection warning (possible misinterpretation of ES 2015 spread operator)
BugWEB-20534Duplicate declaration when using computed property names with function values
BugWEB-21164ESLint: custom severity chosen for ESLint inspection is ignored
BugWEB-20138ES6: reassign const variable
JavaScript. PredefsBugWEB-20708JSON.stringify has wrong parameter type def for replacer
BugWEB-20208Ecmascript 2016: Array.prototype.includes is unknown
LESSBugWEB-20842Code coloring for .less files phpStorm 2016.1
Node.jsBugWEB-20748WebStorm doesn't like the "sql" npm module
BugWEB-20808should not follow symlinked packages that are not in the project library root node_modules folder
BugWEB-20311Remote interpreter: keyboard Escape/Enter keys should work for dialog with Error message.
CosmeticsWEB-21002Typo in npm command list
ExceptionWEB-20643Remote interpreter: NullPointerException on applying empty Vagrant configuration
SASSFeatureWEB-21073Copyright comment format starting with /*!
BugWEB-20545Compass: headings() selector helper is highlighted as unknown function
TypeScriptFeatureWEB-16676Show "File -> New -> Typescript File" not only in Static Web Projects
FeatureWEB-20439Support upcoming TS 1.9 pathMapping semantics
FeatureWEB-20984include typescript 1.8.9
BugWEB-20887Typescript incorrect resolve amd imports with project modules
BugWEB-16951TypeScript: "Unused parameter"
BugWEB-21079'Add import statement' quick fix for Typescript ignores 'use single quotes' setting
BugWEB-21172Initializer type any[]<Foo> is not assignable to variable type Foo[]
BugWEB-20625Convert to template string intention should work in TypeScript
BugWEB-21090Incorrect autoformat tsx code
BugWEB-13906forEach with <any> array marks inner object methods as unresolved
BugWEB-18352Typescript: module resolution logic wrong. Analyzer ignores `typings` entry in sud-modules `package.json` when targeting commonjs
BugWEB-20743TypeScript type "import" is not added although it not present
BugWEB-20934Properties with "readonly" name breaks code validity
BugWEB-20684redudant semicolon in extract method refactoring
BugWEB-20849TypeScript: constructor parameters with decorators are always wrapped on formatting
BugWEB-20942No completion for paths for angular2 modules
BugWEB-21087[TypeScript] False error when initializing an array of objects with string literal types
BugWEB-20838String literal type doesn't work with array
BugWEB-20908File header comment block breaks indentation when using modules in TypeScript and WS2016.1
BugWEB-18835TypeScript: Autoformatting does not put spaces after colon before type in interfaces
BugWEB-20895TypeScript: Incorrect merging for types with generics
BugWEB-20894Good Code Red: TypeScript definition files
BugWEB-21107erroneous "private member is not accessible" warning in ng2 app
BugWEB-20961TypeScript: Path mappings: rootDirs should resolve relative path
BugWEB-20962TypeScript: Path mappings: recognize any baseUrl
BugWEB-20865Good Code Red RxJS in TypeScript
PerformanceWEB-19847WebStorm crashes caused by large TypeScript project when unresolved types introduced
ExceptionWEB-17532TypeScript: subsequent visibility changes with "Make public/private/protected" intentions breaks themselves
Unit TestsFeatureWEB-20979Debugging coffeescript with mocha should set mocha compilers up
FeatureWEB-21153Mocha+Typescript: Set extra mocha options automatically
BugWEB-20889Better mocha + typescript support
BugWEB-20772Karma: allow coverage preprocessors other than `coverage`
BugWEB-20846Mocha: multiline strings are shown as single line when comparing
BugWEB-10636Mocha: order output in the console correctly
BugWEB-20774Japanese characters are corrupted in the karma test runner.
No subsystemFeatureDBE-2161Structure view does not recognize SQL WITH syntax
DB ConnectivityUsabilityDBE-2327Please make missing SSH/SSL tab more discoverable for custom database connection
DB ConsoleBugDBE-2008[0xDBE][Build DB-143.1040.1] "Pin result tab" doesn't work correctly
BugDBE-2463Can't view multiline errors
DB IntrospectionBugDBE-2492Connecting to SQl Azure database fails
BugDBE-2501Index out of bounds exception: BaseFamily.move(BaseFamily.java:281)
BugDBE-2367Length of Char and decimal fields not shown when extracting DDL
BugDBE-2517Introspection is broken by user table
DB RefactoringBugDBE-1674Rename table from DB2 causes disconnect
Data ViewerBugDBE-2331"Clone row" - do not copy primary key value
BugDBE-2460change row
IDE GeneralFeatureDBE-874Ability to group files by their purposes
BugDBE-2377Export to CSV does not replace existing files
TaskDBE-2473Please make 'Remote Hosts Access' plugin available for installation
SQL CodeStyleBugDBE-2494SQL formatting rules mess with local variables
SQL EditingBugDBE-2408SQL Editor recognizes "default on null some_sequence.nextval" expressions as incorrect
SQL HighlightingBugDBE-2396DataGrip sends the SELECT immediately following a WITH (CTE) separately causing syntax errors in PostgreSQL
BugDBE-2478PostgreSQL: GRANT multiple permissions on a sequence highlighted as error
BugDBE-1186MySQL function {{MID()}} is a synonym for {{SUBSTRING()}} but doesn't accept two variable variant
BugDBE-855MS SQL: create index using WITH without parentheses is green
BugDBE-2447SET row_security highlighted as error
BugDBE-2424EXPLAIN on postgres CREATE TABLE AS
BugDBE-1225Allow qualified column names in MySQL INSERT statements
BugDBE-2321Code highlighting for sybase sql displays an error on ^ operator
User InterfaceBugDBE-2003Structure ToolWindow sorts shortens entry names wrong
BugDBE-1242Having focus in "Database Console" and pressing "close tab" with CMD-w always closes SQL console instead
BugDBE-2368No "Print..." opption in File menu
EditorUsabilityEDU-591Find in Path - Preview: Keeps refreshing - unuseable
  • No labels