Child pages
  • IntelliJ IDEA 2016.1 145.844.1 Release Notes
Skip to end of metadata
Go to start of metadata
No subsystemBugIDEA-153364Warning 'Cannot modify read-only scheme' when no one setting is changed
BugIDEA-153761Code analysis stucks in j2me project
BugIDEA-149939CCE in com.intellij.execution.stacktrace.StackTraceLine.getMethodLocation causes frozen UI
BugIDEA-152596Save settings failed. kotlin.TypeCastException: null cannot be cast to non-null type kotlin.ByteArray
ExceptionIDEA-153534AE at com.intellij.openapi.editor.impl.view.EditorSizeManager.reset(EditorSizeManager.java:293)
AntExceptionIDEA-152435SOE during offline inspections
Code Analysis. DependenciesBugIDEA-141154Backward dependency analysis broken for external libraries
Code Analysis. InspectionBugIDEA-153571"Run inspection by name" ignores file name filter
BugIDEA-153063Invalid inspection warning: Condition 'in == null' is always 'false'
Code Formatting and Code StyleBugIDEA-153620Indexing took too long starting from IU-145.596.7
Compiling ProjectBugIDEA-154110Eclipse compiler won't compile sub Java8 SDK project
TaskIDEA-143976Update Eclipse Compiler version
DatabaseUsabilityIDEA-69733Database console is always closed when invoking 'Close unmodified' action
DebuggerBugIDEA-153426Debugging streams and lamdas: debugger enters unexpectedly java.util.stream
DockerBugIDEA-152569Docker: High memory usage
ExceptionIDEA-153110PhpStorm fails to open PHP Interpreter dialog after PhpStorm detected a Dockerfile with the Docker integration plugin
Eclipse IntegrationBugIDEA-151755combineaccessrules is unnecessarily added to .classpath
Editor. Code CompletionBugIDEA-153520Lost type after autocompletion
Editor. Editing TextBugIDEA-153586Backspace setting gets overwritten with every release
BugIDEA-152985Import popup for static import is not always shown
BugIDEA-152991Field to Import pop-up auto-expands when not expected
BugIDEA-152736IntelliJ IDEA refuses to print with no space between cast (unchecked cast)
BugIDEA-152601Copy/paste of reference to class not properly working.
UsabilityIDEA-126952Scratches should have an extension
Find, Replace, Find UsagesFeatureIDEA-152756Add Quick Search ("Search for:") in "Find in path" > "Preview"
Flash_FlexBugIDEA-132621Vector.<SomeClass> as Vector.<*> marked as error
BugIDEA-146613Extract Method in ActionScript creates internal variable
GradleBugIDEA-152976Gradle tooling API for Scala projects is incompatible with Gradle 2.12 due to missing ScalaCompileOptions.getForce() method
BugIDEA-153235Package named 'main' is not correctly recognized in Gradle project with custom source set
BugIDEA-153003Dependent project appears twice in the gradle project view
BugIDEA-153252IDEA 2016.1 Can't Reference Third-Party Project Gradle Configuration Unless It Uses the 'java' Plugin
BugIDEA-153485Test Module dependencies defined in Gradle is not correctly configured in IntelliJ 2016.1
BugIDEA-150077Idea became unresponzible during debug
BugIDEA-152867Gradle window takes more than a minute to open
BugIDEA-153664Gradle project - JAR file dependencies are not included in generated war artifact WEB-INF/lib directory
BugIDEA-153736IDEA16.1 war artifact(explored) with gradle compile project(":dir/module") can not regular work
BugIDEA-150685Gradle multi module project's dependency hierarchy is destroyed
BugIDEA-153231Optional creating a separate IDE module per gradle source set
BugIDEA-137118Intellij debug through Gradle with a JavaExec dependent task fails
GrailsBugIDEA-152910Grails command results in Exception: java.lang.StackOverflowError thrown from the UncaughtExceptionHandler in thread "main"
BugIDEA-153676Cannot run grails command with dynamic classpath
BugIDEA-149568IntelliJ 15 no longer supports GORMs methods
GroovyBugIDEA-153785Correct groovy closure parameter usage marked as error
BugIDEA-150940StackOverFlowException while reindexing
BugIDEA-153208Groovy static compiled code shown red with generics
ExceptionIDEA-152776INRE through GroovyCodeFragmentFactory.isContextAccepted() on opening Breakpoints dialog with running indexes
JPABugIDEA-147717Database Schema Mapping does not show default relationships
Java. Error HighlightingBugIDEA-153156unclear error message on red code: modifier 'interface' not allowed here
BugIDEA-152577Unhandled exception using generic exception along with checked exception
BugIDEA-153411IDEA 15 and 16: varargs not accepting array input
BugIDEA-152090Misleading "Not a statement" error
BugIDEA-151302Good code is red: cannot pass wildcard generic to method with generic parameter which type variable is bounded by generic parameter
BugIDEA-150167Irrelevant error message for lambda
BugIDEA-151761Good code is red
BugIDEA-151409Good code red. Overload resolution fail
BugIDEA-151901Inner interfaces are not resolved in java scratch files
BugIDEA-152179Generics - good code red: can't pass list of <? extends Comparable> to Collections.sort
BugIDEA-150718[inspection] [java] No instance of type variable(A) exists when using stream API toArray()
BugIDEA-152758Bad code green. Generic inference from argument
BugIDEA-152690False error: Incompatible types. Found: '<lambda expression>', required: 'p.X'
BugIDEA-152694Parsing error in Eclipse Collections
BugIDEA-152384Good code red. Array construction method reference
BugIDEA-150688Good code red. Pass wildcard enum class
BugIDEA-151823IntelliJ IDEA doesn't show any compilation error (JDK7) when I try to overload a method var(int... x), var(Object... x), var(Integer... x)
BugIDEA-153122Good code yellow: unchecked warning for varargs when passing array
BugIDEA-151202IDEA highlights wrong method parameter as error
BugIDEA-152685Extending SimpleMongoRepository class shows error in Editor
BugIDEA-152659Incorrect incompatible types error
BugIDEA-150030No error reported for static inner class referencing non-static variable in outer class
BugIDEA-153222Incorrect lambda type inferring
CosmeticsIDEA-151948Java editor: error message extends type parameter names with arbitrary numbers
Java. Intention ActionsBugIDEA-153166Conversion from method reference with type wildcard to lambda creates uncompilable code
BugIDEA-153325Incorrect "Can be replaced with collect call"
BugIDEA-152934Copy to temp final variable adds unnecessary final modifier
UsabilityIDEA-151996Multiple "Add Import" for pasted inner class references
Java. RefactoringBugIDEA-152126Safe delete of method parameter should warn about usages in method references
BugIDEA-151917Refactoring 'Replace Duplicate Code' doesn't work correctly with static methods when runs just after 'Pull Up method'
BugIDEA-152514'Invert boolean' works incorrectly with final fields
BugIDEA-151809No warning when Pull Up method to the interface dependent on the instance variable
BugIDEA-152334Refactor/Extract/Method leads to "Variable [...] is already defined in the scope"
BugIDEA-152320"Package does not exist" prompt is not shown when moving a class to some library package
BugIDEA-120320Constructor field generation should be aware of checkNotNull type assignments
BugIDEA-152956Option to moved to inner class is disabled
BugIDEA-152883Non required cast when inline 'this' reference inside local class
BugIDEA-151440No Move Members refactoring warning when move will hide existing member
BugIDEA-153254Conversion from anonymous class to lambda could lead to forward reference issue
BugIDEA-152822"Replace Constructor with Factory Method" refactoring should warn when method is already present
BugIDEA-151634Invert Boolean incorrectly modifies boolean variable of enhanced FOR cycle
CosmeticsIDEA-151912'Find and Replace Code duplicates' refactoring leaves code highlighted on Cancel
Java.InspectionsFeatureIDEA-152170Option to restrict "Anonymous type can be replaced with lambda" to @FunctionalInterface
BugIDEA-153097SuspiciousMethodCalls misses the baddies
BugIDEA-152303'Optional.get() without isPresent() check' inspection should support assertions
BugIDEA-152331FieldCanBeLocal: not reported when calling super constructor
BugIDEA-152076Inversed condition in if() caused to false alarm for Optional.get() inspertion
BugIDEA-153284Intermitted red highlighting of lambdas
BugIDEA-152446"Confusing argument to vararg method" false positive
BugIDEA-153261Conversion anonymous class to method reference may leave unnecessary wildcard parameter type
BugIDEA-153164Inspection 'Replace Anonymous with lambda' creates uncompilable code in complex case with generics
BugIDEA-152040Inconsistencies concerning analyzations of code using Optional<T> and Optional#isPresent
BugIDEA-151954"Anonymous type can be replaced with lambda" inspection does not report a case in presence of not involved constructor
BugIDEA-153054Inspection 'Lambda can be converted to method reference' creates uncompilable code when wildcard used.
BugIDEA-151559"Explicit type can be replaced with <>" breaks code
BugIDEA-153324Erroneous error message about multiple non-overriding abstract methods on @FunctionalInterface
BugIDEA-152307Option "Ignore outer fields not visible from inner class" of inspection "Inner class field hides outer class field" does not work with nested classes
BugIDEA-151540"Remove explicit type arguments" intention breaks compilation
BugIDEA-153782Inspection Conditional expression (?:) fails for returns in lambdas
BugIDEA-151898Optional.get without isPresent
BugIDEA-152373Optional.get without Optional.isPresent warning when check is present
BugIDEA-153332Wrong "Field can be converted to a local variable" hint
BugIDEA-152332"Explicit type arguments can be inferred" can be wrong with String.valueOf
BugIDEA-153532False positive for "Condition is always false"
BugIDEA-150754False positive "Redundant type cast"
BugIDEA-151971Declaration redundancy inspection flags serialVersionUID and Serializable-related methods
JavaEE.WebBugIDEA-153402optimize imports does nothing in new classes
MavenBugIDEA-133331Dependency Diagram does not show conflicts
Packaging and InstallationBugIDEA-150462JVMVersion < 1.8 should be ignored on MacOSX
BugIDEA-153217IDE suggests to install Java 1.6 on Mac
BugIDEA-153200"You can evaluate for 30 days or buy a license key or upgrade online" message is displayed even with an active subscription
BugIDEA-153847EAP 2016.1 doesn't start on Mac
BugIDEA-149996IDEA 16 144.2608.2 cannot be compiled via ant: jdk.linux does not exist
BugIDEA-152542Windows uninstaller: cancelling the warning shown on attempt to uninstall a running IDE shows uninstallation progress and "Uninstall was completed successfully" message
CosmeticsIDEA-152947MacOSX: IDEA 145.257 application should have name 'IntelliJ IDEA 2016.1', not 'IntelliJ IDEA 2016'
Plugin Support. DevKitBugIDEA-147611Live Preview: Editing stops working after editing BNF
SQLFeatureIDEA-79339SQL: SQLServer: login identifier is resolved, while user name is not
BugIDEA-129278Correct H2 database sql has red underline
BugIDEA-152617Good code red. PostgreSQL update with jdbc parameter
BugIDEA-133650db2 syntax: add support for keywords for string units in built-in functions CODEUNITS16 CODEUNITS32 OCTETS
BugIDEA-148347MySQL # value pattern in SQL does not work
ExceptionIDEA-151821SQL: IAE at SqlFileImpl$8.getCasing() for specific code with Oracle type declaration
Template Languages. VelocityBugIDEA-152434Velocity. Trailing backslash causes wrong highlighting.
TerminalBugIDEA-152291ALT , CTRL characters in terminal window can not type on MAC
UsabilityIDEA-135527Start SSH Session Dialog with weird sorting
Unit Testing. JUnitFeatureIDEA-153424Make the testmethod list searchable
BugIDEA-152905with ErrorCollector: misleading count of failed tests
BugIDEA-152829Test class generator generates test methods in reverse order
BugIDEA-153304Run Configuration is marked as invalid (test doesn't exist) then a test method is declared in a parent class
Unit Testing. TestNGBugIDEA-152733TestNG tests: right click on method shows run as pre-configured pattern instead of run only one method (pattern is equal to the whole class)
BugIDEA-152857the testng xml config file created by IDEA for a class does not include groups info which leads to BeforeGroups method being ignored by TestNG runtime
User InterfaceBugIDEA-142781Scroll preview
BugIDEA-153084IntelliJ IDEA 2016.1 requires acceptance of privacy policy each time I run IDEA
BugIDEA-70943Tooltip animations and buggy visibility are exceedingly frustrating
BugIDEA-153651Choose sources dialog cannot be cancelled properly
BugIDEA-146638Customize IDEA dialog for Community Edition suggests Java Frameworks like J2EE, Spring, JBoss Seam & jBPM, Struts
BugIDEA-152939deadlock on 16 EAP 144.2925.2 startup
BugIDEA-152295StringUtil.pluralize() is incorrect
CosmeticsIDEA-148970Unprintable symbols in Customize Idea wizard
Version ControlBugIDEA-153272Files are lost during the movement of unversioned files to overwrite existing files with same names
BugIDEA-153453Copying file inside project doesn't refresh the status of the new file
UsabilityIDEA-114505Changes tool window forgets preview toggle and has no file selected by default
UsabilityIDEA-153759Commit dialog doesn't remember "Disable editing" toggle state
Version Control. GitBugIDEA-151547Git commit error dialog locks the IDE if the text is too big
BugIDEA-152101Error while "Accepting Theirs" in merge dialog when theirs version was deleted.
BugIDEA-152678Regression: Committing externally does not Update File State Correctly
BugIDEA-153464Weird character ([) in commit warning box
BugIDEA-152430Removing remote branch no longer offers to remove its tracking local branch
BugIDEA-151317Square brackets in file name cause problems with git
BugIDEA-152902Git4Idea doesn't work on windows if home directory contains whitespaces
BugIDEA-153021Git : Update Project doesn't refresh the cached repository information if there were no incoming commits to the current branch
BugIDEA-152460Open on Github breaks when repo is on drive root
Version Control. LogBugIDEA-148029"go to branch" goes to wrong branch with the same prefix
Version Control. MercurialBugIDEA-1535232016.1 does not detect external changes in the VCS repository
BugIDEA-153603Show Diff (Compare) doesn't work for renamed uncommitted files
Version Control. TFSBugIDEA-152761"TF400367: The request could not be performed due to a host type mismatch." while connecting to VSTS
No subsystemBugWEB-20528Incorrect "Generated source files should not be edited..." warning randomly appears for source files with are NOT generated
BugWEB-20882Preserve setting `toggle auto-test` between IDEA restarts
BugWEB-21083Mocha: create default configuration with a correct user interface
BugWEB-19970WebStorm unexpectedly inserts lots of whitespace into string literals
BugWEB-19815WebStorm 12 EAP initially tries to load settings from .WebIde100 rather than .WebStorm11)
Build toolsBugWEB-20914Console does not detect windows-style paths in TypeScript errors
BugWEB-20914Console does not detect windows-style paths in TypeScript errors
BugWEB-20110gulp tasks should be listed in the order they are defined by default
CSSBugWEB-20885CSS/SCSS: "Unit of measure 's' is redundant" on time property for transition-duration
BugWEB-21116Unknown CSS pseudo selector ::-moz-range-progress
BugWEB-21024CSS: show *.svg images in file completion inside 'url' property
CosmeticsWEB-21078CSS: correct typo ('rigth') in info tooltip
CoffeeScriptBugWEB-19807Reformat code fails for coffeescript function bodies
DartBugWEB-20759WebStorm unresponsive when html_dartium.dart is opened
BugWEB-20844Dart script can't be run from outside of a Dart package folder
BugWEB-15936Hovering over a dynamic variable does not tell me what type it is
CosmeticsWEB-20801Dart: do not show "Imports optimized" on each Reformat Code action
DebuggerBugWEB-20807With WebStorm latest, I am sometimes getting an error of Connection failed 404
BugWEB-20340JavaScript debugger doesn't show "this" reference with ES6 fat arrows
BugWEB-21050No additional tabs are opened when debugging child processes when using Node 0.10
BugWEB-20997No-breakpoints hit in typescript sources when running jest via node debug configuration
File WatchersBugWEB-9946WebStorm hangs when a less file-watcher tries to compile malformed less code
BugWEB-13459File Watchers, SCSS: no separate .css files produced for partials if 'track only root files' is off
BugWEB-20970check for related changes from File Watchers took too much time and was cancelled
BugWEB-20021SCSS file watcher not working
HTMLBugWEB-17406HTML-style comment syntax within a javascript comment breaks comment end detection
BugWEB-18909HTML Code Style "Keep white spaces inside:" should apply to granddaughters when reformatting
JavaScriptFeatureWEB-18276Inject 'JSX Harmony' in script tag with type="text/babel"
FeatureWEB-20555JSON Schema: recognize comments
BugWEB-20727Destructurization within catch
BugWEB-19187JSDoc mixin and mixes don't allow variables/functions to be followable
BugWEB-20751Javascript 'Optimize imports' changes order
BugWEB-20933Do not add .jsx file extension when completing the paths in the import statements
BugWEB-20686strange property name autocomplete behaviour
BugWEB-20680ES6 unicode code points escape sequences are not supported in strings
BugWEB-20426export default function gives "Unused function" and "Unresolved variables"
BugWEB-20651Infinite indexing loop
BugWEB-20362refactor move file & import from 'package/file'
BugWEB-20494JSDoc @see symbol autocompletion not working inside constructor function
BugWEB-20788Tagged template literals is not support in PHP Storm.
BugWEB-20557JSON Schema: provide warning about required type Object for the schema to be read
BugWEB-20797Wrong message "overrides method in Object" (again)
CosmeticsWEB-20602Extra items in quick-fix list: suppress suppression
JavaScript. FormatterFeatureWEB-19601Opt-out new indentation rules in JavaScript
BugWEB-20491Spaces around 'in' operator are trimmed if Spaces/Around operators/Relation operators is disabled
BugWEB-20874Reformat code with async and single parameter arrow function without parenthesis
JavaScript. FrameworksBugWEB-20736NgFor initialisers red code
BugWEB-20918Angular2: local variables are not resolved in inline templates
BugWEB-20600Angular 2: red code, 'Unexpected token' inspection
BugWEB-20713Angular 2 Good Code Red
JavaScript. InspectionsBugWEB-20117Redundant local variable inspection for JavaScript incorrectly identifies variable that is required.
BugWEB-20534Duplicate declaration when using computed property names with function values
BugWEB-20138ES6: reassign const variable
BugWEB-20664Adding a JSDoc inline type triggers a completely unrelated and wrong inspection warning (possible misinterpretation of ES 2015 spread operator)
BugWEB-20745Regression: ES 2015 "const" and destructuring assignment cause an inspection error in the latest EAP for 2016.1
JavaScript. PredefsBugWEB-20708JSON.stringify has wrong parameter type def for replacer
BugWEB-20208Ecmascript 2016: Array.prototype.includes is unknown
LESSBugWEB-20842Code coloring for .less files phpStorm 2016.1
Node.jsBugWEB-20748WebStorm doesn't like the "sql" npm module
BugWEB-20311Remote interpreter: keyboard Escape/Enter keys should work for dialog with Error message.
CosmeticsWEB-21002Typo in npm command list
ExceptionWEB-20643Remote interpreter: NullPointerException on applying empty Vagrant configuration
SASSFeatureWEB-21073Copyright comment format starting with /*!
BugWEB-20545Compass: headings() selector helper is highlighted as unknown function
TypeScriptFeatureWEB-20439Support upcoming TS 1.9 pathMapping semantics
FeatureWEB-16676Show "File -> New -> Typescript File" not only in Static Web Projects
FeatureWEB-20984include typescript 1.8.9
BugWEB-18352Typescript: module resolution logic wrong. Analyzer ignores `typings` entry in sud-modules `package.json` when targeting commonjs
BugWEB-18835TypeScript: Autoformatting does not put spaces after colon before type in interfaces
BugWEB-20895TypeScript: Incorrect merging for types with generics
BugWEB-20894Good Code Red: TypeScript definition files
BugWEB-20625Convert to template string intention should work in TypeScript
BugWEB-20887Typescript incorrect resolve amd imports with project modules
BugWEB-20838String literal type doesn't work with array
BugWEB-20934Properties with "readonly" name breaks code validity
BugWEB-20908File header comment block breaks indentation when using modules in TypeScript and WS2016.1
BugWEB-20684redudant semicolon in extract method refactoring
BugWEB-20961TypeScript: Path mappings: rootDirs should resolve relative path
BugWEB-16951TypeScript: "Unused parameter"
BugWEB-20849TypeScript: constructor parameters with decorators are always wrapped on formatting
BugWEB-20743TypeScript type "import" is not added although it not present
BugWEB-13906forEach with <any> array marks inner object methods as unresolved
BugWEB-20865Good Code Red RxJS in TypeScript
BugWEB-20942No completion for paths for angular2 modules
PerformanceWEB-19847WebStorm crashes caused by large TypeScript project when unresolved types introduced
ExceptionWEB-17532TypeScript: subsequent visibility changes with "Make public/private/protected" intentions breaks themselves
Unit TestsFeatureWEB-20979Debugging coffeescript with mocha should set mocha compilers up
BugWEB-20774Japanese characters are corrupted in the karma test runner.
BugWEB-20889Better mocha + typescript support
BugWEB-10636Mocha: order output in the console correctly
BugWEB-20772Karma: allow coverage preprocessors other than `coverage`
BugWEB-20846Mocha: multiline strings are shown as single line when comparing
No subsystemFeatureDBE-2161Structure view does not recognize SQL WITH syntax
DB ConnectivityUsabilityDBE-2327Please make missing SSH/SSL tab more discoverable for custom database connection
DB ConsoleBugDBE-2463Can't view multiline errors
BugDBE-2008[0xDBE][Build DB-143.1040.1] "Pin result tab" doesn't work correctly
DB IntrospectionBugDBE-2367Length of Char and decimal fields not shown when extracting DDL
DB RefactoringBugDBE-1674Rename table from DB2 causes disconnect
Data ViewerBugDBE-2460change row
BugDBE-2331"Clone row" - do not copy primary key value
IDE GeneralFeatureDBE-874Ability to group files by their purposes
BugDBE-2377Export to CSV does not replace existing files
TaskDBE-2473Please make 'Remote Hosts Access' plugin available for installation
SQL CodeStyleBugDBE-2494SQL formatting rules mess with local variables
SQL EditingBugDBE-2408SQL Editor recognizes "default on null some_sequence.nextval" expressions as incorrect
SQL HighlightingBugDBE-1186MySQL function {{MID()}} is a synonym for {{SUBSTRING()}} but doesn't accept two variable variant
BugDBE-2478PostgreSQL: GRANT multiple permissions on a sequence highlighted as error
BugDBE-2396DataGrip sends the SELECT immediately following a WITH (CTE) separately causing syntax errors in PostgreSQL
BugDBE-2447SET row_security highlighted as error
BugDBE-1225Allow qualified column names in MySQL INSERT statements
BugDBE-855MS SQL: create index using WITH without parentheses is green
BugDBE-2321Code highlighting for sybase sql displays an error on ^ operator
BugDBE-2424EXPLAIN on postgres CREATE TABLE AS
User InterfaceBugDBE-1242Having focus in "Database Console" and pressing "close tab" with CMD-w always closes SQL console instead
BugDBE-2368No "Print..." opption in File menu
BugDBE-2003Structure ToolWindow sorts shortens entry names wrong
  • No labels

1 Comment

  1. While I understand the grouping is currently done by project I think it could be improved a bit.

    What I have in mind is:

    • group features first into a New Features section
    • then group bug fixes / tasks by their section so that you don't have the same section a few times (say User Interface) and add a column with the IDE name (not many people might know what DBE stands for) 

    Additionally, having a way to apply filters to the table could be cool so that only a certain IDE can be shown.