Child pages
  • GoLand 2021.2 Release Notes
Skip to end of metadata
Go to start of metadata
Go Build SystemsBug GO-11090 Some Go module dependencies are not indexed
Usability GO-8551 Consider disabling automatic run of go tool after editing go.mod file
Bug GO-11349 Escape the module name when the parent directory contains spaces
Feature GO-9297 Specify the Go version when creating a Go Modules project
Usability GO-11074 Install from clipboard shouldn't cut import path
Bug GO-9367 Dependencies in 'replace' that are not downloaded marked as unresolved
Bug GO-11302 Unused dependency not marked as such
Feature GO-10716 Treat unused and incorrect modules in go.mod differently
Feature GO-11123 Ability to download Go modules on demand
Go Build and RunCosmetics GO-10891 Go tool / Program arguments ignore custom font in input field
Bug GO-11370 Compilation failed shown twice in Event Log
Bug GO-11356 Improper working directory when path to output contains current directory ('.')
Bug GO-10899 Run targets: SSH Remote target does not work with disabled rsync (Mac to Linux)
Bug GO-11155 Not properly output of UTF-8 chars on Windows even is turned off
Bug GO-10836 Run with elevated privileges (sudo) should be hidden from non-Local Run Targets
Feature GO-10982 Run targets: retrieve GOPATH using 'go env'
Task GO-9953 Remove -i go tool flag from configuration templates
Go Code InsightBug GO-10153 Go To Implementation does now work for embed interface from another module
Bug GO-10172 Go to Implementation action to internal packages
Go CompletionBug GO-11069 Don't suggest default value after dot
Bug GO-10822 Some members are missing in code completion list for unimported (yet) package
Go DebuggerPerformance GO-11137 "Computing variable presentation" blocks execution process
Feature GO-8127 Warn user that they're using custom debugger
Go EditingBug GO-11362 Manually added imports are optimized away
Feature GO-4969 Add build constraints support
Cosmetics GO-10784 Darcula colors in Parameter hint popup differ from other IDEs
Bug GO-11305 Error variable is shown for each declaration in 'err' template completion
Go FormatterBug GO-11432 Wrong formatting: blank line in call chain is not removed
Usability GO-11198 `Cannot run gofmt` error message is raised when user tries to run `Reformate code` for whole project
Exception GO-11153 InvocationTargetException is raised when GoLand cannot find gofmt
Feature GO-11082 Run 'gofmt' after default formatter
Bug GO-11274 False difference with gofmt in case of trailing spaces in raw strings
Bug GO-11199 Error message `Go fmt doesn't respond after 30 seconds`
Bug GO-11262 Wrong indent on backspace before right brace
Bug GO-11261 Wrong indent on enter before import/type/var/const block right parenthesis
Bug GO-11425 Wrong formatting: newlines between var/const/type/func and identifiers are not removed
Bug GO-11189 Spurious discrepancy with gofmt in case of trailing spaces
Bug GO-11421 Wrong formatting: redundant space before postfix increment
Bug GO-11226 'Put arguments on separate lines' produces syntax error when triple dot is present
Bug GO-11422 Wrong formatting: redundant blank line between select cases is not removed
Bug GO-11406 Wrong formatting of empty composite literals
Bug GO-11416 Wrong formatting: redundant spaces in cast are not removed
Bug GO-11417 Wrong formatting: redundant spaces in literal values
Bug GO-11410 Wrong formatting: redundant empty line between composite literal values
Bug GO-11187 Run gofmt on code reformat doesn't work on windows
Bug GO-11412 Wrong formatting: missing space in +build directive
Bug GO-11413 Wrong formatting: redundant space after unary operator
Go GeneralCosmetics GO-8314 Better presentation of attached projects in the Project View
Task GO-10392 New project dialog should default to Go modules instead of GOPATH
Bug GO-11242 GoLand suggests wrong location for GO module project
Feature GO-8062 Use language version from go.mod files on per-module bases
Bug GO-11203 Go support should be enabled for attached projects
Feature GO-11259 Automatically disable Go Modules support for GOPATH based projects
Task GO-11293 Disable detecting Go packages from clipboard by default
Bug GO-11204 Incorrect CachedValue use error is raised when user enables Go support for one of the module
Configuration Problem GO-10026 Automatically add a folder with temporary files for Windows Defender to exclusions
Usability GO-11301 Reorganize Go settings
Task GO-11233 Suggest creating Go modules projects in GolandProjects
Bug GO-11227 File level warning `Go support is disabled` isn't shown for module with disabled Go support
Usability GO-10689 Add relevant actions to build tags banner
Feature GO-9446 Move downloaded SDK with progress
Bug GO-11228 The error `Resolve is requested with a file and unrelated module` when the user disables Go mod support
Bug GO-10456 illumos tag should imply solaris
Feature GO-11163 Enable support for generics in .go files
Go InspectionsFeature GO-11091 Go 1.17: Allow conversion from slice to array pointer
Bug GO-11078 False positive "Variable declaration copies a lock value" when iterating array by index
Bug GO-11000 Goland reporting //goembed:xxx is useless.
Bug GO-8437 Unnecessarily exported identifier reports on types that are used in an exported function’s signature
Bug GO-10653 False-positive: Type does not implement with same methods
Go RefactoringsBug GO-11330 Dot import is replaced with actual import when moving file
Bug GO-11311 Import with alias is removed when moving file into directory with same import path
Usability GO-10864 Swap options order on "rename receiver"
Bug GO-8064 Unnecessary package import alias introduced when moving files from project root to same-named package
Bug GO-8494 To not add redundant .go suffix during move
Go TestingBug GO-10730 Run go test with coverage fails when executed on entire module folder
Go Type InferenceFeature GO-11236 Go 1.17: type inference for unsafe.Slice()
TinyGoException GO-11191 TinyGo: Cannot create a new project
Code Analysis. DependenciesBug IDEA-268133 Do not start PWA during editing
Bug IDEA-169897 'Analyze Data Flow to Here' shows javadoc instead of enum
Bug IDEA-269770 Throwable: Read access is allowed from inside read-action ... at com.intellij.analysis.pwa.analyser.PwaServiceImpl.
Bug IDEA-265832 com.intellij.testFramework.LightVirtualFile cannot be cast to class com.intellij.openapi.vfs.VirtualFileWithId
Bug IDEA-268120 Inconsistent and wrong error from PWA
Bug IDEA-268859 PWA doesn't properly handle deletion of the folder
Bug IDEA-268854 Java files in resources are processed by PWA
Bug IDEA-269673 Annotation problems are not detected by PWA
Bug IDEA-166964 'Group by nullness' button opens 'grouped by value' tab as well
Bug IDEA-268417 PWA doens't properly work in power save mode
Bug IDEA-268414 Different number of errors from highlighting and PWA
Bug IDEA-271194 PWA doesn't work and throws exception on restarting
Bug IDEA-154777 'Analyze data flow from here' on parameter from overriding method shows usages of parameter in the base method
Bug IDEA-268687 Included sources are not processed by PWA
Feature IDEA-194774 Analyze dataflow: track through Collections.unmodifiableList
Bug IDEA-268798 Unknown constructor error reported only once per file
Code Analysis. InspectionBug IDEA-255753 Descriptions are missed for tools warning on attempt to run inspections build in TeamCity
Feature IDEA-260954 Add option to highlight ambiguous elements in inspection "Java | Visibility | Access of inherited field looks like access of element in surrounding code"
Performance IDEA-270602 Optimize precommit code analysis for property files
Usability IDEA-141260 Analyze Dataflow should have Expand-/Collapse-Buttons
Bug IDEA-230802 Guava Verify.verifyNotNull receives incorrect inferred @Contract annotation
Bug IDEA-267847 Scoped inspection configuration is left in inspection profile XML upon scope deletion but not shown in the UI
Feature IDEA-207545 Convert `TestFailedLineInspection` to Uast
Bug IDEA-217974 Adding/removing files in/out of scope is ignored in Inspection scope settings
Bug IDEA-272286 org.eclipse.jdt.annotation.NonNullByDefault should not add @NonNull to Local variables
Feature IDEA-269819 Inspections table : Add link to create a SSR inspection when empty
Cosmetics IDEA-267115 Fix "hybrid" lists layout in inspections
Code Analysis. Language InjectionBug IDEA-223039 Throwable when tab in text block injected as a language.
Bug IDEA-265653 Ctrl-F1 ('Show error description') doesn't work inside injected fragments
Exception IDEA-272957 Injecting YAML into YAML causes exceptions
Code Analysis. Structural SearchBug IDEA-269555 Select sensible scope when opening structural search dialog
Bug IDEA-254332 SSR: Make it possible for custom filters to influence SubstitutionShortInfoHandler
Bug IDEA-265535 Support searching for Java 16 pattern matching
Bug IDEA-259948 SSR inspection: false positives when the template language is not available
Bug IDEA-264212 Setting a different search target should not require setting count filter
Bug IDEA-198425 New SSR: mnemonic for Search target doesn't work
Bug IDEA-263967 Filters shouldn't immediately disappear when they have a default value
Bug IDEA-266074 Improve switching between search and replace
Bug IDEA-270390 Structural Search/Replace: "Match Case" option in UI is imported/exported in XML as "caseInsensitive" (without value negation)
Feature IDEA-265528 Support searching for java 16 records
CoreBug IDEA-263296 Call all not-dumbaware EditorTabColorProvider instances just after indexes are built to update editor tabs background colors
Bug IDEA-268536 Throwable: Attempt to load key 'linux.row.height.disabled' for not yet loaded registry
Bug IDEA-270202 Background Process Indicator may remain visible after process finishes
Bug IDEA-270326 Stack overflow in BaseComponentAdapter.getImplementationClass when opening 2021.2 EAP
Bug IDEA-268140 IDEA fails to start, stuck at splash screen
Bug IDEA-262426 com.intellij.serviceContainer.AlreadyDisposedException in EditorGutterComponentImpl
Bug IDEA-269348 ImmediatePainterTest fails
Bug IDEA-271664 Intellij Idea fails to start with VPN enabled
Bug IDEA-270818 Can't start RubyMine when Gherkin plugin is disabled: Startup error: java.util.concurrent.CompletionException: java.lang.IllegalStateException: Class loader is not configured
Performance IDEA-271083 Memory leak in com.intellij.openapi.util.Key.allKeys
Exception IDEA-267034 Cannot init component state (componentName=FileTypeManager, componentClass=FileTypeManagerImpl)
Core. DebuggerBug IDEA-272734 History navigation is broken in evaluate window
Bug IDEA-260695 Inline values in debugger are shown in comments
Bug IDEA-266021 Alt+hover blinking on mouse move
Bug IDEA-267725 There's no 'Layout Settings' action on toolbar in debugger TW
Usability IDEA-269145 Debugger: Selection in frames view always rendered as focused
Usability IDEA-269151 Debugger: Make toolwindow more keyboard-friendly
Performance IDEA-262527 ValueLookupManager.showHint
Core. DiagramsException IDEA-271806 AE at com.intellij.openapi.graph.impl.GraphBase.wrap
Task IDEA-265332 UML diagram: missing color parameters for box and edge selection
Bug IDEA-271586 Diagrams: selected node (or no-bends edge) doesn't look selected
Exception IDEA-271802 IDE hangs on change schema in diagrams
Core. File SystemException IDEA-264492 Randomly failing tests due to VFS exceptions
Usability IDEA-225699 IDE attempts to access samba shares without credentials
Core. IDE SettingsBug IDEA-230267 File Association not working for some files
Bug IDEA-201853 Can't reload encoding inside jar file when use latest idea, 2018.2
Cosmetics IDEA-271786 Settings | Tools | Actions On Save | Rearrange Code: duplicated 'XML' entry in the 'configure arrangement rules' drop-down
Bug IDEA-256106 WindowsLookAndFeel is not migrated to IntelliJLaf / JetBrainsLightTheme, defaults to Darcula
Usability IDEA-267336 Registry editing actions: Edit and Revert aren't available while IDE is indexing
Bug IDEA-204018 Deleted scheme gets restored when a new scheme is created with the same name
Bug IDEA-272996 typo in Advanced settings > Use Windows certificate store option description
Cosmetics IDEA-271651 Actions on Save: Show warning under `Upload to default server` when Deployment sever is not configured
Feature IDEA-228117 Configurable scratch directory
Bug IDEA-269681 UI font changed after update to 2021.2 on Linux
Bug IDEA-265112 "Override file type" action shows duplicated and irrelevant file types
Usability IDEA-263845 Notify a user when shell environment loading has failed
Task IDEA-216133 Migrate macOS environment reader from Python
Bug IDEA-191665 Duplicate copyright in META-INF/services files
Exception IDEA-269559 Advanced settings exception on opening IntelliJ IDEA
Usability IDEA-189694 OOME dialog usability; memory limits validation
Bug IDEA-264344 Pressing "Get more keymaps" link inserts search to a wrong textbox
Usability IDEA-216847 Add Save option to Low Memory heap configuration dialog
Core. IDE Settings. SharingBug IDEA-269456 UnsupportedOperationException when install custom UI theme + theme isn't installed
Bug IDEA-272508 Got all my toolchains removed
Core. IndexingBug IDEA-268926 PhpFieldNamesAssignedByTheConstructorIndex is unstable
Feature IDEA-269099 Print project ID or name in the logs and diagnostics
Task IDEA-269170 Indexing: add navigation link to project indexing diagnostics from Menu/Tools
Bug IDEA-253188 poor performance on node_modules modifications
Bug IDEA-263726 "SerializerNotFoundException: No serializer is registered for stub ID: 2992" on indexing
Cosmetics IDEA-268795 Show local time in indexing diagnostics
Bug IDEA-268788 Indexing pausing might produce deadlock
Task IDEA-268796 Cleanup indexing diagnostics on cache invalidation
Core. InstallationUsability IDEA-271458 IDE should display notification when there are no leftover directories to cleanup
Bug IDEA-272075 Last Used date shows "51 years" on mac for empty directories
Exception IDEA-272114 Unhandled AccessDeniedException if try to clean-up the directory without required permissions
Task IDEA-168113 Include library sources to sources zip artifact
Usability IDEA-271457 Behavior of "Delete Leftover IDE Directories" action is dangerously under-documented
Feature IDEA-165872 Delete old config and system directories after upgrade to a new major version
Task IDEA-266756 Get rid of Log4J usages in updater
Feature IDEA-261458 Make Windows installer tune the system for screen readers
Task IDEA-270576 Drop x86 support
Cosmetics IDEA-271094 Broken UI in the Idea installer
Bug IDEA-271408 2021.2-EAP: phpstorm v219 and intellij-idea-ultimate 301 snap missing 'fsnotifier' bin; reports "External file changes sync may be slow: Native file watcher executable not found"
Core. LicensingBug IDEA-272971 Login Dialog: try to open browser in fallback scenario
Bug IDEA-272359 Login Dialog: support fallback scenario
Bug IDEA-273061 Login dialog: Fallback mechanism: an attempt to validate wrong token does not show error messages
Bug IDEA-271115 NullPointerException in PluginManagerCore when trying to show license dialog
Performance IDEA-271827 Login dialog freezing when internet is off
Bug IDEA-271817 Login dialog: Grey frame around dialog content
Cosmetics IDEA-271732 Login Dialog: UI review
Core. Navigation and SearchBug IDEA-270674 Hierarchy on Overridden Method shows calls to overriding methods
Bug IDEA-203657 Method name labels in call hierarchy are wrong for nested classes
Bug IDEA-250058 Call Hierarchy tab should have a collapse all button
Bug IDEA-268322 Freeze when Analyze Data Flow from Here
Bug IDEA-203328 "Expand all" on call hierarchy of a recursive method never terminates
Core. Platform APIBug IDEA-270799 AboutPopupDescriptionProvider information no longer displayed on About screen
Bug IDEA-264030 Backgrounding progress dialogs seems to have broken between Android Studio Versions 4.1 and 4.2
Bug IDEA-268191 JBPopupFactory.createConfirmation always runs "No" runnable
Task IDEA-269551 Replacement for GotoTargetRendererProvider
Task IDEA-271430 Remove deprecated UAnnotated.annotations
Bug IDEA-264418 Inlays don't work well with fractional font width
Bug IDEA-264792 Broken ToolWindowManagerImpl#unregisterToolWindow(String id)
Core. Plugin ManagementBug IDEA-256101 Can't see installed plugin, can't uninstall plugin
Exception IDEA-271370 Throwable: jarFiles is not set for PluginDescriptor(name=Spring Security)
Bug IDEA-271502 PluginClassloader logs errors which would be ignored otherwise
Bug IDEA-272022 2021.2 EAP doesn't offer a restart after installing language pack plugin
Bug IDEA-272739 Exception in IDEA core at startup
Bug IDEA-272165 `Restart` action in "Plugin list has changed" balloon requires smart mode
Exception IDEA-271395 Throwable: jarFiles is not set for PluginDescriptor(name=Spring Data)
Bug IDEA-271835 Class com.intellij.spring.persistence.integration.hibernate.SpringXmlHibernateSessionFactory must be not requested from main classloader of com.intellij.spring plugin
Bug IDEA-264429 IDEA suggests updating an uninstalled plugin
Bug IDEA-271398 MissingResourceException after dynamic plugin installation
Exception IDEA-273256 PluginException: Class com.intellij.spring.integration.injection.el.SpringIntegrationELImplicitVariableFactory must be not requested from main classloader of com.intellij.spring.integration plugin [Plugin: com.intellij.spring.boot]
Bug IDEA-271488 PluginException: Cyclic service initialization: interface='com.intellij.openapi.keymap.KeymapManager'
Bug IDEA-270855 NPE in Plugin migration downloader
Bug IDEA-262343 Cannot unload a plugin due to leak: ToolWindowIcon in ActivateToolWindowAction
Exception IDEA-271361 ClassNotFoundException: com.intellij.spring.mvc.jam.SpringRequestBaseUrlElement PluginClassLoader(plugin=PluginDescriptor(name=Spring Boot))
Exception IDEA-271367 ClassNotFoundException: com.intellij.aop.psi.AopPointcutExpressionLanguage PluginClassLoader(plugin=PluginDescriptor(name=Spring)
Exception IDEA-271364 Throwable: jarFiles is not set for PluginDescriptor(name=Spring Integration Patterns)
Exception IDEA-271785 Throwable: Class com.intellij.spring.el.SpringELLanguage must be not requested from main classloader of com.intellij.spring plugin
Bug IDEA-272831 On plugins unloading some dependent plugins fail to load without any user-visible hints
Bug IDEA-233743 Restart of IDE is suggested on uninstall/disable of incompatible dynamic plugin
Bug IDEA-215678 "Enable plugins" link in PluginsAdvertiser does not work as intended
Exception IDEA-273001 PluginException: Class com.intellij.spring.el.SpringBeansAsElVariableUtil must be not requested from main classloader of com.intellij.spring plugin [Plugin: com.intellij.spring]
Bug IDEA-270430 Not Possible to enable bundled plugin: the required implementation-details plugin is disabled
Exception IDEA-272436 PluginException: Class must be not requested from main classloader of com.intellij.spring.boot plugin [Plugin: com.intellij.spring.boot]
Bug IDEA-269039 Fail to load descriptor from the downloaded plugin archive
Exception IDEA-271256 Enabling AngularJS plugin causes exceptions
Bug IDEA-270022 java.lang.IllegalArgumentException: com.intellij.openapi.fileTypes.NativeFileType on starting the IDE with 3d party plugins
Bug IDEA-268227 Fail to load language plugin
Bug IDEA-272801 Plugin recommendations by Maven dependencies are not shown on project opening
Core. Project SettingsBug IDEA-271843 Artifacts aren't serialized into cache after importing Maven project from scratch
Bug IDEA-269842 Can't delete the manually added facet in the project with ExternalStorageConfigurationManager=true
Bug IDEA-174113 Excluded by pattern files are still compiled
Bug IDEA-272025 IDEA fails to open project if it has incorrect value of 'type' attribute in 'orderEntry' tag in one of its iml files
Bug IDEA-272863 If a module is removed from list of unloaded modules, it may become unloaded again after external changes in project configuration
Bug IDEA-273184 Freshly Created Project in the Drive Root Throws NPEs on Creation and Opening
Task IDEA-266774 Provide API for specifying Java language level in workspace model
Bug IDEA-269594 Compare Gradle and Maven projects import at old and new project models
Usability IDEA-269817 Project Structure dialog: on new facet adding via Facets tab re-select some module in the Choose Module dialog
Exception IDEA-272606 Throwable at com.intellij.packaging.impl.artifacts.workspacemodel.ArtifactManagerBridge.initBridges
Usability IDEA-265597 Unnecessary .idea/libraries-with-intellij-classes.xml is created when I add gradle module to a project
Usability IDEA-268573 Shorten default name for libraries downloaded from Maven repositories
Bug IDEA-267199 IDEA may automatically unload all modules if some modules were unloaded in the past
Bug IDEA-262274 Minimize usage of VirtualFilePointerImpl replace to VrtualFileUrlBridge
Performance IDEA-265149 Slow synchronization of project model for project with many modules after opening
Usability IDEA-265303 Using independent numbering per scratch file type was a poor decision
Core. Quick DocumentationBug IDEA-265396 Quick Documentation renders only the first one of a repeatable annotation
Performance IDEA-272548 Heavy UI freezes with quick doc panel and font ligatures enabled
Core. RefactoringsUsability IDEA-186088 Display some "process" when paste/delete a big folder into/from a project
Bug IDEA-266884 Rename refactoring should renames occurrences only inside provided scope
Bug IDEA-264381 IDEA freezes when invoking Surround with Live Template
Usability IDEA-268558 Preview for Move class to other package do not show package name changing
Core. Run. ConfigurationsBug IDEA-252159 Run / Debug Configuration $FilePrompt$ as working directory
Usability IDEA-249917 [new run config UI] Highlight error state near the field containing the error
Bug IDEA-261090 [new run config UI] do not show Got It tooltip for classpath in jUnit
Performance IDEA-261332 DefaultJavaProgramRunner.doExecute and GenericDebuggerRunner.doExecute
Bug IDEA-262227 Move settings that were shown in run configuration dialog with the Templates node selected
Bug IDEA-255341 [new run config UI] Logs option adding and deleting is not saved
Bug IDEA-267309 Fork mode is reset to "method" on reopening of run configuration screen.
Bug IDEA-266683 Environment variables in Java Run dialog behavior doesn't conform to the hint provided in configuration window.
Usability IDEA-257348 "command line is too long" error message: hard to understand how to fix, especially with new run configuration UI
Bug IDEA-266139 Kotlin run configuration doesn't support WSL
Bug IDEA-266062 $FilePrompt$ as working directory in run configurations not working anymore
Core. Run. TargetsBug IDEA-270551 Run Targets: On run Quarkus on docker target get java.lang.NoClassDefFoundError: com/intellij/docker/remote/run/target/configuration/DockerTargetEnvironmentConfiguration
Performance IDEA-264654 Rsync: Upload files in batch sets where possible
Bug IDEA-270299 Run Targets: RC with run on target excluded from pre-commit run RC list
Cosmetics IDEA-260898 Run Targets. SSH wizard small fix
Bug IDEA-267619 An exception on Run/Debug is shown to user without means to report it
Bug IDEA-269329 Docker. Run Targets. SpringBoot and Quarkus: runs on docker targets are absent in the Services view
Bug IDEA-268640 IJ cannot complete commands when the terminal is set to zsh and it needs to update
Core. SSHBug IDEA-267480 High CPU Usage and Decent amount of exceptions in log when importing new remote makefile project
Bug IDEA-267569 Public keys are asked before the password if auth type is set to password
Bug IDEA-272423 Broken ProxyJump emulation through ProxyCommand
Bug IDEA-263286 SSH client should not try default keys if any IdentityFile is specified
Core. StatisticsTask IDEA-270682 Add run icon gutter click to group
Feature IDEA-271135 Report type of proxy configured in settings
Exception IDEA-268572 ADE at com.intellij.serviceContainer.ComponentManagerImpl.doGetService
Task IDEA-255671 Add information about array data type to generated scheme
Task IDEA-256920 Track Inspections Widget action
Core. Task ManagementBug IDEA-262805 First underscore in context name gone
EditorFeature IDEA-268343 Add listeners for `Editor.setOneLine`
Cosmetics IDEA-244880 Quick documentation display option: "On hover" vs "on mouse move"
Bug IDEA-267339 Undo - does not restore selection after using an action via popup or menu, but works properly when using a shortcut
Bug IDEA-262153 IJ requests indexes on caret shape changing
Bug IDEA-243023 .editorconfig: max_line_length=off disables visual guides
Bug IDEA-269075 Documentation link for an inaccessible symbol doesn't work with rendered documentaion turned off
Exception IDEA-265875 java.lang.Throwable: Slow operations are prohibited in the EDT when trying to browse recent projects
Bug IDEA-271823 NullPointerException occurs when trying to open markdown file again
Task IDEA-268217 Open non-project files in LightEdit mode by default, show a dialog suggesting to switch to project mode
Bug IDEA-256658 Editor ignores font settings in 'reader mode'
Bug IDEA-270542 Renaming inner class does not update part of the editor window
Feature IDEA-267726 Option to disable "advertise actions" on empty editor
Bug IDEA-272390 VCS name in annotations is longer than the highlighting with JB Mono 14
Bug IDEA-268819 Text preview box under "Font" settings changes size when hovering over the "Current editor font" warning
Feature IDEA-271409 Create editor API to provide custom representation for specified blocks of text
Task IDEA-260495 Font Settings: add sample of bold font to preview
Editor. Code CompletionFeature IDEA-267743 Color Scheme: separate background option for quick doc and code completion
Bug IDEA-269699 Second completion shows duplicated file entries
Editor. CopyrightFeature IDEA-150579 Add the ability to maintain multiple years in a copyright statement using the Copyright Plugin
Editor. Diff and MergeBug IDEA-273361 Diff stops working after back action
Usability IDEA-269638 Confusing behavior with synchronize scroll setting in diff views
Usability IDEA-270466 Go To Changed Files button doesn't appear when another changed file occurs in changelist
Bug IDEA-268534 A "Diff" dragged into a frame does not remmeber size and position
Bug IDEA-273869 Compare with Local opens diff window instead of Changes between revision and local changes dialog
Bug IDEA-270349 Show diff in Separate Window action doesn't work when invoked from Find action
Usability IDEA-269735 Missing actions "Show Diff in Separate Window" and "Show Diff in Editor Tab" for Image Diff and binary file diff
Cosmetics IDEA-270307 Diff Unification: unify tooltip for settings gear button
Usability IDEA-271662 Too long tab title for compare actions
Usability IDEA-268591 Add an option to switch Diff into a frame to the Editor settigns
Usability IDEA-271914 Diff in editor overlaps by dialog
Cosmetics IDEA-239121 diff viewer artefacts (reggression)
Usability IDEA-239744 Dangerous behavior with "compare next file" hotkey
Bug IDEA-269981 Shortcuts for Compare Previous/Next File don't work after first invocation
Bug IDEA-273714 Diff in a separate window doesn't get focus on show diff invocation when diff has been already opened
Editor. Editing TextBug IDEA-271601 Suppress scratch file intention in VCS dialogs
Usability IDEA-145278 Scratches settings: always create empty scratch file / buffer
Feature IDEA-166360 Caret placement after selection
Usability IDEA-138523 Allow new 14.1 AutoWrap Long Lines to be Disabled
Bug IDEA-273731 Strange sorting order in Scratch Files popups
Bug IDEA-263980 Unexpected caret movement behavior in text with RtL fragments and a tab char
Bug IDEA-264288 Join lines with comment on the second line produces red code
Feature IDEA-119435 Keep caret position when commenting code
Bug IDEA-270291 Blue borders are blinking in TODO
Bug IDEA-262221 Font ligatures do not get enabled in editor but are shown in the preview
Feature IDEA-169769 Add "Create new scratch file" to Alt+Enter action on selection
Bug IDEA-273729 "New Scratch File" invoked from Find Results creates empty file in some cases
Bug IDEA-273145 "Export to Scratch File" creates files with wrong text
Bug IDEA-273740 Custom file types is ignored when creating scratch
Feature IDEA-273126 Remove opened empty scratch files on closing project
Bug IDEA-273127 java.lang.IllegalArgumentException occurs when trying to create scratch file
Bug IDEA-273143 No selection-related item in "New Scratch File" in Run console
Bug IDEA-138474 Scratches do not support custom file types
Feature IDEA-80384 Different color and fonts style for public, protected and private methods.
Bug IDEA-166692 Unexpected result when selecting a line and then using shift + down arrow
Feature IDEA-149044 Actions to show popup scratch list and particular scratch
Feature IDEA-194931 Automatically remove empty scratch files
Feature IDEA-228556 Set field color based on access visibility
Feature IDEA-136148 Copy from Run Log into Scratch Window
Editor. Error HighlightingUsability IDEA-130373 Highlighting should not be paused during VFS refresh
Bug IDEA-272748 Incorrect displaying settings in Color Scheme → Language defaults
Editor. FormatterUsability IDEA-260940 Can't generate .editorconfig entries after the .editorconfig file has been created
Bug IDEA-226487 EditorConfig indent settings not applying to SQL file
Bug IDEA-170699 Preview for Code Style goes crazy
Bug IDEA-242506 .editorconfig automatic reformat inserts invalid space
Bug IDEA-186208 Disabling "Code Style / Java / Chained method calls / Wrap first call" does not glue the method invocation to identifier
Bug IDEA-218936 IDEA: Java code rearrangement may produce illegal forward reference
Exception IDEA-269375 FormattingModelInconsistencyException at com.intellij.formatting.FormatterImpl.validateModel
Editor. Intention ActionsBug IDEA-264648 Nothing to show pop up is too big
Feature IDEA-263473 'Fix all' action for (at least some) compilation errors
Editor. SpellcheckBug IDEA-272375 False-positive spell correction "Wrong article": "a" vs. "an" in front of "hours"
Editor. TextMate BundlesBug IDEA-263847 Some log files not editable
Lang. JSONBug IDEA-268856 Edit schema mappings shows an extracted version of settings
Feature IDEA-264003 JSONL type for New Scratch
Bug IDEA-268772 NCDFE: ParseException on Exception on attempt to evaluate JsonPath expression
Feature IDEA-269430 JSONPath: add Evaluate JSONPath action to editor context menu
Lang. MarkdownException IDEA-270501 CCE at org.intellij.plugins.markdown.editor.lists.MarkdownListEnterHandlerDelegate.postProcessEnter
Task IDEA-270479 Move Import/Export actions from File to Tools->Markdown Converter sub menu
Feature IDEA-210695 Export markdown to html
Bug IDEA-261987 Markdown plugin render blank page
Task IDEA-264671 "export to..." group for markdown with providers for converting to html, docx, and pdf
Usability IDEA-270883 Change "Markdown -> Create Link" shortcut from Cmd+K
Bug IDEA-271134 Disable floating toolbar on pull requests input fields
Bug IDEA-269403 Markdown: md file toolbar doesn't have the edit buttons
Feature IDEA-245576 Convert Markdown to Docx (import/export docx)
Feature IDEA-245577 Convert Markdown to Pdf
Feature IDEA-261922 'Expand selection' in markdown should stop inside backtick-quoted code
Lang. Shell ScriptBug IDEA-262819 Syntax Highlighting issue with process substitution and process redirection
Usability IDEA-252906 Support for running scripts without path
Bug IDEA-263122 Wrong detection of the balanced string quotes in the shell script
Bug IDEA-244342 Wrong syntax highlighting in shell script
Lang. YAMLBug IDEA-264311 Fragment editor of injection YAML unexpectedly closed after ENTER
Bug IDEA-267035 Syntax language hint no longer works in YAML files.
Tools. DockerFeature IDEA-159173 Docker integration: ability to restart containers
Bug IDEA-267110 Docker-compose. Ports validation. Add validation errors in case of ports with spaces
Bug IDEA-266612 java.lang.NullPointerException: Parameter specified as non-null is null at adding build options
Bug IDEA-268617 Docker Compose: port indentation is off for code completion
Bug IDEA-273737 close open project leads to the red Docker Compose service state
Exception IDEA-272043 Pipe closed, pipe id: `ComposeExternalRuntime.pipe:writeToT` at a compose app container restart
Bug IDEA-273565 Docker via SSH. Inspect on any item leads to java.util.concurrent.CompletionException
Bug IDEA-271035 Docker. Smart delete. "Delete selected" dialog: correct the behavior of the root item
Bug IDEA-272946 Docker over ssh builds docker-compose only locally
Cosmetics IDEA-271836 Docker-compose. The icon of a new compose app looks line it is a simple container
Bug IDEA-202831 Docker, DockerCompose. Ephemeral ports: Port bindings tab is not updated after the container restart
Bug IDEA-271913 Docker. Rerun via Service view of a Dockerfile/Image doesn't include run config changes
Bug IDEA-273566 Docker. Two equal "Labels" tabs for a volume
Bug IDEA-222687 Support docker-compose compatibility option
Feature IDEA-185923 Docker: provide quick-help for keys in Dockerfiles, docker-compose.yaml files
Bug IDEA-272067 Docker. Don't leave the container in the stopped state after saving changes
Bug IDEA-271873 Docker. Make it not possible to edit the output of the inspect action
Bug IDEA-271870 Docker. Networks. Remove "Delete" item from the context menu for the default networks
Feature IDEA-193298 DockerCompose: provide possibility to navigate from alien nodes to the possible compose files
Usability IDEA-262734 Docker-compose run configuration. "With exit code" up option: show the validation error just after this option adding
Bug IDEA-271139 Docker-compose. Disable "Down" for the synchronized not-existing compose app
Cosmetics IDEA-271972 Docker-compose. Networks: change icons from "container" to the corresponding to volumes/networks
Feature IDEA-265631 [docker-compose editor] add validation for ip type
Bug IDEA-267498 Docker-compose. Wrong inspection error for `cpus` key value
Exception IDEA-273372 NPE: DockerRuntimeCache
Bug IDEA-273371 docker plugin "inspect" vs docker CLI "inspect"
Bug IDEA-259303 Docker. Settings on the Tools page are wrong red marked
Feature IDEA-251420 Docker: Implement start/stop for "alien" compose nodes
Bug IDEA-267017 Docker-compose. Wrong inspection for `cpus` key
Bug IDEA-266983 Docker-compose. Inspection errors for device_cgroup_rules values from spec
Feature IDEA-251843 Docker. Support folding regions for RUN in Dockerfiles
Bug IDEA-267527 Docker. Debug doesn't work: Unrecognized argument: null
Bug IDEA-267093 Dockerfile. Quick help. Correct some descriptions
Bug IDEA-230542 IDE gives warning for multiple-line "command" service option
Bug IDEA-267020 Docker-compose. Inspection error for "subnet" value from spec
Bug IDEA-272788 Docker. Networks. "Containers" tab: + button doesn't work
Bug IDEA-273441 attach network to compose service by "com.docker.compose.project" label
Bug IDEA-267007 Docker-compose. Inspection errors by "list" presentation for `environment` key
Bug IDEA-271023 Docker. Show image action for a container doesn't work.
Feature IDEA-270075 add possibility to disable folding for Docker log console
Feature IDEA-270074 ask user before delete orphans services
Feature IDEA-255708 Allow language injection info Dockerfile commands
Usability IDEA-271112 Docker. Smart delete. Idea is blocked until all is deleted, make the action process in the background.
Feature IDEA-268333 Dockerfile: add quickfix for not allowed spaces
Feature IDEA-268003 Mark unquoted ports in a docker-compose.yml as a warning
Bug IDEA-272228 Docker. No easy possibility to remove volumes without dependencies
Bug IDEA-267124 Docker-compose. Duration type: wrong inspection errors for 2.5s format
Usability IDEA-271107 Docker-compose. Add the explaining tooltips about "red/yellow" states of the items in the Services view
Bug IDEA-272035 Docker. Image run configurations: Command Preview is absent
Usability IDEA-272979 Quick documentation examples in Dockerfiles can be hard to read
Bug IDEA-273722 all documents should be saved before Docker Compose actions
Feature IDEA-171328 Docker - allow for pausing/unpausing containers
Usability IDEA-267225 Docker: Inspect output is barely readable
Cosmetics IDEA-271720 Docker. Container log tab: Fold log actions layout is inconvenient
Bug IDEA-271413 Docker. No list of docker items after connection: Cannot obtain deployments: Illegal char
Bug IDEA-271120 Docker-compose. Services view: if all the services are yellow then make the root compose item also yellow
Bug IDEA-272112 Docker-compose. Impossible to remove project name option
Bug IDEA-267016 Docker-compose. Wrong inspection error for 'user' key
Bug IDEA-274078 smart delete work incorrect in some cases
Bug IDEA-272619 Docker. Port bindings are not present on the tab after Save action
Bug IDEA-270825 Docker: NullPointerException on connect to node in Services view
Bug IDEA-271920 Docker. Delete a volume: Correct the confirm dialog content
Feature IDEA-227244 Docker: Provide Safe Delete UI for the Delete Image action
Bug IDEA-271976 Docker. Networks/Volumes: display "Containers" tab with the related containers
Feature IDEA-265632 [docker-compose editor] add validation for ports mapping type
Usability IDEA-272439 Docker. Volumes. Smart delete dialog. Provide possibility to expandAll/collapseAll/selectAll/deselectAll buttons, add info about selected sub-nodes
Bug IDEA-272883 Impossible to disable Run Built image option in Docker
Bug IDEA-262553 Docker. Dockerfile/Image run configurations: Command Preview is absent in the new options UI
Bug IDEA-271143 Docker-compose. Disable or don't show "Delete" action for not existing items
Usability IDEA-262348 Docker Compose Run Configuration: the focus is not on the chosen option from the Up list
Bug IDEA-273226 Docker Compose: ports outside the 0-65535 interval pass the validation
Bug IDEA-271868 Docker compose: "Enable synchronization with Services view" doesn't work
Bug IDEA-270969 Docker Plugin does not work after a restart of CLion EAP 2021.2
Bug IDEA-269753 Docker: Image completion leads to FROM instruction replacement and exception java.util.NoSuchElementException: Array is empty.
Feature IDEA-271126 Docker. Log console for every compose service node
Bug IDEA-267032 Docker-compose. Add validation for shm_size key values
Usability IDEA-271130 Docker. Smart delete dialog: add some tips over/near compose items
Bug IDEA-271250 Docker: Allow to disable the notification to install/enable the Shell Script plugin
Bug IDEA-268997 Docker. Fails to re-run the pointed Dockerfile: the node hangs in the Service view
Bug IDEA-272064 Docker. Don't create a new run configuration by re-run with -p option
Bug IDEA-271210 from services docker-compose down does not include --env-file
Bug IDEA-267013 Docker-compose. Wrong inspection errors for start_period key
Feature IDEA-173760 Docker Compose: Allow operations on multiple services/containers (run, stop, etc)
Bug IDEA-268618 Docker: [windows] improve error thrown when attempting to connect to Docker when Docker isn't running
Feature IDEA-265630 [docker-compose editor] add validation for duration type
Tools. HTTP ClientBug IDEA-271320 Ctrl+z allows to undo all the text in the Http Client tab
Usability IDEA-269042 HTTP Client: should not mark regexp for URL as a insecure http link
Usability IDEA-265960 "Http is not safe" hint overlaps with underlined references in URL
Bug IDEA-239324 REST client JSON output limitation / truncated
Feature IDEA-267008 HTTP Usage Inspection: ignore local URL addresses by default and add an option
Bug IDEA-266294 HTTP Client doesn't use credentials specified in Proxy Authentication dialog in case of autodetected proxy
Feature IDEA-271808 HTTP Client: provide Generate HTTP Request intention for implicit web references
Bug IDEA-264163 HTTP Client freezes IDE on big response
Tools. TerminalBug IDEA-238288 PhpStorm Terminal is not outputting ANSI formatting sequences correctly
Bug IDEA-265118 Can't open Local Terminal
Feature IDEA-142610 Allow to switch between different shells in the terminal plugin
Feature IDEA-165184 Add "Use Option as Meta key" support to terminal
Bug IDEA-269214 Several keystrokes not recognized by embedded local terminal ( latest debian )
Feature IDEA-118845 Allow configurable cursor shape in terminal
Bug IDEA-260165 Alt + F/B shortcuts do NOT work in Terminal
Bug IDEA-170763 Some special characters cannot be typed in IDE terminal
Feature IDEA-198475 Powershell as a default shell on Win 10
Feature IDEA-166948 Presets for different shells
Feature IDEA-151206 SSH terminal add a new connection
Feature IDEA-268890 Provide quick way to open WSL in Terminal tool window
Bug IDEA-258409 Terminal pane must be opened manually in order for shell configurations to run in 2020.3
Bug IDEA-266310 Typography settings not working in terminal
Feature IDEA-212446 Make opening external files from the embedded terminal configurable
Feature IDEA-268134 Allow to increase/decrease/reset font size in the built-in terminal using keyboard shortcuts
Tools. Test ManagementBug IDEA-270365 "New Test from Test Cases" create file to "/target/generated-sources/annotations" root directory
Bug IDEA-272693 PluginException: com.jetbrains.test.ide.actions.OpenDefaultProjectAction: group with id "WelcomeScreen.QuickStart.IDEA" isn't registered
Bug IDEA-268204 TMS with local markdown files mixes scenarios
Bug IDEA-270362 When choose "Test from Test Case" option within TMS selection window test cases has not ids
User InterfaceBug IDEA-236115 Mac title bar is empty in full screen mode
Feature IDEA-263488 Add a status bar widget for Power Save mode
Cosmetics IDEA-236119 Wrong font is used in title bar if transparent title bar is enabled
Usability IDEA-249597 "Copy" context menu now requires submenu navigation
Bug IDEA-268310 File icons are rendered differently for multiple-selection in VCS changes trees
Bug IDEA-261052 JDK Update should use the IDE/Plugin updates
Bug IDEA-267670 Add an option key to call "Maximize Editor" with double-click on editor tab
Bug IDEA-262687 Some mnemonics are not visible in popups
Bug IDEA-261117 Built-in HTML preview reloads when unreated files are changed
Bug IDEA-271941 Multi-modules detection needs reopen projects
Bug IDEA-270989 New Help menu: Ctrl+C shortcut is not working
Bug IDEA-271944 Letter from the last word will be used for abbreviations in icon
Usability IDEA-262095 Pinned tabs in a separate row: don't stretch unpinned tabs
Bug IDEA-272889 Line numbers are cut in Recent Locations
Bug IDEA-271191 Confirmation dialogs are broken
Bug IDEA-268307 Sort tool windows without mnemonics in Recent Files alphabetically
Bug IDEA-271374 Resizing tool windows in "Undock" view mode does not work/work wrong
Bug IDEA-271880 Alerts: remove mnemonics from title and support line breaks in message
Bug IDEA-256073 Black frame in selected ComboBox item
Cosmetics IDEA-270200 Broken selection color in New File dialog
Usability IDEA-270614 Windows Jump lists items don't have tooltips
Bug IDEA-263581 Add JDK: "com.intellij.openapi.roots.ui.configuration.SDKListItem$..." action items are displayed on touch bar
Bug IDEA-271833 Wrong buttons order on touch bar for dialogs
Bug IDEA-272081 Items from popups are not shown on touch bar
Bug IDEA-263393 Open In Browser action from the URL context action menu is invoked just on mouse hovering or navigating by arrays through the actions popup if Intentions Preview is enabled
Bug IDEA-270699 Toolwindows won't open on mouseclick: TRANSLUCENT translucency is not supported
Feature IDEA-259660 Add a shortcut to allow switching Big Sur tabs
Cosmetics IDEA-270694 Some components background color looks wrong in macOS Light theme
Bug IDEA-267389 Icons appear for popup items without icons
Bug IDEA-236120 Transparent title bar is not hidden if a detached tab is opened in full screen mode
Exception IDEA-269240 'IllegalArgumentException: Can't find advanced setting' when call 'Reset Got it tooltip' action
Cosmetics IDEA-270760 Highlighting area of a dragged tool window takes the whole editor height
Bug IDEA-265122 PHPStorm-EAP 2021.1 throw exception on welcome screen (com.intellij.util.ImageLoader.getResourceData)
Bug IDEA-270071 Quick Definition popup rendering
Bug IDEA-268606 Arrow buttons are not displayed in the image diff
Task IDEA-268511 ExpandableTextField#setMonospaced(true) should use editor font instead of system one
Bug IDEA-267718 [BigSur alerts] Do not support HTML tags in options namees
Bug IDEA-269107 "configure" action for conflicting changelists shows an extracted version of the settings
Usability IDEA-269106 "Edit scopes" setting opens an extracted part of the settings
Bug IDEA-262987 Frame icon is small when in presentation mode
Task IDEA-270841 Main menu cleanup (Refactoring, Analyze, Tools, Help)
Cosmetics IDEA-267398 "About" dialog is not well-aligned when shown in JetBrains Mono font
Task IDEA-272290 Don't show What's new page in the IDE on fresh install
Bug IDEA-261853 JBTextField consumes space when invisible
Feature IDEA-237881 Provide a way to group problems by type in Problems View
Usability IDEA-265384 Make IDE and Project settings widget disablable
Bug IDEA-268182 Projects are opened as separate windows instead of tabs if transparent title bar is enabled
Usability IDEA-272108 Splitter sizes are not saved anymore / suitable after new EAP version is released
Bug IDEA-269313 Toolbar and navigation bar are hidden under project tabs if projects are opened in full screen
Usability IDEA-270670 Tool window in Float mode is hard to drag
Bug IDEA-262284 Recent Projects popup doesn't remember it's width
Usability IDEA-269111 "Customize menus and toolbars" action shows an extracted version of the settings
Usability IDEA-184944 Use words instead of symbols in shortcuts for OSX
Cosmetics IDEA-271858 Detected sdk first element selection looks weird
Task IDEA-270877 Tool windows dnd: add "drag distance" threshold for tool window buttons and headers
Usability IDEA-267926 Display project name in 'Open project' confirmation dialog
Feature IDEA-269756 Better names for multi-module projects on welcome screen in small IDEs
Cosmetics IDEA-267732 "Browse icon for selection action (*.png)" doesn't reflect that .svg is also supported
Bug IDEA-261155 Built-in HTML tab is opened as Preview tab if the *.html file is opened as Preview tab
Bug IDEA-271380 Selected item in the completion popup is unreadable with Mac OS Light theme
Bug IDEA-264013 WebPreview icon isn't shown if all browsers are disabled
Task IDEA-265429 Set minimal width and height of Welcome Screen
Cosmetics IDEA-262886 Move the "Open without Importing" button to the center
Feature IDEA-145837 Add left margin regulation for distract free mode
Bug IDEA-191366 Text in file inspection header is unreadable due to wrong color
Usability IDEA-270122 Only last component of root module group name is shown in Project Structure dialog
Bug IDEA-267051 Sort icon is missing in table headers
Task IDEA-268320 Tab drag out of the editor should open tab in a separate window
Bug IDEA-261164 In Mac Messages the warning icon is always displayed as the general IntelliJ icon
Bug IDEA-269705 New Project wizard doesn't allow to select project type
Bug IDEA-264380 Exception on startup
Usability IDEA-271622 "Quick definition" popup can't be moved
Usability IDEA-265158 Cannot dnd tab to pin when options 'One row' and 'Show pinned tabs in a separate row' are on
Bug IDEA-239838 Duplicated file opened in split mode when we are paused on a breakpoint in debug mode (Tabs are disabled)
Bug IDEA-269330 Add notification for IDEs running under Rosetta2 on apple M1 processors
Bug IDEA-271735 No plugin counter is visible in High Contrast theme
Bug IDEA-272337 Reversed arrows in trusted dialog
Bug IDEA-253426 Implement "Show pinned tabs in a separate row" for single row layout
Feature IDEA-265000 Navigating from the Editor splits: allow users to choose where to activate the file already opened in another split
Bug IDEA-267047 Frequent crashes at [libnst64.dylib+0x6be2] _setButtonData+0x142 in IDEA Nightly (no reproducer yet)
Bug IDEA-232632 "Mark modified (*)" works only if "Show file icon" is enabled for Editor tabs.
Bug IDEA-263607 Inconsistent and annoying presentation of "Copy Path..." menu item
Bug IDEA-189731 Results preview of "analyze dataflow" is "empty" for all but first result inside one node
Bug IDEA-264566 "Updates available" icon disappears after IDEA restart
Task IDEA-265276 Improve wording in New Project Settings menu item
Cosmetics IDEA-263411 Fix System settings layout
Bug IDEA-236133 Window does not get to "normalize" state by double-click the transparent title bar
Bug IDEA-271330 Settings "Drag-and-drop with Alt pressed only" broken
Task IDEA-234632 Make backgroundable tasks start in background by default
Bug IDEA-270541 Esc doesn't close some dialogs
User Interface. AccessibilityBug IDEA-264923 On MacOS, the name of the IDE error icon is spoken with HTML tags
Bug IDEA-270858 Items in result list in Search Everywhere are not pronounced by screen reader
Bug IDEA-263910 Screen reader pronounces "text/html" for some notifications
User Interface. Action SystemBug IDEA-270131 Context menu is not shown in unfocused Project view
Bug IDEA-265677 CloseNotificationAction is not available during indexing
Bug IDEA-267137 Keyboard navigation in popup menu causes duplication in submenu
Bug IDEA-273186 "File" menu sometimes not opening after click
Bug IDEA-263127 Deadlock in ActionUpdater
Bug IDEA-269626 "Compact View" button doesn't work
Bug IDEA-263282 Toolbar jumps and popups resize due to that in async update mode
Feature IDEA-266279 Create dedicated Maximize Editor action
Task IDEA-264768 Right click on a gutter unexpectedly creates a bookmark
Bug IDEA-269110 "Configure inspections" does nothing in 212
Bug IDEA-264299 Toolbar with browsers is no more visible in html files
Performance IDEA-264612 0.5 s delay when showing the branch list
Bug IDEA-264398 Empty menu item in Favorites tool window menu
Bug IDEA-264547 Clicking on the "Run Tests" gutter unexpectedly creates a breakpoint
User Interface. Console ViewBug IDEA-250608 Output automatically activates soft-wrap when a line is longer than 100000 characters
User Interface. ControlsBug IDEA-264027 Branch actions dialog is being closed immediately
Bug IDEA-267261 "Select File In Project View" in TouchBar toggles project build O_o
Bug IDEA-260511 Combox with JBPopup closes on update
Bug IDEA-267068 Offset clickable area for the Resolve button in the Commit panel
Bug IDEA-271423 'VCS' menu item is renamed to 'Git'
User Interface. Embedded Browser (JCEF)Bug IDEA-244182 JCEF heavyweight popup closes too early or always stays on top [Linux]
Bug IDEA-269711 osr markdown is not painted when switching the view modes
Bug IDEA-273898 add registry key to switch Code With Me to OSR mode
Feature IDEA-265760 implement off-screen jcef render handler
Bug IDEA-269568 switch markdown viewer to lightweight OSR mode
Bug IDEA-269332 support JBR-3447 org.cef.browser.CefBrowserOsrWithHandler#createDevToolsBrowser is not implemented
Task IDEA-265333 allow per-browser off-screen rendering mode
Bug IDEA-260275 Screen sharing in jcef also captures microphone
User Interface. Find, Replace, UsagesBug IDEA-270761 Find in Files defaults to a "Directory" scope after serching in File
Feature IDEA-137166 Export Find Results to new Scratch file
Bug IDEA-270766 "Usages of ..." tool window notification is not closed after search is completed
Task IDEA-231364 Implement Find Usages tool window and dialog design updates
Task IDEA-231362 Implement Show Usages popup new design
Bug IDEA-272143 "Show usages" popup is not closed with Esc key if Scope combobox is focused
Bug IDEA-272398 "Search for base method usages" option is shown for methods without base methods and constructors
Bug IDEA-242476 Filter icon becomes a line of checkboxes when the icon does not fit on the toolbar
Bug IDEA-268598 "Replace" is not invoked with Cmd+R if focus is in Find field
Bug IDEA-268087 Fix cosmetics in search field in editor and in popup
User Interface. FocusBug IDEA-250423 Wrong file selected in Project View when clicking it after working in detached Editor
Bug IDEA-268607 Some git actions (probably all) don't raise Git tool window focus when the tool window is in window mode
Bug IDEA-265676 Switching to another project using File -> Open Recent does not work if the other project is already opened and its window is minimized
Bug IDEA-235818 Cmd+` (Command backtick) switches between windows in different workspaces
Bug IDEA-266195 Navigating to Definition not Focusing on Other Screen
Usability IDEA-194818 Focus in Open Project dialog should be on "New Window"
Bug IDEA-214538 UI freeze caused by java focus API, Ubuntu 18.04, two monitors
Bug IDEA-264005 Non-modal commit tool window isn't focused sometimes on 'Commit' action (when "Refreshing Local Changes" progress is shown)
Bug IDEA-271932 Click on gutter does nothing if focus is out of editor
User Interface. Keyboard InputBug IDEA-198381 Modifiers from macro action invocation shouldn't affect macro execution
User Interface. Look and FeelBug IDEA-269582 Broken High contrast theme in 2021.2
Bug IDEA-256700 Different behaviour of JEditorPane for Darcula and IntelliJ Light themes
User Interface. NavigationFeature IDEA-269550 Debugger: Use Preview Tab for files opened for frame navigation and stepping
Bug IDEA-272404 Option to open file in an inactive split is not considered when opening a file from Recent files with Tab Placement: None
Usability IDEA-222648 Navigate to test data: Do not show a popup for a single option
Usability IDEA-269923 Navigating Back/Forward should remember if the file was opened in Preview Tab
Bug IDEA-270835 Mnemonics in Switcher window not working with Ctrl+Shift pressed
Bug IDEA-269744 Duplicates in Search Everywhere
User Interface. PluginsUsability IDEA-265998 Plugin update: modal error messages appear one on another
Bug IDEA-257729 java.nio.file.InvalidPathException: Illegal char <:> at index 4: file:\C:\Program Files\JetBrains\IntelliJ IDEA 211.3089\lib\icons.jar!\plugins\pluginLogo.svg
User Interface. Project ViewBug IDEA-269161 Broken backward compatibility in PsiDirectoryNode
Bug IDEA-270746 Remove "Add BOM" option from project tree context menu
Performance IDEA-261054 ProjectViewTree.getFileColorFor
Feature IDEA-162454 Project View. Count selected items.
Bug IDEA-265441 Project tool window "copy path" context menu action copies wrong path (focusing issue)
User Interface. Search EverywhereBug IDEA-271963 Actions by abbreviations are not shown at the top of results in "Find Action" if ML sorting is enabled
Bug IDEA-273308 Search everywhere: redundant options found for multi-word search sometimes
Bug IDEA-270589 navigate to class: show in find toolwindow opens empty results
Bug IDEA-261426 Empty line in Search Everywhere results when searching for "vcs"
Usability IDEA-265751 "Open recent" name in find dialog could be unintuitive
Bug IDEA-271699 Search everywhere: "Quick definition popup" doesn't take current selected item in results list into account
Bug IDEA-266701 Search Everywhere: Wrong hint on All tab after switching from Actions tab
User Interface. TabsBug IDEA-274043 file opens in new window when using ctrl+alt+left and ctrl+alt+right
Version ControlBug IDEA-269314 Shift+Tab navigation is not working in Commit toolwindow
Usability IDEA-268812 'Esc' no longer closes the diff window
Bug IDEA-265636 Clicking Help button in Remove Remote dialog throws an exception
Usability IDEA-265077 Pre-commit checks in background: add re-run icon
Bug IDEA-267194 Settings Repository fails at clone due to incorrect upstream branch resolution
Bug IDEA-264786 Tests before Commit: first underscore in configuration name turns into mnemonic
Usability IDEA-264785 Pre-commit checks in background: hard to distinguish failed checks when many are shown
Usability IDEA-171873 Commit change dialog should show code cleanup profile
Feature IDEA-57574 Ability to enable tests execution in "before commit" actions
Usability IDEA-171261 Cannot delete last changlist
Feature IDEA-194094 Add option to disable changelists completely
Bug IDEA-270294 Error running Tests': Cannot run 'Test' on '<default>' in AppCode
Bug IDEA-264996 Tests before Commit: infinite checks spinner if test configuration is not full
Bug IDEA-272134 Regression: Local Changes is missing inline diff in 2021.2 EAP 4
Task IDEA-266238 Add "Fetch" icon to VCS main menu
Bug IDEA-270337 Tests before Commit: Selected Tests configuration is not updated in Commit toolwindow if was changed in Settings
Usability IDEA-237547 Ctrl-Tab in preview diff conflicts with tabs switcher
Bug IDEA-264772 Tests before Commit: cannot run tests in gradle project
Bug IDEA-269322 Lost conflicting renamed/modified changes during Update project process
Bug IDEA-264658 Branches: Missing Edit / Remove remote context menu items
Exception IDEA-266052 Tests before commit: IllegalStateException: Already resumed
Bug IDEA-264758 Tests before Commit: code compilation is not started on tests run before commit
Bug IDEA-268108 Balloon notification does not escape html from jest output
Bug IDEA-272191 Double-clicking a file inside "Local Changes" opens strange Diff
Bug IDEA-264651 Branches: "Expand/Collapse All" shortcuts do not work correctly when search filter is filled
Task IDEA-272199 Add the Show on Double click selector under Gear of GIt toolwindow
Usability IDEA-269749 Add "Run Tests" option in Version Control | Commit | Before Commit
Feature IDEA-241921 Branches panel should respect the Path filter
Cosmetics IDEA-264640 Branches: Add "Group By" tooltip
Cosmetics IDEA-269628 Analyze Code before commit: first underscore in profile name turns into mnemonic
Bug IDEA-269629 Analyze Code before commit: latest added profiles are not shown as selected
Bug IDEA-269829 Commit is done whereas pre-commit test task isn't successful
Version Control. GitFeature IDEA-193572 Support git config core.hooksPath
Exception IDEA-267043 Exception and threadDump after merging via Git Merge dialog
Cosmetics IDEA-269554 Show Diff button is always active even though the selection is empty
Bug IDEA-259512 Automatic exclusion of files listed in .gitignore only recognizes files from 1 repository root.
Bug IDEA-268542 "New branch" doesn't work in branches popup invoked from VCS operations popup
Bug IDEA-270207 WSL: IDE incorrectly autodetects git on windows after export/import wsl distro
Bug IDEA-253401 Git Staging Area: File name completion doesn't work in commit message field when staging is enabled
Bug IDEA-272962 GPG Key does not display correctly the owner name
Bug IDEA-272205 Git GPG Signing: cannot turn off commit signing when no private keys were found
Feature IDEA-232456 Branches: Allow grouping by repository
Bug IDEA-271726 VcsException: Cannot run program "gpg": error=2, No such file or directory
Bug IDEA-262265 Unshelve with drag and drop doesn't work inside commit tab
Bug IDEA-263100 Compare with Branch functionality actually compares with tag if branch and tag have identical names
Feature IDEA-259421 Add an action to call Ignored but not excluded check
Task IDEA-269158 Update Compare actions to show diff in the editor
Exception IDEA-272443 NPE at git4idea.config.GitExecutableDetector.getBashExecutablePath
Task IDEA-269501 Git GPG Signing: provide link to help when gpg-signing fails
Version Control. GitHubUsability IDEA-263390 GitHub Pull Requests: can't hit pencil button by keyboard
Bug IDEA-267608 Create PR is just doing a git push without actually creating a PR in PyCharm 2021.1
Bug IDEA-263361 GitHub Pull Requests: push is incorrectly recognized as successful when create PR without access to repo
Usability IDEA-262864 GitHub Sync Fork: sync fork action returns "No suitable GitHub account found" notification instead of "Log In to GitHub" dialog when no github account is configured
Bug IDEA-251845 "Malformed URL" error when "Open on GitHub" for files with `[brackets-in-name].js` (common / required Next.js filename pattern)
Bug IDEA-203276 Rebase My GitHub Fork and Create PR offers to select between origin and upstream
Cosmetics IDEA-264987 Create Pull Request: new text for "no changes" warning
Bug IDEA-251331 Comments in diffs are not visible when "Hard wrap at" is set to 0
Bug IDEA-265152 Create pull request: show tooltip with full repo-branch spec on hover
Bug IDEA-272485 GitHub PullRequest: remote branch isn't detected on new PR creation
Usability IDEA-264210 GIthub Pull Requests: New Pull Request tab is not focused after login
Bug IDEA-265637 GitHub Sync Fork: sync fork doesn't work when upstream configured with ssh or http url
Bug IDEA-264499 "Create Pull Request" button does not appear until after "Pull Requests" pane has been opened
Bug IDEA-270034 GitHub tab is not refreshed after authorization
Bug IDEA-260230 Loading Github branch protection rules not consistent
Cosmetics IDEA-264969 Create Pull Request: use default font color for the errors, red icon is enough to attract attention
Cosmetics IDEA-263303 GitHub Pull Requests: beautify API error messages
Bug IDEA-264970 Create Pull Request: do not duplicate error about empty pull request on creation
Bug IDEA-264973 Pull Request: Do not suggest to reset filters when the search query is empty
Bug IDEA-264961 Create Pull Request: remove plus and target icons for New Pull Request View
Bug IDEA-264976 Pull requests: reset filter should not set state:open
Version Control. Local HistoryCosmetics IDEA-271576 Search in Local History: Changes tree blinks if no results found
Usability IDEA-271431 Search in Local History: no keyboard navigation between items
Feature IDEA-70015 Search Local History for file content and labels
Bug IDEA-269828 Search in Local History Freeze
Bug IDEA-271318 Search in Local History: Do not show diff if no results found
Usability IDEA-271317 Search in Local History: Ctrl+F should set cursor into search field
Version Control. LogException IDEA-269709 Stable ' Broken index maps' after reopening some projects in AppCode
Code CompletionBug DBE-12018 Auto completion in JOIN statement does not qualify objects
Bug DBE-2212 IDE suggest columns from pg_catalog instead of columns from selected search path
Feature DBE-10515 Give priority to chosen schema in code completion
Usability DBE-10512 Add option to toggle suggestion of all objects from all schemas in completion drop-down
Bug DBE-9025 mssql complete not default schema
Feature DBE-11902 On optimistic left join completion, improve priorization
Code FormatterBug DBE-13485 Datagrip always wraps "Create or Alter Function" statement regardless of Code Style setting
Feature DBE-12690 Add formatting option for Place ON/USING under JOIN indented
Feature DBE-8059 An option to treat the asterisk in the SELECT clause as a regular element
Feature DBE-759 Add options to wrap alter table statement
Code GenerationBug DBE-12810 SERAIL field type is incorrectly generated for not default sequence
Bug DBE-13462 COMMENT and LANGUAGE positioned wrong
Code HighlightingBug DBE-13557 UNMASK not recognized as valid permission (MS SQL Server)
Bug DBE-13092 CockroachDB SQL dialect doesn't understand partial UNIQUE indexes in CREATE TABLE
Bug DBE-13551 Inspector expect NEEST instead of NEST
Bug DBE-13458 Clickhouse asof and semi join support
Bug DBE-12682 clickhouse dialect don't support EXCEPT and REPLACE in select query
Bug DBE-12343 ClickHouse toDecimalN could not take such arguments false positive
Bug DBE-13280 Queries with CTE do not work against ClickHouse when sql is multiline or not wrapped in brackets and join syntax highliting
Bug DBE-12304 Clickhouse correct SQL query shows an error in editor
Bug DBE-13058 BigQuery: support BIGNUMERIC/BIGDECIMAL
Bug DBE-3804 Oracle SQL: Existing synonym marked as unresolvable
Bug DBE-3759 SQL inspection: "column should be in group by clause" inspection doesn't work at PostgreSQL, db2 and Derby
Bug DBE-13364 Not working inspection
Bug DBE-12960 Oracle SQL*Plus dialect does not support "create blockchain table" command in DB 19c (19.10.0) or 21c
Bug DBE-12548 Some CTEs are not supported in ClickHouse
Bug DBE-12059 CREATE\DROP\ALTER INDEX in SQL2016 are not supported
Bug DBE-12838 The Exasol IGNORE NULLS Option for Analytics Functions is not recognized
Bug DBE-10550 Aliased table names are highlighted as missing or invalid
Bug DBE-13401 ERROR: syntax error at end of input when running multiline default privileges statement
Bug DBE-13084 Add support for [update|drop histogram on] statements for MySQL dialect
Bug DBE-1632 PostgreSQL: Accessing subfields from function returning composite type
Bug DBE-11582 select auto_id,`rank` from mm0; rank is parsed as function instead of column
Bug DBE-12952 GROUP_CONCAT () does not accept LIMIT clause
Bug DBE-12955 Missing Functions in Snowflake Dialect for Datagrip
Bug DBE-9172 Inline/in-line PL/SQL Functions in SQL queries fail due to syntax-check
Bug DBE-12992 Fix dictionary and dictionary field references resolving for ClickHouse dialect
Bug DBE-13471 Support Full-Text Search capabilities of MS SQL Server 2016/2017/2019 / Azure SQL Database
Bug DBE-10782 Wrong coalesce inspection detects in ClickHouse Dialect
Feature DBE-13476 ClickHouse: support EXPLAIN/EXPLAIN PIPELINE statement syntax
Bug DBE-13477 Support Redshift recursive CTE syntax
Coding AssistanceBug DBE-13493 'Merge INSERT statements' only takes a few of the selected
ConnectivityUsability DBE-13181 Data Sources & Drivers > Advanced: Table not visible on MacOS 11.3
Usability DBE-10327 Database tool window does not appear after creating connection
Bug DBE-13468 Athena results in java.lang.NullPointerException
Data Editor/ViewerUsability DBE-12883 Rename 'Related Data' to 'Related Rows' in 'Go To' context menu
Bug DBE-13450 Invalid query to fetch first referenced row(ERROR: operator does not exist: integer = character varying)
Bug DBE-9814 Oracle DATE type values should not contain time 00:00:00
Bug DBE-13095 [YUGABYTE] [0A000] ERROR: System column with id -1 is not supported yet
Bug DBE-11744 Insert NULL in column of type enumeration results in error
Feature DBE-12547 Allow to set additive sorting by default (old title: Multiple column sorting no longer works)
Bug DBE-13078 No tooltip when hovering commit/rollback button in Database view
Bug DBE-11078 No schema name in 'Choose target' popup
Bug DBE-13236 Data is truncated when pasting on cell(s) in database view
Bug DBE-12679 Filter's inability to format date columns.
Feature DBE-1751 Add an "Open in console" button side by side with the "View Query"
Usability DBE-13055 DataGrip should display the time zone if the data type is one with time zone
Bug DBE-7109 Azure: Incorrect query for Jump to Editor action
Bug DBE-12716 Alt+F7 on binary primary key returns empty search result
Bug DBE-13130 Keymap conflict in database tool "add Row" <-> "set NULL"
Feature DBE-6383 CSV table editor: column names cannot be manipulated
Bug DBE-13522 columns header glitch in database tool window
Usability DBE-12545 Remember new ORDER BY field location on UI
Bug DBE-13361 Image Preview of Blob only showing text in query results
Data Import/ExportBug DBE-13449 Default exported file name doesn't use comment above query
Feature DBE-13448 export table data to the excel would lost precision for bigint field : 导出数据格式为bigint的数据到excel表格,数据精度丢失
Bug DBE-12683 Conversion failed timestamp -> smalldatetime when coping tables
Bug DBE-13328 Too big SQL query causes error when table is exported to Excel
Usability DBE-13259 Improve copy numeric data from SQLite due to dynamic types
Feature DBE-10368 Import CSV success message should contain the link to open the new table
Database ExplorerBug DBE-12745 Broken breadcrumbs
Usability DBE-13276 No way to create a data source from SQLite file using the context menu
Bug DBE-13532 Database view Object filter not working
Database MigrationsFeature DBE-12357 Additional option 'purge' in drop confirmation dialog for Oracle
Usability DBE-12800 Object migration popup default size is weird
Bug DBE-12652 MariaDB: invalid syntax for user creation with TLS Options
DiagramsFeature DBE-3541 Table comment in diagrams
Bug DBE-13264 UML Diagram notes are being lost on save
Explain PlanBug DBE-13473 Failed to explain execution plan while using ClickHouse
GeneralUsability DBE-13068 Add 'Shorten datasource and object names in tab titles' option to context menu of tab
Feature DBE-13111 Treat DataGrip projects like it's done in all other IDEs.
Bug DBE-13502 Impossible to assign a hotkey for Clone Row
Feature DBE-12094 Local history is absent for the source code editors
IntrospectionBug DBE-13443 Presto: "primary keys not supported SQLException" after force refresh
Bug DBE-4269 Postgres operators: introspect and code-generate the "commutator" clause
Bug DBE-9386 PG12 generated column DDL not valid
Bug DBE-13320 Connection Error: Must declare the scalar variable "@@servername". Catalog view 'fulltext_indexes' is not supported in this version.
Performance DBE-13427 Introspection queries needs to be optimized
Bug DBE-13425 Azure connection loses databases when refreshing a single database
Bug DBE-8546 DataGrip 2019.2. Not Recognize USING keyword in CREATE TABLE syntax (PostgreSQL 12)
Bug DBE-13355 There is no length for varchar index in mysql
Feature DBE-10580 Introspect Redshift external tables with nested elements
Bug DBE-13520 ClickHouse supports ddl comments while DataGrip not.
Navigation & SearchBug DBE-13272 Unable to see full name of objects in Favorites despite plenty of room in the Favorites window/panel
Usability DBE-10826 Target data source filter needs to chop long data source names
Bug DBE-9259 Can't map keyboard shortcuts to [Full-text Search...]
Usability DBE-13140 Can't open table data view from Favorites
Feature DBE-13363 CMD + up to explore database schema objects instead of new console opening
Query ConsoleCosmetics DBE-12897 Execute routine dialog looks ugly in default settings
Bug DBE-13634 Re-opening MongoDB console triggers NPE in JSItemPresentation.getFileName
RefactoringFeature DBE-13365 Intention for adding column to column list or GROUP BY clause
Bug DBE-12711 'Qualify identifier' is missed in ORDER BY
SQL GeneralBug DBE-13479 Oracle Formatter doesn't recognise OCI Unicode String Literal (U'String) syntax
SQL ResolveBug DBE-12619 [SQL Server] Unable to resolve security policy
Feature DBE-12263 Unable to resolve object type 'SimpleAggregateFunction' for Clickhouse DDL
Schema DiffBug DBE-13121 Unify primary key and unique index in diff view
Usability DBE-13277 Create an action point to execute migration script
No subsystemFeature WEB-45326 Chromium-based browsers Edge and Opera are assigned to non-Chrome family in "Settings → Tools → Web Browsers" window
Bug WEB-51406 Memory leak editing Vue 2.x Typescript SFC
Usability WEB-50871 Do not show less popular browsers by default in the browser editor widget
Feature WEB-51419 Web-types: show icons in documentation
Feature WEB-51613 Show tooltip advertising pressing save to reload built-in HTML preview
Bug WEB-49983 exception on opening Module Dependencies Diagram for Javascript/Typescript
Feature WEB-11949 simplify built-in web server document root configuration
Bug WEB-47995 IDE "Synchronizing files..." Indefinitely after installing dependencies in multi-package project
Bug WEB-50967 Popup with auto import suggestions shows 'Loading'
Bug WEB-51498 Don't add a path to folder in imports after webpack aliases
Bug WEB-51628 Convert to string template doesn't work in assignment context
Feature WEB-51150 Launching Microsoft Edge
Bug WEB-51616 Prepend relative path prefix to completion items
Feature WEB-51573 Show What's New in WebStorm after update
Bug WEB-50998 "js.namespace.index" seems to produce keys with quotes sometimes
Bug WEB-51576 Run/debug with docker-compose doesn't work with new targets api
Feature WEB-50989 Add 'Reload on Save' for the .php files opened on the built-in web server
Feature WEB-50133 Enable "Copy/Paste with imports" feature for "require"-s
Build toolsBug WEB-50500 Gulp tool window button on sidebar not available after phpStorm restart
Bug WEB-50622 Grunt tool window no longer persists between IntelliJ launches
CSSBug WEB-51099 Support all steps function keywords for "transition-timing-function"
Feature WEB-51071 text-decoration-thickness is marked as Unknown CSS property
Usability WEB-49798 Provide better name/description for "CSS | Invalid elements | Unresolved CSS Class" inspection
Bug WEB-49599 No completion of Tailwind classes if className value is dynamically evaluated
Feature WEB-48767 Support for Tailwind class names completion in styled-components
Bug WEB-50961 Add support for missing generic font families
Bug WEB-50930 Unknown pseudo selector 'file-selector-button'
DebuggerPerformance WEB-50909 Webstorm High Memory Usage Over Time (Suspected Memory Leak)
Bug WEB-35835 The debugger does not stop at any breakpoints in symlinked files when using `--preserve-symlinks` node option.
Bug WEB-44912 Debugging Vue.js + Typescript doesn't work
Usability WEB-50873 Broken default layout of JavaScript debug tool window
Usability WEB-50777 Inline value of an array with an empty string looks unusual in Debugger
Usability WEB-48157 Node.js 15+: Step Into enters "async_hooks" on debugging async/await functions
Task WEB-50869 Remove Firefox Remote debug configuration in WebStorm 2021.2
Bug WEB-51608 Reload Built-in Preview if it's already open
Cosmetics WEB-51183 Incorrect positioning of tabs in Debug tool window
Bug WEB-49821 Deno debug completely broken
Bug WEB-39786 Can't debug mocha tests via @vue/cli-service
Cosmetics WEB-51035 Unexpected filename in context menu items of run and debug
HTMLBug WEB-49670 Simultaneous tags editing breaks JSX tags editing when using multiple carets
Cosmetics WEB-50457 Use Obsolete instead of Deprecated in HTML inspections
JSONBug WEB-50759 JsonSchema: "deprecationMessage" not recognized when using "$ref" or "anyOf"
JavaScriptBug WEB-50052 No completion for commonJS module if the module is required in other files
Exception WEB-51366 Adding require import causes an exception: java.lang.Throwable: Threading assertion. psiFile
Bug WEB-51508 'Redundant await expression' doesn't handle function with non-promise result
Bug WEB-51289 Autosave of file every second (on typing) and crashing/freezing because of FLOW.exe
Bug WEB-50469 InvalidPathException while checking if file is included in .flowconfig when opening files with `:` in URL
Feature WEB-49120 creating arrow function could be a bit more simplified
Feature WEB-35266 Support TypeScript types in JSDoc
Bug WEB-51073 properties completion from `.d.ts` files doesn't work when using destructuring `require()`
Bug WEB-51273 Commonjs imports are inserted before other imports
Feature WEB-51179 [FR] Ctrl+Click on "break" could jump to the enclosing statement
Bug WEB-49102 PyCharm is not displaying class functions properly
Feature WEB-50734 Add Surround with Arrow Function
Feature WEB-50092 'require' is not reused when importing another element
Bug WEB-46919 JsDoc 3 Hashmaps are not supported for plain entries
Bug WEB-50897 live templates on keywords completion ignore semicolon termination preferences
Feature WEB-50653 Private brand checks
Bug WEB-50988 Function's property is not recognized when function returns result
Bug WEB-50638 i18n: Preferences/Settings: Languages & Frameworks: JavaScript: Libraries: hardcoded string in framework type
Bug WEB-49306 Generic type in suggest instead concrete
Feature WEB-19907 Guess parameter types from function calls
Feature WEB-48693 Auto imports for Common.js require statements
Bug WEB-50849 A function call is incorrectly marked as recursive in TS
Bug WEB-50729 Highlighting broken for jsx file
Bug WEB-50949 for-await-of doesn't unwrap promise type
Bug WEB-14267 Optional properties in @typedef declaration are not supported
Bug WEB-51311 Ctrl+Click on break inside switch statement jumps to the wrong place
Exception WEB-51350 auto-import useState causes exception
Feature WEB-51357 Autocomplete/highlighting/navigation broken when importing TypeScript file via a *.js suffix from a JavaScript file
Feature WEB-51278 provide support for regex flags indices `d`
Bug WEB-50461 JavaScript one-line if-else doesn't report syntax error on missing semicolon
Feature WEB-40986 Lodash ES6 imports
Bug WEB-50996 Copying imports from a type declaration should respect types of import in a file
Bug WEB-49131 No auto-import suggestions provided for lodash
Bug WEB-49054 No code completion in dynamic classNames in template strings after interpolation
Bug WEB-50029 Insert template string argument intention should be available after template string
Bug WEB-21852 Refactoring (renaming) a JSDoc type name does not rename all occurrences
Bug WEB-50816 Async function detection fails on changing order of JSX elements
Cosmetics WEB-51320 Update description for the ECMAScript 6 language level
Bug WEB-50951 JS+Flow, arrow function parameter inlined type fails to parse with a trailing comma
Bug WEB-49323 The type is shown incorrectly in the assignment
Bug WEB-50015 Incorrect javascript import path using aliases when working on WSL2
Bug WEB-50854 syntax error when using Flow $Diff type
JavaScript. FormatterBug WEB-32166 'Add semicolons on reformat' should add semicolons after TS interface members
JavaScript. FrameworksFeature WEB-26714 Add support for the classnames library when using React
Bug WEB-51353 'Unknown HTML tag' error for i18n tag
Bug WEB-49229 MDN documentation for tags in TSX is broken
Bug WEB-51335 Named slots shows 'Unrecognised Slot name'
Feature WEB-49740 [2020.3.2] ij_vue_uniform_indent setting ignored in .editorconfig for .vue files
Bug WEB-50538 Props values completion doesn't work when using component created with forwardRef()
Feature WEB-43748 input missing associated label error when using @angular/material
Feature WEB-48703 Rename both state value and function that updates it in React's `useState`
Bug WEB-51329 No documentation & resolve for the 'template' tag in .vue
Bug WEB-50851 Svelte: better imports support
Bug WEB-51338 Unknown events (@input, @focus)
Bug WEB-51339 Pattern info is shown in the Quick doc popup
JavaScript. InspectionsBug WEB-44319 JavaScript noinspection DuplicatedCode has no effect
Bug WEB-50378 False positive "The value assigned to 'x' is never used" inside async function
Bug WEB-50898 "Method expression is not of Function type" when accessing a prototype method using Symbol
Bug WEB-50520 Unreachable Case in Switch
Bug WEB-51312 Add details/examples to "Pointless statement or boolean expression" inspection description
Bug WEB-51274 "Mismatched query and update of collection" inspection not working correctly
JavaScript. RefactoringBug WEB-51370 Substring isn't removed from a function name when removing a state name
Bug WEB-51401 "Extract method" refactoring fails for switch statement ("multiple exit points" error)
Bug WEB-50557 Inlining destructured variable based off conditional selected object
Bug WEB-51511 "Make method static" breaks calls to private methods
LintersUsability WEB-47440 Show quick fixes from the IDE inspections above quick fixes related to linters
Feature WEB-51288 Update bundled JSHint to 2.13
Bug WEB-49805 ESLint: no error highlighting for GraphQL
Live EditBug WEB-51423 Live reload stop working (Throwable: Timeout on waiting for client)
Node.jsBug WEB-51783 NPM script run configuration is wrongly marked as invalid if node & npm are taken from WSL2
Usability WEB-51119 Hide V8 Profiling from the menu Tools
Bug WEB-50591 Hovering over dependency in package.json does not show latest version until you hover over the package again
Bug WEB-51389 Use https to fetch npm package versions
Bug WEB-51514 Can't start TypeScript service with remote node interpreter
Bug WEB-51515 Prettier hangs on the first run when remote node interpreter is configured
Bug WEB-51516 Stylelint doesn't work with remote node interpreter
Bug WEB-51500 NPM install fails with StackOverflowError exception
Bug WEB-50526 Installed prereleased version does not match the version range '*' in package.json
Bug WEB-47462 WebStorm does not use selected WSL Node for Git operations
Feature WEB-36709 Autocomplete in package.json should respect configured npm registry
Feature WEB-46834 On completion show only names and hide values of variables stored in .env
Exception WEB-51391 Exception while creating React template project
Exception WEB-51314 NPE while updating path to npm package
Performance WEB-51565 Linked packages under @types are indexed always
Bug WEB-51242 Add 'serve' and 'lint' to the completion in the 'scripts' section in package.json
SASSFeature WEB-51021 Support Sass/SCSS math.div
TypeScriptTask WEB-51690 Update bundled TypeScript to 4.3
Bug WEB-50975 Typescript 4.3: Allow override as parameter property
Bug WEB-48764 React + typescript, React class component with generic type raise expected syntax error
Task WEB-50611 Improve "Infer parameter types from usages" intention
Bug WEB-51392 Update tsconfig.json schema to include ES2021 target.
Feature WEB-51449 Add tsconfig.test.json to the list of associated file names for TypeScript Configuration Files
Feature WEB-43845 no action for convert `import = require` to `import from`
Unit TestsBug WEB-51076 RuntimeExceptionWithAttachments: Can't run Karma with coverage
  • No labels