Child pages
  • GoLand 181.5540.46 Release Notes
Skip to end of metadata
Go to start of metadata
Go DocumentationBugGO-5598Full paths are shown in tooltips for structures
Go EditingFeatureGO-4845Add .sort postfix completion
Go GeneralFeatureGO-5889Add Test options to Generate pop-up
BugGO-6466Sort content of Go module dependencies alphabetically
BugGO-6449Goland's terminal $PATH hacking is incompatible with fish shell
No subsystemFeatureGO-6309Support HTML for Dependency Diagrams
BugGO-6322Plugin supporting feature (Run Configuration[Go Application]) is currently disabled
BugGO-3939External Tool using incorrect GOPATH
No subsystemFeatureIDEA-177345Find in Path: make "Show filter popup" hotkey customizible in Keymap
FeatureIDEA-132487External annotations for java third party libraries
FeatureIDEA-74666Add Eclipse Style Paren/Bracket/Quote Completiton
FeatureIDEA-196706Multithread model for new SE
FeatureIDEA-188431Better completion variants in Stream::toArray() method
FeatureIDEA-142157"Dump Threads" action in Run panel should open dump view
FeatureIDEA-186244Analyse Stack Trace does not understand jstack -F traces
FeatureIDEA-187979 IJ Internal Statistics: FUSUsagesTrigger for application usages collectors
FeatureIDEA-192898I want to provide searchable options from plugin to allow searching plugin settings in the settings dialogue.
FeatureIDEA-198897Parameter hints: Smart argument completion should insert comma if selected signature has more arguments
FeatureIDEA-68324Add Cmd+1,2,3,4 for selecting tabs like in Chrome, Safari, Firefox
FeatureIDEA-98563Run Configurations: provide a default option for 'Single instance only' setting under Defaults node.
FeatureIDEA-127245Open all files from favorites list
FeatureIDEA-124703Internal "task manager" to see how plugins/features are consuming memory/cpu
FeatureIDEA-138797Prevent double click from maximizing tabs
FeatureIDEA-194897MacBook touch bar: add "Add configuration" button in Run/Debug configuration dialog
FeatureIDEA-190682Support multi ip hosts in client-api RpcUtils
FeatureIDEA-188135Don't report always true asserts: support expression parts; support assertion methods
BugIDEA-113988Instance method call color cant be changed
BugIDEA-188452Define context in Live templates. Context can be selected only after second click on it
BugIDEA-197994Yaml: unnecessary indentation inserted after completion of mapping node key value
BugIDEA-189153Find usages history keeps reference to PSI via computable icon
BugIDEA-201667Soft-Wrap works incorrectly with Inlays
BugIDEA-199063"Remove BOM" will destroy file, which has a "UTF-32 LE" encoding (where the BOM is mandatory)
BugIDEA-204044move clashes with resize in custom decorated mode
BugIDEA-191258Out of memory on opening/reading SVG file.
BugIDEA-191067[win] navigating git log up/down leaves artifacts
BugIDEA-191068After restarted, manually arranged layout jump back to default
BugIDEA-203310Memory leak detected VirtualFilePointerManagerImpl, ConsoleViewImpl
BugIDEA-194169New SE: Keyboard shortcut settings
BugIDEA-204455Breadcrumbs: breadcrumbs still shown after turning them off
BugIDEA-203108fix for RUBY-19897 fails with JFX10
BugIDEA-197011Sibling Inherited Methods Provider should have an option in File | Settings | Editor | General | Gutter Icons
BugIDEA-187611Support custom icons for NamedScope to use it in the Project toolwindow
BugIDEA-187182 Project encoding wrong after first opening of a solution
BugIDEA-191450Idea hangs trying to investigate data flow from a `project` parameter of PsiBuilderImpl
BugIDEA-186750Indent guides often disappear
BugIDEA-182675Find/Replace toolbar in Code Editor: "Paste" into find/replace fields trims a text
BugIDEA-201820UI concurrent creation
BugIDEA-177327AltGr special characters don't work under Windows 10, instead hotkeys for Ctrl+Alt are initiated
BugIDEA-203161SOE at ThreeComponentsSplitter.visibleDividersCount() on attempt to open Run tool window in certain Gradle-based projects
BugIDEA-185161ShelveChangesManager must be PersistentStateComponent
BugIDEA-202565Creating live template containing annotation with value generates code with syntax error
BugIDEA-193180Selecting 'Always show FN-keys at Touch Bar' blows IntelliJ into a billion pieces
BugIDEA-192963Touch Bar does not preserve windows added
BugIDEA-192359Project Files view in CLion shows two folders as one folder named “A/B” when A doesn't have other content
BugIDEA-188262Elements with the same content are underlined when only one of them is selected by mouse
BugIDEA-197458IDEA UI complete freeze: "GotoActionModel" creates Swing components on pooled thread and causes deadlock with EDT
BugIDEA-190868Go plugin: renaming function does not update function name in project tree
BugIDEA-204163Don't suggest `P` and `B` live templates in all Kotlin contexts
BugIDEA-189737UML diagram titles are broken
BugIDEA-59397When caret is outside visible editor area, on Alt-Enter pressing intention bulb appears outside the editor frame
BugIDEA-197661Tooltip appears on a collapsed code block
BugIDEA-202064"Scanning files to index" process is running on project reopening
BugIDEA-188519Actions that do not show popup because of dumb mode fail typeahead
BugIDEA-201797Since IntelliJ 2018.3, Resource Compiler fails on symbolic links:java.nio.file.AccessDeniedException
BugIDEA-188895Provide API for custom activity providers
BugIDEA-204946File templates: File Template Variables aren't parsed in includes
BugIDEA-200322Project explorer empty
BugIDEA-198785When Plugins dialog is opened using FindAction, attempt to search in it returns empty result always
BugIDEA-199785CloudSettings plugin doesn't work with fresh versions of IDE
BugIDEA-197960No completion for Yaml file if caret behind ':'
BugIDEA-196173Recent files + Navigate to file interaction broken
BugIDEA-199646Input dialog should be displayed only when there is $Prompt$ in run configuration arguments
BugIDEA-190432NGramEnumeratingService causes Deadlock
BugIDEA-202994DiffUserDataKeys.GO_TO_SOURCE_DISABLE property is ignored in OpenInEditorAction
BugIDEA-204173"Settings | Scopes" - "Expand" action doesn't work for ill-formatted strings
BugIDEA-193863exceptions when deleted some .xmls
BugIDEA-199415UIDefaults completion inside IntelliJ theme files
BugIDEA-73793PyCharm will freeze when opening certain files and switching to another app
BugIDEA-188724Some keyboard shortcuts are not working after pressing ctrl+shift+F/R in terminal
BugIDEA-202080UI components are not shown in some RC
BugIDEA-201286Linux Native Menu bar: the order of actions in menu can change unexpectedly
BugIDEA-204674The logs' arhive file name is too generic
BugIDEA-200366No way to configure Run Configuration Templates for a new projects in non-IDEA IDEs
BugIDEA-199433Speed search on test is broken
BugIDEA-121111Maven and SBT projects are opened as plain directories
BugIDEA-156074"Cannot redo. Unexpected document state" when undoing then redoing in IntelliJ IDEA 2016.2
BugIDEA-185805Reset Default Scheme removes duplicated Scheme
BugIDEA-194273NullPointerException on finding RemoteDesktopService
BugIDEA-202979intellij idea 2018.3 does not finish scanning files to index
BugIDEA-198853Add description for `IntelliJ Configuration Script` plugin
BugIDEA-188661upgrade batik to 1.9
BugIDEA-188666[batik] missing of width/height rect attribute breaks transcoding
BugIDEA-190535Cannot revert trailed space from diff window
BugIDEA-76438Directory diff: can't resize the columns
BugIDEA-185249modal dialog and <Enter> triggers search
BugIDEA-198043NoClassDefFoundError: Could not initialize class com.intellij.profiler.ultimate.async.UtilsKt exception on project creating
BugIDEA-197863JSON scheme: yaml completion - always insert ": " after completing property name
BugIDEA-202381Missed splitter in navigation bar
BugIDEA-201312Recompilation of several modules: compiler caches and output files are out-of-sync if compilation does not complete normally
BugIDEA-193747Clicking Help | Register does nothing in a Toolbox-installed PhpStorm
BugIDEA-192243Diff Window: Browsing through files by keyboard stopps working when an image cannot be loaded.
BugIDEA-192799Winp exception in the log
BugIDEA-182889Shortcut conflict: Rerun & Refresh
BugIDEA-185285Navigate Class/File/Symbol, Find in Path popup windows don't pick characters from input method
BugIDEA-191897Broken SystemInfo.isGNOME on Ubuntu 18.04
BugIDEA-190112Cannot update to new EAP
BugIDEA-187609NPE in sheets when project does not exist
BugIDEA-127997Gutter changed lines regions not shown when the changed lines are "folded"
BugIDEA-201376IntelliJ IDEA 2018.2.4: Mocha 5.2.0 with Node 10.12.0 does not work, only output when trying to run test: Test Framework quit unexpectedly
BugIDEA-186977NullPointerException appears on Welcome screen after typing
BugIDEA-148298File name match regression in version 10
BugIDEA-130726Configure global external annotations
BugIDEA-194901MacBook touch bar: welcome screen bugs
BugIDEA-161033Navigate to Type Declaration -- Opens a new window
BugIDEA-181678Fix colors on tip of the day welcome screen
BugIDEA-189873Run Dashboard: Del pressing in the Find box in console deletes the current run configuration
BugIDEA-201003Huge freeze while "navigate to test data"
BugIDEA-202296EditorConfig-related actions in the status bar: on the first attempt only one action is shown
BugIDEA-192991WS doesn't keep tab positions on newlines in yml files when switching windows
BugIDEA-191955Focus is lost during typing
BugIDEA-123363Default project language level is ignored if project is created from template
BugIDEA-192102Remove close icon from Analyze Stack Trace tab toolbar
BugIDEA-198289make selecting node in NodeDescriptor-based AsyncTreeModel -ed tree less than quadratic (on tree depth)
BugIDEA-204505Plugin Settings: Custom plugin icons are not scaled on HiDPI Linux
BugIDEA-194670Memory leak in DocumentationManager
BugIDEA-84220CTRL-F5 shortcut doesn't work in Hierarchy view
BugIDEA-201279ctrl-p ctrl-n not working as expected in Webstorm 2018.3 EAP OSX
BugIDEA-147781ColorChooser: Opacity changing doesn't affect the results
BugIDEA-198611Failed to save setting when install CLion from scratch
BugIDEA-193340Batik 1.10 breaks Xerces 2.11.0 dependencies
BugIDEA-193835IDEA starts with error Could not initialize class com.intellij.internal.statistic.eventLog.FeatureUsageLogger
BugIDEA-198409Seems AsyncTreeModel delays showing node until its children are found
BugIDEA-194890MacBook touch bar: More items button does not work in Run/Debug configurations dialog
BugIDEA-199869"Scope" dialog's "path" section cannot be made any smaller
BugIDEA-172173Completion Stats -> factor with null values are ignored during dump
BugIDEA-204321Rider EAP not keeping terminal configuration
BugIDEA-201291Linux Native menu bar: if 'windows-style' menu (i.e. located on the window title bar) is used, menu can't be used in the Full Screen mode
BugIDEA-194201On switching JDK in run configuration, 'class not found' warning is displayed for main class
BugIDEA-125327"Surround with try/catch" code generation seems to not respect final modifier settings
BugIDEA-197869[Copyright Profiles] The hour24 property for the $file.lastModified object isn't interpreted in comments
BugIDEA-149084Spring Boot: completion in .yml files: incorrect results on inserting property if one with same prefix exists
BugIDEA-194877Search windows should sort results with closest match on top
BugIDEA-202396IDE switches to wrong tab when dragging tab to different window
BugIDEA-195058changelist rendering is blocked by some semistuporous locks
BugIDEA-200822Opening any Markdown file freezes recent IntelliJ Ultimate EAP 183.3795.13
BugIDEA-198829Can't open any files in the editor in master
BugIDEA-176405JShell: PsiReferenceExpressionImpl cannot be cast to com.intellij.psi.PsiCodeBlock
BugIDEA-188308Custom console font line spacing is not remembered
BugIDEA-186858Scrollbars not visible in Run and Debug output - can't scroll
BugIDEA-193544100% CPU When Memory View (Debugger tool window) is visible
BugIDEA-189011Go to class popup does not fit the screen
BugIDEA-192410Find usages doesn't stop searching on tool windows tab closed
BugIDEA-200619Maximized window state is not preserved
BugIDEA-189461Stop all StackOverflowError
BugIDEA-202374Cannot open files after import setting from previous release
BugIDEA-200840Exception appears for opened comment after TODO
BugIDEA-201729IntelliJ EAP keeps indexing the same files over and over
BugIDEA-201580Infinite logging loop on IDEA shutdown if there's an exception during IDE close
BugIDEA-192579Breakpoints may lose urls
BugIDEA-187695Idea logging from the "Periodic tasks thread" leads to a deadlock
BugIDEA-202134Wrong location of a magnifier icon in Light theme on Mac
BugIDEA-203356Junit tests should not be marked as ignored when assertion in @AfterClass fails
PerformanceIDEA-196408Idea 2018.2 freezes while typing if bookmark is set in library (decompiled) class
PerformanceIDEA-190794Significant (≥30 sec) UI freeze after directory copy/move
PerformanceIDEA-190829UI freeze during Gradle build
PerformanceIDEA-195495Slow external project configuration changes tracking
PerformanceIDEA-198819"Show affected tests" shouldn't traverse PSI in EDT
PerformanceIDEA-194547LossyEncodingInspection allocate a lot of objects on heap
PerformanceIDEA-200469Should we really convert code style settings into XML just for damage checking?
PerformanceIDEA-172762ProjectRootManagerComponent$1.fileTypesChanged on AWT causes 30-60s freeze
UsabilityIDEA-179037Last Edit Location List: edits performed in the diff window are not appended to the list
UsabilityIDEA-202024Rename "View / Expression Type" to "View / Type"
UsabilityIDEA-192611Debug test is harder to invoke via Alt+Enter menu
UsabilityIDEA-186631Confirmation dialog text is trimmed and does not expand when the window is resized
UsabilityIDEA-165834Export settings to .zip by default
UsabilityIDEA-84622Default "Open directory/project" path and better navigation
UsabilityIDEA-194132Hide JSON widget for Spring Boot YAML configuration files
UsabilityIDEA-204836Nested class/method navigation breadcrumb trail off by one
UsabilityIDEA-160977Not all similar threads are merged
UsabilityIDEA-155709IDE Fatal Errors dialog could show the installed plugin version when blames a plugin
UsabilityIDEA-201792Ability to edit Run Configuration Templates when a project is opened
UsabilityIDEA-188401Parameters info tooltip disappears on switching method overloads
UsabilityIDEA-187112UML diagrams: use editor background color for UML tab background on darcula
UsabilityIDEA-108586Launcher: can't open a project by relative path
UsabilityIDEA-191596Only one gutter intention is visible
UsabilityIDEA-201862Hide inapplicable executors on the external system tool window run config context menu
UsabilityIDEA-200263[Run anything] Window can be resized too small
UsabilityIDEA-186172The "Find in Path" dialog box is always on top
UsabilityIDEA-188960pseudo-tooltip very annoying issue
UsabilityIDEA-161842Key Mapping: Ctrl-Y not assigned to "Redo" is problematic
CosmeticsIDEA-201465Improve display for long string in Ctrl+hover tooltips
CosmeticsIDEA-187402When compressing CPU profile, progress bar in status line says "compressing memory snapshot"
CosmeticsIDEA-204514Some spaces between file names in logs would be really nice
CosmeticsIDEA-188297$FILE$ placeholder is 'unknown' when printing console output
CosmeticsIDEA-194905MacBook touch bar: use buttons with labels instead of icons in Diff dialog
CosmeticsIDEA-194902MacBook touch bar: debugger improvments
CosmeticsIDEA-198288[Run Anything] Incorrect tooltip for the icon in the navigation bar
CosmeticsIDEA-203127Rename "Settings Summary" to "Collect Troubleshooting Information"
CosmeticsIDEA-201610Popup "Current indent options are overridden by .editorconfig" is shown on every project opening
CosmeticsIDEA-194896MacBook touch bar: use close icon instead of close button
CosmeticsIDEA-194893MacBook touch bar: improve Configurations popover
CosmeticsIDEA-168874New 'Find in Path' dialog hard to read
CosmeticsIDEA-201114Plugins: do not show "Show All" link if all plugins in the group are already shown
CosmeticsIDEA-190325"Indexing paused due to &Revert"
TaskIDEA-195201Plugins: number of plugins on trending page
TaskIDEA-189365Get rid of Snappy library
TaskIDEA-189348rework the patfrom error popup according to the new UI
TaskIDEA-194110Turn on Run Anything action in IDEA
TaskIDEA-187791Make JButtons colorable
TaskIDEA-203680Invalidate external projects imported data on 'Invalidate Caches' action
TaskIDEA-185056Remove pin icon from quick navigate tooltip
TaskIDEA-202382Update spy-js icons
TaskIDEA-197845Increment year in license file
TaskIDEA-195193Plugins: implement search
TaskIDEA-186044Rework validation error popup from lightweight to heavyweight
TaskIDEA-196883Run anything: allow to provide completions variants based on the user input
TaskIDEA-180939Allow read-only mode for ExpandableTextField
Auto-reported ExceptionIDEA-191293NPE in TrackingPathMacroSubstitutorImpl.invalidateUnknownMacros
ExceptionIDEA-202313Exception appears on Compress Logs and Show in Explorer menu item
ExceptionIDEA-194957NPE on closing Project in IntelliJ IDEA
ExceptionIDEA-185991Code analysis in "Commit Changes" dialog fails for php formatter
ExceptionIDEA-187858NPE on search in settings if nothing was found
ExceptionIDEA-195911NPE: SearchEverywhereManagerImpl
ExceptionIDEA-195973NPE at com.github.markusbernhardt.proxy.selector.pac.PacProxySelector.findProxy
ExceptionIDEA-199439ISE at com.intellij.ide.hierarchy.HierarchyBrowserBaseEx.$$$reportNull$$$0
ExceptionIDEA-202454PluginManager - mixer IllegalArgumentException: mixer[0..1] is 2.0
ExceptionIDEA-188163BUG | latest EAP Idea ultimate | HttpVirtualFileImpl cannot be cast
ExceptionIDEA-193478cannot share data context between Swing events; initial event count = 4939619; current event count = 4943502
ExceptionIDEA-192088Exception when starting IntelliJ
ExceptionIDEA-199921com.intellij.util.Alarm - Assertion failed: Already disposed
ExceptionIDEA-199679AE at com.intellij.ide.plugins.newui.RestartButton.lambda$null$0
ExceptionIDEA-141213IllegalStateException: This function should be called while holding treeLock at java.awt.Component.checkTreeLock
ExceptionIDEA-194581NPE at com.intellij.psi.util.PsiUtilBase.findEditor
ExceptionIDEA-200374Throwable at com.intellij.openapi.wm.impl.GlobalMenuLinux.lambda$handleEvent$4
ExceptionIDEA-149660IAE at com.intellij.configurationStore.StateStorageManagerImpl.expandMacro
ExceptionIDEA-195827AssertionError caused by ReadAction on already disposed project
ExceptionIDEA-199825IllegalArgumentException on 'Force Step Into'
ArquillianBugIDEA-143282JBoss Arquillian + IPR project format: IAE at StateStorageManagerImpl.expandMacros()
Code Analysis. DuplicatesFeatureIDEA-181304Highlight duplicated branches in 'switch-case' statement
FeatureIDEA-198256Show diff preview in inspection results for duplicate code inspection
Code Analysis. InspectionFeatureIDEA-49092Inspection profiles: provide possibility to create a scope from inspections dialog
FeatureIDEA-121571Feature request: A Contract Annotation that indicates that a method returns its argument
FeatureIDEA-173248Thread-blocking (I/O) calls detection
FeatureIDEA-175780Reactor inspection: unassigned Flux/Mono instance
FeatureIDEA-175784Reactor inspection: do not call blocking operators within a non-blocking scope
FeatureIDEA-151197Apply (partial) "Redundant suppression" in the editor
FeatureIDEA-194409Need way to map inspection class name to the inspection in the inspection configuration ui
FeatureIDEA-197174Nullable inspection control flow with Objects.toString check enhancement
FeatureIDEA-129836"Run inspection by name" popup: allow access to full inspection description
FeatureIDEA-142026Add inspection for Math.min(a, a) and Math.max(a,a)
BugIDEA-204414Exporting inspections results as HTML doesn't produce output
BugIDEA-157566NPE at applying quickfix 'Comment out' to unused class
BugIDEA-152262Don't report warning "private field is never assigned" for fields assigned via java.util.concurrent.atomic.Atomic*FieldUpdater
BugIDEA-200207InconsistentLineSeparators false positives on regexp values that have line-end values
BugIDEA-196200"Generate 'clone()' method which always throws exception" throws exception
BugIDEA-55886Wrong inspection and auto-fix for Arrays.asList
BugIDEA-198686Optional.get() without isPresent() on second nonemptylist.stream().min().get() or .max.get()
BugIDEA-181933Single regex pattern replace to illegal and not equivalent to character class
BugIDEA-194855False positive "Blocking operator in non-blocking scope" for a Flux
BugIDEA-203538Cannot export results of single inspection run to XML
BugIDEA-27535Inspection, erroneous field "can be final"
BugIDEA-203067InspectionElement should be public/otherwise usable, or GotoInspectionModel should not be public
BugIDEA-204984Inspect Code hangs for single java file
BugIDEA-201595All problems in file disappear from "Inspection Results" after applying a single fix
BugIDEA-200236False positive: 'Redundant Suppression' warns for foreign suppressions
BugIDEA-89120AccessToStaticFieldLockedOnInstance inspection incorrectly fires on final threadsafe fields
BugIDEA-86833web.xml inspection for assignable to javax.servlet.Servlet is wrong
BugIDEA-197029Cannot delete `javax.validation.constraints.NotNull` from list of constraints to consider
BugIDEA-187749JSP default package inspection incorrectly displays an error for array types.
BugIDEA-99444IDEA condisers class used when it's not
BugIDEA-144891Good code is red: "Magic Constant" with Calendar.get()
BugIDEA-201236Import of inspection results could not parse method name when it has parameter type
BugIDEA-190445Inspection result toolwindow - after excluding some issue cursor disappears
BugIDEA-194226Reset inspection options in Settings isn't saved
BugIDEA-204111Run inspection by name produces empty view
BugIDEA-189769Analyze data flow from here should be available on interface members
BugIDEA-203922Ctrl+Alt+Up in inspection results moves to the next result, rather than previous
BugIDEA-192189"Settings" button disabled in inspections result if focus is in editor
BugIDEA-200142Deadlock in Inspection tree view
BugIDEA-202177Error during injected code cleanup
BugIDEA-71133Annotation method is incorrectly reported as unused when used in a same file where annotation declared
BugIDEA-194381Resolved inspection items deleted though 'Filter resolved items' disabled.
BugIDEA-199808redundant suppression: support for merged tools
PerformanceIDEA-199413Too much CPU time spent in UnnecessaryModuleDependencyAnnotator.onInitialize(RefElement) when opening offline inspection result
PerformanceIDEA-204287LocalInspectionTool.isValidID should precompile regular expression
UsabilityIDEA-194541Remove close button from inspection result toolwindow toolbar
UsabilityIDEA-192387Not possible to kill inspection quick fix
UsabilityIDEA-97605Serializable/Deserializable/Cloneable class in secure context inspections shall have an option to ignore some class hierarchies
UsabilityIDEA-204371Remember "Group by severity" setting in inspection results
UsabilityIDEA-189380Inspections restore defaults menu option
UsabilityIDEA-204733Troubles massively apply fix to all found warnings
UsabilityIDEA-201800Progress Bar Doesn't Move in Batch Suppress For Statement
CosmeticsIDEA-139756Grammar error in inspection "Managed Bean Inconsistency errors"
CosmeticsIDEA-188219"Suppress" button is small
TaskIDEA-196712Publish existing external annotations from IDEA project to Maven repository
TaskIDEA-77381NonSerializableFieldInSerializableClass should check whether all possible values of final field are serializable
ExceptionIDEA-194975Offline Inspection fails with HeadlessException presumably because EAP version is expired
ExceptionIDEA-188838Keyboard navigation in Inspection Results throws IndexOutOfBoundsException
ExceptionIDEA-190303NPE during JSP code analysis/inspection
ExceptionIDEA-203498com.intellij.analysis.AnalysisScope$2.visitFileEx(AnalysisScope.java:248): Read access is allowed from event dispatch thread or inside read-action only
Code CoverageFeatureIDEA-102075Update code coverage results to include branch coverage column
FeatureIDEA-191726Update JaCoCo to support Java 10
BugIDEA-201686IDEA sometimes hangs when clicking on gutter with coverage information
BugIDEA-190928Annotation NotNull changes behaviour of code coverage
BugIDEA-199411Update JaCoCo to support Java 11
BugIDEA-191734Generated report doesn't contain branch coverage
BugIDEA-200258Coverage tool window: Autoscroll from Source does not work on 1st test execution
BugIDEA-197615Test with coverage suddenly reports "No coverage in 'all classes in scope'"
BugIDEA-154416Shortcuts for "next uncovered" or "next fully covered" work only once.
BugIDEA-184699Code coverage Report includes excluded packages
BugIDEA-190499Run with Coverage: Error occurred during initialization of VM
BugIDEA-179136Code Coverage: "Edit Coverage Colors" action could expand the tree of colors to the corresponding line coverage color
UsabilityIDEA-192287Show full package name at coverage view
UsabilityIDEA-179798Coverage view column size is not helpful and user setting is not remembered
UsabilityIDEA-194483Coverage file is not monitored
CosmeticsIDEA-200520What is the meaning of a checkbox with "include/exclude" title?
ExceptionIDEA-199696Code coverage not working in IntelliJ 2018 running on JDK11
ExceptionIDEA-193071Throwable at com.intellij.openapi.application.impl.ApplicationImpl.assertReadAccessAllowed
Code Formatting and Code StyleFeatureIDEA-98499Allow staticly imported class members to have a different style than other constants
FeatureIDEA-162495Add Java Code Style setting for Spaces -> Within -> Enum braces
FeatureIDEA-151870feature request: code style option to put a semicolon on a line after the last comma of an enum
FeatureIDEA-57898add an option to force a blank line before the end of the class
FeatureIDEA-152088Java Code Style. Add option to not line wrap on import statements
FeatureIDEA-62161Multiline TODO matchers would be nice
FeatureIDEA-155090File level indentation change
FeatureIDEA-149529Code Style settings export options
BugIDEA-191843"Adjust code style settings" adds additional chars
BugIDEA-127949"Names count to use static import with '*'" setting off by one
BugIDEA-153628`Enter` after operator in binary expression should place caret on correctly indented place
BugIDEA-180049New line after javadoc block in enum.
BugIDEA-197819Imported code-style-xml scheme is not applied to unclicked tabs
BugIDEA-98552for() statement: Place ')' on new line → "incorrect" alignment
BugIDEA-167766'Detect and use existing line indents' not applied when reformatting selection of js file
BugIDEA-67968Formatter Ignores Empty Space
BugIDEA-186983NullPointerException at saving changed code folding settings
BugIDEA-197964Line shifting by partly reformat action
BugIDEA-183296Wildcard import for specific packages
BugIDEA-152798Names count to use static import with '*' doesn't work as expected
BugIDEA-175560Right parenthesis (rparen) on new line is not indented properly
BugIDEA-174605Blank Lines for enum doesn't work properly
BugIDEA-115696Incorrect continuation indentation after string concatenation
BugIDEA-190114Impossible to configure Java code style for enums that uses spaces within enum constant definition braces
BugIDEA-130575Java code style enum wrapping "wrap always" warps also end-of-line comments
BugIDEA-145538Code reformatting forces a space before the colon symbol in a Java foreach statement
BugIDEA-110902File reformatting breaks javadoc @link
BugIDEA-163103Wrong static imports order
BugIDEA-153768JavaDoc formatting for <p> on empty lines creates invalid HTML
BugIDEA-200800Configure indents action from the status bar should open JS code style for JS/JSX files
BugIDEA-21623Formatter does not respect <pre> tags with attributes
BugIDEA-166202<pre> tags in Javadoc should not be wrapped
BugIDEA-203775NPE on opening unified diff view when Upsource Integration plugin is enabled
BugIDEA-190462Code format changes ignored (Velocity)
BugIDEA-158493Code formatter adds empty strings when breaking up too long string literal.
BugIDEA-187535Incorrect indent after Enter after a nested code block
BugIDEA-180882Code formatting doesn't remove invalid/empty Javadoc tags
BugIDEA-200800Configure indents action from the status bar should open JS code style for JS/JSX files
BugIDEA-189746Backwards compatibility issue for import/export Code Style?
BugIDEA-175161Javadoc formatter joins lines incorrectly
BugIDEA-204185Code Generation settings are not being saved
BugIDEA-163459Arrangement has different sorting based on anoymous inner class methods
BugIDEA-189059Line indent provider put caret to wrong position
PerformanceIDEA-200803AWT EventQueue uses 100% CPU in idle when using EditorConfig
Code NavigationFeatureIDEA-188351Allow to Navigate to a class within a specified package.
FeatureIDEA-200584Goto symbol should allow to navigate to method overrides
FeatureIDEA-189093Implement Go To Declaration and Go To Implementation for Java 10 var
FeatureIDEA-44323Go to Symbol could handle the results of "copy reference" (eg: com.apptio.biit.server.GraphicsProxyHttpServlet#doGet)
BugIDEA-202922Navigate | File results are not sorted by proximity
BugIDEA-188178Exception when "//" is typed in the "Navigate to file" popup
BugIDEA-190108IDEA is unable to find interface implementation
BugIDEA-197278New SE: Increase search field font
BugIDEA-177179Navigate | Class... - navigation by a method reference navigates to the class declaration
BugIDEA-196545New "Go to" popup GUI: calling "Go to Class" while indexing silently shows empty list
BugIDEA-190713Navigate Back action works incorrectly after navigate to class
BugIDEA-193708Navigate from enum constant to enum class if no enum constructor is available
BugIDEA-198344Editor back navigation not working as expected in TDD workflow
BugIDEA-200567Recent edited files popup shows files from another project
BugIDEA-200980Navigate / Last Edit Location opens Editor Pane in wrong IDEA instance window
BugIDEA-200312UI freeze during Search Everywhere
BugIDEA-194408Exception in 3rd party plugin breaks core functionality
BugIDEA-165452Recent files should preselect first item if no editor is open in tabless mode
BugIDEA-199006Export Type Hierarchy to text file doesn't work
PerformanceIDEA-187744High CPU usage when idle, never stops
PerformanceIDEA-186086UastReferenceRegistrar should avoid converting elements if no pattern is registered for the respective element type
PerformanceIDEA-188959Calculate line marker tooltip in background thread
UsabilityIDEA-187037Provide ability to change name and presentation of 'Navigate | Class' aciton in IntelliJ-based IDEs
UsabilityIDEA-198811Quick search for classes (Ctrl-N) should prefer classes from the same module over classes in another module.
UsabilityIDEA-188686'File Path' action should work in dumb mode
ExceptionIDEA-190672IDEA lost all bookmarks
ExceptionIDEA-188549Show Bytecode is enabled for class/file item and causes NPE at ShowByteCodeAction$1.onSuccess()
Code. GenerateFeatureIDEA-194650Do not use 'Objects.equals' for generated equals/hashCode
BugIDEA-194722#macro does not work correctly in velocity templates for toString etc
BugIDEA-200057IntelliJ IDEA Ultimate 2018.2 toString() code generation uses super class private fields instead of getters
BugIDEA-200281Generete "Delegate Methods..." action doesn't respect already implemented method
BugIDEA-202062Code generation for equals will reference built-in java classes directly regardless of whether identically named user-defined classes are already in scope
BugIDEA-196896No code generation using 'implement methods' or 'override methods'
BugIDEA-192006Clicking Enter in the "Choose fields to initialize by constructor" dialog was interpreted as OK + new line in the editor
BugIDEA-201670Generating setter for final field
BugIDEA-203737Introduced method has wrong context
BugIDEA-198090Changes to velocity macro for generating equals/hashcode take effect only after restarting IDE
UsabilityIDEA-192185'Insert @Override' by default should be enabled in 'Generate toString()' dialog
ConsoleFeatureIDEA-164907Run Configuration console does not support "file:///" URL
BugIDEA-203105Colours messed up in npm output
BugIDEA-195938Unable to type TAB character in console
BugIDEA-188939Toggling soft wrap in the console folds previously unfolded text
BugIDEA-130302First line in console is folded when it is too big (and not command line)
BugIDEA-86669Console: support ASCII backspace symbol in console view
UsabilityIDEA-189608Handle possible misconfiguration of loopback interface in case of connection problems (connection timeouts)
Database (archived)BugIDEA-183999Ignore Unsubmitted Changes grammar error
BugIDEA-169402CSV files not associated with any file type
BugIDEA-201896Idea shows hidden files
UsabilityIDEA-177912Database. "Data Sources Detected". It should be possible to click on "Configure" link if the configuration was cancelled before.
CosmeticsIDEA-200581Hide "Scroll from Editor" button on Database tool window toolbar when autoscroll from editor enabled
ExceptionIDEA-194420Throwable at com.intellij.ide.actions.WeighingActionGroup.getAllChildren
DebuggerFeatureIDEA-186962Allow user defined Async annotations
FeatureIDEA-172018"Print stacktrace" breakpoint option
FeatureIDEA-168185Allow to attach to java processes started without debug agent (SAPIDAttachingConnector)
FeatureIDEA-202146Support switch statement in evaluate code block
FeatureIDEA-197758Attach to this process action
FeatureIDEA-194862Support project-specific async stack traces in remote configuration
FeatureIDEA-194359Support for for Async Stacktraces in Remote JVMs
FeatureIDEA-191508Breakpoint intentions
FeatureIDEA-139757Shortcut for removing all breakpoints
FeatureIDEA-153569Copy current thread stack trace
FeatureIDEA-181675Cross-project HotSwap
FeatureIDEA-186951Caller method filter
FeatureIDEA-202292Support asserts in evaluator
FeatureIDEA-197886Support attach to process for java 9+
FeatureIDEA-75946Provide graceful "Exit" action during the debugging session
FeatureIDEA-190644Delete breakpoint with a middle mouse button click
FeatureIDEA-196669Allow to automatically restart remote debug server configuration
FeatureIDEA-201942Do not use compiling evaluator for method references
FeatureIDEA-199822Create extension point to provide captured stack frames by e.g. evaluation expression in debugged jvm
BugIDEA-203825Deadlock in debugger
BugIDEA-196012Compiling evaluator does not rename variables
BugIDEA-187632Remove extra colon in breakpoint configuration
BugIDEA-203275Cast in evaluator does not fail when is should
BugIDEA-202606UnalignedAddressException during read only attach
BugIDEA-188759Attach To Java Process does not show all available Java Process that are started by Intellij.
BugIDEA-172425debugger under jdk9 throws NoClassDefFound
BugIDEA-195531Debug tool window causes segmentation fault in the JVM
BugIDEA-199513Attach to process (read only) does not work if it requires administrator privileges
BugIDEA-203144sa-jdwp: All object arrays contain only null values
BugIDEA-181303java.lang.IllegalArgumentException by org.jetbrains.org.objectweb.asm.ClassVisitor while running JUnit tests with latest EAP
BugIDEA-201227Unclear error reporting for sa-jdwp
BugIDEA-193400Duplicated async stacktrace
BugIDEA-190451Variable tree loses focus after "more items" is clicked.
BugIDEA-192962[Mute breakpoints] option is switched off on the debug session start
BugIDEA-191114Incorrect variables mapping inside foreach loops without debug info
BugIDEA-201267Color icon is not correct for JBColor objects
BugIDEA-192070Deadlock while debugging
BugIDEA-157897Leaking notifications from EventLog.ProjectTracker
BugIDEA-203021IllegalStateException from objectMirror
BugIDEA-186803Debugger frame view doesn't show recursion depth if "show package names" option is off
BugIDEA-202459Unable to evaluate virtual method ref
BugIDEA-187528Quick evaluate with lambdas broken
BugIDEA-94049Debugger: Return ability to set field watch point via alt+gutter click
BugIDEA-204693Argument boxing does not happen if type is not available
BugIDEA-204691Unable to cast primitive value to Object
BugIDEA-195335Incorrect rendering of partially visible lines in Debugger Variables window
BugIDEA-144955Add Field Watchpoint context menu is missing
BugIDEA-204672Unable to attach to OpenJ jdk
BugIDEA-1966462018.2 Unable to debug application server with async stacktrace instrumentating enabled
BugIDEA-199602Stepping into String constructor with debugger makes a string that is shown as empty in variables view
BugIDEA-202380Can't assign non-array value to an array in Expression Evaluation window
BugIDEA-159144Can't set breakpoint in lambda that is a field
BugIDEA-198704Debugger frames don't navigate to sources if they were added after session start
BugIDEA-184352java.io.FileNotFoundException
BugIDEA-190076Incorrect frame state after thread death
BugIDEA-189239Kotlin breakpoint prints 'evaluate and log' message twice
BugIDEA-202129.attach_pid files in the working dir
BugIDEA-199236JDWP: some debugger features incorrectly disabled when debugging android.
BugIDEA-187709Huge number of captureXXXX.props files created under C:\Users\Миша\AppData\Local\Temp.
BugIDEA-128518Map help buttons of the debugger settings
BugIDEA-203322"Hold alt and click to evaluate expression not working" (this is a tip of the day)
BugIDEA-192798[Breakpoint intentions] [Stop/don't stop in the class] correct filter was added using intention, but it doesn't filter anything
BugIDEA-191797Evaluate expression failed in lambda body
BugIDEA-188405Async stacktraces: java.lang.VerifyError: Bad local variable type
BugIDEA-204462Debugger does not propose to evaluate File.toString with disabled toString renderer
BugIDEA-192430Breakpoint intentions [Stop/don't stop in the class] parent class is displayed instead of caller class
BugIDEA-203543Launching rubocop as external tool fails
BugIDEA-191140Incorrect variables mapping inside catch block without debug info
BugIDEA-198388Dragging breakpoint clones it instead of moving
BugIDEA-202291NPE in compiling evaluator
BugIDEA-189504Breakpoints View is bugging in debug view
BugIDEA-199545Cannot re-attach to restarted process
BugIDEA-198140'Smart step into' works unexpectedly on 'super' method call
BugIDEA-156500Debugger does not stop at breakpoint in test with JMockit
BugIDEA-198992OOM in CaptureStorage
BugIDEA-188904Incorrect primitive conversion
BugIDEA-189725'Smart step into' doesn't work immediately sometimes
BugIDEA-189894minor problem with horizontal scrollbar when debugging
BugIDEA-188941char to double/float conversion is not supported
BugIDEA-203014Target Jdk version does not match message
BugIDEA-191337Select All from debug tooltip variable select code editor instead of Tooltip variable value
BugIDEA-200161Exception related to debugger agent on plugin project startup
BugIDEA-183804Update default remote debugger config for jdk9
BugIDEA-193733history-paste doesn't work in debug-watches, even though it's offered
BugIDEA-187338Async stacktraces may not work with several debug sessions
BugIDEA-127045Unexpected 'step over' behaviour in debugger
BugIDEA-189423Unexpected tokens error in multiline condition
BugIDEA-187968Expressions in window watches are not editable
PerformanceIDEA-204448Debug startup slowly with `debugger-agent.jar`
PerformanceIDEA-187063During debugging IntelliJ IDEA gets extremely slow
PerformanceIDEA-184521Please re-enable killing processes via WinP
UsabilityIDEA-172140Suspend only current thread during evaluation of breakpoint's condition
UsabilityIDEA-204807"Add to Watches" action shouldn't create duplicates
UsabilityIDEA-186171Turn breakpoint condition field background to pink when there is a syntax error
UsabilityIDEA-147697Debug : can't set the value of long variable
UsabilityIDEA-130826Prompt user before removing breakpoints with conditions
UsabilityIDEA-184725edit breakpoint paste from history issue
UsabilityIDEA-198985In Debugger view, the Filter button doesn't allow toggling multiple times
UsabilityIDEA-194431Async Stracktraces for Platform.runLater
UsabilityIDEA-200972View Breakpoints: Show breakpoint icons in the tree view to distinguish between suspend options
UsabilityIDEA-121159Pause Program improvement
UsabilityIDEA-190833Do not highlight disabled breakpoints
UsabilityIDEA-184710No undo (Ctrl+Z) possible in the "Evaluate Expression" edit field after pressing "Evaluate"
UsabilityIDEA-187893View Breakpoints window should not scroll the breakpoint list when I deselect/select a breakpoint
UsabilityIDEA-200959Speed search in debugger Variables view expands nodes
UsabilityIDEA-200637Debugger pop-ups trigger OutOfMemoryError
UsabilityIDEA-204643Debugger buttons could be much more reactive
UsabilityIDEA-200865[Regression] No indication that PHPStorm is connected to XDebug in Debug Tool Window
CosmeticsIDEA-184429Evaluate dialog: Evaluate button takes focus when code fragment is expanded to multi-line mode
CosmeticsIDEA-198903[Floating debug tool window] when debugging run configuration, dropdown list with threads in Frame view is not shown at first step
CosmeticsIDEA-192172Text in "Evaluate and log:" field is too small in Presentation mode
CosmeticsIDEA-188878Replace "Stacktraces" with "Stack Traces"
CosmeticsIDEA-191219Font doesn't scale well in presentation mode in debugger view Frames section
TaskIDEA-195192Update debugger icons
TaskIDEA-122113Get rid of NashornJsBreakpointListener
ExceptionIDEA-201303Exceptions are thrown when the process you are attached to is stopped
Diff_MergeFeatureIDEA-77478Diff: Add by-char comparison mode that will compare individual chars
FeatureIDEA-1997503-way merge should have a Rollback action in the changes stripe menu
FeatureIDEA-182364Add action "Compare something"
FeatureIDEA-101663Allow option to ignore whitespace in three way merge
BugIDEA-194913Zoom is broken in Diff for images
BugIDEA-188245Invoking Directory Diff does not affect productivity guide statistics
BugIDEA-193373Diff in Commit Changes: cannot resize TTF preview below some limit
BugIDEA-188761Alt+up/down navigation over method's of the class does not work in diff window
BugIDEA-111268Tab width not respected when viewing code changes inline
BugIDEA-190698Command line diff : allow diffing single (new) files
BugIDEA-197927VCS: Diff: Unified-viewer renders empty line in the wrong place if 'ignore imports and formatting' is enabled
BugIDEA-170382Unable to use Idea diff command for directories with special symbols
BugIDEA-195754Wrong hint in diff window for function params
BugIDEA-203659Shift+Tab in Diff editor changes line indentation style
BugIDEA-188244Invoking JAR Files Diff does not affect productivity guide statistics
BugIDEA-189154Partial Commit: "Local Changes" preview does not work if all changes in a file are reverted and applied again
BugIDEA-187715Local history ignore encoding settings and show wrong diff.
UsabilityIDEA-195517'Yours' and 'Theirs' columns are not resizable - could not see full branch name
UsabilityIDEA-110057Can't change keymap shortcut for "Compare Next File" in diff view
UsabilityIDEA-182230VCS "visual merge" window: don't ask "Are you sure" if there was no changes
UsabilityIDEA-46059Version control: the clickable area of "Deleted" editor mark is shifted
UsabilityIDEA-197588Text in Comparison/files view does not wrap in narrow window ("Difference between current working tree ...")
UsabilityIDEA-191716"Cancel Visual Merge" dialog is shown even with no modifications when pressing Esc
UsabilityIDEA-190466Diff viewer in Local Changes view works incorrect with grouping by repo
UsabilityIDEA-90565Diff View:git: do not show LF|CRLF when I have option "automatically convert line separators" on
CosmeticsIDEA-194881Rename Files Merged with Conflicts as it is confusing to users
DockerFeatureIDEA-184656Support --shm-size, --security-opt, --name options
FeatureIDEA-175476Add option to wrap words in docker logs
FeatureIDEA-159935Support Multiple Compose files
FeatureIDEA-153443Base directory for Docker deployment
FeatureIDEA-186877Docker. Support --runtime command line option
FeatureIDEA-171362Docker: Provide possibility to choose services to run for Docker Compose
FeatureIDEA-185384Docker. Support --cpus command line option
FeatureIDEA-194585DockerCompose: Editor. Provide possibility to run service/services by keyboard actions and from the context menu
FeatureIDEA-150690Docker - add --rm option
FeatureIDEA-174228Docker: Add Run and Build actions into the Editor Context menu for dockerfiles
FeatureIDEA-192030DockerCompose. Display auto-assigned ports for docker containers
BugIDEA-190331DockerCompose. Display volumes on "Volume Bindings" without duplicating if container folder contains "/" at the end
BugIDEA-186907DockerCompose. RunConfig: IDE fatal errors at attempt to choose services for some compose files
BugIDEA-187895Docker: Don't add the tabs from the previous run to the new container
BugIDEA-192393Dockerfile "cannot resolve stage" with valid --from syntax
BugIDEA-201954NPE at calling "new session" for the "Attached console" of a container
BugIDEA-188077DockerCompose: Stop doesn't work if node contains any container not from the deployed compose file
BugIDEA-175410Docker: Display volumes on "Volume Bindings" without duplicating
BugIDEA-187014DockerCompose: Two nodes instead of one when folder name contains punctuation
BugIDEA-164756Docker log tabs added with each new run
BugIDEA-187035DockerCompose: RunConfig: "Environment variables" field. Cut spaces at the beginning/end when saving
BugIDEA-200116Docker: it should be possible to run compose after "down" all the conflict apps with the same names.
BugIDEA-180157Docker Run configuration : replace JSON file with explicitly listed options in CLI format
BugIDEA-194041Number of Attached Console tabs keeps increasing with every container launch
BugIDEA-201513Docker-compose: call `restart` instead of `up` when already running service is relaunched from the gutter
BugIDEA-202435Adding Docker requires email that has nowhere to enter
BugIDEA-196690Volume mounting doesn't work on Windows using Linux containers
BugIDEA-199410NPE while selecting "pull image" from docker tool window
BugIDEA-200922Dockerfile, Image run config: two nodes at saving changes in the running container
BugIDEA-187158DockerCompose: RunConfig. Different path separators: "/" and "\" in the "Compose Configuration Files" dialog
BugIDEA-181802DockerCompose syntax highlighting / command shows wrong "Single value is expected"
BugIDEA-202973Docker: RunConfiguration: "..." instead of the error about the wrong path to the Dockerfile
BugIDEA-158216Docker: unable to reopen Inspect window
BugIDEA-158217Docker: stop and delete old container after redeploy, even if container name is not set
BugIDEA-187326Invalid target key inspection in docker-compose.yml
BugIDEA-187496DockerCompose: False inspection error for the value: ulimits
BugIDEA-178756compose YAML: support types with different scalar / sequence / dictionary representation
BugIDEA-200684Docker: "Path to compose file required" at running services without established docker connection.
BugIDEA-186939DockerCompose: No values are taken from .env file
BugIDEA-186934DockerCompose: Deployed ok, but the content of the docker-compose node is empty
BugIDEA-203879Creating runConfigs for multiple docker-compose files results in wrong commands being generated
BugIDEA-199274DockerView: NPE at choosing a service without published ports
BugIDEA-178932Docker: "dockerfile detection" description in event log/balloon: the link doesn't work
BugIDEA-202514Docker: Dockerfile fails to run from the Editor with automatically created run config
BugIDEA-200763DockerCompose: "Run" by click on service gutter doesn't work if there is no "docker" server
BugIDEA-187414DockerCompose: The parent docker-compose node has "container" icon in case of some deploys from one folder
BugIDEA-196083docker-compose: wrong inspection at mem_limit option value in case of the string form instead of the integer
BugIDEA-188231DockerCompose: Avoid two-nodes appearance and green tabs by "down" of our compose node
BugIDEA-201807Docker: Start/stop for a service node should work for compose files from one folder
BugIDEA-176049Docker Tab: Freezes happen when there are a lot of containers/images
BugIDEA-194659DockerCompose: impossible to run docker-compose run configuration
BugIDEA-187009Docker, DockerCompose. DockerView: "Show stopped containers" filter doesn't work
BugIDEA-154034Focus on new tab after exec action
BugIDEA-188923Docker pulling progress dialog has negative value for the download size
BugIDEA-202524Docker: Auto-expose the unknown port if added in runtime at PortBinding tab
BugIDEA-201787Docker: DockerView hangs after running tomee/tomcat
BugIDEA-194227Docker: DockerView, Log tab: multiple toolbars at resizing
BugIDEA-201749DockerCompose: after "restart" only the Log from the previous container is shown
BugIDEA-187161DockerCompose: Navigation from override files services doesn't work
BugIDEA-194072Dead `--rm` container shown as not removed from the IDE view
BugIDEA-194871Docker: Provide an inspection error for "rm" in the "Command line options" field if it is not applied
BugIDEA-186890DockerCompose: correct the path to the chosen compose file: display all the "/" in the same way
BugIDEA-186952DockerCompose. RunConfig. Choose Configuration File dialog: disable "Ok" until we choose or auto-detect any file
BugIDEA-193893DockerCompose: can't choose services for the attached yaml
PerformanceIDEA-189747Docker loads YAML file AST when computing icon
UsabilityIDEA-180791Docker: improve UI for Run/Build actions from Dockerfiles
UsabilityIDEA-187016DockerCompose: Provide navigation by F4 and double-click from any compose node to the corresponding configuration file
UsabilityIDEA-194040Typing in Attached Console is very slow
UsabilityIDEA-187260DockerCompose. Yml. Display more usable information after folding a "service" and "services"
UsabilityIDEA-155561Docker. Provide possibility to go to the corresponding Dockerfile from Docker view.
UsabilityIDEA-187040DockerCompose: RunConfig. "Choose configuration file or folder" dialog: provide multi-selection.
UsabilityIDEA-155346Docker. Container tabs. The focus is not on the new tab if we perform any command two times.
UsabilityIDEA-155340Docker. Add possibility to "inspect" for images.
UsabilityIDEA-188595Docker-Compose: provide navigation from containers to the services in the corresponding configuration file
UsabilityIDEA-187279DockerCompose: Rename "Force build" option
UsabilityIDEA-187025DockerCompose: Change the icon for the root docker-compose nodes
TaskIDEA-179297Remove dependency on java-impl from Docker plugin.
TaskIDEA-193122Docker: migrate to docker-java to v3.1.0
TaskIDEA-195394Docker plugin API: provide support for debugging non-Java applications
ExceptionIDEA-193603Docker: IllegalOptionException at saving run configuration with a folder instead of the Dockerfile
DroolsPerformanceIDEA-203046Intellij lags when editing drl (Drools rules) files.
Editor. Code CompletionFeatureIDEA-199722Can I make the live template appear at the top of the code completion list?
FeatureIDEA-203280Groovy Script for PHP Storm Live Templates give suggested box?
FeatureIDEA-192382Override unused imports when adding class with same name
FeatureIDEA-76223Showing Both Autocomplete and Javadoc
BugIDEA-186754Code completion list is blinking after typing non-ASCII text
BugIDEA-198968Idea smart completion suggests non-accessible constructor
BugIDEA-204126[Live templates] autocompletion is not shown for some live templates (e.g. sout, psvm)
BugIDEA-193689IDEA logs of EAP version have eaten all free space of a /home - threaddumps
BugIDEA-200049backspace doesn't work in completion popup
BugIDEA-199925Dash breaks autocompletion for live template name
BugIDEA-180723Parameter name hints completion: incorrect hints are shown in case of nested call (i.e. method call using as argument value)
BugIDEA-193509Unintended code completion list pops up when typing non-ASCII strings
PerformanceIDEA-186114Code completion is extremely slow
UsabilityIDEA-176647Do not show auto-popup with the exact same name when entering text in the middle of a symbol
UsabilityIDEA-144321LookupElementProximityWeigher should work for all lookup items that have PSI
UsabilityIDEA-189603Multi-parameter completion overwrites code if there is no closing parenthesis
CosmeticsIDEA-187518Support italic in completion lookup element item text
ExceptionIDEA-188584AE at com.intellij.codeInsight.completion.CompletionAssertions.assertHostInfo
ExceptionIDEA-193362java.lang.IllegalStateException: Not in a typed action at this time
Editor. Color SchemesFeatureIDEA-193070"Syntax highlight > Language defaults > Parameter" should have option to inherit from "Identifiers > Default" since it's Identifier
BugIDEA-197528Color scheme editor ConcurrentModificationException
Editor. Editing TextFeatureIDEA-204140Should be able to unwrap rule based switch expression
FeatureIDEA-170770Use different color for scratch files and external classes editor tabs
FeatureIDEA-196006Link for files in JavaDoc generation output
FeatureIDEA-151939In scroll panel highlight lines with breakpoins
FeatureIDEA-36496Move statement up/down handles catch blocks improperly
FeatureIDEA-152160Add options to "Save as" for scratch files
FeatureIDEA-195733Show parameter hints for enum constructor
FeatureIDEA-172368'Join lines' could handle increment with 0 nicer
FeatureIDEA-123328When positioned on break/continue, highlight for/while/do it breaks out of
FeatureIDEA-178801Multi-line pasting in line comments
FeatureIDEA-130703Join Lines (Ctrl-Shift-J) could join nested if's
FeatureIDEA-168176Move Caret Backward/Forward a Paragraph With Selection
BugIDEA-193695Quick Definition (Option+Space) writes a space character if it does not work
BugIDEA-182771Editor: Split Vertically resets scroll and caret position
BugIDEA-194978Mouse navigation & tooltips handler: take inlay hints into the account
BugIDEA-203335Parameter info appears when not required
BugIDEA-195416Join lines over arithmetic operations should preserve order
BugIDEA-196224Parameter Info bubble (CTRL-P) disappears immediately if invoked after first dot
BugIDEA-184675Structure view: incorrect, unexpected Expand behavior
BugIDEA-194685Add builtin soutv postfix template
BugIDEA-201625Text jitter in editor when tabs are used for indentation (on a fractional-scale monitor on Windows)
BugIDEA-195183Inspection's tooltip shouldn't appear when the cursor stays on a hint
BugIDEA-198113File | Export to HTML: line numbers are displayed incorrectly when enabled
BugIDEA-186110Esc doesn't close in-editor search during indexing
BugIDEA-203120Adding Inlay leads to code lens invalidity
BugIDEA-198893Parameter info hints: exception on undo
BugIDEA-196505Cannot open JavaScript files
BugIDEA-189671Editor loses caret (thus focus) after closing one of the two splits using Close (Ctrl+F4)
BugIDEA-191159[windows] text in editor can float when parameter hint is on
BugIDEA-190611Unable to turn on parameter hint for all cases
BugIDEA-186636Keystrokes lost during freezing
BugIDEA-197276Adding external annotation into .class file breaks syntax highlighting
BugIDEA-202245Editor ignores EditorMouseEvent consuming
BugIDEA-194238Custom file types comments conflicting
BugIDEA-202087Broken indentation (scaling 250% or higher)
BugIDEA-201750Move Up/Down and Scroll works wrong with a cloned caret
BugIDEA-199621Text selection doesn't work after triple-click
BugIDEA-190905Blacklisted hint can appears sometimes.
BugIDEA-171789"Last edit location" does not honor changes been made on "Commit changes" window
BugIDEA-204058Enter doesn't work in line comment if an invalid todo pattern is configured
BugIDEA-194473Scope highlighting blinks terribly
BugIDEA-187135Pasting multiple lines of Javadoc is broken
BugIDEA-192777Builder methods return hints duplication in the editor.
BugIDEA-198767Caret returns to wrong position at the end of the block in java code
BugIDEA-164133"Optimize imports" adds import which is immediately marked as "Unused import statement"
BugIDEA-186884Can't create a new scratch using New... popup in the Project view
BugIDEA-198539"underscored" and "strikeout" effects not rendering
BugIDEA-192288Strange annoying behavior on mouse click in long file in ES6
BugIDEA-196674Escape doesn't delete all carets in string literal with injected language
BugIDEA-188667arg postfix template removes the line part after the invocation point
BugIDEA-188877'<unknown> file changed' error message on undo
BugIDEA-202915Highlighting of deleted ranges in diff window is blinking sometimes
BugIDEA-187666Multi-caret does not move uniformly over >= and <=
BugIDEA-198066RegEx. Wrong selection with double click.
BugIDEA-204898Exception in buildFoldRegions can block loading of editor
BugIDEA-197843'Move Statement Up/Down' for switch-case-blocks does only detect the statement when the caret is exactly on the statement
BugIDEA-103199Undo: UTF problem
BugIDEA-175878Multicursor first cursor incorrect indent on tab press in injected fragment
BugIDEA-201183Live Template Context in Java type declarations
BugIDEA-192438Underline is always bold underline
BugIDEA-194100Code folding state resets automatically
BugIDEA-198595Last edit location does not remember changes made in Find in Path
BugIDEA-187042arg postfix template incorrectly replaces whole line
BugIDEA-191750Expand selection (ctrl+w) doesn't work correctly for case statements
BugIDEA-188682Moving a Statement through comments mixes up the comment lines
BugIDEA-194718Column selection status text is incorrect when multiple window is open
BugIDEA-193436editor component draws a typed char in editor component even if a typed handler does nothing and returns STOP
BugIDEA-189508Parameter names hinting doesn't work correctly with non-ASCII symbols
BugIDEA-201210Expanding selection within method's generic type parameter expands to beginning of file
BugIDEA-193224Tabbing out of brackets broken when having to import a class.
BugIDEA-192970 Jump outside closing bracket/quote: doesn't work if if/while/switch statements were completed
BugIDEA-190665Caret is not repainted correctly
BugIDEA-190660ClassCastException after code reformatting using 'Join Lines'
BugIDEA-108112Ident after enter in Java binary expressions
BugIDEA-199909'Jump outside closing bracket/quote with Tab' not working for method call closing parenthesis when parameter info tooltip is displayed
BugIDEA-192919Custom file type: incorrect Expand selection if word is between backslashes (tested with in C files)
BugIDEA-196929Cannot copy text while IntelliJ is indexing
BugIDEA-190254Class name is erased after choosing Add Javadoc action and starting to type
BugIDEA-192328Entering a newline between a regular multiline comment and doc comment introduces stray asterisk.
BugIDEA-189708Wrong position of completion parameter hint popup
BugIDEA-201882Scrolling position jumps on completion
BugIDEA-203015Wrong caret position after up/down movements in presence of both inline and block inlays
BugIDEA-203902Text drag'n'drop in editor is not canceled by Esc key
BugIDEA-201502Weird soft wraps behavior when working with XML content
BugIDEA-200103Overload switching doesn't work for vararg methods
BugIDEA-196967External annotations not updated when I edit the file manually
BugIDEA-188770HTML block header sometimes doesn't disappear
BugIDEA-199790FileEditorManagerImpl does not properly handle opening TextEditor instances created by custom FileEditorProvider
BugIDEA-194054Gutter icons of the underlying code displayed on folded region quick view
BugIDEA-136779In editor, alt+drag should clear the old caret.
BugIDEA-192519yml and other files: Editor does not show unquoted devanAgarI unicode characters.
BugIDEA-199639While typing TODO comment with Korean text, color scheme to the last letter is disappeared
BugIDEA-204703Text selection significantly slows down when cursor is outside the text editor
BugIDEA-192700Left gutter is not resized when breakpoint is removed
BugIDEA-202906Parameter hints find wrong overload
BugIDEA-201725Rich text copy / paste on high DPI screens should scale down fonts
BugIDEA-189650IDE closes empty files when restarting
BugIDEA-121060Multiple carets: comment/uncomment works incorrectly
BugIDEA-194649On navigation to a search result target location is not centered in editor
BugIDEA-197878AssertionError when inserting several lines insted of the one in multiline TODO
BugIDEA-188561Truncated parameter info popup on empty argument list
BugIDEA-190298Clipboard content pasted twice when assigning mouse shortcut to `Paste`
BugIDEA-204769Editor: selecting "Copy" action from menu copies whole line instead
PerformanceIDEA-199690Terrible performance with multiple cursors in insert with multiple values
PerformanceIDEA-189038Slow undo in large file
UsabilityIDEA-191765soft wrap for active editor switches off
UsabilityIDEA-193635Parameter hints react in a crazy way on incomplete expression
UsabilityIDEA-188800PostfixTemplates: no description for the user-defined and edited built-in templates
UsabilityIDEA-199843Ctrl hovering over keyword should not show quick doc popup
UsabilityIDEA-197915Unable to set unix line separator for iml file
UsabilityIDEA-126440Collapsed comments preview with timeout or button for preview
UsabilityIDEA-189772Weird presentation of collapsed import block, when something deprecated is inside
UsabilityIDEA-186011Smart Backspace isn't smart enough
UsabilityIDEA-198213Double clicking on the { or } (curly brace) should select class body
UsabilityIDEA-199375Parameter info (Ctrl+P) does not recognize array parameter as a vararg
UsabilityIDEA-191018Selection under diff popup does not work
UsabilityIDEA-200275Multiline TODO: support line Split in block comments
UsabilityIDEA-200276Multiline TODO: line comment <-> block comment conversion breaks multiline comments
UsabilityIDEA-203855Cloned carets visually off
UsabilityIDEA-198598"Split line" does not work for multiline TODOs
UsabilityIDEA-186311Kubernetes: Json. Display long messages on scroll-bar as short description with "more" link or as text.
UsabilityIDEA-204308Multiline TODO popup interferes with editing the TODO.
UsabilityIDEA-188086Split Editor Tab scrolls back to cursor
UsabilityIDEA-200630too eager commenting out
UsabilityIDEA-126243Reformatting on typing curly brace should be performed in a separate command
CosmeticsIDEA-186054Text cursor is reset to position (1,1) when code editor tab is dragged from primary window to new 2nd window
CosmeticsIDEA-200296confusing gutter folding hints for "closure" folding
CosmeticsIDEA-138747Joining line with EOL comment
CosmeticsIDEA-199826Switching from read-only file to editable one incorrectly repaints status bar indicators
TaskIDEA-190840Refactor "Line separator" and "Encoding" status bar widgets to share code
ExceptionIDEA-187187Save settings failed: "Cannot get ScratchFileService component state"
ExceptionIDEA-199974java.lang.ArithmeticException at deleting after calling completion
ExceptionIDEA-193406TraceableDisposable$DisposalException: Editor is already disposed
ExceptionIDEA-190959Wrong line separators: '\r' at offset 0
Editor. Error HighlightingBugIDEA-155186Daemon status icon (aka eye aka TrafficLightRenderer) isn't always repainted
BugIDEA-195971Library source soes not match the bytecode for java.util.regex.Pattern
BugIDEA-204791Duplicate highlights in maven
BugIDEA-197802Editor: highlighting for soft-wraps delimiter not always inherits background color from surrounding code
BugIDEA-199466Editor: Error highlighting isn't change on color scheme switch
UsabilityIDEA-178659Parameter name hints: automatically inserted commas are highlighted as errors
UsabilityIDEA-114803Provide the ability to disable tooltips in editor without disabling inspections
TaskIDEA-188957Add possibility to implement DumbAware highlighting passes
Editor. Intention ActionsBugIDEA-144708add static import adds import to inaccessible class
BugIDEA-191095Raw string literal RegExp should be recongnized
BugIDEA-202205Wrong gutter action add to intention popup when we have disabled gutter action
BugIDEA-200761Settings: Intentions: "Before/After" sections for intention actions are empty
UsabilityIDEA-193480Unable to add annotations to parameters from the gutter icon
External ToolsFeatureIDEA-129070Macro: multiple $Prompt$ in External Tools
File SystemFeatureIDEA-198080fsnotifier fails to start from Flatpak image
BugIDEA-193418Deadlock on project open
BugIDEA-188926`VirtualFileManager.refreshWithoutFileWatcher` can take an extremely long time on a Windows FileSystem with a large number of mapped network drives
PerformanceIDEA-201455Less calls to File.isDirectory in CoreLocalVirtualFile
PerformanceIDEA-191007Too large buffer passed to ReadDirectoryChangesW seriously impacts Windows file system performance
UsabilityIDEA-192665Annoying "External file changes sync may be slow" notification
Find, Replace, Find UsagesFeatureIDEA-69435Search for Multi-line fragment
BugIDEA-200011Replace in pre-selected text doesn't work any more
BugIDEA-193584New SE: plugin enabling/disabling via Find Action is confusing and incorrect
BugIDEA-189518Search in path never completes when using named capturing groups in regexp
BugIDEA-188153Next occurrence doesn't work when focus is in folded code
BugIDEA-184743Button in "Replace in path" old dialog is called "Find" instead of "Replace"
BugIDEA-195122Find / Replace: when the size of the search field is small, it is not autoscrolled on typing or on Right arrow key pressing; cursor just goes to the invisible area
BugIDEA-188789Find in Path: cannot switch between Find and Replace in Path dialogs
BugIDEA-197216Regex search for \b locks up the IDE
BugIDEA-189385Line with both read and write access to a field is shown with read-access icon in 'Show usages' results
BugIDEA-177766Find In Path: regex search finds irrelevant matches if "In commets" selected in filter
BugIDEA-185627Regression: 'Search/Replace in Path' popup doesn't find usages under .idea directory even if explicitly invoked on that directory
BugIDEA-179801Replace in File doesn't find all occurrences
BugIDEA-187131Find popup shows incomplete usages and doesn't indicate they're incomplete
BugIDEA-188646Livelock in Git commit dialog during code analysis
BugIDEA-186556Find symbol should show [jdk9] module at beginning of the list when exact name entered
BugIDEA-130620Incorrect find usage on fields if exist methods named like a setter and used in inner class
BugIDEA-198724New SE: Duplicated results in "Recent files"
BugIDEA-196638Rows in usage view sometimes get cropped
BugIDEA-195542Inconsistent and partial results in "Occurrences of" Find tool window tab after opening from "Find in Path"
BugIDEA-191479"Find in Path" partial results can flicker/selection is reset while the search is in progress
BugIDEA-189354"Find in path" (old style) requires 2 "ESC" pressing to close
BugIDEA-203111Undo doesn't work correctly after "replace all"
BugIDEA-193455Cannot go from Find to Replace if shortcut was changed to Ctrl+H
BugIDEA-203563Can't change "Find in Path" scope during indexing
BugIDEA-189995Not possible to access the options of 'Replace' when selected text is long, cannot resize search/replace field box either
BugIDEA-189227'File mask' is not saved when switching from 'Find in Path' to 'Replace in Path'
BugIDEA-193329New SE: SearchEverywhere | Action (FindAction): OpenInFindWindow button should be disabled
BugIDEA-193321SearchEverywhere: on scope switching the 'include non-project items' checkbox loses its state
BugIDEA-170585Disable tooltip for regex find
BugIDEA-199986Find/Replace in Path closes immediately
BugIDEA-194819Add reactive API/event listeners for usage inclusion/exclusion in UsageView
BugIDEA-82930Ctrl+R (Replace) doesn't always copy the text selected to "From" box
BugIDEA-190721Accessorr search works incorrect when child field hides parent
BugIDEA-189447"Find in Path" shortcut (Ctrl+Shift+F) not working in "Find in Path" preview window
BugIDEA-140859'undo' (ctrl+z) in the 'find' (ctrl+f) box has unexpected behaviour
PerformanceIDEA-19836989-second decompiler UI freeze
UsabilityIDEA-180366Find in Path from VCS | Local Changes shall pre-select the selected change list or directory
UsabilityIDEA-167955Find: `Ctrl+F` on selected word doesn't pre-select text in search field if Find bar is open
UsabilityIDEA-108477Preview for in-place regexp replace doesn't preview line breaks
UsabilityIDEA-204169Add "Open results in a new tab" in the Find ToolWindow
UsabilityIDEA-175973Enter file name search popup is not closing itself after losing focus when no value available in textbox.
UsabilityIDEA-186671Find in path: automatically include project files into search scope if *.iml is set as a file mask
UsabilityIDEA-173010Rerun is greyed out in Find Occurrences, results are collapsed by default
UsabilityIDEA-202987Ability to customize a shortcut for search history
UsabilityIDEA-76610I want to be able to turn off the "Do you want to find usages of the base method?" question
CosmeticsIDEA-202206Search everywhere: Type / to see commands
ExceptionIDEA-202503Exception occurs on opening file context menu for the first time
ExceptionIDEA-193330AIOOBE at com.intellij.ide.actions.searcheverywhere.SearchEverywhereUI$SearchListModel.getContributorForIndex
ExceptionIDEA-198437NPE at com.intellij.structuralsearch.plugin.ui.filters.FilterPanel.initFilters
HTML.PreviewBugIDEA-184915IntelliJ doesn't rescale an SVG properly after editing its viewbox property
IDE ConfigurationFeatureIDEA-99671Export Settings: plugin repositories settings are not exported
FeatureIDEA-107709StringUtils within a File Template
FeatureIDEA-146459Provide a more convenient way of editing custom file type keywords
FeatureIDEA-152848Fresh IntelliJ IDEA 2016.1 installation doesn't recognize the the exported settings file
FeatureIDEA-136387Add a template variable that displays file path from project root.
FeatureIDEA-135447Remember settings last exported
BugIDEA-187735Comment live template macros show long description text in completion
BugIDEA-197838Project leak via animated icon in PluginsGroupComponentWithProgress
BugIDEA-188434Can't export Data Source settings
BugIDEA-170111password storage throws exception if config directory is symlink
BugIDEA-179784Idea fails to load a project when running on Java 9
BugIDEA-172658Reassigned file wildcard for predefined file type is reverted on restart
BugIDEA-189135java.nio.channels.OverlappingFileLockException when idea.config.path and idea.system.path point to the same location
BugIDEA-196469NPE error on startup with initial wizard
BugIDEA-189920Attribute inheritance flag in Editor color scheme is reverted on Apply
BugIDEA-201898Handle plugin duplications with sync settings
BugIDEA-200626File and Code Templates preferences section loads infinitely
BugIDEA-198818'Annotations to copy' setting is not persistent
BugIDEA-186551HttpConfigurable#getJvmProperties ignores proxy exceptions
BugIDEA-189452IDEA overwrites write-protected files on saving settings (even with "safe write" option turned off)
BugIDEA-138366Default file types configuration (extensions) is not preserved if custom plugin registers conflicting extension
BugIDEA-192064"Remove from Sidebar" is not persisted across project re-opening
BugIDEA-193029Restarting is not supported on GNU/Linux with Python 3 as the only Python interpreter
BugIDEA-200585Live Templates: Expand with = None is shown as "Default (Space)"
BugIDEA-200848SDK: Don't add the same SDK some times
BugIDEA-196437Plugin manager: problem with enabled/disabled plugins blocks any interaction
BugIDEA-192127Launcher Script Should Use Python3 When Available
BugIDEA-188964Error loading kotlin-language facet
BugIDEA-202843WARN - ge.ExternalProjectsDataStorage java.lang.NullPointerException
BugIDEA-187515Parameter hints enable/disable isn't applied when toggled from action popup
BugIDEA-194876When removing "Other" from "B" live template context, it's reset to "None"
BugIDEA-186794"Reassociate" action to change a file type association
BugIDEA-186546Copyright plugin can't read copyright profile created in IDEA 2017.3
BugIDEA-189445In 2018.1, "Settings | Appearance & Behavior | System Settings | Updates | Automatically check updates" is disabled by default
PerformanceIDEA-2026612018.3 slowness
UsabilityIDEA-193234Sort Live Template Scopes alphabetically
UsabilityIDEA-198415Option to turn off EAP channel updates entirely for stable releases
UsabilityIDEA-190017Allow to duplicate postfix templates
UsabilityIDEA-189436IDEA fails to launch with JDK 10 set as IDEA_JDK_64.
UsabilityIDEA-169751Notification in the IDE about low heap memory which clearly tells user to increase an Xmx and provides a convenient way to do it.
CosmeticsIDEA-203663Preferences | Editor | General | Gutter Icons: sort plugin groups alphabetically
CosmeticsIDEA-142225File template descriptions are wrapped when shouldn't + better padding in general description
CosmeticsIDEA-199540Strange selection display when switching to "Other" tab in File and Code Template settings
TaskIDEA-196480New SE file types filters are not saved on IDE close
TaskIDEA-201087Do not log performance statistics to the console
Configuration ProblemIDEA-195913Version Control Sidebar GUI behaviour
ExceptionIDEA-188196"Unknown macro $APP_CONFIG$" exception on start
Image ViewerBugIDEA-203942SVGLoader incorrectly interprets svg document size
IndicesBugIDEA-198452Exception on Welcome screen -> Preferences -> Quit
BugIDEA-190677OOME while indexing images in TeamCity project
BugIDEA-197296deadlock between FileBasedIndex Vfs Event Processor and EDT
BugIDEA-189189Repeated scanning files for index
BugIDEA-194315Spring Boot: application.yaml file opened in Editor while indexing is not recognized as SpringBoot configuration file
BugIDEA-188041Uncommitted saved document still leading to "Outdated stub in index" sometimes
BugIDEA-181227Throwable: unable to get stub builder
BugIDEA-193172Deadlock while typing after auto completion
PerformanceIDEA-2022212 minute freeze on index query after deleting a large directory
PerformanceIDEA-186709freezes on older project open/branch checkout
PerformanceIDEA-159590File-based index stamp changes when the index returns equal results for modified file
PerformanceIDEA-202748Hang during UnindexedFilesUpdater working
PerformanceIDEA-1852399 seconds freeze caused by non-interruptable Readlock
CosmeticsIDEA-200475Stacktrace found in log file - unsure of the cause
ExceptionIDEA-188028A test failing with "Outdated stub in index"
InternalTaskIDEA-200277Get rid of access to package-private members in platform modules from java support modules
Internal build scriptsFeatureIDEA-188583Support generation of Maven artifacts for modules of IntelliJ-based IDEs
BugIDEA-189408Incorrect artifactId is generated for module names which include digits
BugIDEA-189683Building intellij-community from sources fails because of missing jgoodies-common JAR
BugIDEA-188812IDEA with Python plugin run configuration is broken
BugIDEA-200994Building distribution of IntelliJ-based IDEs fails on Windows because of incorrectly extracted JRE
BugIDEA-203509Cannot debug tests in nested classes
BugIDEA-198772Testings scripts fail to start a JUnit run configuration if it uses our UrlClassLoader
BugIDEA-200988Building PHP plugin on Windows fails with "The filename or extension is too long" error
TaskIDEA-198661Bundle product information file with a product distribution
TaskIDEA-202226Generate links to third-party libraries in JSON format
TaskIDEA-197426pom.xml generated for modules from IntelliJ IDEA project should honor exclusion of transitive dependencies
TaskIDEA-201926Allow building plugins which aren't supposed to be automatically published
Configuration ProblemIDEA-199738Upgrade internal Ant to version 1.10.3 or newer (support JUnit5 Jupiter engine)
JSONFeatureIDEA-185069Kubernetes: Json. QuickHelp. Provide quick help for completion list items
BugIDEA-198593Errors reported by JSON annotator disappear only on typing
BugIDEA-195340bad JSON kills IntelliJ
BugIDEA-193494IndexNotReadyException
UsabilityIDEA-195016Kubernetes: Json. Completion for "integer" types should be with space before comma
ExceptionIDEA-193553Error while indexing .stylelintrc
Java. Code FormattingFeatureIDEA-119282Remove blank line between header and package declaration
BugIDEA-192024Java formatter breaks do ... while onto a new line if it exceeds the hard limit
JavaFXBugIDEA-200092Java 11 + OpenJFX Support
BugIDEA-187363New FXML File in the Web tool window does nothing
BugIDEA-200215Warn the user if the JDK can't build JavaFX artifact
JavaScriptBugIDEA-190826@NotNull method com/intellij/lang/javascript/nashorn/library/NashornJSLibraryProvider$1.compute must not return null
BugIDEA-190598Nashorn JS with Java 9: IDE does not support class declaration
ExceptionIDEA-196599JSUndeclaredVariableInspection quick fix AIOOBE on invalid code
JavaScript. DebuggerBugIDEA-187460Nashorn debugger no longer works with Java 9
ExceptionIDEA-198791IAE at com.intellij.javascript.debugger.nashorn.NashornObject.createValue
KubernetesFeatureIDEA-185224Kubernetes: Yaml. Validate Integer values
BugIDEA-187357Kubernetes. Yml. Labels: false inspection by empty labelValue and absent error at key/value ending with "_"
BugIDEA-187853 Kubernetes. Yml. Labels: false inspection by empty label values
BugIDEA-204167Helm. com.intellij.util.IncorrectOperationException at attempt to rename the chart name in a read-only file
BugIDEA-187343Kubernetes: improve "Change Notes" for plugin
BugIDEA-184998Kubernetes: Yml. QuickHelp. Show it for the completion list items
BugIDEA-200606Web view: useless "Kubernetes" item in the context menu
BugIDEA-185004Kubernetes: Yml. QuickHelp. It's impossible to restore it as popup from keyboard
UsabilityIDEA-183805Kubernetes: update the view of the quickhelp
UsabilityIDEA-202462Noisy Kubernetes menu
CosmeticsIDEA-187399DockerCompose. Kubernetes. Inspections. Start the parent node name from the upper-case letter.
ExceptionIDEA-199970Helm. java.lang.Throwable by calling "Helm template"/ "Helm Dependency update" via keyboard shortcut
ExceptionIDEA-192537java.lang.Throwable: Do not call synchronous refresh under read lock (except from EDT)
Language InjectionBugIDEA-162596Un-inject action works from the second attempt only
BugIDEA-196222HTTP Requests editor: collapse stops working after expand
BugIDEA-153981Injected fragment editor: multiple instances can be opened for the same fragment, but their contents is not in sync
BugIDEA-201839Injected Brace Matcher Works Pretty Fun
BugIDEA-202431Postgres SQL injected language formater
BugIDEA-188783Intellij IDEA 2018.1RC#IU-181.4203.519 freezes frequently on start and during project build
BugIDEA-188988<statement> or DELIMITER expected in Java constants
BugIDEA-196513java.lang.AssertionError at "undo" language injection
BugIDEA-191232Injected language fold regions aren't cleaned up if the injected document becomes invalid
PerformanceIDEA-194117@Language("RegExp") annotation doesn't scale to O(1000) expressions in a single file
Local HistoryBugIDEA-189367Current version is not editable in the Local History of a directory.
BugIDEA-197060Local history reverts file timestamps
BugIDEA-203490Copy/paste is not working in the left pane of the Local History window
BugIDEA-197446IntelliJ 2018.2.1 freezes after a short time
ExceptionIDEA-203259It's possible to call 'Show History for Selection' for project tree items: IllegalArgumentException is thrown
MacrosBugIDEA-204339Some IDEA macro invalid in other IDE's context.
Packaging and InstallationFeatureIDEA-198292Bundle WSL plugin for Windows distribs of Idea Ultimate
FeatureIDEA-187290New balloon notification: IDE update has been applied
FeatureIDEA-194148Publish 'intellij.platform.testFramework' module as a Maven artifact
FeatureIDEA-170297"Batch mode" for IDE updates
FeatureIDEA-199523Listing of Error/Exit codes
FeatureIDEA-199192Add "Open with Rider" action for files and folders to Windows context menu
FeatureIDEA-187763Register our IDE for compatible file type on macOS
FeatureIDEA-194011Turn vcs.log.graph module into a healthy maven dependency
FeatureIDEA-114307'Create command line launcher' on Windows
FeatureIDEA-184006Add log for win installations.
BugIDEA-201664Silent installation by user: The name of the destination folder is changed while changing the location during the installation
BugIDEA-201669Silent Installation: The installation is not done but there is a message about successful installation in installation log.
BugIDEA-200776Remove dependency from 'extensions' module to 'XStream' library
BugIDEA-199519Uninstall: The IDE installation folder is not deleted after uninstallation
BugIDEA-203550Windows Installer: 'Uninstall old versions' shows only several installations from only one disk with a weird gap
BugIDEA-201878Uninstall previous installations: There is bin folder with uninstall.exe after uninstalling
BugIDEA-138195Uninstall progress bar animation doesn't represent the actual process state
BugIDEA-189387Pycharm 2018.1 won't start after patch update
BugIDEA-170921Can't uninstall IntelliJ IDEA Community Edition
BugIDEA-200342Silent installation: There is no checking if the current version was already installed
BugIDEA-199339Incorrect installation folder.
BugIDEA-200369Silent Installation: mode=user: if you have no permission to install in the specified folder, installation is finished in the different folder
BugIDEA-167297After broken update can't run pycharm
BugIDEA-194822Incorrect sed command in non OS_TYPE Linix libyjpagent check breaks non Linux startup
BugIDEA-198859Batch Mode for IDE updates: IDEA just restarted without any message when the last patch in chain is wrong
BugIDEA-200274Silent installation: installation to the wrong folder
BugIDEA-158855Windows installer starts uninstaller even when clicking back
BugIDEA-190079Installer doesnt close with finish button and nothing happens
BugIDEA-202935Regression: cannot install IntelliJ IDEA in silent mode if intermediate directory is missing
BugIDEA-199522Silent installation: There is no check if the installation folder already exists.
BugIDEA-165190Uninstaller should not remove the files it didn't create
BugIDEA-122925IntelliJ Fails to apply IDE update patch due to faulty "IOException: No Space Left on Device /tmp"
BugIDEA-198383Duplicating libraries copied to 'lib' directory in IDE distributions
BugIDEA-141900Installer: Uninstall old version has weird word wrapping
BugIDEA-190448Missing 'config' dir in Install-Linux-tar.txt instructions
BugIDEA-201027Small UI issue in Installer
BugIDEA-193348The IDE has been updated by Snap shouldn't be shown on macOS
BugIDEA-203213JPS from IntelliJ IDEA 183 branch fails to compile project because of missing class org.apache.maven.model.InputLocationTracker
BugIDEA-200784Uninstall.exe couldn't be launched in some cases.
BugIDEA-200781Sometimes there is no message that this version already installed during the installation
BugIDEA-182484IntelliJ IDEA restart fails on Windows because of company restrictions
BugIDEA-166445Add SVG icon file to IDE distribution
BugIDEA-201292Several installations of one version IDE: Problems with Uninstall in Users folders
BugIDEA-202232Two versions of commons-codec.jar are included into IntelliJ Platform
BugIDEA-168582Windows setup stacks on 'Select Directory' wizard step for several seconds
BugIDEA-197938Windows installer: incorrect "64-bit launcher" label layout
BugIDEA-200843PATH can not be updated. The size is very big.
BugIDEA-162267Update requires excessive disk space
BugIDEA-204606Disable Uninstall feedback options activated by default when uninstaller running from installer(when you install update with installer).
BugIDEA-188130Launcher should be able to recover when config/port contains invalid value
UsabilityIDEA-197129Kotlin compiler binaries miss executable permissions
UsabilityIDEA-198858Batch Mode for IDE updates: It will be usefull to mention which patch-file.zip is wrong when there is wrong jar file in chain.
UsabilityIDEA-200235No option to disable "Open Folder as <IDE> Project" context menu.
UsabilityIDEA-202806There are too few rows in Uninstall Old Versions tab
UsabilityIDEA-182601Silent install could provide some error feedback
UsabilityIDEA-185044Show list of used third-party libraries directly in the IDE
UsabilityIDEA-191432Force "Download and install JRE x86 by JetBrains" and "32-bit launcher" options when installing on 32-bit system
CosmeticsIDEA-204535Header text in Rider Installer is heavily misaligned
CosmeticsIDEA-198470The community edition setup has the wrong icons
CosmeticsIDEA-200363Silent Installation: It is better to mention in log what was wrong in installation by specific words
CosmeticsIDEA-191997com.intellij.updater.Runner usage message for Runner install <folder>
CosmeticsIDEA-198708IDEA Community Edition should probably have its own icon on the Welcome screen - not the same as IDEA Ultimate has
CosmeticsIDEA-161414"Profiling agent is not enabled" should not be a WARN log entry and / or chatter to the terminal
CosmeticsIDEA-181200Install-Windows-zip.txt instructions are out of date
TaskIDEA-200437Use correct product code when IDE is started from sources
TaskIDEA-191884Extract platform classes to separate JARs in IDEs distributions
TaskIDEA-202194Bundle Kotlin 1.3.10 with IntelliJ IDEA
TaskIDEA-193948Publish modules which allows to read IDEA project configuration as Maven artifacts
TaskIDEA-149668Publish javac2 on maven
TaskIDEA-192396Publish java-psi and required modules as Maven artifacts
TaskIDEA-200752Remove dependency from java.psi.impl to java.resources.en
TaskIDEA-196699Bundle Kotlin 1.3 with IntelliJ IDEA
TaskIDEA-192733Update bundled JDOM to 2.0
TaskIDEA-109935Merge "Inspection Gadgets" and "Intention Power Pack" plugins into IDEA core
TaskIDEA-203997Bundle Kotlin 1.3.11 with IntelliJ IDEA
TaskIDEA-189415Bundle Kotlin 1.2.60 with IntelliJ IDEA
TaskIDEA-189413Bundle Kotlin 1.2.50 with IntelliJ IDEA
TaskIDEA-189411Bundle Kotlin 1.2.41 with IntelliJ IDEA
TaskIDEA-192663Provide special svg icons for EAP distributions
TaskIDEA-195115Bundle Kotlin 1.2.51 with IntelliJ IDEA
TaskIDEA-166447Provide separate application icon for EAP distributions
TaskIDEA-192182Extract sources of java annotations to separate GitHub repository
TaskIDEA-185083Unblock basic proxy authorization scheme for https protocol
Password SafeFeatureIDEA-200611Protect master key file using PGP key
BugIDEA-164296Unable to load library 'secret-1'
BugIDEA-174581KeePass storage is wiped if password token does not match.
BugIDEA-187790Passwords Inaccessible (in Settings->Appearance&Behavior->System Settings-> Passwords )
BugIDEA-200735Password Safe: IDE freezes on opening Settings dialog on Ubuntu
BugIDEA-196508On select custom location of keepass file, master password file should be checked also
BugIDEA-190514"Magic number did not match" exception on opening Deployment Settings
BugIDEA-200404Idea change Password Safe option silently on "cancel" in case selected DB is unaccessible
BugIDEA-200401Auth error on open DB file with [...] button
BugIDEA-200375Idea doesn't save password in KeePass database
BugIDEA-200849Password Safe: incorrect reaction on custom location setting for the (not existing) KeePass database
BugIDEA-200188Password Safe: Set/ChangeMasterPassword actions cause significant delays on Ubuntu
BugIDEA-164786ISE at com.intellij.credentialStore.kdbx.KdbxSerializerKt.a
BugIDEA-165257KeePass OVERWRITES existing database instead of appending or prompting!?
UsabilityIDEA-163353Not obvious when master password is set up
UsabilityIDEA-191264Uncheck remember on push credentials dialog by default
Auto-reported ExceptionIDEA-195101Login to GitHub: exception on hitting Deny
Platform APIFeatureIDEA-183815Capability to add a content between code lines in the editor
FeatureIDEA-188386Support debug-level logging in IntelliJ product build scripts
FeatureIDEA-198928Make UAST provide a priory list of PsiElement types which could be used to get required UElement
FeatureIDEA-192059Improve `JavaBuilderUtil.registerFilterToSkipMarkingAffectedFileDirty` for using in other builder categories
FeatureIDEA-200287UCallableReferenceExpression should provide access to referenceNameElement
FeatureIDEA-192484Allow IntelliJ-based products to define custom icons for EAP builds under Windows and Linux
FeatureIDEA-187115JPS: provide API to report exception to IDEA
FeatureIDEA-177378make the registry entries extendible by plugins
FeatureIDEA-201009Introduce ApiStatus.AvailableSince annotation
FeatureIDEA-169107Create an API to add custom text in place of OuterLanguageElement-s to aid template data language lexer
FeatureIDEA-201860Allow third-party IDEs to customize how major version is obtained from build number while suggesting updates
FeatureIDEA-192305EditorTabTitleProvider: pass FileEditor, not just VirtualFile
FeatureIDEA-184848UAST Pattern: constructor param
FeatureIDEA-193136Synchronous notification on file opening
BugIDEA-199978Support several find-usages-providers
BugIDEA-200807NPE caused by NonClasspathClassFinder constructor leaking "this"
BugIDEA-193989IDE does not start - broken icon loading by relative path and IconPathPatcher in multiple plugins
BugIDEA-203169Handle ProcessCanceledException during extension point listeners
BugIDEA-199458NPE in UnionScope creation
BugIDEA-196796UAST: UMethod should provide access to the return-type reference expression
BugIDEA-202707If PersistentStateComponent::loadState failed with exception it won't be called next time
BugIDEA-199797ProgressDialog#myDisableCancelAlarm won't fire for a modal progress bar
BugIDEA-188348Change com.intellij.openapi.actionSystem.ex.DefaultCustomComponentAction API
BugIDEA-195319`PsiSearchScopeUtil#isInScope(GlobalSearchScope, PsiElement)` returns true for every non-physical element
BugIDEA-134387CallHierarchyNodeDescriptor or HierarchyNodeDescriptor should implement equals method
PerformanceIDEA-202315UAST TreeBasedEvaluator consumes a lot of CPU
PerformanceIDEA-189948AST is loaded when computing file icon because of smart pointers
PerformanceIDEA-187382Documents for LightVirtualFile's are leaked via SmartPointerManager
PerformanceIDEA-197722Instantiate stubs lazily within file
PerformanceIDEA-181206Unwarranted checks for type annotations at AnnotationUtil.isAnnotated() cause performance issues
UsabilityIDEA-192560ReplaceConstructorWithFactoryDialog has non public constructor
TaskIDEA-192805Clean up values set by Look-n-Feel
TaskIDEA-158421Document requirements for mac-builder agent
TaskIDEA-203954Make sure that `PsiReferenceProvider`s add references to elements they were asked about
TaskIDEA-195486Expose JBTabs instance used by EditorComposite in its public API
TaskIDEA-191331Migrate to ASM 6.2
TaskIDEA-193114Make property-based and code insight sanity testing frameworks available outside IntelliJ IDEA repository
Meta IssueIDEA-175637Check in tests that PSI text can be parsed back to a similar PSI structure
ExceptionIDEA-203514java.lang.AssertionError: Smart pointer list mismatch: size=1, ref.key=SMART_POINTERS 2145812205, manager.key=SMART_POINTERS 2145812205; has another pointer list with size 36
Plugin DevelopmentFeatureIDEA-196383DevKit: support <group> "use-shortcut-of"
FeatureIDEA-194946DevKit: verify plugin provides pluginIcon.svg
FeatureIDEA-197617Extension point for inferred annotations
FeatureIDEA-201007Devkit: show warning if a plugin code uses API which wasn't available in old versions of the platform
FeatureIDEA-202010Highlight services/components with identical interface and implementation classes as redundant in plugin.xml
FeatureIDEA-197972DevKit: add checks from PluginVerifier (plugins.jetbrains.com) to plugin.xml inspection
FeatureIDEA-140461DevKit: make TestDataReferenceContributor work for Groovy
BugIDEA-204436Plugin Icon search path is wrong for ZIP plugin distributions
BugIDEA-194306Devkit: fix quick/full doc for extension point w/ "qualifiedName"
BugIDEA-196765Good code red in a module.xml when referring an action defined in the same xml
BugIDEA-186696TestDataNavigation: don't compound two side editor from files in different directories
BugIDEA-187409AutoCompletion popup disappears if variant contain dash symbol "-"
BugIDEA-185624False inspection description not found error
BugIDEA-188247JavaSdkImpl#getVMExecutablePath returns wrong path on Windows
BugIDEA-183006Automatically load plugins on which the main plugin optionally depends in tests
BugIDEA-200152Error launching plugin project with 'local' IDEA SDK
BugIDEA-194744DevKit: extensionPoint declaration verification
BugIDEA-166677XIncludes in plugin descriptions should resolve paths in classpath (or even in entire project's classpath)
BugIDEA-188374CommitChangeListDialog.commitAlienChanges shows empty changes browser (when it is not)
BugIDEA-163694Devkit: fix IdeaPlugin DOM
BugIDEA-194146plugin.xml EP naming checks: tighten rules
BugIDEA-202885DevKit: constant assertion when using xi:include with <depends> in plugin descriptors
BugIDEA-190994Usage of ITNReporter in PlatformExtensions.xml is reported as an error
BugIDEA-197440Navigation to testdata hangs uninterruptible
BugIDEA-194424DevKit: fix usage scope for Action/Group
BugIDEA-202393Always include ID of a problematic plugin into exception report
BugIDEA-202635Devkit: fix all gutter icon sizes, make configurable
BugIDEA-191217Devkit: "Element should be registered in ..." false positives
UsabilityIDEA-187502Add module for IntelliJ IDEA Community as well as joint module for both Community and Ultimate
UsabilityIDEA-201599Don't show 'Version must be specified' error in plugin.xml files for plugins developed via gradle-intellij-plugin
UsabilityIDEA-193156DevKit: keep "plugin.xml" in editor tab title
CosmeticsIDEA-192134Remove 'MaxPermSize' from default VM options when start IDEA plugin run configuration
TaskIDEA-201464Properly attribute exceptions happened during instantiation of plugin components to corresponding plugins
TaskIDEA-188302plugin.xml: highlight <idea-plugin@use-idea-classloader> as deprecated
TaskIDEA-188065Warnings when using httpclient-4.5.2 provided with IntelliJ
ExceptionIDEA-183233Exception during offline inspections
ExceptionIDEA-201432Got 'Control-flow exceptions (like ProcessCanceledException) should never be logged' when opening project
Plugin ManagementFeatureIDEA-186805Rework plugin page for settings dialog
FeatureIDEA-201336Drag'n'drop plugin zip file to welcome screen doesn't install it, but instead opens it as a file
BugIDEA-195202Plugins: delete action
BugIDEA-198136New plugins page shows nothing after pressing Enter for empty search line
BugIDEA-199129New Plugins panel opens oversized if last opened tab was "Installed"
BugIDEA-202302Plugins management: confusing reaction in case of required plugin disabling, and the dependent plugin uninstalling
BugIDEA-193311"Install plugin" button is undistinguished
BugIDEA-194591New plugin manager has incorrect window size
BugIDEA-198219New plugins page: stars are cropped
BugIDEA-182869Plugin update fail if requested with major version IDE patch update
BugIDEA-189271IDEA plugin manager cannot download Xtext
BugIDEA-202957New Plugins dialog: 503 server error causes two error dialogs - one after settings dialog is closed
BugIDEA-191790NoClassDefFoundError in case of disabling Coverage plugin
BugIDEA-194120New Plugins Manager: cannot select text/version text in plugin details page
BugIDEA-196430New Plugins dialog: do not allow to install plugin from disk when it is already installed
BugIDEA-193930New Plugins dialog: visual garbage on the upper panel after clicking on different tabs
BugIDEA-202017Can't install plugin if it contains necessary dependence on another plugin
BugIDEA-202018Old plugin dialog is shown when click on the notification popup
BugIDEA-197950It's confusing that one has to install new plugins using Trending section
BugIDEA-202421Enabling parent plugin from the depending plugin doesn't work
BugIDEA-193890New Plugins dialog: Updates page does not suggest existent newer version of bundled plugin
BugIDEA-198191New plugins page takes 6-7 seconds to Show All plugins
PerformanceIDEA-193969Project leak via UIUtil$JBHtmlEditorKit
UsabilityIDEA-200225When user installs plugin from disk tab should be switched from "Marketplace" to "Installed"
UsabilityIDEA-197334Completion is not aligned with word start in plugin dialog
UsabilityIDEA-199205New Plugin manager: add hint for gear icon
UsabilityIDEA-176508Unable to install plugins when their download URL returns 307 redirect
UsabilityIDEA-126874Settings | Plugins have poor keyboard navigation
UsabilityIDEA-199622Updated plugins UI -- grey "Install" button for already installed plugins hard to read
UsabilityIDEA-199435Search field is focused when returning to plugins list
UsabilityIDEA-199434Non-standard hotkey for uninstalling a plugin
UsabilityIDEA-200867Show plugin versions in the installed plugins list
CosmeticsIDEA-193887IDEA refreshes plugin description page when hovering a link
CosmeticsIDEA-199197Poor rendering of completion list in Search field on Plugins settings page
ExceptionIDEA-201296Restart from new plugins dialog results in exceptions in console
Project ConfigurationFeatureIDEA-50658Artifact editor: copy artifact action could be provided
FeatureIDEA-130730Support per-project custom plugin repositories
FeatureIDEA-193050Add option to specify minimum version of the IDE which is required for a project
FeatureIDEA-27486Make file templates per-project
FeatureIDEA-193045Repository libraries: add option to exclude only some of transitive dependencies
BugIDEA-195433Errors on updating sdk
BugIDEA-189112Externally stored settings of facets aren't loaded by build process
BugIDEA-188581Project Structure: SDK: two JDKs in Add new SDK list
BugIDEA-199667Maven lib versions updated daily
BugIDEA-192893Project file encoding settings: the 'BOM for new UTF-8 files' option settings are not preserved on project reopening
BugIDEA-188647Renaming a module breaks stored renaming scheme
BugIDEA-145808Default File Encodings settings are ignored if project created from template
BugIDEA-191059Can't find bundle for base name messages.JavaCoreBundle
BugIDEA-192248Default PHP Interpreter settings are reset after PhpStorm restart
BugIDEA-185133Changing version works incorrectly for Maven libraries if MAVEN_REPOSITORY path variable has non-canonical case of letters
BugIDEA-187885Modules may disappear from 'Load/Unload Modules' dialog
BugIDEA-194717Excluded roots are lost after refreshing a repository library
BugIDEA-200525ProjectRootManagerComponent does not react properly on roots update
BugIDEA-199546IntelliJ hangs when trying to add a JDK
BugIDEA-192913Stop updating misc.xml with test statistics
BugIDEA-203651Kotlin MPP (Common and JS) test source roots are not detected as source roots
BugIDEA-186834Creating a project in the drive root adds the second backslash leading to the wrong project working directory for Run Configurations
BugIDEA-182850Module with a dot in the name is displayed as if it were a module group
BugIDEA-187313New Project Wizard unexpectedly replaces path by '~'
BugIDEA-189444Default run/debug configurations are not saved
PerformanceIDEA-199732Icons for downloadable library types are synchronously loaded on start
PerformanceIDEA-201304IDEA hangs for ~20 sec when adding module to IDEA project
UsabilityIDEA-192234Quickfixes offer to add annotation and junit jars from IDEA installation directory to project configuration
UsabilityIDEA-189675Remove misleading 'channel' option from 'Required plugin' settings
UsabilityIDEA-189733Properly check version range for bundled plugins in 'Required Plugins'
UsabilityIDEA-190951Reload all repository libraries when list of repositories changes
UsabilityIDEA-147807Project Structure: Project language level is reverted from "SDK default" to lowest value, if SDK path does not exist anymore
CosmeticsIDEA-188607Fix warning icon for "Module managed by Gradle" notification
CosmeticsIDEA-202743Library that contains only a single folder is shown as "libs and one more file" in Project Structure
TaskIDEA-85546Introduce constants for the persistent components macros
ExceptionIDEA-188194Removing module from a big project may fail with NPE
ExceptionIDEA-190988Cancelling creation of a library in Project Structure dialog fails with exception
ExceptionIDEA-187726Constant exceptions after opening Idea/ultimate#master with IJ 2017.3.5
ExceptionIDEA-202726AccessDeniedException on project name change if .name file is read-only
ExceptionIDEA-190250Assertion failed: Write access is allowed inside write-action only - at IdeaProjectModelModifier.changeLanguageLevel
Quick DocumentationFeatureIDEA-199882Support JDK 11 external javadoc folders structure
BugIDEA-191421{@literal foo} in Javadocs doesn't display correctly in CTRL-Q popup - braces display
BugIDEA-200711View | External Documentation doesn't work for Java11 classes if documentation url is provided
BugIDEA-203728Quick doc opened for an item from Project View changes position if one clicks on a hyperlink it contains
BugIDEA-201819QuickDoc popup is shown under the element in Diagram area even if there is not enough space for it
BugIDEA-201036Autocomplete list moves up when opening/closing QuickDoc Tool Window
BugIDEA-198297Quick Documentation popup is sometimes placed off screen
BugIDEA-201079QuickDoc popup is not focused on the second "Ctrl+Q" if it was opened from autocomplete or Project View
BugIDEA-187505Locally-referenced images are not displayed in quick doc
BugIDEA-201280QuickDoc popup appears at the cursor position after closing the documentation tab in Tool Window
BugIDEA-195622QuickDoc is not accessible from Search Everywhere popup
BugIDEA-186786groovy: view quick documentation is rendered incorrectly for @link
BugIDEA-202597View | ExternalDocumentation doesn't work for decompiled classes opened in Editor
BugIDEA-200855SVG displayed in Quick Documentation popup ignore any size hint and are too large
BugIDEA-202665Quick documentation resolves method to any compatible method
BugIDEA-203264Restoring quick doc popup size changes its content
BugIDEA-189815Quick doc popup shown on mouse hover closes when clicking on a reference to a different class inside
BugIDEA-189315QuickDocumentation popup flicker for some libs
BugIDEA-201393QuickDoc popup hides after selecting "Show Toolbar" option if QucikDoc is shown on mouse move
BugIDEA-203713QuickDoc shown on mouse move changes position or disappears after clicking on link it contains
BugIDEA-201023QuickDoc popup becomes small after resizing and clicking the link inside the popup
BugIDEA-204179Wrong scrolling position after hyperlink navigation in quick doc popup
BugIDEA-202463Opening external documentation for OpenJFX 11 libraries does not work
BugIDEA-202789Too many "Element information is not available during index update" notifications
BugIDEA-188232Invoking Browse external documentation does not affect productivity guide statistics
BugIDEA-189701Navigation doesn't work in documentation on hover
BugIDEA-202420Opening offline external documentation for JDK 11 does not work
BugIDEA-203588JDK11 Javadoc links use wrong anchor format
BugIDEA-199409UI freezes: Documentation popup loads images from network on UI thread
BugIDEA-186562Javadoc not shown for jigsaw modules in another module
BugIDEA-201449Documentation tab name is not updated on following links in documentation
UsabilityIDEA-200674Adjust popup size according to the font size
UsabilityIDEA-200124Quick Documentation hides context menu
CosmeticsIDEA-163805documentation jumps with ctrl down
CosmeticsIDEA-188396Quick Doc: caret is not hidden when switching from Doc tool window back to Doc pop-up window
ExceptionIDEA-199046NPE at pressing edit in the quick documentation
ExceptionIDEA-199780Quick Doc: Throwable on 'Edit source' in read-only files
RefactoringBugIDEA-199345Change Signature is available from Structure view though not yet implemented for Go
BugIDEA-185936Rename File action shouldn't be available while indexing is in progress
BugIDEA-187647Rename module does not rename directory
BugIDEA-191733Copy file dialog: selection with mouse does not select words
BugIDEA-189391Wrap return value doesn't work with Optional
BugIDEA-176840View / Expression Type just after closing pair character changes user selection
UsabilityIDEA-190300Duplicate menu hot keys for Refactor|Make Static and Refactor|Wrap Method return value
RegExpFeatureIDEA-202325In RegExp form, check whether the regular expression could match a longer input
BugIDEA-198794"2 consecutive spaces in RegExp" when one is in brackets
BugIDEA-195762Single character alternation generates wrong replacement
BugIDEA-195628Tab in "Check RegExp" should switch focus between lines
BugIDEA-191355SingleCharAlternationInspection quick fix produces inconsistent PSI
BugIDEA-199135Bad error recovery in regular expression parsing
BugIDEA-186023Regexp: "Single character alternation" quickfix yields invalid code
UsabilityIDEA-202189Pressing Shift+Tab in the Check RegExp window leaves the window
ExceptionIDEA-190180RegExpSetOptionsImpl ClassCastException blocking editor inspections
Run | Debug configurationFeatureIDEA-114577Confirm deletion of run/debug configurations
FeatureIDEA-196611redirect file to stdin for Java-based run configurations
FeatureIDEA-74031Variables in command line parameters of run configuration
FeatureIDEA-197239Report warning when test pattern name does not occur in project
BugIDEA-198940Dark font color on dark background in 'run anything'
BugIDEA-195937Disable classpath file shortener for java 9+
BugIDEA-202004Run Configuration. Red class name "Class 'Main' is in the default package"
BugIDEA-96960Run Configurations popup: inconsistent position for run config folders
BugIDEA-199121"Run anything" suggests groups, execution targets and then throws exception
BugIDEA-155610ModuleBasedConfiguration.createInstance() may produce wrong custom 'cloning'
BugIDEA-197127Restart tests opens a new tab instead of reusing current tab
BugIDEA-157989"Stop" button does not work when the IDE is launched as a background task
BugIDEA-197466JDK 11 doesn't have jaxb causing JShell not to load
BugIDEA-184007Run dashboard debugger window very narrow
BugIDEA-195693Context help shows 404 page when invoked for a run configuration which don't have special help page
BugIDEA-187390Allow using classpath instead of module path when running applications on JDK9
BugIDEA-188962"Before Launch" tasks are shared between Run Configuration and its copy
BugIDEA-198525[Run Anything] when running saved configuration via run anything, it becomes unsaved
BugIDEA-186505"Ungroup Configurations" doesn't work in the Run Dashboard
BugIDEA-187519Run button not disabled for for debug only run/debug configurations
UsabilityIDEA-128651Keep duplicate in same folder when duplicating a run configuration
UsabilityIDEA-181444Run dashboard: toolbar buttons like ShowConfigutations, Restorelayout, Help should be available when some group or deleted RC is selected
UsabilityIDEA-181847RunDashboard: auto-scroll to the running item in case of many items in the view
UsabilityIDEA-182763Run configuration drop down menu does not show the full name of the test being selected
UsabilityIDEA-201215JVM launcher cannot process @argfiles produced by IDEA
UsabilityIDEA-169476Run configurations are too easily deleted
UsabilityIDEA-193775No easy way to delete a run configuration
SQL (archived)FeatureIDEA-115461SQL code style: Improve formatting for ON DUPLICATE KEY UPDATE
BugIDEA-112933Criminal autoindentation on SQL code
Settings RepositoryBugIDEA-193023completion.factors.user.xml should not be synchronized by Settings Repository
BugIDEA-193044Duplicated plugins in Sync Plugin list
UsabilityIDEA-149733Settings are not synced when using only read-only sources
Structural Search and ReplaceFeatureIDEA-198496Structural search usability: Switch between search and replace modes
FeatureIDEA-161879CTRL+C on Structural Search > Existing Templates yields SearchConfiguration@2115ed8a
FeatureIDEA-191915finding switch statements: allow counted branches
BugIDEA-190128SSR Structural Replace to achieve Java 7 diamond syntax produces illegal Java
BugIDEA-203274Syntax highlighting does not change when changing file type
BugIDEA-189344Structural search doesn't match statement variable in lambda
BugIDEA-146380Structural replace fails
BugIDEA-187792Structural Search Inspection problem: Groovy Script execution error: java.lang.Throwable
BugIDEA-201833Structural search inspection: added filter is not saved for search template
BugIDEA-189852html pattern finds nothing
BugIDEA-200892Dialog remembers its size incorrectly
BugIDEA-195166Finding same values does not work
BugIDEA-202451SSR: search templates are missing on each project openenig
BugIDEA-191669can't find anonymous class within hierarchy
BugIDEA-129336Structural search pattern not found because of comment
BugIDEA-198746Search target dropdown does not set search target
BugIDEA-202958try-finally without catch blocks pattern finds try-catch-finally statements
BugIDEA-195278Replacing an unqualified method call fails
BugIDEA-192548Structural replace replaces arrays with plain values in method signature and class fields
BugIDEA-190055Can't find XML/HTML tags without a specific attribute value
BugIDEA-189473improve java 9 var matching
BugIDEA-191831Wildcard pattern with a variable finds nothing
BugIDEA-202914mess after selection
BugIDEA-191858Problems with finding try-catch statements
BugIDEA-190519replace structurally creates wrong code, when using static import
BugIDEA-188144 javascript method with optional qualifier pattern returns less results than expected
BugIDEA-187725Bad Groovy script can cause exception
BugIDEA-199278Can't search for default method
BugIDEA-200742Tooltip with "Edit Filters" should be disabled in Existing Templates window
BugIDEA-187291Replacing an XML tag set as target does not work correctly
BugIDEA-200398Structural search doesn't find all constructor calls
BugIDEA-187436Malformed pattern warning expected on incorrect use of variables
BugIDEA-187437ActionScript annotation matching incorrectly matches attributes
BugIDEA-189196Labeled break and continue statements can't be found with a variable
BugIDEA-189195Not possible to find labeled statements
BugIDEA-176024Adding an annotation with structural replace breaks a nested class reference in annotation parameters
BugIDEA-201528Simple xml query not found because of index access problem
BugIDEA-194520SSR: search template finds nothing if symbol with qualifier is used
BugIDEA-191673Find within hierarchy does not handle negation correctly
BugIDEA-187532Reference target constraints panel visible for replacement variable
BugIDEA-186640SSR: extremely hard to edit patterns
BugIDEA-187663JavaScript replace replaces only first statement of multiple statement result
BugIDEA-188376SSR: 1 dimensional array is found when using 2 dimensional array expression syntax
BugIDEA-189220Can't find annotations with counted number of parameters
BugIDEA-201300No validation after filter change
UsabilityIDEA-168054Make structural search/replace templates available globally
UsabilityIDEA-189234Misleading "available variable" if var is optional in structural search groovy code snippets
UsabilityIDEA-187826Find Structurally: remove Unlimited checkbox
UsabilityIDEA-203074Cutting and pasting a placeholder in the template editor looses all placeholder filters
UsabilityIDEA-189236Open variable settings directly from search/replacement template in Structural search
TaskIDEA-193238File type combo-box for the new design of the Structural Search dialog
ExceptionIDEA-191889SSR: java.lang.ClassCastException when open 'Search template' dialog in 'Edit variables'
ExceptionIDEA-198357SSR: com.intellij.openapi.util.TraceableDisposable$DisposalException: Editor is already disposed
ExceptionIDEA-141767NPE at at com.intellij.structuralsearch.plugin.replace.ui.ReplaceUsageViewContext.replaceOne(ReplaceUsageViewC ontext.java:130)
ExceptionIDEA-193171Existing pattern "all methods of the class (within hierarchy)" fails
TapestryFeatureIDEA-51032Support Tapestry 5.1 features: Parameter Namespace and Library Namespace
FeatureIDEA-125433Tapestry tml editor does not recognize library components
FeatureIDEA-26518Provide an easy way to navigate forth and back between a page/component class and its template
BugIDEA-111859Tapestry plugin breaks code analysis
BugIDEA-144473Element inside t:content marked red
BugIDEA-181603New > Tapestry > Component / Page operation does nothing - fails with NPE in AddNewComponentDialog.getName()
BugIDEA-152132Tapestry templates: cannot cmd + click to navigate from CSS class name to its definition
BugIDEA-107000Renaming incorrectly appends "get" to property references in .TML files
BugIDEA-25877IDEA should not report warning "private field is never assigned" for injected fields
BugIDEA-98955Incorrect code highlighting because defaultPrefix on @Parameter is not supported
BugIDEA-128498False warning about unresolvable properties for labels
BugIDEA-106998Tapestry loop 'value' elements are incorrectly marked as errors in TML editor
BugIDEA-128473Value of "class" attribute in Tapestry components is always treated as an expression
BugIDEA-90773[Tapestry5 plugin] .tml editor doesn't know tags related to template inheritance
BugIDEA-100346Incorrect red squiggly error line below "-" (dash) characters in TML tag attributes
BugIDEA-124505HTML5 attribute parsing throws errors in Intellij IDEA
BugIDEA-103154Good code is red: can't coerce the string to a DateFormat
BugIDEA-100796Properties file editor incorrect highlights keys as 'unused' when referenced in TML file as ${message:property-key}
BugIDEA-145014Tapestry project library download fails - codehaus repository is no longer accessible
BugIDEA-100807Tapestry 'parameter' namespace elements are incorrectly marked in error in TML editor
BugIDEA-143210 [Tapestry5 plugin] .tml editor doesn't recognize t:upload tag
BugIDEA-85170Code Analysis Fails
BugIDEA-52763Make IDEA understand @SupportsInformalParameters
BugIDEA-52910Autoinsert pairing brace when typing ${ in tml file
BugIDEA-135752Tapestry plugin does not support switching between page/component class and tml files in "base" package
UsabilityIDEA-143514[Tapestry5 plugin] Goto template (ctrl-shift-g) doesn't work for Scala classes
UsabilityIDEA-135741Dialog window for menu New > Tapestry > Page/Component should focus on Name field
ExceptionIDEA-175988Throwable at com.intellij.openapi.application.impl.NoSwingUnderWriteAction.a
Task ManagementFeatureIDEA-199282Pre-Select branch by task name in "Open Task" dialog
FeatureIDEA-190710Tasks plugin does not support time tracking for GitLab
BugIDEA-162223Task Server is not removed.
BugIDEA-202675"Open Task" dialog with empty "Create changelist" field
BugIDEA-203337Duplicate shortcuts in "Open Task" window
BugIDEA-189113Unable to save settings: Failed to save settings. Please restart... Error with Mantis Task server enabled
BugIDEA-168220IDEA freeze up to 1 minute after open "open task" dialog
BugIDEA-197824Cannot type in "Switch to task" dialog
BugIDEA-184079Switching context by tasks is competing with Restore branch workspace when changing tasks
BugIDEA-187507Cannot save Trello integration settings in 2018.1
BugIDEA-189251Task management: name of newly created local task is not displayed in the toolbar and in the open task dialog
BugIDEA-173186Commit message lost after cancelling commit dialog with Add commit message from Task server enabled
BugIDEA-203220After phpStorm upgrade when opening task it doesn't strip "[" when generates branch name causing not valid branch name error
BugIDEA-185092Commit message is generated from active changelist not task
BugIDEA-190752Adding YouTrack server should configure https URL by default
BugIDEA-195862[projectname].tasks.zip is not truncated
BugIDEA-193736Task intgaration with GitLab does not work - 410: Gone error
BugIDEA-187128Generic task server configuration cannot be saved in settings
BugIDEA-188611[remove context] option not present / not possible while CLion is still indexing
UsabilityIDEA-203090Context List displays only the 10 most recent contexts
UsabilityIDEA-85270Tasks: don't allow empty changelist name format
CosmeticsIDEA-199265'Switch task' menu item is almost invisible when invoked from main pane
CosmeticsIDEA-171919Underscore missing in task list drop-down
ExceptionIDEA-199388Throwable at com.intellij.util.io.HttpRequests.process
TerminalFeatureIDEA-191464Add environment variable to terminal detect if running in IntelliJ IDES
FeatureIDEA-119667Feature request: shortcut for switching between terminal tabs
BugIDEA-184778Terminal - Console - wrong format - wrap new line after 2017.3.1 update
BugIDEA-202523Opening Embedded Terminal starts with: "cp: overwrite '/home/<username>/.WebStorm2018.3/config/terminal/history/history-'? " since updating to WebStorm 2018.3
BugIDEA-201601Sometimes terminal shows broken prompt on IDE startup
BugIDEA-118871Integrated terminal doesn't scroll to bottom on "movement-keys"
BugIDEA-184513Terminal prompt displaying incorrectly
BugIDEA-203647Terminal settings (Environment Variables) forgotten after app restart
BugIDEA-200839Can no longer open specific directory in Terminal
BugIDEA-200854Regression: "Close session" and "Select Next/Previous Tab" no longer works in terminal since latest build
BugIDEA-201459Terminal doesn't source ".bash_profile" anymore in PyCharm
BugIDEA-191852Show typed user input in terminal console
BugIDEA-202881Failed to start cmd.exe
BugIDEA-194928Terminal console: a few first long lines are not properly carried over to next line
BugIDEA-186950Exception on trying to evaluate java program that throws exception in terminal
BugIDEA-200294Context actions on terminal tabs not working consistently
BugIDEA-203500Can't Open Local Terminal
BugIDEA-200880Terminal: resize mouse pointer when hovering over "New session" button
BugIDEA-202821Blank terminal
BugIDEA-185523Fish Terminal displays ⏎ (U+23CE) after every input
BugIDEA-204683No login shell if "Python Terminal" plugin enabled
BugIDEA-193879IJ Terminal links are not clickable when output hides from viewport (regression)
BugIDEA-155071TERM variable should not be set for windows (cmd) terminals
BugIDEA-173259fish plugin functions do not work on macOS in built-in terminal
BugIDEA-204725Terminal with bash: 'cat' process ignores SIGPIPE
UsabilityIDEA-186170Enter key in terminal doesn't scroll down
UsabilityIDEA-204510too easy to accidentally close terminal window
UsabilityIDEA-132932Console font change doesn't take effect immediately
CosmeticsIDEA-126617Resizing terminal moves caret
ExceptionIDEA-203045Start ssh session is broken in 183.3795.24
ExceptionIDEA-187084StringIndexOutOfBoundsException while executing some action with long output in the Terminal
UMLBugIDEA-187287SVG UML Diagram Export results on zero length file
Unit Testing. TestNGFeatureIDEA-195047No way to change Expected file from Actual in diff window on <click to see difference> in testng
FeatureIDEA-94400Cannot define TestNG using YAML file
BugIDEA-193318Do not fold comparison results for SoftAssertions in console
BugIDEA-193485"Jump to source" action broken for failed tests
BugIDEA-190388Upgraded to 2018 now TestNG tests not working
BugIDEA-193024Execution hangs when Testng testsuiterunner throws runtime exception in onStart/onExecutionStart
UsabilityIDEA-196264TestNG hijacks JUnit Run Configuration?
User InterfaceFeatureIDEA-197685New SE: Also integrate (basic) "find in path"
FeatureIDEA-192585Use special icons for EAP builds at runtime
FeatureIDEA-90507Need tab actions close all to the right/ to the left
FeatureIDEA-189689Move HelpTooltip settings to resources
FeatureIDEA-168887Themes: Ability to customize "speedsearch matching results" color
FeatureIDEA-188603Allow to align grid label with the upper edge of multiline components
FeatureIDEA-163208Add support for MacBook Touch Bar (Magic Toolbar)
FeatureIDEA-158158Love the new img you can set on the IDE however (.. flip and mirror)
BugIDEA-201098Panel for swapping branches is missing from the Compare with current dialog on mac
BugIDEA-204789project frame opens out of screen
BugIDEA-184388Exception on pressing "context menu button" if there is no context menu in the current UI component
BugIDEA-194131Missing 'Expand All/Collapse All' icons in TODO tool window
BugIDEA-203319"Run/Debug Configurations" dialog is opened without toolbar if invoked from Touch Bar while "Search Everywhere" was opened
BugIDEA-192055Focus goes nowhere after breakpoint popup
BugIDEA-198135Version control toolwindow is not displayed after Enabling VCS integration
BugIDEA-195558'Use dark header' setting is saved immediately
BugIDEA-191708VersionControl: visual garbage on the very first opening of VersionControl toolwindow
BugIDEA-189327Exception on startup when consent dialog is shown
BugIDEA-192157When configuring touch bar, I would like to be able to see changes instantly.
BugIDEA-191170[windows] tip of the day picture is large on 125% scale
BugIDEA-190806notification balloon shadow gaps
BugIDEA-142839ActionCallback.REJECTED.doWhenProcessed results in memory leaks
BugIDEA-180876[fps] VCS branch markers and log track paint artefacts
BugIDEA-193536scaling a composite icon modifies the base icons
BugIDEA-193398New SE: multi selection is not supported
BugIDEA-192119Some SVG icons are rendered incorrectly in IDE
BugIDEA-186989Invoking "find action" in Evaluate dialog moves focus to the main window
BugIDEA-193403New SE: incorrect integration with other popups
BugIDEA-178171intention settings: description editor is too small
BugIDEA-192960Incorrect close button position
BugIDEA-186615Tool windows: resizing cursor appears on top of 'Hidden tabs' arrow
BugIDEA-187873UI glitch in editable combobox with wide popup
BugIDEA-191300Hyperlink stays underlined when mouse leaves its area
BugIDEA-196488Live Templates -> Change Context: keyboard navigation is impossible.
BugIDEA-186262Default icons for editor actions are not default for that actions
BugIDEA-178351"Restore Default Layout" do not work with 2017.2.3 having "Run Dashboard" open
BugIDEA-188161Quickly typing one letter and pressing Enter in "Goto File" leads to endless progress indicator without any results
BugIDEA-183544Artifacts Application icon setting missing
BugIDEA-186564Default size of Edit configuration -> tasks before launch is just for 1 step
BugIDEA-193789Settings: Plugins: unable to search in installed plugins
BugIDEA-192318Progress bar in "Getting Started" dialog do not scale correctly in HiDPI
BugIDEA-187834Replace translucent text rendering in tab pane with opaque one using premultiplied alpha and srcOver rules
BugIDEA-196366Add ability to customize changes browser toolbar in VCS log
BugIDEA-188740LightweightHint.pack() doesn't have any effect when hint uses AWT tooltip internally
BugIDEA-193316Font setting for IDE appearance is ignored
BugIDEA-116955Text in the "Evaluation Feedback" window is editable
BugIDEA-186229'Search everywhere' loses focus after some item selecting by mouse in the drop-down
BugIDEA-193867Clicking bottom-most 'more' link in new Search Everywhere popup throws IndexOutOfBoundsException
BugIDEA-193862Hard crash macOS
BugIDEA-203496java.lang.IllegalStateException: component cannot be null
BugIDEA-201284Linux Native Menu Bar: main menu is not available if the detached editor has focus
BugIDEA-178692AppServers View: splitter position is not persisted between sessions
BugIDEA-197106DesktopLayout ConcurrentModificationException on startup
BugIDEA-192713focus is lost on opening Find Usages tool window
BugIDEA-189520[fps] gaps in git-log graph edges
BugIDEA-195603IDE crashes on startup
BugIDEA-191812Buttons in license agreement popup overlap each other
BugIDEA-190948Dropdown button for elements content in Artifacts panel is not very good looking
BugIDEA-187932Invoking some features does not affect productivity guide statistics
BugIDEA-195253Project Settings: Assertion Error exception on add+delete incorrect content root
BugIDEA-193169badly rendered SVG icons in Customize dialog
BugIDEA-197862No AA in a list (jre 9)
BugIDEA-133900Can't type @ in Find/Replace dialog
BugIDEA-199585Svg product icon isn't used when IDE is started from sources
BugIDEA-195589Structure popup has weird initial size
BugIDEA-183148Cannot export colour scheme as plugin from PhpStorm
BugIDEA-202939Can't exit search from Mac Touch Bar when no Touch Bar menu configurations
BugIDEA-94851Icons: Griffon icons missing
BugIDEA-198933Problem painting splash screen tail image
BugIDEA-188167Remove light line between vertical tool windows
BugIDEA-202305Update JavaScriptDebugger and JavaScriptLanguage icons
BugIDEA-193028"Refactor this..." is not displayed in Touch Bar
BugIDEA-198321Unable to create exception breakpoint
BugIDEA-154988No default icon suggested on adding buttons to main toolbar
BugIDEA-127973Ctrl+Click doesn't work for multiple selection in Changes | Log, File History
BugIDEA-197803ContextHelpLabel becomes too wide in project type settings
BugIDEA-197801ContextHelpLabel loses its tooltip after switching to another project type pane
BugIDEA-191164[windows] text floats in preview diffs
BugIDEA-198594Input text box selection does not select to beginning of field if mouse pointer moves left of text box edge
BugIDEA-164920Wrap toolbar
BugIDEA-199508New Search Field: replace clean icon with close one
BugIDEA-188687switch on SVG icons by default
BugIDEA-194712Messages tool window header is missing "Collapse/expand all" icons
BugIDEA-194716Fatal error reporting with optional files not working correctly
BugIDEA-194924TouchBar support: touch bar is not appeared after first IDE launch
BugIDEA-201529It should be not possible to reduce panel view to zero size
BugIDEA-151200Ubuntu: Unity menu bar is not available for detached editor tabs and floating tool windows
BugIDEA-184963"Diff Viewer" switch via popup breaks focus
BugIDEA-200724IntelliJ IDEA does not fully start after update, ends with window with menubar and nothing else
BugIDEA-190607It is not possible enter another character in plugin window.
BugIDEA-193383New SE: please remember last action I typed
BugIDEA-191122"Captured Snapshot" notification's "Show in Explorer" link does not work when IDEA is installed on alternate drive letter
BugIDEA-204831On IDEA restart 2 projects are opened while when IDEA was closed only one project was opened
BugIDEA-202749Missing mnemonics for labels
BugIDEA-192976MacBook Touch Bar: show debugger actions when run configuration is shown in Run Dashboard
BugIDEA-200459New Search Everywhere dialog doesn't retain previous search in "All" tab
BugIDEA-201276Linux Native menu: shortcuts disappeared from main menu panel
BugIDEA-23606application Run/Debug Configuration main class chooser issue
BugIDEA-196109New Installed Plugin page's context menu actions are not DumbAware
BugIDEA-192029Touch bar blinks when scrolling the file
BugIDEA-186873Unpinned "Find Usages" window became closed when some control in it are pressed
BugIDEA-190646Tool Window tabs revision
BugIDEA-180725Background Image is not set for the RemoteHosts toolwindow if there are no selected hosts
BugIDEA-197444Run Anything. Shortcut cannot be changed or disabled
BugIDEA-190257Layout changes for no reason when typing in the Description field for a newly created LiveTemplate
BugIDEA-190258Context selection popup is unusable in LiveTemplate editor
BugIDEA-195751New SE: Dialog doesn't fit screen on HiDPI displays
BugIDEA-191318Icons are not scaled correctly in presentation mode
BugIDEA-194795Exception appears when try to open file chooser from Welcome screen
BugIDEA-166871IDEA doesn't show 'Scratch File' button in navigation bar toolbar
BugIDEA-199447Can't select multiple files with [command]-click from Navigate files dialog (regression)
BugIDEA-204130Find usages -> Export to Text background does not match font colour
BugIDEA-204015IllegalArgumentException because event getcomponent is null (from TrayIcon)
BugIDEA-195177Intermittent tests failure on MacBook with Touch bar in IntelliJ project
BugIDEA-194229New SE: layouting of "actions" results
BugIDEA-106651Editor Search/Replace and Find/Replace in Path: font for text input fields is too small
BugIDEA-192303"Darcula" colors are not replaced with "Light" ones on switching LaF back and forth on Windows
BugIDEA-193875Synchronise '' context menu item
BugIDEA-193872New Plugins dialog: search field in "Updates" allows to select plugin that doesn't require update
BugIDEA-193493"Tip of the day" pixelated but correct size with 125% DPI scaling
BugIDEA-194051Wrong row height for com.intellij.codeInspection.ui.ListTable
BugIDEA-118171Show the same background color for files in Favorite as in Project.
BugIDEA-186587'Replace all' confirmation popup is out of focus
BugIDEA-194208"Add Language Annotation" quickfix appearance depends on the position of mouse cursor
BugIDEA-126774Lens mode doesn't show last line
BugIDEA-185007No find in bytecode view
BugIDEA-97714Add "Associate With File Type" to the editor tab context menu and menu
BugIDEA-200379Native menu bar on Ubuntu Linux: the View menu actions have incorrect state
BugIDEA-192720Selection in Local changes resets when context menu invoked via keyboard
BugIDEA-151301Navigation over highlighted search matches in "Override/impl method" dialog only works for method names
BugIDEA-193115TouchBar: dropdown values are not selectable
BugIDEA-185834Scope tabs of the Project toolwindow: focus is lost on item deleting
BugIDEA-190937Changing language in Scratch files not always properly updates file extension
BugIDEA-199619'Use dark window headers' doesn't affect the Welcome window
BugIDEA-204645Help | Submit a Bug Report causes YouTrack to complain about template
BugIDEA-191613Structure tool window steals focus (regression)
BugIDEA-198774Deadlock on a key event process
BugIDEA-194010New SE: some toggles do not change their state while action performed
BugIDEA-194018New Plugins dialog: "enable" link is not visible for a plugin with multiple dependencies
BugIDEA-197937JDK9 - Wrong debugger toolwindow tab label rendering on HiDPI Linux
BugIDEA-197287Holding shift makes it look like you can click on code you can't
BugIDEA-197708New SE: Include non-project items has no accelerator in "All" tab
BugIDEA-199367IDE hangs when searching in Hebrew+English
BugIDEA-189464Poor presentation of incompatible plugins when using the search bar
BugIDEA-200654Search Everywhere not opening file on Linux
BugIDEA-191807Cannot paste file into Scratches
BugIDEA-202634ParameterInfo is now wedged in completion settings area
BugIDEA-198521Preview diff in local changes Tab not always shown
BugIDEA-203219Touch Bar buttons for "Find/Replace in Path" dialog do not correspond to dialog buttons
BugIDEA-201446NullPointerException during using 'FindUsages'
BugIDEA-199024GUI stack overflow with "Find in Path" action
BugIDEA-187482ToolWindow header becomes active when context menu is invoked on editor
BugIDEA-203350Help | Submit a Bug Report does not work for AppCode / CLion / DataGrip
BugIDEA-182408Provide ability to cache icons in platform-api
BugIDEA-194995slow scrolling in svg viewer
BugIDEA-192691Wrong title of JetBrains Privacy Policy window
BugIDEA-198051Remove button in Recent project is overlapping the project path
BugIDEA-197853CaptureConfigurable table has wrong cell/row height
BugIDEA-169693No Help Available In Cannot Save file dialog
PerformanceIDEA-191867Disposed project leaked via Changes View content tab label
PerformanceIDEA-192424Editors are leaked forever after opening, via EditorTabbedContainer.CloseTab shortcut
PerformanceIDEA-192184Goto Class/File/Symbol popups leak via native window and focus traversal policy
PerformanceIDEA-199938"Compress and Show Logs" works on UI thread
PerformanceIDEA-20434130s hang inside DeferredIconImpl
PerformanceIDEA-199779Make generated icons lazy
PerformanceIDEA-198160Non-disposed HelpTooltip leaks disposed project
PerformanceIDEA-178384Too many events from ProgressDialog update (via FileTreeModelBuilder)
UsabilityIDEA-165231Input fields should be inactive when exception comes from 3rd-party plugin
UsabilityIDEA-192075IDE Fatal Errors dialog - cannot copy/analyze stacktrace
UsabilityIDEA-203869Confusing description of language level 12-preview [Java 12 good code red - switch expressions]
UsabilityIDEA-57019Add support for drag-and-drop files in welcome screen.
UsabilityIDEA-166944Reopen project: a way to save half a click
UsabilityIDEA-199392Incorrect menu spacing on macOS
UsabilityIDEA-186774Change UI texts for Editor Tabs Settings
UsabilityIDEA-196288Icons for "Commit" and "Set Active Changelist" are almost identical
UsabilityIDEA-203571Disabled icons on status bar should support LAF changes
UsabilityIDEA-203577Update tool window modes menu
UsabilityIDEA-197645Tools | 'Internal Actions' menu is too long
UsabilityIDEA-191113Don't show "Background tasks running" if we know the tasks can be safely resumed
UsabilityIDEA-191361Exception dialog is too tall
UsabilityIDEA-193841New "Search classes" does not show outer class for inner classes
UsabilityIDEA-187091'Mark Directory as | Unmark root' option name is confusing
UsabilityIDEA-187133Redesign remote configuration
UsabilityIDEA-179591'Couldn't checkout. Rollback changes to not let branches diverge' message extends past screen on Mac OS X
UsabilityIDEA-198537Settings dialog search: on finding an entry in new Plugins page the plugins list is not filtered and not scrolled
UsabilityIDEA-198538Search Everywhere / Find Action: on finding an entry in Plugins page the plugins list is not filtered and not scrolled
UsabilityIDEA-110169New Action dialog loses all information when there is an error after pressing "OK"
UsabilityIDEA-197044Run configuration doesn't fit the screen
UsabilityIDEA-125158Do not show versions of bundled plugins
UsabilityIDEA-202513'Evaluate' window always shows on a fixed size and location.
UsabilityIDEA-180216Image viewer zooms in wrong direction on scroll wheel
UsabilityIDEA-189726Tree nodes expand unexpectedly when navigating using Up/Down keys
UsabilityIDEA-198129Mac: impossible to switch to Diff Window with a shortcut after switching to the project
UsabilityIDEA-190363Improve UI of 'Third Party Software' list
UsabilityIDEA-185564Match Refactor | Extract | Method ... with "refactor method" in Find action
UsabilityIDEA-200298Show the first unsubmitted error when clicking on the "Fatal Error" icon in the status bar
UsabilityIDEA-103803Customize menus and toolbars - Choose action to add - Usability
UsabilityIDEA-170891Show meaningful error when IDE fails to create new project in the read only directory
UsabilityIDEA-190251Unhelpful and misleading wording in update checker under Toolbox
UsabilityIDEA-195300"Copy relative path" should exist in the keymap, or somehow lead to "Copy reference"
UsabilityIDEA-195309Support Ctrl+Backspace in SpeedSearch
UsabilityIDEA-167451file chooser dialog: can't definitely say which icons are grayed and which are wnot
UsabilityIDEA-192403Touchbar support for Select in > Project view
UsabilityIDEA-190216Hard to resize quick doc popup
UsabilityIDEA-173072Change wording in "IDE updates are managed externally and weren't checked": message is unclear
UsabilityIDEA-192180No speed search: Edit Severities
UsabilityIDEA-153071Settings > Version Control > Confirmation window resize issues
CosmeticsIDEA-203829Analyze actions shows "Include test sources" option even if there are no tests in the project
CosmeticsIDEA-174261"Unused declaration" inspection settings has ugly buttons
CosmeticsIDEA-134373File type icon on windows title bar doesn't reload for non-physical files
CosmeticsIDEA-118069Untidy one-pixel gap between border and toolbar buttons
CosmeticsIDEA-191307Update "Create Gist" Git Octocat icon to white cat in black circle
CosmeticsIDEA-188095Button width should accommodate the length of the label plus standard indents
CosmeticsIDEA-169819"New Window" button in open project dialog has extra space
CosmeticsIDEA-204690Mojave: low contrast menu selection background
CosmeticsIDEA-193276Strange gray rectangle instead of disabled value when moving Class
CosmeticsIDEA-198742Markdown "Auto-Scroll Preview" Button Looks Like "Download"
CosmeticsIDEA-190090Double arrow cursor on Project tree header on hover
CosmeticsIDEA-194379Auto-hide scrollbar on OS X similar to how default scrollbars work
CosmeticsIDEA-196183TODO view: trim the ending spaces in the changelist name when displaying it in TODO view tab
CosmeticsIDEA-200555Icons in the Apply Patch dialog are not updated
CosmeticsIDEA-191579table view folded/unfolded toolbar inconsistency
CosmeticsIDEA-193385New SE: cursor keeps improper shape
CosmeticsIDEA-184165Startup splash screen progress bar is not centered
CosmeticsIDEA-197467Modernize Maven Run/Debug Configuration icon
CosmeticsIDEA-190919Increase height for popup headers with buttons
CosmeticsIDEA-191985Speed search is truncated
CosmeticsIDEA-199007Incorrect progress dialog border rendering
TaskIDEA-191080Refactor components to clarify insets meaning
TaskIDEA-189867Switch Search Everywhere toolbar icon to ActionButton
TaskIDEA-192178Enable IntelliJ laf on Mac
TaskIDEA-190225Replace Run Configuration combobox with button if no configuration created
TaskIDEA-197166Increase click and hover zones for the close button for Manage Recent Projects popup and Welcome Screen
TaskIDEA-194353Change focus border for field and combo in table cell
TaskIDEA-188160Make terminal tabs the same as other tool window tabs
TaskIDEA-192417Provide an API for adding status bar widgets
TaskIDEA-190218Rename "Default settings" and "Default project structure"
TaskIDEA-195244Merge two 'Version' comboboxes in repository library settings dialog
TaskIDEA-196095Update icons for Build tool window statuses
ExceptionIDEA-193393TouchBar: exception is thrown after cancelling Project Structure window
ExceptionIDEA-203174ShortcutSet of global AnActions should not be changed outside of KeymapManager
ExceptionIDEA-200273Exceptions: GlobalMenuLinux - Unable to register window and AppMenu-service can't register xid
ExceptionIDEA-193575New SE: ClassCastException on selecting filter criteria
ExceptionIDEA-186452StackOverflowError on setting Floating mode for console
ExceptionIDEA-191859Using this EAP caused my Mac to hang twice today. I had to restart. It looks this version is completely broken.
ExceptionIDEA-199072java.util.ConcurrentModificationException
ExceptionIDEA-200919ClassCastException: java.base/jdk.internal.misc.Unsafe cannot be cast to jdk.unsupported/sun.misc.Unsafe
ExceptionIDEA-203132NullPointerException occurs on entering Presentation mode
ExceptionIDEA-195533NPE in RequestFocusInToolWindowCmd
ExceptionIDEA-203612NullPointerException occurs on opening a second/new project in the same window
User Interface. AccessibilityBugIDEA-193617Accessibility issue with ComboBox and the Win10 LAF
BugIDEA-199219tables in dialogs not accessible
BugIDEA-182960Screen Reader Accessibility: Autocomplete
BugIDEA-201167File tree in Commit dialog and Revert changes are not accessible for Jaws
BugIDEA-204449[a11y] instant rename refactor popup items are not selectable
BugIDEA-203712[a11y] completion popup closes immediately in break point settings
BugIDEA-189859provide JVM property for the screen reader option
BugIDEA-201843NavBar popups are closed on up/down/speed search
BugIDEA-201273Problem with User Agreement Accessibility
BugIDEA-200351can't escape diff dialog when screen reader is enabled
UsabilityIDEA-192637NVDA: Debugger
TaskIDEA-195260UI element with line numbers and debugging graphic not accessible to screen readers
User Interface. Action SystemBugIDEA-202541Replacing an action via unregisterAction/registerAction may not update references in action groups
BugIDEA-202598Remove action from all action groups when ActionManager.unregisterAction is called
BugIDEA-198166`enter` key does not work in pycharm switcher
BugIDEA-197877Throwable is thrown when switching files while Current File TODO Toolbar is opened
ExceptionIDEA-203236Throwable occurs when accessing "Run Anything" via shortcut
User Interface. ControlsBugIDEA-197998Multiline TODOs: multiline values are not displayed in toolbar on macOS
BugIDEA-196307Stripe buttons layout is broken after 'move to top/left/bottom/right'
BugIDEA-202228NPE at com.intellij.ide.ui.laf.darcula.ui.DarculaProgressBarUI.paintDeterminate
BugIDEA-201124Linux native menu: main menu appears on a toolwindow in windowed mode
BugIDEA-200857TabbedPaneUI reduces tabs font when switching theme
BugIDEA-195921Toolbox buttons are cropped on hidpi displays with non-default UI font size
BugIDEA-195717Clicking directly on the arrow in the intention's menu has no effect unless it's done more to the right
BugIDEA-200457ComponentValidator doesn't work with EditorTextField
BugIDEA-197936New SE: unable to use Ctrl/Cmd to expand selection
BugIDEA-196606Floating toolwindows can't be moved
BugIDEA-193777Cannot switch on 'Show function keys on touchbar' feature
CosmeticsIDEA-202283Plugins UI: Top border of "Back to Plugins" button is cut
CosmeticsIDEA-201120Cannot Run Git popup contains Configu link instead of Configure
User Interface. FocusBugIDEA-187615VCS tool window loses focus when file is selected from History dropdown list
BugIDEA-172564Webstorm 2017 REGRESSION BUG! - Pressing F4 In full screen mode diff does not close diff dialog
BugIDEA-196542Exceptions from intentions are logged as info, not error
BugIDEA-199344The "Find In Path" action throws TypeAheadTimeoutException
BugIDEA-186820Escape key often stops moving focus from a tool window back to the editor
BugIDEA-194482Focus lost from main pane after swithcing tabs with keyboard (Alt+Right)
BugIDEA-203154Focus lost when some tab is closed in Version control toolwindow
BugIDEA-196291IntelliJ is sometimes not persisting files to file system
BugIDEA-198612can't tab out a pane once breakpoint is hit
User Interface. GraphicsBugIDEA-199416IDEA startup NPE if no 'icons' specified in theme file
BugIDEA-193488Tool windows blur text when slide in/out
BugIDEA-195624wave underscore is partially bold
BugIDEA-195981Validation errors: bugs
BugIDEA-195614IAE in EffectPainter2D
CosmeticsIDEA-197371Add down arrow in "Go To Changed Files" in diff dialog
User Interface. Keyboard InputBugIDEA-203999Double CMD doesn't show tool windows
BugIDEA-201492Default keymap doesn't save shortcuts
UsabilityIDEA-201494Shortcut chooser dialog cannot be submitted from keyboard
User Interface. Look and FeelBugIDEA-200591White editor for Darcula scheme by default
BugIDEA-185124Project Structure dialog doesn't change theme properly
BugIDEA-202248Color Scheme reverts to Darcula from *custom* light color theme after restart if IDE theme is Darcula
BugIDEA-200171High Contrast Theme: Editor color scheme remains "High Contrast" after changing theme from "High Contrast" to "Darcula"
BugIDEA-195856IDEA fails to start on Java 10
BugIDEA-203934Icons become of a Darcula theme after restarting IDEA with "High Contrast" theme set
BugIDEA-200158High Contrast Theme: Menu bar and popup menu items are not highlighted when selected after restarting IDEA with "High Contrast" theme set
BugIDEA-200278Background in editor doesn't change according to color scheme
BugIDEA-199525Mojave: selected item in context menu is highlighted with a different color than in the main menu
BugIDEA-183573printing a PHP source always encases the text in a background color (Darcula)
BugIDEA-204746No border between 'Shelf' toolwindow content area and toolbar
BugIDEA-191398NullPointerException when switching theme to GTK+
BugIDEA-200845Editor color scheme is not applied when switching between custom themes
BugIDEA-159315Black text on dark background in 'Rename File' dialog box. (Dracula theme)
CosmeticsIDEA-186708Standard panel height difference between Darcula and IntelliJ themes causes buttons misalignment in DialogWrapper
CosmeticsIDEA-193982Problem toolbar menu item's icon seems disabled when enabled
CosmeticsIDEA-204282Tree in "File and Code Templates" has grey background when "High Contrast" theme is applied
CosmeticsIDEA-191671Mac menu icons don't handle Darcula well
TaskIDEA-198114Remove GTK/Windows native LookAndFeel support
TaskIDEA-203153Support old color key names
User Interface. NavigationFeatureIDEA-202496Extension point to alter "No {0} found" text in Search everywhere contributor
FeatureIDEA-184492"File..." action is suggesting folders
FeatureIDEA-198407Add nullness annotations to base SearchEverywhereContributor class
BugIDEA-199862No selection until search is not finished
BugIDEA-195557Cannot close splitted editor part after switching original editor
BugIDEA-196401Don't show "no classes / files /symbols found" when files are found
BugIDEA-199768New SE: remove duplicates on "All" tab
BugIDEA-199517Add Run Configurations to new SE
BugIDEA-201937Search Everywhere shortcuts: Ctrl/Shift+Tab shortcuts set for tabs switching do not work if Tab shortcut is set for "Select item" action
BugIDEA-201051New SE: Use "Tab" key for command autocomplete
BugIDEA-199664[Run config in the new SE] hints to run or to debug configuration are mixed with each other and should be vice versa
BugIDEA-198579Freeze while searching files by name during indexing
BugIDEA-198765Rubymine 2018.3 EAP display file/folder paths truncated
BugIDEA-200462New SE: Add statistics
BugIDEA-195792No file name completion in File Choosers
BugIDEA-199757Fuzzy search works with folders only if slash filled in
BugIDEA-196250It is impossible to invoke "Recent files" action from the "find action" popup.
BugIDEA-201868New SE: Use FUS statistics provider
BugIDEA-199403New SE: skip other contributors results when search with command
BugIDEA-202230Setting or registry items aren't shown in "Find Action" dialog
BugIDEA-154117Cannot bind Alt+S to an action
BugIDEA-197872Select in... is broken in new Search Everywhere
BugIDEA-201308New SE: Actions descriptions is not shown in status bar
PerformanceIDEA-200920Goto File is slow
PerformanceIDEA-201678Analyze stacktrace hangs
UsabilityIDEA-199661Results in "Search Everywhere" are delayed
UsabilityIDEA-198002New SE: part of the popup is outside the screen
UsabilityIDEA-204424Confusing representation of items without a group in go to related symbol popup
CosmeticsIDEA-199666[Run config in the new SE] run config name and hints doesn't change a font color to white when is selected
CosmeticsIDEA-198030New SE: Search item full name is overlapped by scrollbar
ExceptionIDEA-200357'Quick Documentation' action fails with exception
User Interface. Project ViewFeatureIDEA-145898Scratches timestamps and preview
FeatureIDEA-200471File nesting not happening when file name is equal to configured file suffix
BugIDEA-192786Wrong directory is highlighted during moving files to Scratches
BugIDEA-195578New files do not show on package view
BugIDEA-188727"Select in Project View" should select file in active scope (and not switch to "Project" tab)
BugIDEA-204481Folders from "Scratches and Consoles" node do not disappear from the tree after deleting
BugIDEA-190556Scratches and Consoles - when adding a new scratch file, the project view wasn't updated and the file is not seen
BugIDEA-192028Directories with dots in the name show up incorrectly in Project pane
BugIDEA-183801Structure panel doesn't show correct data
BugIDEA-191952Scopes view: flatten packages doesn't work
BugIDEA-192364Problems with opening multiple files when Scoped view is selected
BugIDEA-196319Non-project/excluded from custom scope folders are still visible in project view
BugIDEA-166142Autoscroll from/to source broken
BugIDEA-189742Items in Project View remain highlighted as incorrect after deleting the class with uncompilable code
BugIDEA-203616Update in Resource Bundle makes the file explorer to close the Resource Bundle folder
BugIDEA-189991File changes external to project tree view cause collapse and reset
PerformanceIDEA-185472Idea is unresponsive while updating Gradle projects
UsabilityIDEA-182143Edit Scopes option only appears in Project tool window's menu when a custom scope is selected
UsabilityIDEA-25714Empty folders are invisible in scope tree view
UsabilityIDEA-194516Issue when changing error color
UsabilityIDEA-186081Collapsing tree node does not collapses all subnodes (regression)
CosmeticsIDEA-168362Inconsistent labels in Project Tree View
ExceptionIDEA-85169PIEAE through ProjectViewTree.paintFileColorGutter() on pasting incomplete annotation inside another annotation
ExceptionIDEA-203552CancellationException at org.jetbrains.concurrency.AsyncPromise.cancel
Version ControlFeatureIDEA-167703Shelf deletion should support undo instead of confirmation
FeatureIDEA-193058Update commit legend UI
FeatureIDEA-66051Local Changes: need a special subtree/group only for unmerged conflicts.
FeatureIDEA-66943Add "Revert Commit" action to file history context menu for Git
FeatureIDEA-177606Use more relaxed heuristics to mark cherry-picked commits
FeatureIDEA-52927Version control: Unversioned Files: provide possibility to specify the amount of unversioned files that would be shown in separate view
FeatureIDEA-193537Update "Commit Message History" action UI
FeatureIDEA-160857Unversioned Files in Commit Changes dialog: support delete shortcut (DEL)
FeatureIDEA-120755Local changelists: apply background scope colors for files as in other views
FeatureIDEA-200561VCS Annotations: add mode to show author initials instead of full name
FeatureIDEA-203130Allow to apply shelved changes without removing them from shelf by dragging corresponding changelist to 'Local Changes' tab while holding Ctrl
FeatureIDEA-63893Show current branch on Commit Dialog
FeatureIDEA-182234VCS code analysis: specify exactly how many files contain problems
FeatureIDEA-202946Show History for selection should work for the caret position
BugIDEA-190311Commit directory action is not searchable
BugIDEA-191782No tooltip for new button containing "ignore" actions in Changes view
BugIDEA-148366File history: file history is not shown on two simultaneous requests
BugIDEA-192400"Move to Another Changelist..." creates new changelist instead of using existing one
BugIDEA-186772Git compare two branches: sort is wrong
BugIDEA-196914Compare with local is disabled for directories in Mercurial History
BugIDEA-188052Tasks create branches with quotes
BugIDEA-186651Move to another changelist shortcut in Diff moves the entire file
BugIDEA-188502Commit Window Automatically Scrolls Back and Forth While Clicking
BugIDEA-188501Partial Commit: "Git | Revert" action reverts changes, that are excluded by checkboxes
BugIDEA-204713Deadlock after switching git branches (with kotlin)
BugIDEA-186725Changes grouping by repository: confusing results for external VCS root if group by module is used
BugIDEA-92390Added files are placed into default changelist after rename
BugIDEA-188319Partial Commit: Pre-commit changes by "Update Copyright" hook will not be committed when committing non-active changelist
BugIDEA-179602Workspace should not be restored is a branch is not checked out
BugIDEA-168338Apply patch choses wrong module for new files if there is similar path in other module
BugIDEA-115100Maven project import sets Subversion VCS for submodules, if there is a folder or file called .svn in parent folders
BugIDEA-190095File Mismatch When Unshelving Changes
BugIDEA-192793SelectChangesGroupingActionGroup doesn't work via Quick Actions Popup
BugIDEA-106293VCS gets confused if you revert changes quickly
BugIDEA-151064Show Diff action is not available in annotations of an old revision
BugIDEA-192474Annotate fail in error
BugIDEA-189350Undo sometimes doesn't work if 'partial Git commits' feature is enabled
BugIDEA-192877Git: CheckOut Tag Or Revision: on the first invocation some tags are not available in completion
BugIDEA-148109A file ignored via .gitignore is shown as modified in 'Local Changes'
BugIDEA-192203keymap "Xcode" not found warnings on startup from Git4Idea & hg4idea
BugIDEA-186758LocalChanges view: when focus in in the Diff Preview, click in the changes tree doesn't change selection
BugIDEA-194895Git annotate: "Number of lines annotated by git is not equal to number of lines in the file ..."
BugIDEA-189523Cannot delete changelist created by Remote Run in TeamCity
BugIDEA-193195Compare Before with Local should support file move
BugIDEA-183551Copy As Patch to Clipboard enabled only on files
BugIDEA-198676TODO appears in list several times on 'Review TODO' with selected 'Check TODO'
BugIDEA-197154Exception when highlighting a VCS file version opened via Browse Repository at Revision
BugIDEA-153272Files are lost during the movement of unversioned files to overwrite existing files with same names
BugIDEA-202099Shelve tab automatically closed if delete last shelve even if there are items in Recently deleted
BugIDEA-193116"Compare with Local" doesn't work with "added" shelved files
BugIDEA-192552CloneDvcsDialog#prependToHistory: Cannot use this method with a non-Mutable data model
BugIDEA-189699Wrong unshelving: XML file is restored to not original state (duplicating lines)
BugIDEA-187108Commit action does not respect file selection in Local changes
BugIDEA-187101EAP #IC-181.3870.7:Create partial patch does not work as expected
BugIDEA-204764File history missing part before rename/modified conflict.
PerformanceIDEA-192017Unshelving creates a thread for each shelved file
PerformanceIDEA-201408ChangesViewManager's tree builds itself in EDT causing performance problems
PerformanceIDEA-174636Unregistered VCS root scanning, which happens in the Settings | Version Control, should be moved out of the EDT
PerformanceIDEA-195871VcsRootScanner adds everything under a symlinked directory into the VFS
PerformanceIDEA-203998Do not use RemoteRevisionsCache for Git
PerformanceIDEA-199583Files affected by revision is slow when invoked from annotation markers
PerformanceIDEA-188192File History view periodic refresh causes synchronous VCS queries under modal dialogs
PerformanceIDEA-131357Idea stucks after "accept mine" for 100 files in merge dialog
UsabilityIDEA-192073Missing 'Expand All/Collapse All' icons in VCS Local changes
UsabilityIDEA-187405Copy to clipboard can copy the currently visible in-place diff instead of the just selected text in editor
UsabilityIDEA-171261Cannot delete last changlist
UsabilityIDEA-131325VCS Commit Message box is using the caret foreground from "Generic" but background color is not inherited from "Generic"
UsabilityIDEA-199471Add Shortcut to open Diff from annotations without invoking contex menu
UsabilityIDEA-193296Assign default shortcut for the "Set Active Changelist" action
UsabilityIDEA-186415Clear metadata associated with changelist after first successful commit
UsabilityIDEA-140866Conflict in button's keyboard shortcuts in the Code analysis failed dialog
UsabilityIDEA-187114Regression: there is no shortcut to group changed files by directory in 'Local Changes' view anymore
UsabilityIDEA-138130Make 'vcs changed' popup scrollable for much code
UsabilityIDEA-195646'Local Changes' tree shows module names instead of directory names if 'Group by: directory' is selected
UsabilityIDEA-93999Don't show modal "add files to VCS" dialog when files being added are project files
UsabilityIDEA-198769Provide better progress indication for the Show Affected Paths dialog
UsabilityIDEA-201491Default key binding for VCS/Git/Branches conflicts with MacOS binding
UsabilityIDEA-195922Local changes: Focusing an empty changelist doesn't remove the preview diff
UsabilityIDEA-204999Preview diff is too wide if file path is long
UsabilityIDEA-199656Changelists should be expanded by default, and should retain the state
UsabilityIDEA-192682Can't drag&drop several files from 'Shelf' tool window to the 'Local Change" tool window
UsabilityIDEA-196963Unclear dialog options in abort/rollback
UsabilityIDEA-141136Extremely wide not-resizable "Commit Changes" dialog in case of a long error message
UsabilityIDEA-184616'Reword commit" do not add/alter item in commit message history
UsabilityIDEA-189421Undoing typing sometimes works in two steps if 'partial Git commits' are enabled
CosmeticsIDEA-195273Default Changelist Changelist
CosmeticsIDEA-197717Edit Changelist should have default shortcut
CosmeticsIDEA-203839Change 'Unshelve changes' dialog button rename
CosmeticsIDEA-82955Windows-specific setting name
CosmeticsIDEA-195248Dialog Add File to Git, change Yes/No buttons to Cancel/Add File to Git
TaskIDEA-191668Replace "Move to another changelist" icon with combobox in Commit > Diff dialog
TaskIDEA-190945Update icons in diff dialog
TaskIDEA-191693Update patch icon
ExceptionIDEA-200051IllegalStateException: Cannot find content provider for vcs hg4idea
ExceptionIDEA-131135AE at com.intellij.openapi.vcs.changes.ui.ChangesBrowserFileNode.render
ExceptionIDEA-201711Throwable at com.intellij.openapi.application.impl.ApplicationImpl.assertReadAccessAllowed
ExceptionIDEA-188593ISE at com.intellij.openapi.vcs.changes.ui.CommitChangeListDialog.$$$reportNull$$$0
Version Control. GitFeatureIDEA-75835Init Git projects submodules automatically or by asking user at least?
FeatureIDEA-147018Delete git tag
FeatureIDEA-116425Ignored files and folders should indicate that they are ignored
FeatureIDEA-139940Force push could be made a bit safer with --force-with-lease option
FeatureIDEA-192678Multiple Github accounts: show login dialog if attempt to perform the remote operation fails
FeatureIDEA-95494Copy some files from one branch to another branch
FeatureIDEA-74492Git: Checkout tag or revision: provide a list of available tags in combobox
FeatureIDEA-190870Cherry-pick only some of the files from the selected commit
FeatureIDEA-88818When creating .idea directory, automatically put inside a .gitignore containing workspace.xml and other files which have to be excluded from the VCS
FeatureIDEA-192369Allow configuring Local changes toolbar in "Appearance & Behavior | Menus and Toolbars"
FeatureIDEA-160208Git Fetch multiple roots in parallel
FeatureIDEA-184293Create a .gitignore on enabling VCS integration in new projects
FeatureIDEA-193870Set GIT_OPTIONAL_LOCKS for IDE operations
FeatureIDEA-64024Git submodules should be supported
FeatureIDEA-133270(Git) Annotate should retain history through file renames.
BugIDEA-199226Git "Browse Repository at Revision" panel is not available in dumb mode
BugIDEA-186463After the valid git executable is configured for a project reopening is necessary to make Log or History displayed
BugIDEA-192800Allow force push is available in Find action but does nothing
BugIDEA-187706Partial Commits: First included file is not selected in commit dialog by default
BugIDEA-200208Git: the set custom shelf location should be considered on .gitignore generating
BugIDEA-189369Cannot deselect files with line-ending changes only in the commit-dialog tree
BugIDEA-200433VCS: gitignore not always created after new project creation
BugIDEA-186342Cherry-pick with auto-commit uses full hash in the suffix, while cherry-pick showing the dialog uses short hash
BugIDEA-199263Confusing "Add file to Git" dialog choice
BugIDEA-201193Git Fetch is fetching only the current remote
BugIDEA-196503Git: Partial Commits: when ShowDiff is invoked for file in specific changelist should display changes from this changelist
BugIDEA-187425 Partial Commits: Exclude Lines From Commit action does not work with deleted blocks
BugIDEA-187426Partial Commits: Exclude Lines From Commit action does not work with selection in left editor
BugIDEA-123397Git: History for file doesn't show anything before the move if there were too many changes in the commit that moved the file
BugIDEA-185964Git: Partial Commits: after turning the HighlightFilesFromNonActiveChangelists ON the behavior becomes unpredictably wrong
BugIDEA-196286Git Reword Commit sometimes throws an exception when trying to find a commit to reword
BugIDEA-108316Unregistered Git roots are not auto-detected if they are more than 2 folder levels deep than any project module
BugIDEA-196449IntelliJ tries to set git username and email for non-git vcs roots.
BugIDEA-196117Have not understood this message, there is a grammatical mistake
BugIDEA-180112IDEA stores passwords in memory even when "Remember" is unchecked
BugIDEA-201054Git: native SSH: confusing dialog on attempt to connect to (yet) unknown host
BugIDEA-200096New parallel multi-root fetch not working with store credential helper
BugIDEA-187375Partial commit checkboxes are not always shown
BugIDEA-191309Commit failed with error
BugIDEA-192906Git Push with Rebase puts all changes into the Default changelist
BugIDEA-193239Incorrect branch names shown for "checkout with rebase" and for interactive rebase operations
BugIDEA-198271Git: Native SSH: if password authentication is used, the password can't be remembered
BugIDEA-200864Update Project doesn't fetch submodules
BugIDEA-193788Git: Submodules: attempt to merge conflicts fails
BugIDEA-193259Git: Browse Repository At Revision: on new revision tab opening move focus there
BugIDEA-202874Indexing is suspended during the cherry-pick process
BugIDEA-203005Project update over SSH fails if there are many repositories
BugIDEA-181823moving a class to another package leaves it unversioned in git
BugIDEA-204480Git: all remote operations fail with "execvp: No such file or directory" error
BugIDEA-200432VCS: deleted previously generated .gitignore file will be recreated anew after opening project again
BugIDEA-200486"This file doesn't belong to the project" warning for .gitignore file in the project
BugIDEA-201575Failed git clone notification shows progress messages
BugIDEA-191992Files Merged with conflicts shows only one branch name
BugIDEA-195270Missing notification about invalid Git roots
BugIDEA-192771Git commit partially causes change CRLF to LF.
BugIDEA-193141Git: on saving file after Reword Commit performing i often get the File Caches Conflict dialog
BugIDEA-193140Can't undo rewording of a commit made before a merge commit and get an exception
BugIDEA-185221Git 2.16 considers Builtin SSH as simple client => `ssh variant 'simple' does not support setting port` error on remote operations
BugIDEA-200448VCS Git "Fetch" does not refresh the VCS "Log" view
BugIDEA-198727Git Submodules: Annotate is enabled in the Diff view for the submodule entry but returns 'fatal: bad object'
BugIDEA-187748Partial Commit: can't move file with changed line separators to another changelist
BugIDEA-199581Diff opened in a separate window takes forever to complete when cherry-picking
BugIDEA-198723Git Submodules: project update doesn't update submodule project if the submodule is on branch
BugIDEA-187498On partial shelve the changes excluded from shelve are moved to default changelist
BugIDEA-187702Git: Resolve conflict during rebase - "Accept Theirs" does not work
BugIDEA-169002Git submodules: Diff invoked for submodule entry shows 'fatal:bad revision...' message
BugIDEA-193688Squash message editor starts with an extra line break
BugIDEA-190132GitCheckinEnvironment#reset needs to split request into multiple commands.
BugIDEA-202796Git Remote operations do not work with Native SSH
BugIDEA-169020Exception from the VcsLogRefresher, if a Git root is unregistered in the Settings
BugIDEA-200211Git: if the project files are located not in the project root, but in some subfolder, the .gitignore is generated incorrectly
BugIDEA-199969Git: .gitignore is created in the project root on git repository creating in one of its subfolders
BugIDEA-199966Git: .gitignore created on enabling git in project should not contain absolute paths
BugIDEA-193934Git clone --recurse-submodules checkouts submodules in detached state which breaks Update project
BugIDEA-188681Partial commit does not work for old git (1.x)
BugIDEA-198360Git: built-in SSH: if the saved password doesn't match, allow to enter the new one
BugIDEA-198951Pushing main repo with submodule with reject leads to "not on branch" AssertionError
BugIDEA-198952Rejected push in a submodule fails if "Update non-rejected repositories as well" is not selected
BugIDEA-172234Git Branches Popup Menu does not pop up at all
BugIDEA-195466Status of new files is not parsed if `git add -N` was used
BugIDEA-197249Builtin-SSH: fails when git protocol.version 2 is enabled
BugIDEA-198143On Linux, remote git operations over SSH hang if IDEA started via terminal (has tty assigned)
BugIDEA-194286Continue rebase doesn't refresh file status
BugIDEA-197506Git clone operations are not listed in log
BugIDEA-198264Git: Native or built-in SSH: correctly process the invalid (empty) passphrase
BugIDEA-168999"History up to Here" for a submodule folder shows empty history
BugIDEA-189562Deadlock during VCS changes revert
BugIDEA-200107Exception when invoke Default Settings from Welcome screen
BugIDEA-199761File names with trailing spaces break git diff
BugIDEA-200354unwanted .gitignore created
BugIDEA-194449New Git root is not detected until restart, if added externally as a submodule or under a new subdirectory
BugIDEA-193260Git: Browse Repository At Revision: JumpToSource action for folders is enabled but doesn't work
BugIDEA-140196Built-in SSH: does not support strong security ciphers - Cannot negotiate, proposals do not match
BugIDEA-197913File History on a submodule folder shows the log of the submodule repository
BugIDEA-170013Git Native SSH with passphrase fails with Permission denied
BugIDEA-188650Git: Partial Commits: for some changes the diff preview is wrong
BugIDEA-193134Multiple Github accounts: clone doesn't suggest github repositories if you are not logged in to all accounts
BugIDEA-149060Modified files in one of repositories are often moved to the active change list
BugIDEA-196072Git Rebase dialog - Onto branch not persistent
BugIDEA-156454No Unstash of uncomitted changes when cancelling Git Rebase
BugIDEA-199003git commit failed with "the following paths are ignored by one of your .gitignore files"
BugIDEA-187335On Partial Shelve reverts only selected changes are shelved, but the whole file is reverted
BugIDEA-100075Git submodule commit should make parent repository re-request Git status to show updates to the submodule folder itself
BugIDEA-191210Run Git Hooks option does not check for commit-msg hook
BugIDEA-175120Files are shown in local changes but diff says contents are identical
BugIDEA-191656Git commit history with control characters causes intellij to spin, consuming CPU and repeating the same stack in the idea.log
BugIDEA-194991Annotation tooltip is huge and empty
PerformanceIDEA-197868Branch listings extremely slow with many remote branches
PerformanceIDEA-193442Git Cherry-Pick became slower because of long process of searching for containing branches
PerformanceIDEA-1965352018.2 constant java processes
PerformanceIDEA-201588GitUtil.isGitRoot is expensive on windows and called too many times
UsabilityIDEA-194090Protected branches do not prevent branch deletion
UsabilityIDEA-167671No simple shortcut for Force push
UsabilityIDEA-192982Multiple Github Accounts: if default account is selected and you are logged in, use this account for sharing and skip not authenticated ones
UsabilityIDEA-136155Git Resolve conflicts: use more specific text for 'theirs' and 'yours' labels
UsabilityIDEA-83415IDEA should "git commit" when possible instead of always calling "git commit --only" with paths
UsabilityIDEA-192333Automatically register Git submodules as VCS roots
UsabilityIDEA-56183Optionally Do not show "Push" dialog after pressing "Commit and Push"
UsabilityIDEA-180118Interactive Rebase: Clicking Cancel in the dialog to enter a message for Squashed commits should cancel rebase.
UsabilityIDEA-118140Don't add renamed or moved files to git index unless configured to do so
UsabilityIDEA-155587Git action "Checkout with Rebase" has counter-intuitive name
UsabilityIDEA-163630"Cherry-picked from" suffix should be optional
UsabilityIDEA-187320"Show history for revision" action name is unclear
UsabilityIDEA-201596Don't add unrelated entries to automatically created .gitignore file
UsabilityIDEA-197543Native SSH doesn't allow to save the passphrase or the password
UsabilityIDEA-183867Ignore whitespace changes in annotations for git option
UsabilityIDEA-153448Shortсut to change action in "Rebasing Commits" window
UsabilityIDEA-190367Shortcut for git branch by default
UsabilityIDEA-199926Scanning for Git roots in a project should skip known third-party libs locations
UsabilityIDEA-174119Git -> Add option should execute git add for all selected files
UsabilityIDEA-144072Sort order of branch names in git branches drop-down lists is not alpha-numerical (Rebase, Branch Widget etc)
UsabilityIDEA-195155Rebase Branch - Onto box should default to refs/heads/master if there is no tracked branch
UsabilityIDEA-144948Branch list in Git Rebase dialog should include remote branches
UsabilityIDEA-124453Update Project should not fail completely when some module can't be updated (have no remotes, doesn't have a tracked branch, is in detached state, etc)
CosmeticsIDEA-198989Broken html in remotes dialog
CosmeticsIDEA-198272Git: change the tooltip text for "SSH executable" option in Settings
CosmeticsIDEA-192384History for Selection shouldn't be visible in the context menu of Project Files
CosmeticsIDEA-203057Unify wordings in 'GitHub Pull Requests'
CosmeticsIDEA-168642Git remote editor doesn't resize properly
CosmeticsIDEA-192092Rephrase a notification that appears when users switch branches
ExceptionIDEA-197947ISE at git4idea.commands.GitNativeSshGuiAuthenticator.askKeyPassphraseInpu
ExceptionIDEA-193107IllegalArgumentException trying to open Branches menu in the detached HEAD state
ExceptionIDEA-194024AssertionError at git4idea.rebase.GitRebaseLineListener.onLineAvailable
ExceptionIDEA-202533IllegalArgumentException occurs on attempt to fetch changes from remote git repository if repository is not set
ExceptionIDEA-186769CME at com.intellij.openapi.vcs.changes.conflicts.ChangelistConflictTracker.optionsChanged
ExceptionIDEA-192978kotlin.UninitializedPropertyAccessException at org.jetbrains.plugins.github.GithubShareAction$Companion$shareProjectOnGithub$1.onSuccess
Version Control. GitHubFeatureIDEA-202764Add Open on GitHub option to annotations in diff dialog of older revisions
BugIDEA-201720Multiplr Github accounts: can't clone from the accessible host while another configured one can't be reached
BugIDEA-198120Cannot create github token when one with the name already exists
BugIDEA-200881GitHub: Cannot view a PR on GitHub Enterprise 2.12 or older
BugIDEA-192531Clone from github: incorrect behavior in case of github accounts configured but w/o saved credentials
UsabilityIDEA-200690Git: Pull Requests Browser: can't autocomplete suggested search query
UsabilityIDEA-200441Git: "Сhoose Github Account " dialog size is not remembered
CosmeticsIDEA-198247Use smoother scaling for avatars in GitHub accounts panel
Version Control. LogFeatureIDEA-199867Support Back and Forward navigation in VCS Log
FeatureIDEA-130845Log: add action to go-to-parent and go-to-child
FeatureIDEA-190615Explore the source code based on specific revision
FeatureIDEA-116053Ability to open filtered results in Changes/Log view a new tab
FeatureIDEA-170988Add Diff Preview to File history view
BugIDEA-191908Recent branches/users/paths should be shared between different Log tabs.
BugIDEA-180371Open Repository Version uses Jump-to-Sources Hotkey
BugIDEA-204247VCS Log repository root filter doesn't show tagged commits
BugIDEA-193814com.intellij.openapi.vcs.VcsException: Index: 1, Size: 1
BugIDEA-199655Unable to see git diff from file history for renamed file for commits made before rename
BugIDEA-198803VCS log shows garbage in "author" field, looks like a corrupted index
BugIDEA-190544Clicking on a hash in file history does not open main log tab
PerformanceIDEA-178016High memory consumption of git indexing for shallow clones.
UsabilityIDEA-130970Git Log: search for filter string both in hashes and in strings
UsabilityIDEA-190169Shortcut assigned to "Open Repository Version" action should have priority over Jump to sources
UsabilityIDEA-160441Better name for Log tabs & tooltips
UsabilityIDEA-194808Branch filter should take repository filter into account
UsabilityIDEA-160834Log: do not display 2 progresses when filtering
UsabilityIDEA-202408Strange window flickers on the screen when I navigate through git log (Windows 10)
CosmeticsIDEA-195976Fix progress bar in VCS Log in darcula
TaskIDEA-191611Update toolbar in VCS Log
ExceptionIDEA-200875NPE at com.intellij.vcs.log.ui.render.GraphCommitCellRenderer$MyComponent.getFontMetrics
ExceptionIDEA-202461java.lang.Throwable: Skipping invalid VCS root: VcsRoot{vcs=svn, path=null}
ExceptionIDEA-191967Throwable at com.intellij.vcs.log.impl.VcsLogTabsWatcher.closeLogTabs
Version Control. MercurialFeatureIDEA-187194Add compare action to the branch popup menu for Mercurial
BugIDEA-130035Mercurial - move refactoring bugs
BugIDEA-193378Merurial push/pull not working - hg4ideapromptextension returns AttributeError: 'module' object has no attribute 'Abort'
BugIDEA-203079Add project files to Mercurial
CosmeticsIDEA-187924Mercurial: Project update - Cropped text
TaskIDEA-203152Update incoming / outgoingChangesOn icons for HG
Version Control. PerforceBugIDEA-187738Changelist is duplicated in IDEA after partial commit (Perforce)
BugIDEA-191521Duplicate changelist is created when submitting a part of files in a Perforce changelist
BugIDEA-186736Perforce integration is unusable with 2018.1 EAP
BugIDEA-183743Use file revision encoding when comparing file contents
BugIDEA-193396Perforce: 2 default changelists are displayed by default, and the one not marked as default can't contain any changes
PerformanceIDEA-192097Too many threads spawned by reading Perforce command outputs from refreshing File History
ExceptionIDEA-188162NoSwingUnderWriteAction assertion in Perforce actions
Version Control. SubversionFeatureIDEA-75033Add option to immediatly switch to a new branch when branching from repository location
BugIDEA-140811IDE Hangs when importing large maven project.
BugIDEA-172626Can not parse output - SVN integration is basically useless after that
BugIDEA-190790Subversion: tree conflicts can't be viewed if path contains spaces
BugIDEA-192371NPE on importing project with directory mappings set to "Subversion", but without real svn working copy
BugIDEA-191927"Repository" tab - Aggregating commits from several working copies is slow
BugIDEA-190960"Error updating changes: can not parse output" error in local changes for certain tree conflicts
BugIDEA-189300ISE at com/intellij/openapi/vcs/changes/VcsDirtyScopeManager.getInstance
BugIDEA-188180"Merge from" fails if branch location of the current branch is under some other branch location
BugIDEA-186917Path to ssh executable for svn+ssh tunnel is not valid
BugIDEA-198691Version Control: Error updating changes: For input string: "UNDEFINED"
BugIDEA-191518Subversion "Update Project" dialog - error on selecting revision if url contains special symbols
BugIDEA-189542SVN+SSH shows "Process exited with code 1" instead of the actual error
BugIDEA-202942SVN Commit dialog hangs for a long time before showing up (since 2018.3)
BugIDEA-191800Urls of switched files are shown encoded in "Local Changes"
BugIDEA-185360Subversion File History not working for links with spaces
UsabilityIDEA-158791Unexpected output of svn commands for a single file/revision should not prevent further svn operations
CosmeticsIDEA-188814Subversion: correct the title of "BranchOrTag" tab in Messages tolwindow
TaskIDEA-197126Remove "Update administrative information only in changed subtrees" option
ExceptionIDEA-198536After upgrading to IDEA 2018.3 EAP - Subversion History fails with error
ExceptionIDEA-202460NFE at org.jetbrains.idea.svn.commandLine.CommandUtil.parse
ExceptionIDEA-190935ISE at org.jetbrains.idea.svn.branchConfig.SvnBranchConfigurationManager.resolveConfiguration
Version Control. TFSBugIDEA-184463Selected work item is not updated on checkin - can not resolve or associate changeset
BugIDEA-185601Commit to TFS - Code Reviewer issues
XMLFeatureIDEA-108183XML: auto-popup completion for attribute values with enum
FeatureIDEA-199839Support deprecation in xsd schemas
FeatureIDEA-64075Automatic XML Schema discovery
BugIDEA-197050IntelliJ doesn't find my namespaces when using autocompletion in an XML Schema file
BugIDEA-199694XML reformatting does not preserve line breaks when the comments are at the end of the file
BugIDEA-194155"Collapse empty tag" quickfix deletes non-empty inner tags in XML file
BugIDEA-194328Bundled XMLSchema-instance.xsd refers to nill- instead of nil-attribute
BugIDEA-195872IntelliJ marks "Element is not allowed here" an Element which is allowed to configure
BugIDEA-202642XmlLikeFileType.isCaseSensitive has wrong name
BugIDEA-151043code completion sometimes does not suggest enumeration values when used with extension or union
BugIDEA-78840generate xml from xsd fails
BugIDEA-115240Tags from scheme helptopic.xsd are not recognized
BugIDEA-142045XML attribute is highlighted with red but validation succedes (using xml schema with restriction xs:list > xs:enumeration)
BugIDEA-170206'Collapse empty tag' intention breaks code
PerformanceIDEA-193127DomFileIconProvider loads AST unnecessarily
PerformanceIDEA-189915Checking DOM applicability loads AST for files under .idea
CosmeticsIDEA-204273Outdated version of the Xerces library in org.jetbrains.intellij.build.CommunityLibraryLicenses
CosmeticsIDEA-75432Duplicate menu entries
ExceptionIDEA-128571AIOOBE at org.apache.xerces.impl.XMLDocumentFragmentScannerImpl$ElementStack.popElement
i18nBugIDEA-179376Almost all items from refactoring menu is unavailable for Resource Bundle in Project Tree
BugIDEA-179826Refactor|Rename is unavailable for Resource Bundle in Project Tree
BugIDEA-190909Autopopup code completion is not working for message bundles
BugIDEA-189804IDEA hangs after NullPointerException
BugIDEA-179977The properties keys names should be in full format in Resource Bundle Editor when "Group by Prefixes" button is not pressed
BugIDEA-179972Subgroups properties names changes when you select group node
ExceptionIDEA-180097NPE on deleting Resource Bundle
No subsystemFeatureDBE-5126Dialect scopes for Live templates
BugDBE-4449SQLite dialect does not understand vector valued updates
BugDBE-6451DataGrip: Execution of SQL command does not ask for colon-parameter values if not whole SQL command is selected
BugDBE-6559New Data Source dialog does not save the status of driver downloads if dialog is closed with Cancel
BugDBE-6982Intellij hangs when work in database editor.
PerformanceDBE-6206PyCharm freezes or shows Xmx out of memory error when typing .SEPARATOR , \n in an SQL file
DB ConnectivityFeatureDBE-5294Auto-reconnect to db after "db timeout / disconnect / ssh timeout" feature
BugDBE-7555Unable to connect to Heroku Postgres database
BugDBE-1673Data Sources and Drivers Settings are applied to connection only after reconnect to DB
BugDBE-6347No current database in PostgreSQL connection
BugDBE-6435Datasource postgres configuration problem : ClassNotFoundException: org.postgresql.Driver
BugDBE-1423Wrong encoding when connection to database failed
UsabilityDBE-3260Add default values in SSH configuration for Data Sources
UsabilityDBE-6655Custom JDBC driver configuration workflow
UsabilityDBE-5628Password dialog box issues
UsabilityDBE-6321Postgres: if database in connection parameters differs from the database selected in Schemas tab IDE may fail to connect
DB ConsoleFeatureDBE-4949Possibility to set default Isolation Level
BugDBE-7298IndexOutOfBoundsException occurs on opening "Parameters" dialog if there are no parameters in query
BugDBE-5904Database Console name in Files have turning into Guids
BugDBE-3116Impossible to disable prompt for query parameters
BugDBE-7121AbstractMethodError with Informix JDBC driver in Database Console
BugDBE-6384Disconnect database keyboard shortcut (Ctrl+F2) is stopping running application
BugDBE-2297Changes to Tools > Database > User Parameters are only in effect until PhpStorm is restarted
BugDBE-6751Execute stored procedure: specify type length for the result or otherwise (if infer type length is not possible) indicate that the script is invalid
BugDBE-397DESC/DESCRIBE in read-only mode
BugDBE-6889MySQL execute procedure in console produces "[S1000] Operation not allowed after ResultSet closed" error
BugDBE-6358Cannot execute multiple queries as batch in 181.4892.10 (unless highlighted)
UsabilityDBE-6112closing database console tab also closes the tab
UsabilityDBE-6115database console > scroll from editor doesn't work well
UsabilityDBE-7543DataGrip: When executing SQL script in a script file (not console) the IDE switch over to the Console after executing SQL
UsabilityDBE-7135Console History's "OK" button should be more descriptive
ExceptionDBE-5953DBE-5953 AE: SqlPsiElementFactory#createROFile
DB DiffFeatureDBE-7336DataGrip compare schema preference
BugDBE-7604Schema compare compares non-selected schemas
BugDBE-7320Comparing two schemas fails
BugDBE-7066Migrate left right shouldn't synch both
DB IntrospectionFeatureDBE-2102Default constraints in MS SQL
FeatureDBE-4366Support for EXTENSIONS in PostgreSQL
FeatureDBE-6234Allow filetype association to sqlite/sqlite3
FeatureDBE-7198DataGrip Should Provide Pattern to functionNamePattern in DatabaseMetaData.getFunctions() call.
BugDBE-4962Cascade rules of foreign keys not correctly displayed for Microsoft SQL Server
BugDBE-4559MS SQL Server index condition (filter definition)
BugDBE-7234Unknown system variable 'storage_engine' when trying to connect to MySQL 5.7
BugDBE-4693Column is missing from FK as displayed in Database tool window
BugDBE-6362Redshift view with no schema binding - unable to inspect columns
BugDBE-6896Synchronizing a Database (Intersystems Caché) forgets the Schema
BugDBE-5968Sybase: incorrect length for types nchar, nvarchar, unichar, univarchar
BugDBE-7459Error connecting to Redshift
BugDBE-7201Uninformative "Project Data Sources: re-sync required"
BugDBE-6553NPE when sync DB structure on already droped tables
BugDBE-6863PostgreSQL 11 Stored Procedures incorrectly show as functions in the Database pane and cannot be deleted
BugDBE-6324DataGrip does not understand "included columns" of MS SQL Server indexes
BugDBE-7150Triggers not showing for MariaDB ver. 10.1.34
BugDBE-7371PostgreSQL error upon database introspection in PyCharm 2018.3
BugDBE-6409MariaDB schema discovery fails with: Unknown column 'purchase_date' in 'field list'
BugDBE-6070PhpStorm Database PostgreSQL doesn't show new added columns
UsabilityDBE-1996Database: "Unsupported format version" message gives no hint what data sources are in question
ExceptionDBE-6818Postgres 11 broke backward compatibility (columns proisagg and proiswindow are dropped from pg_catalog.pg_proc)
DB RefactoringBugDBE-6503Incorrect Exract subquery as CTE with INSERT statement
BugDBE-634MS SQL Incorrect statements for modifying a table column default value
BugDBE-7103Extra engine alteration
BugDBE-7503Not able to rename a StoredProc, if I am just changing the casing.
BugDBE-6616Cannot delete database
BugDBE-7205Default SQL value wrongfully becomes string in "modify table" dialog
BugDBE-6496 Extract subquery as CTE incomplete or abbiguous when existing CTE named cte_alias
BugDBE-6517Incorrect Extract subquery as CTE on UNION/EXCEPT/INTERSECT queries
BugDBE-6663MYSQL: Drop table command does not encapsulate table name
UsabilityDBE-6235Can't create a table during indexing
Data Import & ExportBugDBE-7012Cannot import into table with ENUM field
BugDBE-7019JSON groovy extractor provides 1.0E8 instead of 100000000
BugDBE-5987Cannot use \N as null text in data import
BugDBE-6081Can't import from .csv ISO timestamp with "Z" timezone
BugDBE-6312Incorrect string parsing in batch script execution
UsabilityDBE-7015Export to Database: do not re-execute the select query if possible
UsabilityDBE-6130Add IMPORT DATA FROM SQL DUMP menu option
ExceptionDBE-5985java.lang.IllegalArgumentException: Argument for @NotNull parameter 'typeName' of com/intellij/database/extractors/ObjectFormatter.isBit must not be null
Data ViewsFeatureDBE-4150Show # of selected rows in IDE
FeatureDBE-6693Qualify table and routine names in editor tabs
FeatureDBE-4100Feature Request: Show column comments in tooltips
BugDBE-69MySQL datetime incorrectly shows <null>
BugDBE-6200Quick documentation popup: too wide columns of the referencing data
BugDBE-74312018.3 . Where did database console STOP button go?
BugDBE-5969Syntax error inserting row with all column values default similar DBE-2057
BugDBE-5204Database Table DDL does not open in active window group
BugDBE-6306Copying Column List
BugDBE-6436Filter correction does not bring back matching column list
BugDBE-1858Fiter in database table view does not apply to query result after cleared
BugDBE-7266Impossible to edit a boolean field in a new row
BugDBE-6499First time commit is issued it needs to be issued twice
BugDBE-2444Can't select total row count of PostgreSQL table while a column is being sorted
BugDBE-7044Incorrect search path in reopened data editor after restart
BugDBE-2057Insert row into SQLite table with default values in Table Editor doesn't work
BugDBE-6292Manual Transaction re-executes command after transaction rollback
BugDBE-5769Table Editor: does not automatically load data on selecting a table
BugDBE-4868sorting does not work if the filter contains a comment
UsabilityDBE-7411"Move to the opposite group" is cloning tabs with database tables
UsabilityDBE-6003Ctrl+Shift+Left should be used as Editor Action: Move Caret to Previous Word with Selection
UsabilityDBE-7224Data view "Compare with" underscore in tab name is transformed to accelerator in dropdown
IDE GeneralFeatureDBE-7036DataGrip is missing "Report a Problem" menu item under Help.
FeatureDBE-6502YAML plugin in DataGrip
FeatureDBE-3178dbForge-like projects
FeatureDBE-5081REST client in DataGrip
FeatureDBE-2614Add support for opening SQLite files from command line
FeatureDBE-6278Project handling more like IntelliJ, PyCharm, WebStorm
FeatureDBE-5999Ability to sort items in structure pane
BugDBE-6544Fail to generate pojos.groovy on view in database
BugDBE-7477Wrong thread for DumbAware startup activity
BugDBE-6005Clicking issue does not work in update GUI
BugDBE-5576DataGrip .desktop entry description is not descriptive
BugDBE-6004Run and Synchronize Options in Scratches and Console Window show GUIDS and not logical names
BugDBE-5601Navigate to symbol works bad with column names
BugDBE-7116Publish GitHub Integration plugin along with Git Integration
UsabilityDBE-557It is impossible to Undo directory detaching
UsabilityDBE-6405Query plan fails for sub-queries in sqlite
CosmeticsDBE-4250Inconsistent Invalidate Cache / Restart location
ExceptionDBE-7584Throwable at com.intellij.openapi.application.impl.ApplicationImpl.assertIsDispatchThread
ExceptionDBE-7584Throwable at com.intellij.openapi.application.impl.ApplicationImpl.assertIsDispatchThread
Navigation & SearchBugDBE-6289Database View hasn't got focus after Go to Definition action
BugDBE-7303Oracle: navigate to package procedure: DG navigates to the first line instead of the line with procedure declaration
BugDBE-7500Find yields duplicate results
BugDBE-6796Consider data source group in Go to actions and other places where I'm choosing some database object
UsabilityDBE-5459Remove storage files from "Go to file"
PL & DDL EditorFeatureDBE-5340Compiling PL/SQL code with atual errors
BugDBE-5908plpgsql valid assignment is red
BugDBE-3195Oracle PL/SQL Auto complete object types
BugDBE-7481Updating foreign key column name crashes
BugDBE-6301Postgresql - Create Foreign key between tables in schema different than public
BugDBE-6754Editor tabs are not named consistently so they don't sort consistently
BugDBE-6254Database toolwindow: ModifyTable action should not be available for read-only datasources
SQL CompletionFeatureDBE-4770GROUP BY completion should offer non-aggregated columns from SELECT clause
FeatureDBE-2242Completion for sql select should show "all columns" as for insert into
FeatureDBE-5940don't suggest aliases for table names
FeatureDBE-6411MS SQL: INSERT INTO [TABLE] ([ALL COLUMNS SUGGESTION])
FeatureDBE-6989Customisable aliases for tables when auto-completing SQL queries
FeatureDBE-850Expand column list improvements
FeatureDBE-2854Automatic alias
FeatureDBE-2774Smart Complete of enum types
FeatureDBE-7256Auto complit for "create table", "create function" and etc by "ct".
FeatureDBE-2285Completion for sum() and avg() functions
FeatureDBE-2282'Create table definition' suggest bad type
BugDBE-4981REGEXP_COUNT is an unknown database function
BugDBE-6954Improper syntax completion for functions
BugDBE-6541Complete function parameters in drop function statement
BugDBE-4246If inside brackets, on completion item selected dot is inserted incorrectly
BugDBE-4656Bad completion for window functions
BugDBE-6895Autocomplete and changing join type
BugDBE-2824Live template problem
BugDBE-5948sql completion does not suggest distinct in count() on sql server
BugDBE-5451Oracle 12c ALTER TABLE identity clause
BugDBE-5981suggested alias should not have hash sign for temp tables on sql server
BugDBE-7128Duplicate "INTERVAL" completion suggestion
BugDBE-7387MSSQL: Unable to resolve symbol
BugDBE-5358"Qualify Object on code completion" setting "Always" breaks postgresql updates
BugDBE-5591Autocomplete for the FILTER (WHERE ...) clause of an aggregate function is not correct
BugDBE-5163create index column autocomplete defaults to all columns
BugDBE-7049Bad completion for avg() and sum() functions in Postgres
BugDBE-6778Code completion doesn't suggest column types in create table statement for sqlite console
BugDBE-6536Inapplicable autocomplete suggestions - table ailas after table alias
BugDBE-7333Extract Subquery as CTE appends CTE in wrong position
BugDBE-7332Extract Subquery as CTE produces unsupported inner CTEs
BugDBE-4848Code Completion: stored procedure with named parameters (Sql Server)
BugDBE-2852Setting to select table order in ON-clause
BugDBE-5654Duplicates in completion
BugDBE-2567Quoted table name completion: a dot is added inside quotes
UsabilityDBE-6606"NOT NULL" should be suggested before "NOT FOR REPLICATION"
UsabilityDBE-7032Improve completion for joins
UsabilityDBE-6450Remove SELF argument from autocomplete prarmeter list of PLSQL Object type method
UsabilityDBE-3518Autocomplite default inside values
UsabilityDBE-5660Better completion in Modify Table for SQLite
Configuration ProblemDBE-5511Can't disable MySQL JOIN alias autocomplete
SQL Format and StyleFeatureDBE-4923First word right-aligned code style
FeatureDBE-6839Formatting INSERT
FeatureDBE-6678Align JOIN under FROM
FeatureDBE-6798Egypt style for INSERT and subqueries
FeatureDBE-6819Indent-only no-alignment code style (also C-like style)
FeatureDBE-2837align create table comments
FeatureDBE-6822Procedure block: new line after BEGIN
FeatureDBE-6801Allow to specify elements place separately for each clause in query
BugDBE-6939SQL formatter - lag and no effects in preview
BugDBE-2799SQL formatting: case - when - then else alignment
BugDBE-7536DataGrip formatter breaks code when removing AS
BugDBE-7236MSSQL: Query hint formatting
BugDBE-6874MSSQL: Obscure spaces before and after dot between schema and table name
BugDBE-7167SQL code style format - Comment
BugDBE-1376SQL Formatting: line break before closing ")"
BugDBE-7522Reformat code: MSSQL table hint
BugDBE-7220Indent everything between BEGIN TRANSACTION and COMMIT statement MSSQL
BugDBE-7562Postgres: formatter ignores the context when unquotes aliases
BugDBE-6823Formatter uses the style named 'Default' instead of currently selected one
BugDBE-6681Formatter unwraps MySQL-style line comments
SQL GeneralFeatureDBE-3834Find usages on SQL file could find SQL data sources where this file is added to
FeatureDBE-4744Redshift SQL Dialect does not support "IGNORE NULLS" in LAG/LEAD Window Function
FeatureDBE-7268Support Decimal type
FeatureDBE-4560Shift-shift search looks for functions in database, not in codebase
FeatureDBE-7069Multiline TODOs for SQL
FeatureDBE-3275Fold multiple values in IN operator
BugDBE-7098"ROWS FROM" join from_item is not recognized
BugDBE-5325Code Folding > Expand All requires repeating the action two times
BugDBE-7260Error "COLUMN, CONSTRAINT or TO expected, got 'COLUMN'" when use alter table expression.
BugDBE-5928Oracle: Don't report OVERLAPS function as error
BugDBE-7241Redshift first_value/last_value Parse Failure
BugDBE-5750TEXT datatype not in Code Completion
BugDBE-6859MSSQL: Table hint for MERGE breaks down
BugDBE-7143Auto-created folding regions are un-folded on file re-open
BugDBE-7264Unquote identifier does not work for SQL Server T-SQL
BugDBE-2250At symbol (@) causes spell checker to report false positive in SQL file
BugDBE-6490Extract subquery as CTE works wrong when having 'as'-expression with column aliases
BugDBE-6887MSSQL: CREATE SECURITY POLICY
BugDBE-5930Oracle: ELSEIF should not be valid keyword
BugDBE-6314limit 1 is not recognized as valid sytax in PL/PgSQL
BugDBE-4532Structure tool window view changed in recent IDE versions
UsabilityDBE-2249SQL: File Structure: if current statement is not shown selection could be preset to the nearest shown element
UsabilityDBE-2248SQL: File Structure: table item is preselected if the caret is right after the last character of a column definition
ExceptionDBE-7023IAE at com.intellij.psi.PsiManager.$$$reportNull$$$0(PsiManager.java)
SQL GenerationFeatureDBE-7025Support SQL Generator `IF NOT EXISTS` option
BugDBE-6992Reshift Generic: invalid SQL generation for routines
BugDBE-3548Postgres: sequence start value is wrong
BugDBE-6743MariaDB: Support CREATE OR REPLACE PROCEDURE
BugDBE-7180Several PostgreSQL rule issues with the Source Editor
BugDBE-6176Suggested DB2 procedure drop statement is wrong
BugDBE-5479explain plan for redshift outputs: Invalid operation: syntax error at or near "FORMAT"
BugDBE-7129Query plan visualizer doesn't work
BugDBE-6473"Request and copy original DDL" action fails
BugDBE-5825MySQL code generator: invalid CHARSET clause for column definition
BugDBE-7526Can not edit trigger
BugDBE-7195In "Database Changes" window, right-clicking on a single function/view and clicking on "revert" reverts all changed objects!
BugDBE-7487Schema cannot be created from UI in DB2
SQL HighlightingFeatureDBE-3109Please add an inspection for unused field of subquery
FeatureDBE-1456Show warning on DELETE FROM without WHERE clause
FeatureDBE-2647Custom Parameter %VAR% not working when wrapped in single quotes.
FeatureDBE-6367H2. Support select with 'with'
FeatureDBE-6368H2. Support drop scheme cascade
FeatureDBE-4999Need temporal table support in SQLServer Dialects
FeatureDBE-6759highlight if JOIN aren't paired with ON
FeatureDBE-7283Show parameters info for INSERT automatically
FeatureDBE-521Psi aware brace highlighter
FeatureDBE-3127MS SQL: Introspect and highlight columns of cursors that are returned by functions
BugDBE-4772Good code is highlighted yellow
BugDBE-4774MySQL: "where" keyword in select statement is highlighted as error
BugDBE-5791oracle dialect -> support for TYPE records
BugDBE-5896MySQL dialect does not recognize CTEs
BugDBE-5891Can't change SQL dialect for the injected string
BugDBE-6975Support 'or replace, materialized view, precomputed' syntax
BugDBE-6196Oracle: INSERT ALL incorrectly parsed without column list
BugDBE-6761PostgreSQL 10 drop function without arguments
BugDBE-5960Window functions support for MySQL
BugDBE-6853Newline concatenation with a bind variable in COPY command is erroneously not recognized as a valid syntax with Postgres
BugDBE-6325MSSQL: Unable to resolve column
BugDBE-6830'ON' is not treated as value
BugDBE-6303SQL integration: "AT TIME ZONE" not recognised for Microsoft SQL Server
BugDBE-6817Oracle ~= (not equals) operator causes parse error
BugDBE-5635Redshift: support varchar(max) syntax
BugDBE-4709SQL statement parse error with slash at end of line
BugDBE-7386Exasol: Division Operator mistaken for query terminator
BugDBE-7382SQL Server file starting with IF shows error when cursor on IF keyword
BugDBE-6027Set statement with multiple clauses is reported as error
BugDBE-6028CTE ("with" statement) and code folding are not working together (2018.1 EAP, MySQL 8/MariaDB 10.2)
BugDBE-7065Support schema qualification syntax in CREATE OPERATOR FAMILY
BugDBE-1509Teradata diagnostics command is treated as a parameter by mistake
BugDBE-7586Unresolved reference using functions with xml data type
BugDBE-7007MySQL dialect constantly resets after IDE restart
BugDBE-6336Support for MAXFILESIZE in Redshift UNLOAD
BugDBE-7288MSSQL: Sub query and GROUP BY
BugDBE-7282Just alone field is treated as a function
BugDBE-5935PostgreSQL dialect Valid SQL marked as red
BugDBE-7111[ClickHouse] Invalid inspection on INSERT into table with materialized column about incorrect values count
BugDBE-6862Syntax for Oracle's sample.
BugDBE-2581Support of conditional compilation flags in pl/sql code
BugDBE-5919DataGrip: Color coding when calling a user defined procedure with SQL Server global variables does not work
BugDBE-6844Invalid "Ambiguous column reference"
BugDBE-6848Unresolved reference for alias in Redshift
BugDBE-6104H2 SQL dialect does not recognize "drop column" statement with multiple columns
BugDBE-5958 DB2: Syntax Error at temporal Table Select Statement with BUSINESS_TIME alias
BugDBE-5952False positive: Condition X is always true
BugDBE-6125PostgreSQL support USING NEW INTO syntax
BugDBE-5859MySQL Create Table Syntax parse error
BugDBE-6354UNION ALL FROM TWO TABLES
BugDBE-5995PostgreSQL. Good code red. Custom sampling_method
BugDBE-6167H2 Custom type is not parsed correctly
BugDBE-7112Incorrect error highlighting in HSQLDB mode
BugDBE-6391PyCharm unable to determine record fields when looping through query surrounded by parentheses (PostgreSQL)
PerformanceDBE-7335Suppression calculation could be faster
UsabilityDBE-7314A better highlighting for 'column aliases required' inspection
UsabilityDBE-5855PostgreSQL CITEXT type and extensions not supported
SQL RefactoringFeatureDBE-636SQL Intention: Introduce/inline table alias
FeatureDBE-6151Declare new variables on-the-fly (PL and declare-variable statements)
FeatureDBE-2058Generate DECLARE TABLE statement
BugDBE-7178Alias renaming in a view source editor fails to apply changes to all references
SQL ResolveBugDBE-6676Quoted Identifiers are case insensitive SQL Server
BugDBE-6947Some MySQL 8 functions aren't resolved
BugDBE-6182Same aliases for different tables in adjacent UPDATE queries lose column name resolution for SQL Server
BugDBE-6378Oracle JSON syntax is not recognized
BugDBE-6641User table not properly parsed
User InterfaceFeatureDBE-7214Ability to choose color in data source settings
FeatureDBE-4928Add of Database Color Settings check box for Table Bookmarks
FeatureDBE-4074Database keep project datasource visible when scrolled down
FeatureDBE-6432Possibility to configure icons for custom data sources
FeatureDBE-6797When renaming a datasource, interpret slashes as groups or interpret slahes in datasource names as groups
FeatureDBE-6753Can not drag Data Source to a group
FeatureDBE-6537Database view: add database element to a favourites by Drag and Drop
FeatureDBE-5515Make it possible to choose default console for all project SQL files
FeatureDBE-5052In datasources list show only db vendors
BugDBE-5927Speed search next match doesn't always work
BugDBE-7470Two PostgreSQL dialects in injection intention
BugDBE-6551Database coloring stops working for some Editor tabs on project re-opening
BugDBE-6558Color settings in datagrid different to database panel
BugDBE-6231Hover over link breaks UI on data source options tab
BugDBE-4273Table Names Sort Does work on DB2 database
BugDBE-2390Data Statistic Error
BugDBE-4722Move Data Source to Project/Global not visible
BugDBE-6808Gutter color is not respected
BugDBE-6146Incorrect navigation via NavigationBar to the stored procedures
BugDBE-4822"DB Consoles" from "Tool Windows / Files / Scratches" doesn't respect colors
BugDBE-6443Default row height int "Modify Table" dialog is equal to the biggest row in the dialog
UsabilityDBE-6249Changing DB user or password resets the URL
UsabilityDBE-6527Cannot create datasource with MSSQL jdbc driver
UsabilityDBE-5774Database element is always "unclassified" in Find Usages results
UsabilityDBE-6679Provide an easy way to create custom Data Source
UsabilityDBE-6799Moving a datasource to a parent group that has no direct child only possible via "new..." group
UsabilityDBE-1668Data Sources and Drivers dialog / Schemas: "Use legacy introspector" control is visually attached to filtering description
CosmeticsDBE-6150Order of datasources is different in database tool window and 'Data Sources and Drivers' window
CosmeticsDBE-1851Clearer connection status indication
No subsystemFeatureWEB-15038Support for media type suffixes (application/***+json)
FeatureWEB-33334Run spell check on the description property in package.json files
FeatureWEB-11431Smarty: CSS autocomplete from included css file
FeatureWEB-25165Provide ability to pass command line args to protractor
FeatureWEB-33932Bundle markdown plugin
FeatureWEB-33236Add ng add integration
FeatureWEB-33641Angular2: allow injecting languages other than CSS in `styles:[]`
FeatureWEB-35815Improve syntax highlighting for Angular templates
FeatureWEB-34686XML intention to create tag from attribute value
FeatureWEB-34725Angular: provide navigation and content assist for selectors in [ngClass]
FeatureWEB-29322Webstorm doesn't support pluralization rules syntax in angular templates
FeatureWEB-33928Add intention to wrap xml value in cdata block
FeatureWEB-33249Typing quotes/backticks over selected text should wrap that text, not delete
FeatureWEB-19564Web Browsers: support Microsoft Edge browser
FeatureWEB-31177Color picker doesn't work for template string literals
FeatureWEB-34619Associate WebStorm with JSON files
FeatureWEB-31391Go to Angular component's HTML template from usage
FeatureWEB-29005Add support of -webkit-image-set in CSS
FeatureWEB-11807Feature: Folder templates for new projects
FeatureWEB-28371Make links in package.json clickable
BugWEB-33570Do not log issues with bad schematics in New|Angular Schematics... dialog
BugWEB-35806Prettier: plugin does not format code with 1.5.2 prettier version
BugWEB-35807The gutter icon for "Implemented" is shifted to the left when it merges multiple icons
BugWEB-31037Do not report spelling errors for values from bundled JSON schemas
BugWEB-32040Missing support for JSON in Prettier
BugWEB-31963Emmet BEM filter doesn't work in JSX
BugWEB-35865node module locals are styled as globals
BugWEB-35483Invalid window order for filechooser in window "Run Gulp/Grunt/npm Task"
BugWEB-34375Live templates: surround with tag inserts superfluous line break
BugWEB-35054Add words to default dictionary: monorepo, denormalize
BugWEB-35729So called "Smart Paste" escapes valid code blocks making them invalid in Javascript.
BugWEB-32496Prettier plugin resets package path in 2018.1.2
BugWEB-36034##teamcity log messages when run mocha tests
BugWEB-9333Copyright Formatting Not Working For HTML5 DOCTYPE
BugWEB-36639New project template is only visible after the IDE restart
BugWEB-14589multi-line todo in html
BugWEB-34776Angular. Make method private/protected leads to exception
BugWEB-31412React Native Run configuration does not start
BugWEB-31627Can't analyse webpack.config.js: coding assistance will ignore module resolution rules in this file.
BugWEB-36051JSX: no parser recovery on an opening "<"
BugWEB-34755routerLink value should not resolve and be just a plain string literal
BugWEB-36280<noscript> Content gets incorrectly highlighted
BugWEB-33007Folder is automatically being excluded, cannot be undone
BugWEB-33002'Change signature to match and update call' removes 'new'
BugWEB-33217DartAnalysisServerService trying to read files on disposed project
BugWEB-20634Highlighting problems with bundled WebStorm color schemes
BugWEB-31307'Reformat with prettier' action is disabled on first opening of project
BugWEB-32412template stringx jsx closing bracket expected
BugWEB-36306Welcome frame missing Create New Project action link
BugWEB-32120Copy and Paste and Syntax Highlight stops working
BugWEB-35931Auto-inserted brace breaks the code in JS object with braceless lambdas
BugWEB-31108"closing tag matches nothing" shows on the correct tag of vue file
BugWEB-32711Prettier: support .prettierignore
BugWEB-31736Flow: provide a detailed error message if flow service fails to start because of incorrect flowconfig
BugWEB-31719Prettier autosave on format
BugWEB-34597Don't treat XML files in Vue.js projects as Vue templates
BugWEB-34624Argument for @NotNull parameter 'jestPackage' must not be null
BugWEB-34250TSCONFIG custom inspections should traverse config hierarchy, not just check the parent object
BugWEB-31520TypeScript parse/syntax error: "formal parameter expected"
BugWEB-31206Renaming exported const does not rename import statement
BugWEB-35223Deadlock on indexing
BugWEB-33569Suggest newer version for 'ng-add' dependencies if older one doesn't support 'ng-add'
BugWEB-31040Add to the dictionary
BugWEB-21704Support qualified references in templateString JS language injection patterns
BugWEB-33543Remove Web Starter Kit from the project wizard
BugWEB-32053editorconfig plugin is not working properly
BugWEB-33150Yarn workspaces: support “nohoist” option
BugWEB-32850How to apply code style base on Prettier on this project, after saying "no" initially
BugWEB-34085Mac OS X keymap is selected if you skip the IDE configuration
BugWEB-34578Spelling 'mistakes' in variable names
BugWEB-32748NodeModulesDirectoryManager is on UI thread with a lot of threadDump-freeze reports
BugWEB-36065Sometimes editor shows Angular 2+ attributes as not allowed. This is the message. "Attribute (click) is not allowed here less... (Ctrl+F1) Inspection info: This inspection highlights unknown HTML tag attributes as invalid, and lets mark such attributes as Custom to avoid highlighting them as invalid. "
BugWEB-34299Closing tag is not changed when selecting an autocomplete option by mouse (not keyboard)
BugWEB-34740Using new element action on navigation bar is broken
BugWEB-35363ClassCastException when opening and setting focus to some js files
BugWEB-31461prettier: should use builtin config cache
BugWEB-25681Methods in Angular's *.component.ts falsely recognized as unused
BugWEB-31858Use NPM package configured in project preferences when downloading TypeScript stubs
BugWEB-31444When debugging Node.js, computer logs out after a while
BugWEB-33756WebStorm ignoring hostname for 127.0.0.1 IP address
BugWEB-33753'Convert class to functional component' loses defaultProps in TSX
BugWEB-33364Angular template reference wrong typing
BugWEB-29946Vue+pug: selector usages in Pug template not found
BugWEB-36333Go To menu from within Angular component template could be more functional
BugWEB-32300Incorrect warning: ") expected" on React components
BugWEB-36109Angular template: template reference variable incorrectly reported as unused
BugWEB-16795Git conflicts suggest switching to the JSX Harmony project type
BugWEB-33287Nested indices access in JsTestSourcesFilter may cause deadlock
BugWEB-35425"ActionScript/Flex" diagram is suggested for TypeScript file
BugWEB-31258Rename in angular template can generate wrong code (Angular, Typescript)
BugWEB-31708EAP - Prettier tries to run on HTML files
BugWEB-35098Disabled library is enabled after applying changes in 'JavaScript - Libraries' dialogue
BugWEB-31399Surround with Emmet doesn't work with linewise selection of JSX
BugWEB-10491Add standard framework keywords to dictionary
BugWEB-33786Add "realtime" to the default dictionaries
BugWEB-32769Webpack config rejects automaticNameDelimiter optimization setting
PerformanceWEB-35491Webstorm process uses up to 500% CPU
PerformanceWEB-31233Freezing when editing JSX during typing
UsabilityWEB-33877Cannot shrink Name column in JavaScript Libraries
UsabilityWEB-34438Typing dot or space in import path results in applying selected variant from completion list if module name is selected there
UsabilityWEB-33927Cannot locally suppress typescript "unused export" inspection
UsabilityWEB-35408Disabling the webpack configuration shows a warning on project load
CosmeticsWEB-32211Rename 'twitter bootstrap' project template
CosmeticsWEB-32801Webpack option schema has a wrong link in the inspection description
CosmeticsWEB-35701Crosslined description in confirmation dialog.
CosmeticsWEB-32036Save As.. should be Save As...
TaskWEB-35225Invalid built-in server certificate when using https
TaskWEB-32175JS live template: rename "JavaScript" context to "JavaScript and TypeScript"
ExceptionWEB-35364File processor exception on project close
ExceptionWEB-35460IndexNotReadyException when trying to get qualified name while indexing
Build toolsFeatureWEB-30117Allow to remove/disable gulp tool window
FeatureWEB-34701Run Anything: add npm tasks
BugWEB-12263Grunt console support for ANSI terminal
BugWEB-28715Gulp tasks tree cannot build due to missing --silent option
ExceptionWEB-34650InvocationTargetException when debugging npm script with node 6.x
CSSFeatureWEB-34312Add intention action: replace CSS var() function invocation with its fallback value
FeatureWEB-32000Support repeating-conic-gradient CSS function
FeatureWEB-24774Support inline comments in PostCSS
FeatureWEB-22Code cleanup - sort CSS properties by name inside declaration
FeatureWEB-30704@apply is deprecated and only supported by PostCSS, use more lenient parsing
FeatureWEB-17009Add not listed CSS &JS files for suggesting for go to declaration in HTML files
FeatureWEB-24381Extract Ruleset intention action
FeatureWEB-30004Stylelint: allow linting CSS/PostCSS files with custom extensions
FeatureWEB-32228Support of CSS property "font-display"
FeatureWEB-25011Colors and Fonts/CSS should have it's own field for class and attribute identifiers
FeatureWEB-10307Multiline TODOs for CSS/LESS/SCSS/Stylus/PostCSS
FeatureWEB-19525Add "Keep Maximum Blank Lines" to Settings -> Code Style -> CSS
FeatureWEB-32672WebStorm doesn't recognize backdrop-filter
FeatureWEB-35114Stylesheet languages code style: add an option to control blank lines around nested selectors.
FeatureWEB-7317Provide option to complete styles from all CSS files even if current file has a style tag
FeatureWEB-6176Add refactoring: "Move CSS ruleset to a different file"
BugWEB-36018Typescript TSX: value of "class" attribute is not recognizing as css class in 2018.3
BugWEB-31295CSS code completion is shown in JSX after className=<space>
BugWEB-32646Css: "Insert semicolon" produces incorrect PSI
BugWEB-35555Some CSS pseudo-selectors are highlighted red in the editor
BugWEB-34177Value of css attribute stroke-width can be a number
BugWEB-34176stroke-linejoin. Add available values
BugWEB-10143Code readability in css color preview
BugWEB-23986PHP: completion/navigation for selectors defined in external stylesheets don't work if there is a <link>/<style> tag in main template
BugWEB-24619BUG: PostCSS code completion doesn't work right before an &-sign (Ampersand).
BugWEB-61CSS optimization bug
BugWEB-27101::slotted(*) css pseudo-element is highlighted red
BugWEB-18258Update css-text spec
BugWEB-26828reformating CSS with :host >>> subselect ends up with :host > > > subselect
BugWEB-26368CSS '/deep/' combinator causes 'unexpected token' error if it's the first item in selector list
BugWEB-35249'Rearrange Code' action messes up CSS file if it contains import
BugWEB-31567'<?php' symbols in CSS class completion
BugWEB-22895PostCSS: Colors & Fonts: arithmetic symbols are not colored
BugWEB-22894PostCSS: Colors & Fonts: Tag name is not colored
BugWEB-22893PostCSS: Colors & Fonts: unknown-at-rule cannot be colored
BugWEB-34155CSS frames() function is marked as unknown
BugWEB-28165Wrong CSS syntax check for @apply rule
BugWEB-24628CSS: string literal with backslash as property value is not parsed correctly
BugWEB-34825Emmet in stylesheet comments
BugWEB-20810 Css Custom Properties will be in error if you are in both the transform and calc
BugWEB-33182Intellij complains about valid css
BugWEB-32100CSS autocomplete works unpredictably
BugWEB-35230CSS formatting: 'Keep single-lines blocks' option affects blank lines
BugWEB-34017Unknown CSS property 'row-gap'
PerformanceWEB-34434"Unused CSS selector" inspection overloads CPU
PerformanceWEB-30965Slow CSS completion
UsabilityWEB-35013Sort CSS properties: restore default custom order
UsabilityWEB-31592CSS font-family: initial warning generic font
UsabilityWEB-35153Group code style pages for style sheet languages in Settings
TaskWEB-35196No reason to have different code style settings for CSS and PostCSS
ExceptionWEB-22810"PSI and index do not match" exception while editing CSS
ExceptionWEB-34806Invalid comment range on file opening on comments searching
CoffeeScriptFeatureWEB-12464Add support for JSX syntax to CoffeeScript
BugWEB-31789Coffeescript highlight OR= operator error
BugWEB-32860Local class properties/methods not being properly indexed
BugWEB-36577Cannot insert new lines in multiline string in coffeesript
BugWEB-29109CoffeeScript formatting of 'export default'
BugWEB-31455CoffeeScript the "from" operator is not highlighted in orange
BugWEB-32981[CoffeeScript] Uncorrect highlight "not" keyword
BugWEB-32594Spread Operator in CoffeeScript gives error
BugWEB-32452Do not add keywords completion in import statement
BugWEB-32778CoffeeScript "code reformat" change semantics of the string tag
BugWEB-32793Class as prop value error: unexpected indentation
BugWEB-14981Existential Operator `?` on newline marked as invalid syntax, while invalid `?` usage is not marked
BugWEB-24288Coffeescript - regex with whitespace considered bad code
BugWEB-32486Coffeescript: splat operator in object definitions marked as error
BugWEB-15683CoffeeScript: Red code: incorrectly parsed slash symbol
BugWEB-34889wrong autoformatting in coffeescript with exports
BugWEB-34887support coffeescript re-export statement
BugWEB-33731CoffeeScript: JSX: correctly highlight XML tags
BugWEB-33733CoffeeScript: JSX: export default should be highlighted as unused when it is unused
BugWEB-33736CoffeeScript: JSX: React import should not be highlighted as unused for stateless components
BugWEB-22252Existential Operator Not Properly Parsed With Assignment to Function Result After Valid Space
BugWEB-32195CoffeeScript string tag error
BugWEB-32194CoffeeScript parse error
BugWEB-33782CoffeeScript: prohibit use of JavaScript Postfix Templates
DartFeatureWEB-32254Nest Dart compiled output under *.dart file
FeatureWEB-32909Provide code completion when editing Dart breakpoint condition and in Evaluate Expression dialog
FeatureWEB-33112Be able to run test of dart 2 code in intellij
FeatureWEB-36421Feature: allow to limit the scope of the Dart Analyzer with the current package
FeatureWEB-32957Dart Command line app / Flutter app debugging: make 'Evaluate Expression' available not only when paused on a breakpoint
FeatureWEB-31130Support Dart Override Completions
BugWEB-17258Dart SDK is not configured after updating Dart
BugWEB-31924Dart: method override list contains duplicate entries
BugWEB-33251Unable to run unit tests from folder with space in path
BugWEB-32434Dart Analyzer Diagnostics action should be disabled in non-Dart projects
BugWEB-36326Dart "assert" support
BugWEB-27128When no selection for Extract Method, IDE sets it to the full line
BugWEB-35995Failed to load templates during new Dart project creation
BugWEB-32559Bad Dart formatting (token per line) if syntax error in argument list
BugWEB-35878Problem creating new Dart Analysis Server issue on github from Dart plugin
BugWEB-32205.dart_tool folder can't be excluded from indexing if Dart SDK 1.x is configured
BugWEB-28443"Open issue submission form?" link in Event log broken
BugWEB-35068Dart completion prevents from typing a number literal
BugWEB-33051Dart formatter swallows white space on line merge
BugWEB-35712Dart Indexer doesn't work with mixins yet
BugWEB-33011Unfortunate Dart formatting of syntactically valid code
BugWEB-32974Incorrect 'Pin Tab' icon in Dart 'Get Dependencies' console.
BugWEB-32955Dart tab-autocompletion deletes code
BugWEB-31482Intention action list is sometimes wrong in Dart
BugWEB-31486Dart code completion list is incorrectly sorted
BugWEB-31403Dart Structure View missing sort button
BugWEB-34164URL is recognized as directory/files while having dart support enabled
BugWEB-34184'packages' is not resolved in HTML file (Dart project)
BugWEB-35159'itar' live template works wrong in Dart if var i is already used
BugWEB-31074Formatting a dart file with syntax errors reformats the file with one token per line
BugWEB-35257Preference dialog filtering doesn't work for the 'Show closing labels in Dart source code' option in Community Edition
UsabilityWEB-35885No need in 'Undo Reformat Code' confirmation when editing a Dart file
UsabilityWEB-27015need a custom icon for the pub serve tool window icon
UsabilityWEB-31845the Dart plugin doesn't have content in its changelog
UsabilityWEB-28503Possibility to specify Dart Dev Server port for a Web app to facilitate using local storage such as indexeddb
UsabilityWEB-14771Custom code folding regions do not work in Dart code in some cases.
TaskWEB-31788In Dart 2 world 'pub global run webdev serve' should be used instead of 'pub serve'.
TaskWEB-31498Auto-exclude .dart_tool folder
TaskWEB-32571Remove 'Dartium path' field from the Dart Settings page and from the New Dart Project wizard
TaskWEB-32296'enable asserts' flag for Dart Command Line App configuration in case of Dart 2
TaskWEB-32172In Dart 2 world 'webdev build' should be used instead of 'pub build'
TaskWEB-36102Support new Dart syntax: Set literals
DebuggerFeatureWEB-14403Drop to frame / Restart frame not available in JavaScript debugger
FeatureWEB-23258Configurable remote mappings for "Attach to Node.js/Chrome" run configuration
FeatureWEB-25793It's not possible to get value of async function in "Evaluate Expression" dialog
FeatureWEB-35737npm script debugging not supported without $NODE_DEBUG_OPTION argument
FeatureWEB-31991Implement "Run with coverage" for JS Debug configuration
FeatureWEB-32096Show coverage on source files when source maps are used
FeatureWEB-33127JS Coverage: Show correct coverage for css
FeatureWEB-15261Unable to put breakpoints inside JavaScript scratch files
FeatureWEB-25672Allow Node.js/Chromium remote debugger to reconnect automatically
BugWEB-32841Node.js/Chrome remote: 'Another debugger is attached...' warning is wrongly shown
BugWEB-30501karma debugging: breakpoints not hit when re-running the debugger
BugWEB-14424IntelliJ can't debug into node_module entries that are created by NPM Link
BugWEB-35073Not changed object value on changes via evaluation window
BugWEB-32003No log in console for npm in debug mode
BugWEB-34520Support BigInt type in Debugger
BugWEB-34890IDE can't connect to Chrome - 'Waiting for connection to localhost'
BugWEB-34895Can' debug react native app with react-native@0.57.0
BugWEB-33044Debugger stops on muted breakpoints in React native app
BugWEB-36056'Run to cursor' doesn't work in node.js debug
BugWEB-33398CSS Coverage is shown for the generated .css, not for the apprepriate .sass file
BugWEB-33397No CSS coverage for 'Web Starter Kit' project
BugWEB-30119Jest debugging support not allowing break point inspection of variables
BugWEB-34132Exception on JS debugging on a local node server
BugWEB-30584Source mapped breakpoints have unexpected behavior in async code
BugWEB-31842Node.js Debugger Console allows to type commands after process termination
BugWEB-33020IndexOutOfBoundsException when stop JS 'Run with coverage'
BugWEB-35534Duplicated 'Drop frame' action in debug tool window
BugWEB-35530React Native build doesn't start with 'react-native' package
BugWEB-36132Regression: Debugger doesn't attach to forked process
BugWEB-34474Breakpoints are not reached in Karma tests @angular/cli 6.1.4
BugWEB-34206Webstorm 2018.2: "Debugger Console" view missing from Debug window with Node 6.x
BugWEB-34990Debugger doesn't update breakpoints positions
BugWEB-31161Object not totally copied on Copy Value
BugWEB-32921Turn off breakpoints when run js with coverage
BugWEB-35630node debug connector isn't listening to debug port
BugWEB-32714Debugger steps into node_modules even if "Do not step into library scripts" is enabled
BugWEB-32908Can't resolve breakpoints in webpack 3.X project
BugWEB-33878NodeJS debug breakpoint not working without server restart when using reconnect automatically Build #IU-182.3684.2
BugWEB-33604Infinite 'Loading value' when calculating a variable
BugWEB-34605Debugger stops on EVERY same-named source file while debugging Node JS remotely using "Attach to Node.js/chrome"
BugWEB-35418Changing built-in web server port breaks JavaScript debug configurations
BugWEB-33667Child process debugging doesn't have async call stack when using Node 8 'inspect-brk'
BugWEB-35084@angular/cli: duplicated AppComponent in variables | local | this
BugWEB-33132JS Coverage: create-react-app, App.js is not added in coverage result
BugWEB-36462Background is blinking in debugger console
BugWEB-33119Wrong file path in Console when debugging a Vue app
BugWEB-34667Debugger ignores breakpoints when debug grunt task
BugWEB-36230Node.js debugger breaks on the first line when using Node.js 7.x
BugWEB-33170Breakpoints not matched properly
BugWEB-32550Wrong line is hit when debugging Jest tests
BugWEB-33095Breakpoint is not hit in multi-module node projects bundled with webpack
BugWEB-33328Node.js remote debugger ignores breakpoints in .ts file inside Docker container
BugWEB-33151NPE when hovering over field declaration during debug session
BugWEB-31589Warning about breakpoints in JSX tags with event handlers
BugWEB-32851Debugging Karma tests with karma-browserify not working sometimes
BugWEB-33528Out of memory when debugging React Native application
BugWEB-27620Node.js: Don't display variables that went out of scope while debugging
BugWEB-34537Cannot attach to remote nodejs after upgrade to 2018.2
BugWEB-32389Assertion failed: Debug tool window not initialized yet!
BugWEB-33717WSL: debugger ignores breakpoints when use babel-register
BugWEB-36660Debugger: empty library file is opened
BugWEB-32636Debugger: the number of properties that can be inspected is limited to ~ 100
BugWEB-35502Jest: debugger hits the wrong line on debug session restart
BugWEB-34783Docker on Windows: ports are not bound automatically
BugWEB-34822'this' is wrongly evaluated with sourcemaps in Variables view
BugWEB-33033IntelliJ 2018.1.3 does not show frames when debugging webpack
BugWEB-32155Debug different chromium browsers
BugWEB-34786Karma tests can't be debugged when they are not bundled with webpack but it's set up in karma config
BugWEB-33419Debugger tooltip shows value for the variable one line above
BugWEB-31314Client-side debugging pauses in same-named files loaded before the file breakpont is set in
BugWEB-32132Rerun not works with JS coverage.
BugWEB-35467Step into nodejs core modules opens virtual file
BugWEB-34213javascript debug insists on using Chrome Canary, rather than my release Chrome 68
BugWEB-34407Debugger controls do not work when debugging code executed within a VM
BugWEB-35448JS debug is broken (183.3975.9)
BugWEB-35449Debugger stops on first line in a file when debug with js.debugger.use.node.options turned on
BugWEB-35613Can't run Node debug session if there mappings for 127.0.0.1 in /etc/hosts
BugWEB-33288Incorrect coverage report for @angular/cli 1.7.4
BugWEB-36266Nullpointer Electron / Node.js Debugging
BugWEB-33128JS Coverage: Rename in Coverage toolwindow
BugWEB-36457Electron: render process debugging hangs after reloading app
BugWEB-36185Node.js: debugger is not attached if 'Allow taking heap snapshots' is ON unless 'js.debugger.use.node.options' is disabled
BugWEB-35218Can't debug Node.js: path no program files is considered as incorrect
BugWEB-32763Debugging hangs on Facebook API
BugWEB-34907Electron: main process debugging: Debugger Never Attaches
BugWEB-34483Run/Debug Configurations: .NET Project : Browser/Live Edit. Confusing button in the web address field
BugWEB-35037Variables from outer function appear in shorthand arrow function scope
BugWEB-22818Debugging with sourcemaps doesn't work when using `null` as `"file":` value
PerformanceWEB-35886Out of memory after debugging my Angular app for awhile
PerformanceWEB-31775Debugger: false stops in same-named files cause delays when debugging
PerformanceWEB-20253IDEA hangs when debugging TypeScript
UsabilityWEB-32843Node.js global.console has duplicate logs in Console tab when Debugger Console tab is hidden, when debugging
UsabilityWEB-32842Improve notification in case of wrong settings in 'Node.js/Chrome remote' RC
UsabilityWEB-33956Auto expanded object properties values make variables view noisy of there is too many object entries
UsabilityWEB-33303Node script fails to debug due to run configuration typo
UsabilityWEB-32810Add to watch is not always possible in JavaScript
UsabilityWEB-30689Blank page opened when debugging Chrome with custom profile if Chrome instance from same user data directory is running
UsabilityWEB-13852Debugger: "Add to Watches" for multiple variables selected in Variables view adds the first variable only
CosmeticsWEB-33294Attach to Node.js configuration: add separator
TaskWEB-33027JS Coverage: hide the Debugger and Elements tabs in tool window, add notification
TaskWEB-7998If breakpoints muted, don't stop on debugger keyword
ExceptionWEB-33729InvalidPathException when debug creare-react-app
ExceptionWEB-34839IllegalArgumentException: Argument for @NotNull parameter 'file'...
ExceptionWEB-32925Throwable: No last annotation when 'Run with coverage'
ExceptionWEB-31501[[FunctionLocation]] not found when call 'Jump to source'
ExceptionWEB-36460ObjectNotDisposedException when create @angular/cli project
ExceptionWEB-34648IllegalArgumentException: BIGINT when debug via node 6.X
ExceptionWEB-33102Exception in IntelliJ IDEA on closing Internet Explorer
File WatchersFeatureWEB-33319Add Insert Macro button for the Program path field in File Watchers
FeatureWEB-33321Add File Watchers to Settings for Default Project
FeatureWEB-33175Add File Watcher template for Prettier
FeatureWEB-12478Global File Watchers
BugWEB-31413File watcher (prettier) marks files as generated files
BugWEB-32127File Watcher dialog: 'File not found' error if macro is used in Program field
BugWEB-31808Not all watchers are run
BugWEB-33191File Watcher with custom scope is triggered on all files if this custom scope is deleted
BugWEB-33661Export File Watchers action: preserve Path Variables
BugWEB-35498Prettier file watcher: opening and closing file chooser changes Program path
UsabilityWEB-27952File Watchers which modify the current file cause prompts to Reload From Disk on Undo
CosmeticsWEB-33683File watchers: column title doesn't fit on Linux
TaskWEB-34630Update file watcher template for Babel 7</